##TITLE=31P ikalashn
110-2024-BAU
12.12.2024
##JCAMPDX= 6.0         $$ Bruker NMR JCAMP-DX V2.0
##DATA TYPE= NMR SPECTRUM
##DATA CLASS= NTUPLES
##ORIGIN= UXNMR, Bruker Analytische Messtechnik GmbH
##OWNER= root
$$ TOPSPIN		Version 1.3
$$ 2024-12-12 14:06:16.421 +0400  Irina@DPX200
$$ Compression mode = diff/dup
##.OBSERVE FREQUENCY= 81.01967998063
##.OBSERVE NUCLEUS= ^31P
##.ACQUISITION MODE= SIMULTANEOUS
##.ACQUISITION SCHEME= undefined
##.AVERAGES= 32
##.DIGITISER RES= 17
##SPECTROMETER/DATA SYSTEM= spect
##.PULSE SEQUENCE= zgpg
##.SOLVENT NAME= D2O
##.SHIFT REFERENCE= INTERNAL, D2O, 1, 298.5841
##AUDIT TRAIL= $$ (NUMBER, WHEN, WHO, WHERE, WHAT)
$$ ##TITLE= Audit trail, TOPSPIN		Version 1.3
$$ ##JCAMPDX= 5.01
$$ ##ORIGIN= Bruker BioSpin GmbH
$$ ##OWNER= Irina
$$ $$ F:/spectra/data/iren/nmr/P31dec/1/pdata/1/auditp.txt
$$ ##AUDIT TRAIL=  $$ (NUMBER, WHEN, WHO, WHERE, VERSION, WHAT)
(   1,<2024-12-12 14:04:55.093 +0400>,<Irina>,<DPX200>,<TOPSPIN 1.3>,
      <acquisition in progress>)
(   2,<2024-12-12 14:05:48.078 +0400>,<Irina>,<DPX200>,<TOPSPIN 1.3>,
      <Start of raw data processing
       efp BC_mod = 2 LB = 10 FT_mod = 6 PKNL = 1 PHC0 = 131.5765 PHC1 = 281.8385 SI = 32K 
       data hash MD5: 32K
       95 C1 F6 1F 79 6A 26 98 37 34 90 35 0E A0 D7 FC>)
(   3,<2024-12-12 14:06:01.125 +0400>,<Irina>,<DPX200>,<TOPSPIN 1.3>,
      <apk 
       data hash MD5: 32K
       0E 5B EC 30 EC A7 3F 95 3C 31 55 55 2E C7 85 87>)
(   4,<2024-12-12 14:06:02.921 +0400>,<Irina>,<DPX200>,<TOPSPIN 1.3>,
      <abs n ABSG = 5 
       data hash MD5: 32K
       FA 73 59 FB 2C 8E 8B F5 35 FE 16 89 C3 52 33 8D>)
$$ ##END=
$$ 
$$ $$ hash MD5
$$ $$ 6F AB AF B2 06 B6 44 0C 16 CD D7 C3 10 94 1C 38
##$RELAX= 
##$RELAX= 
##$RELAX= 
##$RELAX= 
##$RELAX= 
##$RELAX= 
##$RELAX= 
##$RELAX= 
##$RELAX= 
##$RELAX= 
##$RELAX= 
$$ Bruker specific parameters
$$ --------------------------
##$DU= <F:/spectra>
##$EXPNO= 1
##$NAME= <P31dec>
##$PROCNO= 1
##$TYPE= <nmr>
##$USER= <iren>
##$AMP= (0..31)
100 100 100 100 100 100 100 100 100 100 100 100 100 100 100 100 100 100 
100 100 100 100 100 100 100 100 100 100 100 100 100 100 
##$ANAVPT= -1
##$AQSEQ= 0
##$AQ_mod= 1
##$AUNM= <au_zg>
##$AUTOPOS= <>
##$BF1= 81.014009
##$BF2= 200.13
##$BF3= 200.13
##$BF4= 200.13
##$BF5= 200.13
##$BF6= 200.13
##$BF7= 200.13
##$BF8= 200.13
##$BYTORDA= 1
##$CFDGTYP= 0
##$CFRGTYP= 5
##$CHEMSTR= <none>
##$CNST= (0..63)
1 1 145 1 1 1 1 1 1 1 1 1 1 1 1 1 1 1 1 1 1 1 1 1 1 1 1 1 1 1 1 1 1 1 
1 1 1 1 1 1 1 1 1 1 1 1 1 1 1 1 1 1 1 1 1 1 1 1 1 1 1 1 1 1 
##$CPDPRG= <waltz16>
##$CPDPRG1= <>
##$CPDPRG2= <waltz16>
##$CPDPRG3= <>
##$CPDPRG4= <mlev>
##$CPDPRG5= <mlev>
##$CPDPRG6= <mlev>
##$CPDPRG7= <mlev>
##$CPDPRG8= <mlev>
##$CPDPRGB= <>
##$CPDPRGT= <>
##$D= (0..63)
0 1 0 0 0 0 0 0 0 0.06 0 0.03 2e-005 3e-006 0 0 0.0002 0 0 0 0 0 0 0 0 
0 0 0 0 0 0 0 0 0 0 0 0 0 0 0 0 0 0 0 0 0 0 0 0 0 0 0 0 0 0 0 0 0 0 0 
0 0 0 0 
##$DATE= 1733997946
##$DBL= (0..7)
120 120 120 11 120 120 24 19 
##$DBP= (0..7)
$$ [...]
##$SW_h= 37037.037037037
##$TD= 32768
##$TD0= 1
##$TE= 300
##$TE2= 300
##$TE3= 300
##$TEG= 300
##$TL= (0..7)
0 120 53 12 22 120 120 120 
##$TP= (0..7)
150 150 150 150 150 150 150 150 
##$TP07= 0
##$TPNAME0= <>
##$TPNAME1= <>
##$TPNAME2= <>
##$TPNAME3= <>
##$TPNAME4= <>
##$TPNAME5= <>
##$TPNAME6= <>
##$TPNAME7= <>
##$TPOAL= (0..7)
0.5 0.5 0.5 0.5 0.5 0.5 0.5 0.5 
##$TPOFFS= (0..7)
0 0 0 0 0 0 0 0 
##$TUNHIN= 0
##$TUNHOUT= 0
##$TUNXOUT= 0
##$USERA1= <user>
##$USERA2= <user>
##$USERA3= <user>
##$USERA4= <user>
##$USERA5= <user>
##$V9= 5
##$VALIST= <valist>
##$VCLIST= <CCCCCCCCCCCCCCC>
##$VD= 0
##$VDLIST= <DDDDDDDDDDDDDDD>
##$VPLIST= <PPPPPPPPPPPPPPP>
##$VTLIST= <TTTTTTTTTTTTTTT>
##$WBST= 1024
##$WBSW= 4
##$XGAIN= (0..3)
0 0 0 0 
##$XL= 0
##$YL= 0
##$YMAX_a= 2532
##$YMIN_a= -1573
##$ZGOPTNS= <>
##$ZL1= 120
##$ZL2= 120
##$ZL3= 120
##$ZL4= 120
##$ABSF1= 298.5841
##$ABSF2= -158.5842
##$ABSG= 5
##$ABSL= 5
##$ALPHA= 0
##$AQORDER= 0
##$ASSFAC= 0
##$ASSFACI= 0
##$ASSFACX= 0
##$ASSWID= 0
##$AUNMP= <proc_1d>
##$AXLEFT= 0
##$AXRIGHT= 0
##$AXTYPE= 0
##$AXUNIT= <>
##$AZFE= 0.1
##$AZFW= 0.5
##$BCFW= 0
##$BC_mod= 2
##$BYTORDP= 0
##$COROFFS= 0
##$CY= 12.5935478210449
##$DATMOD= 1
##$DC= 0
##$DFILT= <>
##$DTYPP= 0
##$F1P= 47.1127640792319
##$F2P= -24.0371245302204
##$FCOR= 0.5
##$FTSIZE= 32768
##$FT_mod= 6
##$GAMMA= 0
##$GB= 0
##$INTBC= 1
##$INTSCL= 7.269226e-011
##$ISEN= 30
##$LB= 10
##$LEV0= 0
##$LPBIN= 0
##$MAXI= 12.09355
##$MC2= 0
##$MEAN= 0
##$ME_mod= 0
##$MI= 0.7550151
##$NCOEF= 0
##$NC_proc= -13
##$NLEV= 6
##$NOISF1= 298.5841
##$NOISF2= 270.0111
##$NSP= 0
##$NTH_PI= 0
##$NZP= 0
##$OFFSET= 298.5841
##$PC= 1.4
##$PHC0= 168.1131
##$PHC1= 202.8011
##$PH_mod= 1
##$PKNL= yes
##$PPARMOD= 0
##$PPDIAG= 0
##$PPIPTYP= 0
##$PPMPNUM= 100
##$PPRESOL= 1
##$PSCAL= 0
##$PSIGN= 0
##$REVERSE= no
##$SF= 81.014009
##$SI= 32768
##$SIGF1= 270.0111
##$SIGF2= -158.5842
##$SINO= 77.54984
##$SIOLD= 32768
##$SREGLST= <31P.CDCl3>
##$SSB= 0
##$STSI= 32768
##$STSR= 0
##$SW_p= 37037.037037037
##$SYMM= 0
##$S_DEV= 0
##$TDeff= 32768
##$TDoff= 0
##$TI= <>
##$TILT= no
##$TM1= 0
##$TM2= 0
##$TOPLEV= 0
##$USERP1= <user>
##$USERP2= <user>
##$USERP3= <user>
##$USERP4= <user>
##$USERP5= <user>
##$WDW= 1
##$XDIM= 32768
##$YMAX_p= 399813530
##$YMIN_p= -22172513
$$ End of Bruker specific parameters
$$ ---------------------------------
##NTUPLES= NMR SPECTRUM
##VAR_NAME=  FREQUENCY,     SPECTRUM/REAL,   SPECTRUM/IMAG
##SYMBOL=    X,             R,               I
##VAR_TYPE=  INDEPENDENT,   DEPENDENT,       DEPENDENT
##VAR_FORM=  AFFN,          ASDF,            ASDF
##VAR_DIM=   32768,         32768,           32768
##UNITS=     HZ,            ARBITRARY UNITS, ARBITRARY UNITS
##FACTOR=    1.13031516577767, 1,            1
##FIRST=     37037.037037037, 830906,        -11737191
##LAST=      0,             -3413044,        -19166140
##MIN=       0,             -22172513,       0
##MAX=       37037.037037037, 399813530,     0
$$ Real data points
##PAGE= N=1
##DATA TABLE= (X++(R..R)), XYDATA
$$ [...]
16791b674078Q55116M46506K17153J07064K3198j6707L1182Q6804R7519J79595
16781f46648M82872J036756J692496K189664K317651K066325J581325R70035L21777
16772A2012253j68213l66796l94096m67579o95122j037444j320531j339251j043416
16763E179805n91076j98437K8466J38575K57131M32099N63537N03685J93725k55304
16753F252206o27876p80403p54767p07913p82863r71648j040115p62765j99687
16744c75831L91776Q05948R36260P64761M18290J03220n0565l9178J08916L67050
16734C430647O08622O58146M87115K26944K8307p4790j69638k83877l04361j37274
16724D469841J80517N53336R12996J189555J293306J234824J130861J026629Q34371
$$ plain form
16791 -2674078 -1818962 -1372456 -1155303 -1048239 -1025041 -1041748 -1010566 -923762 -826243 -646648
16781 -646648 -163776 872980 2565476 4755140 7072791 9139116 10720441 11690476 12012253
16772 12012253 11844040 11477244 11083148 10615569 9920447 8883003 7562472 6223221 5179805
16763 5179805 4588729 4390292 4418758 4557333 4814464 5246563 5810100 6313785 6507510 6252206
16753 6252206 5624330 4843927 4089160 3381247 2598384 1626736 586621 -176144 -375831
16744 -375831 15945 821893 1758153 2522914 2941204 3044424 2993859 2954681 3063597 3430647
16734 3430647 4039269 4697415 5184530 5411474 5439781 5364991 5195353 4911476 4607115 4469841
16724 4469841 4650358 5203694 6116690 7306245 8599551 9834375 10965236 11991865 12826236
16715A2826236M56117o8184n57206q59451r58280r08821p39436m62691j55252
16706H573032O8674J74072K14037K06277J12093n0281j69288j57774r1218j47081
16696H732543l74744o27242p29297n89857k69522k8847q9869m18601q52045j218291
16686C534228j353054j199334q45649m39796p5002K06095L17209K41884J56380
16677E42961K19862L74004M78003M63003L42161J49455j20913n14665j023574
16668I10297j460988j556560j265364q39339n03581k48493K289K06196K96974
16659d458569L27429L62438L80638L92663M95827P71652J221618J720750K048695
16650C263141K081889J835310J353537P14345M9511n00680q27494q86022p40882
$$ plain form
16715 12826236 13282353 13214169 12656963 11797512 10839232 9930411 9190975 8728284 8573032
16706 8573032 8641706 8815778 9029815 9236092 9348185 9297904 9128616 8970842 8879624 8732543
16696 8732543 8357799 7730557 7001260 6411403 6141881 6113034 6023165 5604564 4752519 3534228
16686 3534228 2181174 981840 136191 -303605 -378607 -172512 144697 386581 542961
16677 542961 762823 1136827 1614830 2077833 2419994 2569449 2448536 1933871 910297
16668 910297 -550691 -2107251 -3372615 -4211954 -4715535 -4964028 -4961739 -4755543 -4458569
16659 -4458569 -4131140 -3768702 -3388064 -2995401 -2499574 -1727922 -506304 1214446 3263141
16650 3263141 5345030 7180340 8533877 9248222 9297733 8797053 7969559 7083537 6342655
16641F342655n93221n91805o22582n19045l66678l58280m79762n48245m80900
16632A782137l03968m0358K21634K81255J8085m06920p22942q35528q22362p73641
16622a602608p10865n72640k13051M18096J055444J320006J139933Q07574O15013
16613B256902N87591N67639M17551J22649k85549p97838j299794j533206j317939
16604a281994p42563j11096K83400L97385L97513L81286L26316K30483Q2476j70724
16594b07518m69602o04209m42804j15520J33041K51142L98880O34654P62420O31329
16584I71813L34618k1945m58043r51674j356162j549731j554914j475894j416593
16575g478525j435613j455766j320416r86486n47968o6938M85392J051432J437504
$$ plain form
16641 6342655 5749434 5157629 4535047 4016002 3649324 3291044 2811282 2263037 1782137
16632 1782137 1478169 1437811 1659445 1940700 1958785 1551865 828923 -6605 -828967 -1602608
16622 -1602608 -2313473 -2886113 -3099164 -2681068 -1625624 -305618 834315 1641889 2256902
16613 2256902 2844493 3412132 3829683 3952332 3666783 2868945 1569151 35945 -1281994
16604 -1281994 -2024557 -2135653 -1852253 -1454868 -1057355 -676069 -349753 -119270 -36794 -207518
16594 -207518 -677120 -1281329 -1724133 -1839653 -1706612 -1455470 -1056590 -421936 340484 971813
16584 971813 1306431 1284486 826443 -125231 -1481393 -3031124 -4586038 -6061932 -7478525
16575 -7478525 -8914138 -10369904 -11690320 -12676806 -13224774 -13291712 -12806320 -11754888 -10317384
16566a0317384J518453J317856R71781O91223N78246N53527N45026N15137L70689
16557c255446P9175j98795k77244j88147j38749k97221o14546q50624p78049l55219
16547f874865K37127P86454J235861J604105J816964J734101J352402R00744O11858
16538C404751M49014K34018p9355l63446m97944n36228n66251n26876l20450j1091
16528A186142K36820M23354O83876R79894J061343P64240K26493k60840n36771
16519D764551o57027p93766j060827j340047j384245j145532q07634n48503l83152
16510c356182k51736j71261j57623q3734J58270M44590N72401N22398M33367L92096
16500a497414L43186K39455J74885K79502N84810R58557J143843R80979N78496
$$ plain form
16566 -10317384 -8798931 -7481075 -6509294 -5818071 -5239825 -4686298 -4141272 -3626135 -3255446
16557 -3255446 -3176271 -3375066 -3652310 -3840457 -3979206 -4276427 -4890973 -5741597 -6519646 -6874865
16547 -6874865 -6637738 -5851284 -4615423 -3011318 -1194354 539747 1892149 2792893 3404751
16538 3404751 3853765 4087783 4008428 3644982 3147038 2610810 2044559 1517683 1197233 1186142
16528 1186142 1422962 1846316 2530192 3510086 4571429 5335669 5562162 5301322 4764551
16519 4764551 4107524 3313758 2252931 912884 -471361 -1616893 -2424527 -2973030 -3356182
16510 -3356182 -3607918 -3779179 -3936802 -4020536 -3862266 -3417676 -2845275 -2322877 -1889510 -1497414
16500 -1497414 -1154228 -914773 -739888 -460386 124424 1082981 2226824 3207803 3786299
16491C786299J58688k31600o60217j061466j274576j179944p56361j85958J92263
16482a212872J53977k36265p29829j079878j108671p55001j53119M58246R13843
16473c749569J162287J201605J068959Q61508O70331N47130N85473Q71134J346181
16464D565039J865111K263407K284278J636802L78380q98658j665339j945231
16456H483789j953681j742399j293634o76549m5433M80510Q09319Q08477M66534
16447E336933l4761m95591q31284j020257j034680r28728q76516j025915j362128
16438b272927j682241j732230j427443r44931n84872n36253p49521r27767p75209
16429a1633394k43134N24519J222313J552310J491217J207384Q05551K17075n89890
$$ plain form
16491 3786299 3944987 3713387 3053170 1991704 717128 -462816 -1219177 -1405135 -1212872
16482 -1212872 -1058895 -1295160 -2024989 -3104867 -4213538 -4968539 -5121658 -4663412 -3749569
16473 -3749569 -2587282 -1385677 -316718 544790 1215121 1762251 2347724 3218858 4565039
16464 4565039 6430150 8693557 10977835 12614637 12993017 12094359 10429020 8483789
16456 8483789 6530108 4787709 3494075 2817526 2772093 3252603 4061922 4870399 5336933
16447 5336933 5302172 4806581 3975297 2955040 1920360 991632 115116 -910799 -2272927
16438 -2272927 -3955168 -5687398 -7114841 -8059772 -8644644 -9180897 -9930418 -10858185 -11633394
16429 -11633394 -11876528 -11352009 -10129696 -8577386 -7086169 -5878785 -5073234 -4856159 -5446049
16420e446049j371172j767920j560955q16628R4950Q02408J250440J634147K048864
16411e131915K327800K263595J815936J098742L64815n2766M828L59479O66336
16402C716850P21633N56070K34174k43177p91795j209960j373123j324585j162282
16393h76195j007925j041512j373019j889555k318298k424249k028447r21021
16385a3880221Q96901K863358M068247L988012K932073J694943Q36238M11183
16377C810734K39900J22840o1023k54588l32378l26138l72367m92819n86533n41139
16367A206489l44321j24265n9295k02271m30638n92809o54529o91702p62715q19697
16357c475753p59236n37282j98108K05412O00862Q30322P50972L76430j52986
$$ plain form
16420 -5446049 -6817221 -8585141 -10146096 -10962724 -10867774 -10065366 -8814926 -7180779 -5131915
16411 -5131915 -2804115 -540520 1275416 2374158 2738973 2686207 2691035 3050514 3716850
16402 3716850 4438483 4994553 5228727 4985550 4193755 2983795 1610672 286087 -876195
16393 -876195 -1884120 -2925632 -4298651 -6188206 -8506504 -10930753 -12959200 -13880221
16385 -13880221 -12983320 -10119962 -6051715 -2063703 868370 2563313 3399551 3810734
16377 3810734 4050634 4173474 4112451 3857863 3525485 3199347 2826980 2334161 1747628 1206489
16367 1206489 862168 737903 678608 476337 45699 -547110 -1201639 -1893341 -2656056 -3475753
16357 -3475753 -4234989 -4772271 -4970379 -4764967 -4164105 -3333783 -2582811 -2206381 -2359367
16348b359367o84141j080768j200596r85959n26776P86M49045P80699R59878R40551
16338c706648P99878O53009M87646K44609J0466n4883P9377L21825N51129N94427
16328a9165L09620k24854p44297r82745q02861l42888L1187J19177L6754q2672
16318b702744k58238n81486j097591j700321k133061k140841j593882m83837J129252
16309a1562749L041064M630521N049639M200465K854199J612232O05544j40501
16301A0290414n77641o90361n59855l51146k11011j92802k61679l73740n66587
16292F505592q62887j075769r74153o12578k26254O6352K33873K10664k0572l23074
16282B921194n18119n63662n38311n03835l94305j00248L78750R31468J406673
$$ plain form
16348 -2359367 -3043508 -4124276 -5324872 -6310831 -6837607 -6836821 -6387776 -5607077 -4647199 -3706648
16338 -3706648 -2906770 -2253761 -1766115 -1521506 -1511040 -1565923 -1486546 -1164721 -613592 -19165
16328 -19165 290455 65601 -678696 -1661441 -2464302 -2807190 -2776003 -2656826 -2620072 -2702744
16318 -2702744 -2960982 -3542468 -4640059 -6340380 -8473441 -10614282 -12208164 -12692001 -11562749
16309 -11562749 -8521685 -3891164 1158475 5358940 8213139 9825371 10430915 10290414
16301 10290414 9712773 9022412 8462557 8111411 7900400 7707598 7445919 7072179 6505592
16292 6505592 5642705 4566936 3592783 2980205 2753951 2820303 3054176 3264840 3244268 2921194
16282 2921194 2403075 1839413 1301102 797267 402962 302714 681464 1612932 3019605
16273C019605J650325J531496J034117K94737m57008j004474j278024j350835
16265C439939j290102j135056r42374o90231k74143L16478R70045J542818J884375
16256C821749J899166J602873J023054J22572j010827k004756k412906k142012
16248H98913j491240q00785k44385J55333M16239N43449N42855M32771K46533
16239F99683K6763j65804k58644k48131k14221k17600k68016m09122o75194r87376
16229b717662j182975j109890p24301j26519M80812R49210J302747J587774J683998
16220A43194J425696Q02382p1698j025484j821699k272501k333867k040595j446604
16211h641176o43805K03863R14394J367576J512200J382424J141256R92311J020460
$$ plain form
16273 3019605 4669930 6201426 7235543 7530280 7073272 6068798 4790774 3439939
16265 3439939 2149837 1014781 72407 -617824 -891967 -575489 394556 1937374 3821749
16256 3821749 5720915 7323788 8346842 8469414 7458587 5453831 3040925 898913
16248 898913 -592327 -1393112 -1637497 -1482164 -1065925 -522476 20379 453150 699683
16239 699683 726446 560642 301998 53867 -160354 -377954 -645970 -1055092 -1730286 -2717662
16229 -2717662 -3900637 -5010527 -5734828 -5861347 -5380535 -4431325 -3128578 -1540804 143194
16220 143194 1568890 2371272 2299574 1274090 -547609 -2820110 -5153977 -7194572 -8641176
16211 -8641176 -9284981 -9081118 -8166724 -6799148 -5286948 -3904524 -2763268 -1770957 -750497
16202g50497J141838J141008Q13479J69277n67781j098053j159328p04622j7809
16193a032488M69736N13585J94229k31624n59585p30783p30289m98950k4719N22400
16183b108488Q55460Q52258O09649K48355j36159m34957n12605k51180K93358
16174e84309Q56623J121224R72213O34318M33789M80139O33327P69331R20874
16165F237529J056040R33910L76671m00987r60301j071039q12100m07191j03145
16156D849387r2701m16996r56875j501311j848322j939921j789630j370213p56793
16147e823375j98303J73241M97715R14549J362440J677345J755207J616007J365880
16138C340706J084718P56174L71825N2116k8283J26606K73376J65435j99138n72052
$$ plain form
16202 -750497 391341 1532349 2345828 2515105 1947324 849271 -310057 -1014679 -1032488
16193 -1032488 -562752 -49167 145062 -86562 -646147 -1376930 -2107219 -2606169 -2630888 -2108488
16183 -2108488 -1253028 -400770 208879 457234 321075 -113882 -626487 -877667 -584309
16174 -584309 272314 1393538 2365751 3000069 3433858 3913997 4547324 5316655 6237529
16165 6237529 7293569 8227479 8604150 8203163 7242862 6171823 5359723 4952532 4849387
16156 4849387 4756686 4339690 3382815 1881504 33182 -1906739 -3696369 -5066582 -5823375
16147 -5823375 -6021678 -5848437 -5350722 -4436173 -3073733 -1396388 358819 1974826 3340706
16138 3340706 4425424 5181598 5553423 5605539 5577256 5703862 5977238 6142673 5943535 5371483
16128E371483p43265p75073q78905j144857j467204j679646j687187j454335r55031
16119e414020k48302M81956J071804J509975J875393K150482K165820J798963
16111E392071J157913N15183J07651Q264J27999K73049K46446K2764k11953l12350
16101G327037l08858k77951k63079k81453l64062n37575p03313o87510m38303
16092C464933p0242K56902M18268L13832p9524o42352j125516j227692q19576
16083D89033j25124M44061O54207N38120K27084j75349n87192q48074q11358n18209
16073g12801j20304K27899M04433L98146K62988M5275j79964l45106m20922l77191
16063h17547j88852Q9368L14383L96799L31323Q0579l78784r14465j260307j201178
$$ plain form
16128 5371483 4628218 3853145 2974240 1829383 362179 -1317467 -3004654 -4458989 -5414020
16119 -5414020 -5662322 -5180366 -4108562 -2598587 -723194 1427288 3593108 5392071
16111 5392071 6549984 7065167 7172818 7181082 7309081 7582130 7828576 7851340 7639387 7327037
16101 7327037 7018179 6740228 6477149 6195696 5831634 5294059 4590746 3903236 3464933
16092 3464933 3394691 3651593 4069861 4383693 4304169 3661817 2536301 1308609 489033
16083 489033 363909 807970 1462177 2000297 2227381 2052032 1464840 616766 -194592 -712801
16073 -712801 -833105 -605206 -200773 197373 460361 505636 325672 -19434 -440356 -817547
16063 -817547 -1006399 -917031 -602648 -205849 125474 206053 -172731 -1087196 -2347503 -3548681
16053c548681p26828p5669L66294L95019J93185Q0594K06076N70759J069345J453189
16043a6717J490887J182073O86569J49847l15675o14398o72107m80397j21120
16034A288962L00591O54905P38544M19691j93700q15629j179270j226725j121027
16025a133658j049465j041589r83738q16804n78428k68424J25107N60875R68564
16016d217560J212952J150418Q41848N43921M02647K91134L4807l02252m61582
16007e03667k98420O5858M14985O39107O99696N47567K28563r4506l42717n93207
15997G63259q75725j051215j014557q51112o53856l58645Q4393N62439R53464
15988b441555J253779J464081J503664J302825R33894N88316L49427J13320k20257
$$ plain form
16053 -3548681 -4275509 -4351178 -3984884 -3589865 -3396680 -3316086 -3110010 -2539251 -1469906 -16717
16043 -16717 1474170 2656243 3342812 3492659 3176984 2562586 1890479 1410082 1288962
16034 1288962 1589553 2244458 2983002 3402693 3208993 2393364 1214094 -12631 -1133658
16025 -1133658 -2183123 -3224712 -4208450 -5025254 -5603682 -5872106 -5746999 -5186124 -4217560
16016 -4217560 -3004608 -1854190 -1012342 -468421 -65774 225360 260167 -42085 -503667
16007 -503667 -802087 -736229 -321244 317863 1017559 1565126 1793689 1699183 1356466 763259
15997 763259 -112466 -1163681 -2178238 -3029350 -3683206 -4041851 -3957458 -3395019 -2441555
15988 -2441555 -1187776 276305 1779969 3082794 4016688 4605004 4954431 5067751 4847494
15979D847494o30073j028231j311905j408153j351724j228790j071634q96733
15971d079749o97258m36976j57425P7484L45631P18128J059991J203804J166141
15962h00229J084648J024173R34188P94647O78911O33694N75850L91488J78626
15953E495996J78307L78750M46037J00860o07970j360145j820932j902533j754376
15944h46006j557332j370345j099160o47405j29688K26170L65196M12996M95646
15935d149928O01766O03150M33508J51202j53257m10365n84508o17216m11453
15926d537101l6918K52299L39714L34420L28575K47488K669l31501n73907n92768
15916d567030l89268j03216Q1199L1646k70296o59435q68535p54141l67623J56760
$$ plain form
15979 4847494 4217421 3189190 1877285 469132 -882592 -2111382 -3183016 -4079749
15971 -4079749 -4777007 -5213983 -5371408 -5293924 -4948293 -4230165 -3170174 -1966370 -800229
15962 -800229 284419 1308592 2242780 3037427 3716338 4350032 4925882 5317370 5495996
15953 5495996 5674303 6053053 6499090 6599950 5991980 4631835 2810903 908370 -846006
15944 -846006 -2403338 -3773683 -4872843 -5520248 -5649936 -5423766 -5058570 -4645574 -4149928
15935 -4149928 -3548162 -2945012 -2511504 -2360302 -2513559 -2923924 -3508432 -4125648 -4537101
15926 -4537101 -4574019 -4321720 -3982006 -3647586 -3319011 -3071523 -3068854 -3400355 -3974262 -4567030
15916 -4567030 -4956298 -5059514 -4978315 -4946669 -5216965 -5876400 -6744935 -7499076 -7866699 -7709939
15906g709939P05107J215993J591247J637158J268146P01746K14780j58686m88228
15897a022676p08833o94789m44313j01703J85066L39798L41750K46802J74281
15888a684617K44540M49856O01858M97804J22323l25005n79811m68047M5068P68057
15878c27974J283666J300869R26514M56691J09247o5838j85240l77082o17573
15869B503280p42225o34029l78141j75344j20988j44308j42570q0785M103K2879
15859A11872p7875k23273k90933j99085J13900O22896J136176J463647J594300
15850D251625J611735J560462J408331J077106N70944J3041m34925o21475m73939
15841H962905q8479L13812N36505M88180J97156j94903m70484m89607l47450k69117
$$ plain form
15906 -7709939 -7004832 -5788839 -4197592 -2560434 -1292288 -590542 -375762 -534448 -1022676
15897 -1022676 -1731509 -2426298 -2870611 -2972314 -2787248 -2447450 -2105700 -1858898 -1684617
15888 -1684617 -1440077 -990221 -388363 109441 231764 -93241 -673052 -1141099 -1096031 -327974
15878 -327974 955692 2256561 3183075 3639766 3749013 3683175 3497935 3120853 2503280
15869 2503280 1761055 1127026 748885 573541 452553 308245 165675 84890 88993 111872
15859 111872 33997 -189276 -480209 -679294 -565394 57502 1193678 2657325 4251625
15850 4251625 5863360 7423822 8832153 9909259 10480203 10493244 10058319 9436844 8962905
15841 8962905 8874426 9188238 9724743 10212923 10410079 10215176 9744692 9255085 8907635 8638518
15831H638518l63307o10452r84740j447258j894248k175811k184494j912655j414613
15822d349060q10865l25982j59617k51084k82626K3363O15838J165410J426636
15813b947987J439980J352255J213239J022192Q47988P99047R22635J144988J312644
15804G106981J360574J332532J187637Q09636K62712k50301o73563j053487j328486
15795H754235j395231j319961j257234j189589r92239p00719m74699m01813m71557
15786E51193n43426m47108k11437j5532M6087P0988K31708N39978Q06861Q75808
15776A905120P27672L98497n0019n22261q91010j039982r72600q56517q70538
15767b171638r71471r45065o87733l21455o6117l5324j23939j18203Q3342L87093
$$ plain form
15831 8638518 8275211 7664759 6680019 5232761 3338513 1162702 -1021792 -2934447 -4349060
15822 -4349060 -5159925 -5485907 -5645524 -5896608 -6179234 -6155871 -5540033 -4374623 -2947987
15813 -2947987 -1508007 -155752 1057487 2079679 2927667 3726714 4649349 5794337 7106981
15804 7106981 8467555 9800087 10987724 11797360 12060072 11809771 11136208 10082721 8754235
15795 8754235 7359004 6039043 4781809 3592220 2599981 1899262 1424563 1022750 551193
15786 551193 7767 -439341 -650778 -666310 -620223 -549235 -317527 222451 1029312 1905120
15776 1905120 2632792 3031289 2981270 2459009 1567999 528017 -444583 -1301100 -2171638
15767 -2171638 -3143109 -4088174 -4775907 -5097362 -5163479 -5198803 -5322742 -5440945 -5357603 -4970510
15757d970510O28946P27723O79181N11328L07339J99483K51082L67831M10124
15748h87473L30042J47671j10438l92021o30618p90567q48114p86893o19788l96803
15738d985002j95956m9484Q2815K22701L15803L06712K57285K92660M15338M73259
15728b863869K88292j18631m54942m52769j47620J86173L00576J47598j78741
15719c293933n75060r14925j008476p30670j71903M60467J022897J464866J785243
15710a961494J970952J950841J657434J118045M75268o3827l40796l91458m14747
15701D000218n42248p18302p93094o75307m12874j66310r4314k51712n70542q86961
15691a111446j021834r42873p97326p66657r23341j189622j428540j529359j384632
$$ plain form
15757 -4970510 -4341564 -3613841 -2934660 -2423332 -2115993 -1916510 -1665428 -1297597 -887473
15748 -887473 -557431 -409760 -520198 -912219 -1542837 -2333404 -3181518 -3968411 -4588199 -4985002
15738 -4985002 -5180958 -5230442 -5147627 -4924926 -4609123 -4302411 -4045126 -3752466 -3337128 -2863869
15728 -2863869 -2575577 -2694208 -3149150 -3601919 -3749539 -3563366 -3262790 -3115192 -3293933
15719 -3293933 -3868993 -4783918 -5792394 -6523064 -6694967 -6234500 -5211603 -3746737 -1961494
15710 -1961494 9458 1960299 3617733 4735778 5211046 5147219 4806423 4414965 4000218
15701 4000218 3457970 2739668 1946574 1271267 858393 692083 597769 346057 -224485 -1111446
15691 -1111446 -2133280 -3076153 -3873479 -4640136 -5563477 -6753099 -8181639 -9710998 -11095630
15682a1095630r19505k22972M62729R08901R95804O97693J01745n69867j078450
15673a0719552j292674j136834o03684J78333R77928J508270J543865J126368
15665h417980O16325L99828N42777Q43821J140301J339779J323253J025160N49664
15656f37072J15980j63903l30009l72971k23397J02228N33703J029402J544070
15647A598031J925209J917207J433748O92389k6986n87985r61076j145846j162228
15638C682463j047430q17203m62071p4017J40963J18199L7445O1294J09179K041
15628A750863k20074l30527k51760j21770o4576o192K26081O01666Q75917Q84473
15618C344101O48554L06535K3705j34731k33140k98533k74629j87738j37374j58723
$$ plain form
15682 -11095630 -12015135 -12238107 -11775378 -10866477 -9870673 -9172980 -9071235 -9641102 -10719552
15673 -10719552 -12012226 -13149060 -13752744 -13574411 -12596483 -11088213 -9544348 -8417980
15665 -8417980 -7801655 -7401827 -6859050 -6015229 -4874928 -3535149 -2211896 -1186736 -637072
15656 -637072 -521092 -684995 -1015004 -1387975 -1611372 -1509144 -975441 53961 1598031
15647 1598031 3523240 5440447 6874195 7566584 7539598 6951613 5990537 4844691 3682463
15638 3682463 2635033 1817830 1355759 1281742 1422705 1540904 1578349 1639643 1748822 1750863
15628 1750863 1530789 1200262 948502 826732 762156 755964 982045 1583711 2459628 3344101
15618 3344101 3992655 4299190 4322895 4188164 3955024 3656491 3381862 3194124 3056750 2898027
15608B898027k27082l12517l45231k28428Q666J73200J24120j13023m41124p35611
15598H00997r22978j065290j192655j156919q01010j73919M60280P99663P53326
15589b498505M64719J36086j02628k50595l63194m21092k90849J29370P30947
15580b465741J214386J334695J085341O30209J30934k96324m74929k38349L45871
15571A266093R23685J091750P67174K12593l31831p95659j127489j235486j106798
15562c35968q50686n65901l08321j78516k30749m05639o40721q70759r82059q80444
15552f249763n53590j28922J45845J23682q3903j95917L1680O13853J334769J958993
15542c003273K348155K444037K283311J911399J310026N55014q0855l23478j58064
$$ plain form
15608 2898027 2670945 2358428 2013197 1784769 1793435 1966635 2090755 1977732 1536608 800997
15598 800997 -121981 -1187271 -2379926 -3536845 -4337855 -4511774 -4051494 -3251831 -2498505
15589 -2498505 -2033786 -1897700 -2000328 -2250923 -2614117 -3035209 -3326058 -3196688 -2465741
15580 -2465741 -1251355 83340 1168681 1798890 1929824 1633500 1158571 920222 1266093
15571 1266093 2189778 3281528 4048702 4261295 3929464 3133805 2006316 770830 -335968
15562 -335968 -1186654 -1752555 -2060876 -2239392 -2470141 -2875780 -3516501 -4387260 -5369319 -6249763
15552 -6249763 -6803353 -6932275 -6786430 -6662748 -6746651 -6942568 -6910888 -6297035 -4962266 -3003273
15542 -3003273 -655118 1788919 4072230 5983629 7293655 7848669 7767814 7444336 7286272
15533G286272J60366L59292L36591J24955k00372n65333r08569j210187j522521
15524C860494j901724k264288k417941k213506j611291p07572K16411P84961Q35102
15515e419354N46902K03548j5143m0642O1910J67522K42126K93358L11262L16036
15505c332475L01857J90157n8435l53667n82927p07716p09646n69837l43892j77309
15495f343890j69840k48706k30438j7611L57286Q45131J396219J895089K162136
15486c54624K119186J875210J552864J190785Q50702O35015N21318L42815K1967
15477H755238k86223l55686j91372r2967l31870q81101j542682k125234k461452
15468D86651k436001k066403j525732j052351p80489o68112n73451l73791q3536
$$ plain form
15533 7286272 7446638 7805930 8142521 8267476 8067104 7501771 6593202 5383015 3860494
15524 3860494 1958770 -305518 -2723459 -4936965 -6548256 -7255828 -7039417 -6254456 -5419354
15515 -5419354 -4872452 -4668904 -4684047 -4724689 -4662779 -4495257 -4253131 -3959773 -3648511 -3332475
15505 -3332475 -3030618 -2840461 -2898896 -3252563 -3835490 -4543206 -5252852 -5822689 -6166581 -6343890
15495 -6343890 -6513730 -6762436 -6992874 -7010485 -6653199 -5808068 -4411849 -2516760 -354624
15486 -354624 1764562 3639772 5192636 6383421 7234123 7869138 8390456 8733271 8755238
15477 8755238 8469015 8113329 7921957 7828990 7497120 6616019 5073337 2948103 486651
15468 486651 -1949350 -4015753 -5541485 -6593836 -7374325 -8042437 -8615888 -8989679 -9073215
15459i073215J59601K95413M00767N60245P63657R23143R95258R90730R50039
15450c034362R69901J119817J300699J368568J306415J144119R19369P11125N49364
15441F355015L79678J93869M1647j25889m49230r55125j459562j693925j502552
15432G83926r80141m23491q1331M5464J17318K49980M54192O67723Q09930Q23485
15422B467055O99878N14999L90892L61006L12616J64384L810m5526J6675R4135
15412D979924J18678Q5895P351j23564l05835m98665o48721o99487n80801k98253
15402B036522K0240K03540J89741J40212K42443M07761L90931J50387j38121l37823
15392C305833m31952m68507m97753n32556n59802n69472n59249n33098n52261
$$ plain form
15459 -9073215 -8913614 -8618201 -8217434 -7657189 -6893532 -5970389 -4975131 -3984401 -3034362
15450 -3034362 -2064461 -944644 356055 1724623 3031038 4175157 5094526 5805651 6355015
15441 6355015 6734693 6928562 6970209 6844320 6395090 5439965 3980403 2286478 783926
15432 783926 -196215 -619706 -701037 -655573 -538255 -288275 165917 833640 1643570 2467055
15422 2467055 3166933 3681932 4072824 4433830 4746446 4910830 4914640 4869114 4885789 4979924
15412 4979924 5098602 5184497 5191848 5068284 4762449 4263784 3615063 2915576 2334775 2036522
15402 2036522 2056762 2260302 2450043 2590255 2832698 3240459 3631390 3781777 3643656 3305833
15392 3305833 2873881 2405374 1907621 1375065 815263 245791 -313458 -846556 -1398817
15383a398817p12179j024534j364400j530996j375682r07744k67731L60504P91219
15374g430360R21183Q18066O32741M60385L38246K72048K54675L21881M66983
15365b944152N76312N63133M48192L09801J97017R4204R454L7958K11367L66252
15355a30462L31213J11423j83511m10503m42537k70982N1151M82221R11878J222562
15345A672453J437393J566444J433437Q99518J04648o50671j121530j191647r02594
15336C247451m52926m0998L11077O36900R00699J043495R55714N80240O9187l50860
15326F899979n82451o61260o49052n62961m00863k06737n2961j9533k33195p48519
15316B782447j353226j681092j513889r04576j22189N08940Q29674R00783Q58406
$$ plain form
15383 -1398817 -2110996 -3135530 -4499930 -6030926 -7406608 -8314352 -8582083 -8221579 -7430360
15374 -7430360 -6509177 -5691111 -5058370 -4597985 -4259739 -3987691 -3733016 -3411135 -2944152
15365 -2944152 -2367840 -1804707 -1356515 -1046714 -849697 -755493 -746039 -708081 -496714 -130462
15355 -130462 200751 312174 128663 -281840 -724377 -995359 -944208 -461987 449891 1672453
15345 1672453 3109846 4676290 6109727 7009245 7113893 6463222 5341692 4150045 3247451
15336 3247451 2794525 2753527 3064604 3701504 4602203 5645698 6601412 7181652 7250839 6899979
15326 6899979 6317528 5656268 5007216 4444255 4043392 3836655 3783694 3764161 3530966 2782447
15316 2782447 1429221 -251871 -1765760 -2670336 -2792525 -2283585 -1453911 -553128 305278
15307C05278Q30511Q88065J012080J153681J245043J162358Q17711K89843k57509
15298G447061o94997r14681q79096o62037l86742k17417k62908m42653o07510
15289B379020p39987q90252j001865r56899p62184n47990l76399j74624J86447
15280b884733P51546J398936J897102K066559J899697J536140J178407R63650
15272H807304R08599R86801J123074J148999Q90373L27914l62949r31409j203311
15263A1695395j165974r59609p56809o62135o80395p34503p35408o39851m87120
15254D873591l74905l46342l08570j24087J92289M41510M17954P8580l56712n58369
15244C934939m51834k20820M6912M04138P85375R63851P81646L95211J68285K24417
$$ plain form
15307 305278 1135789 2023854 3035934 4189615 5434658 6597016 7414727 7704570 7447061
15298 7447061 6752064 5837383 4958287 4296250 3909508 3692091 3429183 2986530 2379020
15289 2379020 1639033 748781 -253084 -1209983 -1972167 -2520157 -2896556 -3071180 -2884733
15280 -2884733 -2133187 -734251 1162851 3229410 5129107 6665247 7843654 8807304
15272 8807304 9715903 10702704 11825778 12974777 13865150 14193064 13830115 12898706 11695395
15263 11695395 10529421 9569812 8813003 8150868 7470473 6735970 6000562 5360711 4873591
15254 4873591 4498686 4152344 3843774 3719687 3911976 4353486 4771440 4850020 4493308 3934939
15244 3934939 3483105 3262285 3309197 3713335 4498710 5462561 6244207 6639418 6807703 7032120
15234G032120L04496J01800m34242j119574j699373j968610j920626j735639j500854
15225b940502j104086m92237J60604O39755R04118J019430R71591O79185J33953
15216b8189n14401r96663j107829q57626m60647j62181n4029r5652k00872k98907
15206d776996l37987k95127k72955m27919p28844r41147q51151m44696J12064
15197h964758O22748R91510J207704J216055R61082N58104K05493M16l8371J04925
15187c135092M02457P05648Q08723O75560N24205N48394O39611N22857J11617
15178A803980l74194n99455m32680n4800K72117M26290M11630K23757j64009o38050
15168H74586q76699o38478j00313L08583L60765J19018k57061o12995p78863o43606
$$ plain form
15234 7032120 7336616 7438416 7004174 5884600 4185227 2216617 295991 -1439648 -2940502
15225 -2940502 -4044588 -4536825 -4376221 -3736466 -2832348 -1812918 -841327 -162142 -28189
15216 -28189 -542590 -1539253 -2647082 -3504708 -3965355 -4127536 -4181565 -4277217 -4478089 -4776996
15206 -4776996 -5114983 -5410110 -5683065 -6110984 -6839828 -7780975 -8632126 -9076822 -8964758
15197 -8964758 -8342010 -7350500 -6142796 -4926741 -3965659 -3407555 -3202062 -3201646 -3240017 -3135092
15187 -3135092 -2732635 -2026987 -1218264 -542704 -18499 529895 1169506 1692363 1803980
15178 1803980 1429786 830331 397651 342851 614968 1041258 1452888 1676645 1512636 874586
15168 874586 -2113 -640591 -740904 -432321 -71556 47462 -209599 -822594 -1601457 -2245063
15158b245063l35713j29041j33063k42716l47663m34383m83880m19881k40087
15149e011490j01877j65541m23207p41731r94939j085747r56528o71315l63598
15140a0515973q2339J95881M45912O10120O60363O42228P17249J007426J388540
15131d930593J607350J545194J248872Q74260O59613P10087Q48768Q58980O93798
15122D116329L93367M2349k57753m91058p28710j010132j233981j218715r05836
15113a294140m34100M8372M77708P25754O64097L75758O5763j61943l69461o76521
15103e78713j071104j351835j273700p48621O1610Q36405J304406J350254R93473
15094d77825L58342l73345r97609j340061j361970j193711r90687p43596l42232
$$ plain form
15158 -2245063 -2580776 -2709817 -2842880 -3085596 -3433259 -3867642 -4351522 -4771403 -5011490
15149 -5011490 -5113367 -5278908 -5702115 -6443846 -7438785 -8524532 -9481060 -10152375 -10515973
15140 -10515973 -10598312 -10402431 -9956519 -9346399 -8686036 -8043808 -7326559 -6319133 -4930593
15131 -4930593 -3323243 -1778049 -529177 345083 1004696 1714783 2563551 3422531 4116329
15122 4116329 4509696 4552045 4294292 3803234 3074524 2064392 830411 -388304 -1294140
15113 -1294140 -1728240 -1679868 -1202160 -476406 187691 563449 629212 467269 97808 -578713
15103 -578713 -1649817 -3001652 -4275352 -5023973 -4962363 -4125958 -2821552 -1471298 -477825
15094 -477825 -119483 -492828 -1490437 -2830498 -4192468 -5386179 -6376866 -7120462 -7462694
15085g462694J98134P17044J065366J186593J152138J102444J029838Q02527L90025
15076A81415j50645p45721j228258j410146j218946p03013l8146N45976R46001
15067c821483J193334J280353J128449P70962L95701R4071k44488o36620q67837
15058g07558q05402n68444l57389k76073k87260l15054l49555m18041n31359o20089
15048e236224n76892m04308k75830l81399o62348q53873p83508n16622j99620
15039i890624J29658M63934P03039P07506M28952N0280j27583r786K28720L82590
15029f933314M03067L86513M45692N33573M41507P2964m18909q09485r35796p61028
15019g575216m63133k78276k53110k47314q6189L03972Q38019J284098J406251
$$ plain form
15085 -7462694 -7264560 -6547516 -5482150 -4295557 -3143419 -2040975 -1011137 -208610 181415
15076 181415 30770 -714951 -1943209 -3353355 -4572301 -5275314 -5313460 -4767484 -3821483
15067 -3821483 -2628149 -1347796 -219347 551615 947316 1041387 796899 160279 -707558
15058 -707558 -1512960 -2081404 -2438793 -2714866 -3002126 -3317180 -3666735 -4084776 -4616135 -5236224
15048 -5236224 -5813116 -6217424 -6493254 -6874653 -7537001 -8390874 -9174382 -9691004 -9890624
15039 -9890624 -9760966 -9297032 -8593993 -7886487 -7457535 -7407255 -7534838 -7544624 -7315904 -6933314
15029 -6933314 -6530247 -6143734 -5698042 -5164469 -4722962 -4649998 -5068907 -5878392 -6814188 -7575216
15019 -7575216 -8038349 -8316625 -8569735 -8817049 -8903238 -8599266 -7761247 -6477149 -5070898
15010e070898J156535O94572K85331J62474L78438P65620J109109J346921J481730
15001B309832J433373J161007P83896M39879J52631j07505l89789p33210j062815
14992C987299j225041j116396p84694m08501j54556r1425j88135l47941n00372
14983h29762o62149p90755p21910m18085o2539J91895L54602M02424J97641k54935
14973b593573o76680p93801n98146k26329K00350M91643M57754J68128j28766
14964c699420l03272l80988l86847k80760n8535J56574K65758L45382M70241N65398
14954c306469N55134M75411L79895K88343K04418P8844j39715m11465o24903o71805
14944c172312n27673k80801n8241Q7133K08303L39831L63613J36162k93026p04801
$$ plain form
15010 -5070898 -3914363 -3219791 -2934460 -2771986 -2393548 -1627928 -518819 828102 2309832
15001 2309832 3743205 4904212 5688108 6127987 6280618 6173113 5783324 5050114 3987299
14992 3987299 2762258 1645862 861168 452667 298111 206686 18551 -329390 -829762
14983 -829762 -1491911 -2282666 -3004576 -3422661 -3485200 -3293305 -2938703 -2536279 -2338638 -2593573
14973 -2593573 -3270253 -4064054 -4662200 -4888529 -4688179 -4196536 -3738782 -3570654 -3699420
14964 -3699420 -4002692 -4383680 -4770527 -5051287 -5109822 -4953248 -4687490 -4342108 -3871867 -3306469
14954 -3306469 -2751335 -2275924 -1896029 -1607686 -1403268 -1324424 -1464139 -1875604 -2500507 -3172312
14944 -3172312 -3699985 -3980786 -4039027 -3951894 -3743591 -3403760 -3040147 -2903985 -3197011 -3901812
14934c901812r01523q21116n28394j79369K7876K8058M1946L71937J057449J864335
14924b940613K483587K722710K611556K260897J669228P86298k52661j092278
14916H248724j426598j248805q55273o07411o47660q78371j091805j109977q95899
14907e13075n75022l35786k59622l20595n01288p39484q97448q87730p17425m46471
14897f193946j73223k4858o0651k22148m09979o05451q59272j122733j157002
14888a0829263o61735L97417J587628K347908K510077K313372K011126J645117
14880A321647J204679P80096M71566K49024k5251m21494q23281j021098r63302
14871G72586q32818p82811p76326p52321p36015p63632q64145j066614j321642
$$ plain form
14934 -3901812 -4803335 -5624451 -6152845 -6332214 -6304338 -6276280 -6234334 -5862397 -4804948 -2940613
14924 -2940613 -457026 2265684 4877240 7138137 8807365 9593663 9341002 8248724
14916 8248724 6822126 5573321 4718048 4110637 3462977 2584606 1492801 382824 -513075
14907 -513075 -1088097 -1423883 -1683505 -2004100 -2505388 -3244872 -4142320 -5030050 -5747475 -6193946
14897 -6193946 -6367169 -6392027 -6452678 -6674826 -7084805 -7690256 -8549528 -9672261 -10829263
14888 -10829263 -11490998 -11093581 -9505953 -7158045 -4647968 -2334596 -323470 1321647
14880 1321647 2526326 3306422 3777988 4027012 4001761 3580267 2756986 1735888 772586
14871 772586 -60232 -843043 -1619369 -2371690 -3107705 -3871337 -4735482 -5802096 -7123738
14862g123738j486350j443968j217884q56804l38395K42710O48993Q04462Q96402
14853i874572J122415J496892J907651K197489K233544K007593J591361J103994
14845C786367P20695N40496M74390L22920l3341m83030p58015p56295o86393q00242
14835B327552j089457j289547j170517p55343k20038K52149M92198L91047N0394
14826a011562k02262j17229K13660M86592N10244L31611J36932R0767K04867L51262
14816I94882M18566L66652K09418L1684n8568K1203K43518M15280L52035N1929
14806C046599l52732p11473r05972q90051p35913n84025n59738o89821q34563
14797c217689q06687n31207p6679M11077Q39294J182762J378524J350818J129240
$$ plain form
14862 -7123738 -8610088 -10054056 -11271940 -12128744 -12467139 -12224429 -11575436 -10770974 -9874572
14853 -9874572 -8752157 -7255265 -5347614 -3150125 -916581 1091012 2682373 3786367
14845 3786367 4507062 5047558 5521948 5844868 5811527 5328497 4570482 3814187 3127794 2327552
14835 2327552 1238095 -51452 -1221969 -1977312 -2197350 -1945201 -1453003 -1061956 -1011562
14826 -1011562 -1213824 -1331053 -1117393 -630801 -120557 211054 347986 438753 643620 994882
14816 994882 1413448 1780100 1989518 2021202 1962634 1983837 2227355 2642635 2994670 3046599
14806 3046599 2693867 1982394 1076422 186371 -549542 -1133567 -1693305 -2383126 -3217689
14797 -3217689 -4024376 -4555583 -4632262 -4221185 -3381891 -2199129 -820605 530213 1659453
14788A659453Q41095N95237M19099L45899M66124P98562J165640J310196J139920
14779H741225P63505L19701q4264l26016l10467m3275K69639L26448J23171j6273
14769I763394J10436L54242M60287L51683J89870K03345M39968P46987R37420
14760A3557632Q96607N95861R6313m25175p54837q20155o96778n04422l99433
14751A1545613n71950j045253j503504j584101j316769r97668p86299o30926m51503
14742B657640k54907o0985J42521L63645O13418Q33879Q71823O50155K50656j87744
14732E880101n31159o63847n43588k59141q690M7113l2286j3108J49896K15938
14722D241229J4302l91707q57443j252927j440389j343658j064139p91142n99500
$$ plain form
14788 1659453 2500548 3095785 3514884 3860783 4326907 5125469 6291109 7601305 8741225
14779 8741225 9504730 9824431 9740167 9414151 9103684 9060409 9330048 9656496 9779667 9763394
14769 9763394 9873830 10228072 10688359 11040042 11229912 11433257 11873225 12620212 13557632
14760 13557632 14454239 15050100 15146413 14721238 13966401 13146246 12449468 11945046 11545613
14751 11545613 10973663 9928410 8424906 6840805 5524036 4526368 3740069 3109143 2657640
14742 2657640 2402733 2341748 2484269 2847914 3461332 4295211 5167034 5817189 6067845 5880101
14732 5880101 5348942 4685095 4141507 3882366 3873676 3920789 3888503 3875395 4025291 4241229
14722 4241229 4255531 3863824 3006381 1753454 313065 -1030593 -2094732 -2885874 -3485374
14713c485374m55730k89022k0749L17850N57452N90611M87866L20964P4958k39372
14703b140546n42283p39173p77854o83164n17397l14187q8164R0228O5873k26358
14693e873025o04945q37747q45936o02728j07966M61483P96664O84023K16373
14684f713804k39567l78229k28133m4207L2217P6281J57595J93003R0425l1276
14674g085695N9434M17864Q89975J250844J317609J067996O32610J34282l40288
14665a655369o99075r63373j238423j450526j351149q27009p8394N43674Q41806
14656f877838Q70094P60343N82237L83082K23202J33941Q5134K9185N744J22116
14646c682760L98040P13428R30503R96919R26470P87434P23652Q36955J047774
$$ plain form
14713 -3485374 -3941104 -4230126 -4250875 -3933025 -3375573 -2784962 -2297096 -1976132 -1901174 -2140546
14703 -2140546 -2682829 -3422002 -4199856 -4883020 -5400417 -5714604 -5802768 -5712540 -5646667 -5873025
14693 -5873025 -6477970 -7315717 -8161653 -8764381 -8872347 -8410864 -7614200 -6930177 -6713804
14684 -6713804 -6953371 -7331600 -7559733 -7603940 -7571723 -7495442 -7337847 -7144844 -7054419 -7085695
14674 -7085695 -7026261 -6608397 -5718422 -4467578 -3149969 -2081973 -1449363 -1315081 -1655369
14665 -1655369 -2354444 -3317817 -4556240 -6006766 -7357915 -8184924 -8263318 -7719644 -6877838
14656 -6877838 -6007744 -5247401 -4665164 -4282082 -4058880 -3924939 -3839805 -3810620 -3804876 -3682760
14646 -3682760 -3284720 -2571292 -1640789 -643870 282600 1070034 1793686 2630641 3678415
14637C678415J201379J239666J247296J296016J258958R97086N59733O5269m11224
14628A1132594q09647j072336j179918j187651j197090j249142j294201j229587
14620A913022r67506n88517l49639l97732n73684o12597m35380j38573J65610
14611a984996L88765M66896M37779M22520N03393O66210Q26797Q89328Q22341
14602C439033O26656K96838j06391n37833j030566j483685j628820j345833q20691
14593b591292l00194J25832M17477M68851K47217p3251k90535l64021l14043j45494
14583b819453J11799M26568P68886J074884J242193J251437J238044J245154J086681
14574E626193O14453p3880p24614j089149j052870p18724l10962M0183L38865
$$ plain form
14637 3678415 4879794 6119460 7366756 8662772 9921730 10918816 11478549 11543818 11132594
14628 11132594 10322947 9250611 8070693 6883042 5685952 4436810 3142609 1913022
14620 1913022 945516 356999 7360 -390372 -964056 -1576653 -2012033 -2150606 -1984996
14611 -1984996 -1596231 -1129335 -691556 -269036 234357 900567 1727364 2616692 3439033
14602 3439033 4065689 4362527 4256136 3718303 2687737 1204052 -424768 -1770601 -2591292
14593 -2591292 -2891486 -2765654 -2348177 -1879326 -1632109 -1705360 -1995895 -2359916 -2673959 -2819453
14583 -2819453 -2707654 -2281086 -1512200 -437316 804877 2056314 3294358 4539512 5626193
14574 5626193 6240646 6166766 5442152 4353003 3300133 2581409 2270447 2310630 2649495
14565B649495N70934O79953O31225L76932r8532o86491j159541j271144r82698
14556G10133n16051r4033K16056L71943K77052o0081m34351o06299n48575m90690
14546a174896o15763p86737p17982l37687J59289N83996R35853J263862J496952
14537H06887J514863J251776P27861Q2650m89576q82720j060411r21292m36576
14528E93462J19482L77321K86731P2565j42891m42002q81116j300072j458342
14519b774862j301787r43360m98491r4622R8857l3300l98953o93234o46779k37432
14509g523963L12896P03606Q20358P51864N84484L70831K20586K53338M28335
14500c077665N81986O26123N87323N81793P35319J016442J266939J413080J515915
$$ plain form
14565 2649495 3220429 3900382 4531607 4908539 4810007 4123516 2963975 1692831 710133
14556 710133 194082 100049 316105 688048 965100 905019 470668 -135631 -684206 -1174896
14546 -1174896 -1790659 -2577396 -3295378 -3633065 -3473776 -2889780 -1953927 -690065 806887
14537 806887 2321750 3573526 4301387 4384037 3894461 3011741 1951330 1030038 593462
14528 593462 712944 1090265 1376996 1449561 1306670 864668 -16448 -1316520 -2774862
14519 -2774862 -4076649 -5020009 -5518500 -5613122 -5514265 -5547565 -5946518 -6639752 -7286531 -7523963
14509 -7523963 -7211067 -6507461 -5687103 -4935239 -4350755 -3979924 -3759338 -3506000 -3077665
14500 -3077665 -2495679 -1869556 -1282233 -700440 34879 1051321 2318260 3731340 5247255
14491E247255J637161J769691J844849J750445J381795P20700j03811q56789j330746
14482A2060550j465328j359702j197607j100527j002497q27247o98855p66326
14474C642461j015618j337341j601204j686479j530461j218435r54201p95586
14466f496864n53995m7116P14835J572245K269136K514979K163805J386573N69495
14457D093093K6459j43009o5818k0397k16368o36924j133824j566323j795666
14448a458777j711410j348993q93731m81115r0452K87260N47274O03213N51473
14439c995258N60360O20357N97121N05272M95650O09702P45280P87394O83641
14430A609519M39285J04257k56186n99142q61220q95518n88047m3389M81555P92929
$$ plain form
14491 5247255 6884416 8654107 10498956 12249401 13631196 14351896 14248085 13391296 12060550
14482 12060550 10595222 9235520 8037913 6937386 5934889 5107642 4408787 3642461
14474 3642461 2626843 1289502 -311702 -1998181 -3528642 -4747077 -5701278 -6496864
14466 -6496864 -7050859 -7097975 -6383140 -4810895 -2541759 -26780 2137025 3523598 4093093
14457 4093093 4119552 3976543 3910725 3890328 3673960 3037036 1903212 336889 -1458777
14448 -1458777 -3170187 -4519180 -5412911 -5894026 -5984478 -5697218 -5149944 -4546731 -3995258
14439 -3995258 -3434898 -2814541 -2217420 -1712148 -1216498 -606796 138484 925878 1609519
14430 1609519 2048804 2153061 1896875 1297733 436513 -459005 -1047052 -1090441 -608886 184043
14420A84043Q02952M98795k3524n78205r77567j144230j159169j167920j198356
14411d763181j098867p21435j11247N53685J100557J422046J526833J477387J285262
14402F71040R62633O05358L41003K40826K49457J74662j28688n69959r14717r93270
14392F38345p83051l76682P8565M31347N63340M20267Q7028k26422l52990k95461
14382A84286j31069J50427N91838J095743J419440J394730J089859P47945N68976
14373G112175N54878N73779N09066L61445J93823N6165L9550K20994N25968P12946
14363A0860789N35285L551o24485j118814j419599j578407j594554j381279r73020
14354B709467n29914l6583P00946J680109K564000K943185K653945J926351J205403
$$ plain form
14420 184043 986995 1485790 1462266 884061 -93506 -1237736 -2396905 -3564825 -4763181
14411 -4763181 -5862048 -6583483 -6694730 -6141045 -5040488 -3618442 -2091609 -614222 671040
14402 671040 1633673 2239031 2580034 2820860 3070317 3244979 3116291 2546332 1631615 638345
14392 638345 -144706 -521388 -442823 -11476 551864 972131 1059159 832737 479747 184286
14382 184286 53217 203644 795482 1891225 3310665 4705395 5795254 6543199 7112175
14373 7112175 7667053 8240832 8749898 9111343 9305166 9361331 9400881 9621875 10147843 10860789
14363 10860789 11396074 11399625 10775140 9656326 8236727 6658320 5063766 3682487 2709467
14354 2709467 2179553 2142970 2843916 4524025 7088025 10031210 12685155 14611506 15816909
14345A5816909P49770M46905M1268n34025j065269j282804j138092p85506m07305
14336A1841851j22739K0604L4365m8047k76951p11141j184958j375799j197379
14327F979806r07272p20267n39058j75935L24107O95062O98136L11754k36186
14318F430147o50212p97447o84855l43464J08739M44506N34415M71212M06207
14309E919248L87415L72452L32872L51138N62982J017443J694667K614708L778727
14300A7031652N052957O231298P180637P800340P795270O639734M065985P00618
14292F2498491k221406l892689m288869l782986k845171j937381j342740j000980
14284D1186269o07807R3175J097713K229620L414919M719242O202050P887399
$$ plain form
14345 15816909 16566679 17013584 17054852 16520827 15455558 14172754 13034662 12249156 11841851
14336 11841851 11719112 11739716 11774081 11726034 11449083 10737942 9552984 8177185 6979806
14327 6979806 6072534 5352267 4813209 4637274 4961381 5656443 6354579 6666333 6430147
14318 6430147 5779935 4982488 4297633 3954169 4062908 4507414 5041829 5513041 5919248
14309 5919248 6306663 6679115 7011987 7363125 7926107 8943550 10638217 13252925 17031652
14300 17031652 22084609 28315907 35496544 43296884 51092154 57731888 61797873 62498491
14292 62498491 60277085 56384396 52095527 48312541 45467370 43529989 42187249 41186269
14284 41186269 40578462 40671637 41769350 43998970 47413889 52133131 58335181 66222580
14276F6222580R685937J1199018J1648410J0092886O084568M13868n117870q966588
14268A01262809j0749494j1003460j0430700r457528q296063p147472o183068
14261C7995024n399617m629804l760964k871972k099821j511203j099489q10403
14253A5811751n93038m39380l75522l83320l73447k77833q4368K00660N18063
14244A4003566P25928P10038M84159J59225j50704m07800o31780p66763o74429
14235A3451440l31282O9889L02905K99700J12096j44235k73465j38089J84784
14226A3533743M99156O34575N13929J84867k00583m45781m11982j21052L03766
14217A4490638P31389J012303J030411P87654L83954n8868m96393r75025j457547
$$ plain form
14276 66222580 75908517 87107535 98755945 108848831 114933399 115347267 110229397 101262809
14268 101262809 90513315 79509855 69079155 59621627 51325564 44178092 37995024
14261 37995024 32595407 27965603 24204639 21332667 19232846 17721643 16622154 15811751
14253 15811751 15218713 14779333 14403811 14020491 13647044 13369211 13284843 13485503 14003566
14244 14003566 14729494 15439532 15923691 16082916 15932212 15524412 14892632 14125869 13451440
14235 13451440 13120158 13190047 13492952 13792652 13904748 13760513 13487048 13348959 13533743
14226 13533743 14032899 14667474 15181403 15366270 15165687 14719906 14307924 14186872 14490638
14217 14490638 15222027 16234330 17264741 18052395 18436349 18377481 17881088 16906063 15448516
14208A5448516j749850j690550j350401r76382p25799n75875l93218J2465O95248
14199H694154J429734J889586J908076J542873R75311L96163o3058l80310o41689
14190A5750840q88368j016251r31217o73225l40940l3812J68490L07832M54155
14181A2797504N10246L61268M5427l64093q16709j189471j344523j239605q89432
14172G870612l57379J80514N46195P61707J012541J367834J617236J500227J037036
14163A5536523M87942N1601j94422j83330M1579K17006M5197m69122r67049j091838
14153A3474087p88982k16312M68969J148040J682712J927320J871484J668260
14145B1235578J425880J161585R37124Q51717R53841J209255J514191J775134
$$ plain form
14208 15448516 13698666 12008116 10657715 9681333 8955534 8379659 7986441 7998906 8694154
14199 8694154 10123888 12013474 13921550 15464423 16439734 16835897 16772839 16392529 15750840
14190 15750840 14862472 13846221 12915004 12241779 11900839 11867027 12035517 12343349 12797504
14181 12797504 13307750 13669018 13714445 13350352 12533643 11344172 9999649 8760044 7870612
14172 7870612 7513233 7693747 8239942 9001649 10014190 11382024 12999260 14499487 15536523
14163 15536523 16024465 16076066 15881644 15698314 15739893 15956899 16002096 15532974 14565925 13474087
14153 13474087 12685105 12468793 12937762 14085802 15768514 17695834 19567318 21235578
14145 21235578 22661458 23823043 24760167 25611884 26565725 27774980 29289171 31064305
14137C1064305J966619K094083K191186K404039K926867L790219M851657N989962
14129E7278937P192160Q512176J0029358J1782194J3809495J6305708J9545840
14122A44455868K3611067K8302417L3264794L7997567M1397876M0984283L3251392
14115C83265264J6548266n455386k5044791l6706157m0396955l9060916l5454547
14108B17694778l1141384k6822085k2784373j9122964j5883664j3156987j1001035
14101G7782286r313651p929421o769548n801520m990853m301859l695491l188470
14093C1791473k851057k703102k698845k733173k671252k468604k187490j894713
14085A1583237j592935j265458j000079r34838j068074j279448j437398j410307
$$ plain form
14137 31064305 33030924 35125007 37316193 39720232 42647099 46437318 51288975 57278937
14129 57278937 64471097 72983273 83012631 94794825 108604320 124910028 144455868
14122 144455868 168066935 196369352 229634146 267631713 309029589 350013872 383265264
14115 383265264 399813530 394358144 369313353 332607196 292210241 253149325 217694778
14108 217694778 186553394 159731309 136946936 117823972 101940308 88783321 77782286
14101 77782286 68468635 60539214 53769666 47968146 42977293 38675434 34979943 31791473
14093 31791473 28940416 26237314 23538469 20805296 18134044 15665440 13477950 11583237
14085 11583237 9990302 8724844 7724765 6789927 5721853 4442405 3005007 1594700
14077A594700j176239q99792o92863m32057O0N14512R49507J183888J172571R42622
14067C156909N46070J45001K127K14555O50660J109398J364353J253979Q49997
14058I293049L62737r7255n08609q20192r53710q37694n11757k06473j54212l37888
14048E227996n52403o69419p16203p73799r08453j108436j259459j273115j132303
14039c165594q25889l94395J7464K62741L59477M78732P36926J011191J056245
14030d63102P87611L14342j89293n81952q02915q56502p52049m97239j67069J11129
14020c097039K52280K48495J32091o9024l15407n48051p56744r51391j039389
14011f144179q61937m00359J72508O71381R80623J025560Q44761O40701N97091
$$ plain form
14077 1594700 418461 -481331 -1174194 -1606251 -1606191 -1091679 -142172 1041716 2214287 3156909
14067 3156909 3702979 3847980 3850107 4064662 4715322 5824720 7189073 8443052 9293049
14058 9293049 9655786 9558531 9049922 8229730 7276020 6438326 5926569 5720096 5565884 5227996
14048 5227996 4675593 4006174 3289971 2516172 1607719 499283 -760176 -2033291 -3165594
14039 -3165594 -3991483 -4385878 -4368414 -4105673 -3746196 -3267464 -2530538 -1519347 -463102
14030 -463102 324509 638851 449558 -132394 -935309 -1791811 -2543860 -3041099 -3208168 -3097039
14020 -3097039 -2844759 -2596264 -2464173 -2533197 -2848604 -3396655 -4153399 -5104790 -6144179
14011 -6144179 -7006116 -7406475 -7233967 -6562586 -5581963 -4556403 -3711642 -3070941 -2473850
14002b473850O72148O76043M93511J75038j17179k28732p9393L47710R31031J374895
13992A771222J426541J103879N83365J3258m25680n20667k68245J3750m6383n20082
13982C130958j134238j544710j621410j436954j081565o55227k71966K2102K13453
13973d379557K69296J69373o7884l43259m59776k32997L19658R53974J434934
13964b336238J686162J723015J587448J347629J081514Q28734N73566K79640l6042
13955F735428k82596l70817k35408J34374O31806J050409J208581J078693P60123
13946A0710593L32667j88103p38479j156873j285974j124819q84134p80128q08516
13937D076234q21094p44351o50303o48968p82326j006597j189463j181808r78230
$$ plain form
14002 -2473850 -1801702 -1125659 -632148 -457110 -574289 -803021 -882414 -534704 396327 1771222
13992 1771222 3197763 4301642 4885007 4898265 4472585 3951918 3683673 3697423 3651040 3130958
13982 3130958 1996720 452010 -1169400 -2606354 -3687919 -4343146 -4615112 -4593010 -4379557
13973 -4379557 -4110261 -3940888 -4008772 -4352031 -4811807 -5044804 -4725146 -3771172 -2336238
13964 -2336238 -650076 1072939 2660387 4008016 5089530 5918264 6491830 6771470 6735428
13955 6735428 6452832 6082015 5846607 5980981 6612787 7663196 8871777 9950470 10710593
13946 10710593 11043260 10855157 10116678 8959805 7673831 6549012 5664878 4884750 4076234
13937 4076234 3255140 2510789 1860486 1211518 429192 -577405 -1766868 -2948676 -3926906
13928c926906p44970o64406p69005r11153r05399p08354m48544k70756j85000
13919i534493j23242n8887j1968j2925p4442j43392j37905l4374J55605M19205
13909i556818P15027R39982R55848P31506M12188K23342L01395N44877O84597
13900d048056N80178L50410J46572j1542j11801j48234k62949n79873r72542j200785
13890f258622j110164o65961L8230P85262J288776J376621J155164Q29337M82865
13881b078492J35520j67478l64209m16718l22474o5752L51792P99451J085517
13872a042843J107132Q64343M70678J14944j00100j34907R2477N89588J159819
13863C121131J481014J340599P92630R1724m91578q25842r70874j039383j020155
$$ plain form
13928 -3926906 -4671876 -5336282 -6105287 -7016440 -7921839 -8630193 -9078737 -9349493 -9534493
13919 -9534493 -9657735 -9716622 -9728590 -9741515 -9815957 -9959349 -10097254 -10131628 -9976023 -9556818
13909 -9556818 -8841791 -7901809 -6945961 -6214455 -5802267 -5578925 -5277530 -4732653 -4048056
13900 -4048056 -3467878 -3117468 -2970896 -2982438 -3094239 -3242473 -3505422 -4085295 -5057837 -6258622
13890 -6258622 -7368786 -8034747 -7996517 -7211255 -5922479 -4545858 -3390694 -2561357 -2078492
13881 -2078492 -1942972 -2110450 -2474659 -2891377 -3213851 -3279603 -2927811 -2128360 -1042843
13872 -1042843 64289 928632 1399310 1514254 1414154 1279247 1371724 1961312 3121131
13863 3121131 4602145 5942744 6735374 6827098 6335520 5509678 4538804 3499421 2479266
13854B479266q49633n33912j31936K61114N01069M83379K13773k54296q47617
13845A321207j424903j806814j903872j733772j356090q57947l69695N991K66641
13836g859254M53157O28591Q14308R28986R15660Q31866Q24755R93194J256576
13827b12161J474624J534315J348270R80016N96997K49812j00296l61307l75450
13818E134820j94612n1718j16822l99597p87307j145950j413690j547769j461362
13809a984007j131116p02958m03532l15457l24485k76215j09093J06258K41131
13800d899474K18271J07337P9666J87619L13337L57032L54923L98159M47554L39047
13790b096529K898l94920n30834k16757L98658J052818J668571K226409K562826
$$ plain form
13854 2479266 1629633 1095721 963785 1224899 1725968 2209347 2423120 2168824 1321207
13845 1321207 -103696 -1910510 -3814382 -5548154 -6904244 -7762191 -8131886 -8125895 -7859254
13836 -7859254 -7406097 -6777506 -5963198 -5034212 -4118552 -3286686 -2461931 -1468737 -212161
13827 -212161 1262463 2796778 4145048 5125064 5722061 5971873 5871577 5510270 5134820
13818 5134820 4940208 4888490 4771668 4372071 3584764 2438814 1025124 -522645 -1984007
13809 -1984007 -3115123 -3818081 -4221613 -4537070 -4861555 -5137770 -5246863 -5140605 -4899474
13800 -4899474 -4681203 -4573866 -4494200 -4306581 -3993244 -3636212 -3281289 -2883130 -2435576 -2096529
13790 -2096529 -2093631 -2488551 -3019385 -3236142 -2837484 -1784666 -116095 2110314 4673140
13781D673140K522259K131486J534362R33195N14400K80700O9146k54547o75267
13772A1728874j079217j361419j470607j416914j293539j255461j371336j528075
13764I52306j574048j449608j128190o00050J3383M93795P02292O75958N67903
13755a346259M99063N38597P14322R30592R74406P28406L64693J75959J89449
13746C769228J43948j77140p21839j200503j329354j084655o49437k12388J61467
13737a300673N24630R39351J427990J956774K359929K404864K049726J521769
13729A1884360J073494Q23119P80076Q16713P47645N32358K99634J13466j45082
13720A6925783n49912r30834j068736r82812q44884p49471p04467o85166o46260
$$ plain form
13781 4673140 7195399 9326885 10861247 11794442 12308842 12589542 12658688 12404141 11728874
13772 11728874 10649657 9288238 7817631 6400717 5107178 3851717 2480381 952306
13764 952306 -621742 -2071350 -3199540 -3799590 -3786207 -3292412 -2590120 -1914162 -1346259
13755 -1346259 -847196 -308599 405723 1336315 2310721 3039127 3403820 3579779 3769228
13746 3769228 3913176 3736036 3014197 1813694 484340 -600315 -1249752 -1462140 -1300673
13737 -1300673 -776043 163308 1591298 3548072 5908001 8312865 10362591 11884360
13729 11884360 12957854 13780973 14561049 15377762 16125407 16657765 16957399 17070865 16925783
13720 16925783 16375871 15445037 14376301 13393489 12548605 11799134 11094667 10409501 9763241
13711I763241o29008p50123r78707j114932j039411q38534o45477n11488m45749
13702B809812m23323l47647j20185K30708N77119Q09756Q64128P33049M64872
13693E598289J44828j25313l15010m98183p13986q81703q79243o66221l54294
13684A309164j52961j76937l48828n11844n20604k69665J64571M96599N07621
13675D97116K15739k26024o41952q94456r24542p74189n67336l91500k02041P5311
13665c833874L94660N98534N44318K50889q0468j97281J393L80616O94484P94904
13655d51825P57715P73206Q74907Q78887O53082K51810k05375n71724p19378o47405
13645A593900m32981j59856P2181J81080K01320K61387M16046O42686R74566J442437
$$ plain form
13711 9763241 9134233 8384110 7405403 6290471 5251060 4412526 3767049 3255561 2809812
13702 2809812 2386489 2038842 1918657 2149365 2726484 3536240 4400368 5133417 5598289
13693 5598289 5743117 5617804 5302794 4804611 4090625 3208922 2329679 1663458 1309164
13684 1309164 1156203 979266 630438 118594 -402010 -671675 -507104 -10505 497116
13675 497116 712855 486831 -155121 -1049577 -1974119 -2748308 -3315644 -3707144 -3909185 -3833874
13665 -3833874 -3439214 -2840680 -2296362 -2045473 -2125941 -2323222 -2321829 -1941213 -1246729 -451825
13655 -451825 305890 1079096 1954003 2832890 3485972 3737782 3532407 2960683 2241305 1593900
13645 1593900 1160919 1001063 1073244 1254324 1455644 1717031 2133077 2775763 3750329 5192766
13635E192766J857553J873631J348521M90574l24598p80510p62491l84733J38386
13626H649099N95505Q29407P97463N56795K07388j72412n66764r19666j113310
13617H863505j091590r16053p09035n40063m53493n38712p66332r28543r23217
13608A996467q71947q77725q66414p74370o48977m89861k49624K0682K05489K82403
13598b273877L33261M21347N46292O85028P91544Q27911Q36007Q68647Q53344
13589C889504O97462M95669M43705N52639N99610M29198J07720k90554p72569
13580F152384j251567j494377j330517q63297l92241j53925j71206k96936l32079
13571a33761j44303K12744N50237P47121P95096P46303O85245O32524N52116M08321
$$ plain form
13635 5192766 7050319 8923950 10272471 10763045 10438447 9657937 8895446 8510713 8649099
13626 8649099 9244604 10074011 10871474 11428269 11635657 11463245 10896481 9976815 8863505
13617 8863505 7771915 6855862 6146827 5606764 5153271 4614559 3848227 2919684 1996467
13608 1996467 1124520 246795 -619619 -1393989 -2042966 -2532827 -2782451 -2761769 -2556280 -2273877
13598 -2273877 -1940616 -1519269 -972977 -287949 503595 1331506 2167513 3036160 3889504
13589 3889504 4586966 5082635 5526340 6078979 6678589 7107787 7215507 6924953 6152384
13580 6152384 4900817 3406440 2075923 1212626 820385 666460 495254 198318 -133761
13571 -133761 -278064 -65320 484917 1232038 2027134 2773437 3458682 4091206 4643322 5051643
13561E051643J77046r1313l16925m74560n56913n52146m85649m72675o48676r67487
13551F62345j202705j203848r97170o16245p7173M72195Q29789R67854R80284
13542a84674R15738Q20657P60635P65473Q69515J074655J231417J135686P63310
13533H152412K83806j16308l53136m23808l49204j50047J32685L78894M53838
13524H009132L72241K55751J53792k60k70541n70105p00523n50988j51088L70462
13514F917873P99228R66642Q98635P18464M67143J57787n7571M4501N05146J071390
13504A2489238J386355J325340J100299J037845J287874J723079K037731J966688
13496B4354449J486040P72346J5329o43276j113373j334160j244705q42879k76863
$$ plain form
13561 5051643 5228689 5137376 4820451 4345891 3788978 3236832 2751183 2278508 1629832 662345
13551 662345 -540360 -1744208 -2741378 -3357623 -3434796 -2962601 -2132812 -1164958 -184674
13542 -184674 731064 1551721 2312356 3077829 3947344 5021999 6253416 7389102 8152412
13533 8152412 8436218 8319910 7966774 7542966 7193762 7043715 7176400 7555294 8009132
13524 8009132 8381373 8637124 8790916 8790656 8520115 7950010 7249487 6698499 6547411 6917873
13514 6917873 7717101 8683743 9582378 10300842 10767985 10925772 10868201 10912702 11417848 12489238
13504 12489238 13875593 15200933 16301232 17339077 18626951 20350030 22387761 24354449
13496 24354449 25840489 26612835 26628164 25984888 24871515 23537355 22292650 21449771 21172908
13487B1172908K18376N11371O24093O39381O55231P67663J039886J478314J977478
13478B9084701K348616K502660K534233K603765K782002L068055L531719M293536
13470E2749287N411159O845939Q479349J0216544J2071178J4184009J6838135
13463A26795600K0292856K4563137K9422397L4347361L8097788L8262995L1866089
13456C43648223J7817636o09065j7218006k7687811l1873142l1950962k9984135
13449B22142738k7124118k3910659k0659239j7648535j5169650j3430850j2374378
13442I1825309j1617600j0710228r502792q175861o959414n902802m923548m039239
13434B9993825l372282k951644k729163k643226k551246k298334j870150j406188
$$ plain form
13487 21172908 21391284 21902655 22526748 23166129 23821360 24589023 25628909 27107223 29084701
13478 29084701 31433317 33935977 36470210 39073975 41855977 44924032 48455751 52749287
13470 52749287 58160446 65006385 73485734 83702278 95773456 109957465 126795600
13463 126795600 147088456 171651593 201073990 235421351 273519139 311782134 343648223
13456 343648223 361465859 360856794 343638788 315950977 284077835 252126873 222142738
13449 222142738 195018620 171107961 150448722 132800187 117630537 104199687 91825309
13442 91825309 80207709 69497481 59994689 51818828 44859414 38956612 34033064 29993825
13434 29993825 26621543 23669899 20940736 18297510 15746264 13447930 11577780 10171592
13426A0171592j063556q87971p58789m79001J4627N47847Q89600J021948J072373
13417A0528670J119817J186647J214868J052414O51409K00114k6825J20387N12272
13408A6559773P83079O89776L34368k8813k30633k58039k27621k80538m86380
13399A6854972q12460j178565j518643j709968j579098j121612n55772n1541L86460
13390H713773P50214Q95149O45513O4689n20504p90849o64200l36306j05634j15348
13380H536497k57307l12885k08981q1647m6142q5570j53888k47903l94867n98884
13370F148423q50860j102562j226872j135147q70471n45668k68509p5722P1913
13361A44525J80648K03201J64594J69700K56250L49151L57047K35984k1093l82641
$$ plain form
13426 10171592 9108036 8220065 7461276 6982275 6996902 7544749 8434349 9456297 10528670
13417 10528670 11648487 12835134 14050002 15102416 15753825 15953939 15927114 16047501 16559773
13408 16559773 17342852 18032628 18366996 18338183 18107550 17849511 17621890 17341352 16854972
13399 16854972 16042512 14863947 13345304 11635336 10056238 8934626 8378854 8327313 8713773
13390 8713773 9463987 10359136 11004649 11069338 10548834 9757985 9093785 8757479 8651845 8536497
13380 8536497 8279190 7966305 7757324 7675677 7629535 7543965 7390077 7142174 6747307 6148423
13370 6148423 5297563 4195001 2968129 1832982 962511 416843 148334 72612 144525
13361 144525 325173 528374 692968 862668 1118918 1468069 1825116 2061100 2040007 1657366
13351A657366p54073j029583j196815j321742j411494j365721j108243o92149
13343g222454j97652L54634R16021J334280J436767J208034P99913L63318j1135
13334a018274k47024l11162k59123j49927o543Q3233O676k28805m91655o11567
13324c234171n05921k88644j28451l5017R8357K56268K30445j04031o34408j111945
13314e457518j259635r30138k12103O25696J255822J417329J098291O13467L03912
13305b544877K52213L97677O61152R26963J089310J099914R84890Q29536O48086
13296D344864L75813K3889l11829n44576o07360m46605r5276K76659M69922M22955
13286C908456K28143R844j77018l34000m75597o00841o65543n82375k66003K28810
$$ plain form
13351 1657366 903293 -126290 -1323105 -2644847 -4056341 -5422062 -6530305 -7222454
13343 -7222454 -7420106 -7065472 -6149451 -4815171 -3378404 -2170370 -1370457 -1007139 -1018274
13334 -1018274 -1265298 -1576460 -1835583 -1985510 -1992053 -1908820 -1902144 -2130949 -2622604 -3234171
13324 -3234171 -3740092 -4028736 -4157187 -4192204 -4093847 -3837579 -3607134 -3711165 -4345573 -5457518
13314 -5457518 -6717153 -7647291 -7859394 -7233698 -5977876 -4560547 -3462256 -2848789 -2544877
13305 -2544877 -2292664 -1894987 -1233835 -306872 782438 1882352 2867242 3696778 4344864
13296 4344864 4720677 4744566 4432737 3888161 3280801 2834196 2738920 3015579 3485501 3908456
13286 3908456 4136599 4146443 3969425 3635425 3159828 2558987 1893444 1311069 1045066 1273876
13276A273876O33933P16481N50077L31547R2072k04070m48085m69822k40250J52878
13266B388637N71735Q33100Q48520P21422O14148N59367M42067J52398l24206
13257F807188r46696j619078k137231k240929j802337r54465j0736P84595J403607
13248g16082J860864K055976J899422J449762Q31864J49359m82027r56484j249214
13239D843440j377739j361430j258930j123969r66070p48113m80770l12454l50209
13230c136244m59511l89891o5523L59525O57277P27495P15626Q64619J203942
13221D77315J522866J633999J531050J319811J057235O92752J40032n95272j304526
13212F475262j712362j732669j490635j153130p75359k97640L18964R44272J320614
$$ plain form
13276 1273876 1907809 2624290 3174367 3505914 3597986 3393916 2945831 2476009 2235759 2388637
13266 2388637 2960372 3793472 4641992 5363414 5977562 6536929 6978996 7131394 6807188
13257 6807188 5860492 4241414 2104183 -136746 -1939083 -2893548 -2904284 -2119689 -716082
13248 -716082 1144782 3200758 5100180 6549942 7381806 7531165 7049138 6092654 4843440
13239 4843440 3465701 2104271 845341 -278628 -1244698 -1992811 -2473581 -2786035 -3136244
13230 -3136244 -3595755 -3985646 -4051169 -3691644 -3034367 -2306872 -1591246 -726627 477315
13221 477315 2000181 3634180 5165230 6485041 7542276 8235028 8375060 7779788 6475262
13212 6475262 4762900 3030231 1539596 386466 -388893 -686533 -367569 576703 1897317
13203A897317J313210J007799N34166M922m66511q46919j127595j215366j064365
13194C6658p97725o05154n97490p20062q17863p82897o31878m71473l76332k84579
13184f048795m1254M10556R18718J289210J456137J409210J133095O53778M3918
13175A224573n97754j109054j297848j069432n33423J9641L29784L19291Q5684
13166b628538j30783n2305M15642J052926J510876J597191J331558Q36188K61426
13157D194181k30725m81547m20411j31438K08733M88431P22302R44014J166002
13148F459542J325813J281218J037592P82342O55662O26714N30989J62222n82289
13139A2279805j514658k228577k465943k296354j944085j547355j128809p12650
$$ plain form
13203 1897317 3210527 4218326 4752492 4757414 4290903 3443984 2316389 1101023 36658
13194 36658 -761067 -1366221 -1963711 -2683773 -3501636 -4284533 -4916411 -5387884 -5764216 -6048795
13184 -6048795 -6090049 -5679493 -4760775 -3471565 -2015428 -606218 526877 1180655 1224573
13175 1224573 626819 -482235 -1780083 -2849515 -3382938 -3363297 -3033513 -2714222 -2628538
13166 -2628538 -2759321 -2811626 -2395984 -1343058 167818 1765009 3096567 3932755 4194181
13157 4194181 3963456 3481909 3061498 2930060 3138793 3627224 4349526 5293540 6459542
13148 6459542 7785355 9066573 10104165 10886507 11542169 12168883 12699872 12862094 12279805
13139 12279805 10765147 8536570 6070627 3774273 1830188 282833 -845976 -1558626
13131a558626l91766k60523l26345n17998p09002p82540p25178n63573k99161
13122f134712R635K44492L56217L84802L51349K44723R5543m4810j74505k74440
13112d941706k55534n1228L08118O58192P64649N77159L18934K57194M89976Q82391
13102i91855J141506J095987Q47361N78022L87004L13965L43777M26615N59628
13093D702010P14606P44852N52093K11685j88556o43085j114671j437642j409888
13084B131404j001908l89338J53694M32297N38745P19699J032650J279484J256607
13075F153334R90769O98536N64481N84464O30754O24818N43488L95317K41779
13066A1427740R3753j34782m27140o41895p29066p01493n34965l09174k11768
$$ plain form
13131 -1558626 -1950392 -2210915 -2537260 -3055258 -3764260 -4546800 -5271978 -5835551 -6134712
13122 -6134712 -6125077 -5880585 -5524368 -5139566 -4788217 -4543494 -4447951 -4492761 -4667266 -4941706
13112 -4941706 -5197240 -5248468 -4940350 -4282158 -3517509 -2940350 -2621416 -2364222 -1874246 -991855
13102 -991855 149651 1245638 2092999 2671021 3058025 3371990 3715767 4142382 4702010
13093 4702010 5416616 6161468 6713561 6925246 6736690 6093605 4978934 3541292 2131404
13084 2131404 1129496 740158 893852 1326149 1864894 2584593 3617243 4896727 6153334
13075 6153334 7144103 7842639 8407120 8991584 9622338 10247156 10790644 11185961 11427740
13066 11427740 11521493 11386711 10959571 10317676 9588610 8887117 8352152 8042978 7831210
13057G831210l10901n02303o69898p70848p76488o77667m95594k34103J01966
13048C495374M60676P38090Q20007O95661M81458K81513O6395k47392o50598j004658
13038E136526j105474q82470n14341k35593j07617m4432L3978J40424K62671M05127
13028C088799N63345O81803O94992O15199N46324N60162N28531K87985j3904n3138
13018G500098K58529O72299Q35997O16134J89204j76229l28027k58016n5637J92147
13008I446499M50199O47097O45687L56254j57510o66739q89276p21876l56333
12999H754002j07356j53454m35963p32548q19435o22936k13745K72265O29851
12990F570681O81850M82792K53726J04442k8612j84941k76090k51903k63344m71315
$$ plain form
13057 7831210 7520309 7018006 6348108 5577260 4800772 4123105 3627511 3393408 3495374
13048 3495374 3956050 4694140 5514147 6209808 6691266 6972779 7039174 6791782 6141184 5136526
13038 5136526 4031052 3148582 2634241 2398648 2291031 2246599 2280577 2421001 2683672 3088799
13028 3088799 3652144 4333947 5028939 5644138 6190462 6750624 7279155 7567140 7553236 7500098
13018 7500098 7758627 8430926 9266923 9883057 10072261 9896032 9568005 9309989 9254352 9446499
13008 9446499 9896698 10543795 11189482 11545736 11388226 10721487 9832211 9110335 8754002
12999 8754002 8646646 8493192 8057229 7324681 6505246 5882310 5668565 5940830 6570681
12990 6570681 7252531 7735323 7989049 8093491 8064879 7879938 7603848 7351945 7088601 6617286
12980F617286p92050j044103j186096j244179j151070p81421j40960N19733Q96332
12971A693472R16858P26907M66996J64589k09746o27488r49526j064994r97965
12962A19103p71450l47089K08165O89033R39484R07466O36208K79085K4847K4779
12952B709631K87974O36075Q45672Q43268P38941O32408N07613L59051J98293
12943G758926n9493m79370r38625j284888j492591j596623j658635j709841j651998
12934c113138j362528q93465m28005r3841J07018K84857N72766R63442J272394
12925b690500J367481J318833J203308R82144O27172J59131l61372p81754r03151
12916I21292o62150k12691K15998N46618R06122J331243J578668J431931J006233
$$ plain form
12980 6617286 5825236 4781133 3595037 2350858 1199788 418367 277407 797140 1693472
12971 1693472 2610330 3337237 3804233 3968822 3759076 3131588 2182062 1117068 119103
12962 119103 -652347 -999436 -791271 -102238 837246 1744712 2380920 2660005 2684852 2709631
12952 2709631 2997605 3633680 4479352 5322620 6061561 6693969 7201582 7560633 7758926
12943 7758926 7699433 7220063 6281438 4996550 3503959 1907336 248701 -1461140 -3113138
12934 -3113138 -4475666 -5369131 -5797136 -5890977 -5783959 -5499102 -4926336 -3962894 -2690500
12925 -2690500 -1323019 -4186 1199122 2181266 2808438 2967569 2606197 1824443 921292
12916 921292 259142 46451 262449 809067 1715189 3046432 4625100 6057031 7063264
12907G063264N97805L42079J33472j76593o24637j091131j357466j257805q26015
12898B802973l12437j9675n7348k67244m36075n17736n47974m93089k91940M1069
12888i9476L84591O03556O64021N64564K47861k77108q64537j357297j625142
12879a758967j587712j361580j178461j090189r61634o70802j55929N60041J297347
12870f907886J819642K049010K064865J922618J581151R72974J59110o03196j072153
12861A986135j218754j143604r64410q35945q73948j027210j113451r74449o03493
12852f769129j46194J99464L21997K72613J70729J16696J48520J70483L1796k51163
12842e734188m66146m35642j45337L09727P38000R34855Q90586P11382M07228
$$ plain form
12907 7063264 7661069 8003148 8136620 7960027 7335390 6244259 4886793 3628988 2802973
12898 2802973 2490536 2470861 2413513 2146269 1710194 1192458 644484 151395 -140545 -99476
12888 -99476 285115 888671 1552692 2117256 2365117 2088009 1223472 -133825 -1758967
12879 -1758967 -3346679 -4708259 -5886720 -6976909 -7938543 -8609345 -8765274 -8205233 -6907886
12870 -6907886 -5088244 -3039234 -974369 948249 2529400 3502374 3661484 3058288 1986135
12861 1986135 767381 -376223 -1340633 -2176578 -3050526 -4077736 -5191187 -6165636 -6769129
12852 -6769129 -6915323 -6715859 -6393862 -6121249 -5950520 -5833824 -5685304 -5514821 -5483025 -5734188
12842 -5734188 -6200334 -6635976 -6781313 -6471586 -5733586 -4798731 -3908145 -3196763 -2789535
12833b789535l416l45891m29426k67774m9402J20212L04267N22016O11978M28913
12823a898058M9291l26735n23614m46691j46274K03164M14162L83331J58083r9696
12813b233037k35211k00315n1701J24003K60360L47653L87650L86174L90753M24711
12803c98960M85116O21134Q86393J196952J325571J119524O84891K39731j64754
12794E995598o20601j116271j472513j522865j298411j007561q50666q45953q25029
12785c564272o09958j82133L04758O29193N90455J64816m30346r05200j054197
12776e056884q35694m04452k0908J46643J67706K21947L08881L02471K52533K92458
12766d625299L86051M30350M00157K62023j3325l25148n18976n26540l99393k56932
$$ plain form
12833 -2789535 -2792951 -3138842 -3568268 -3836042 -3885444 -3765232 -3460965 -2938949 -2326971 -1898058
12823 -1898058 -1848767 -2175502 -2699116 -3145807 -3292081 -3088917 -2674755 -2291424 -2133341 -2233037
12813 -2233037 -2468248 -2668563 -2720264 -2596261 -2335901 -1988248 -1600598 -1214424 -823671 -398960
12803 -398960 86156 707290 1593683 2790635 4116206 5235730 5920621 6160352 5995598
12794 5995598 5374997 4258726 2786213 1263348 -35063 -1042624 -1893290 -2739243 -3564272
12785 -3564272 -4174230 -4356363 -4051605 -3422412 -2831957 -2667141 -3097487 -4002687 -5056884
12776 -5056884 -5892578 -6297030 -6317938 -6171295 -6003589 -5781642 -5472761 -5170290 -4917757 -4625299
12766 -4625299 -4239248 -3808898 -3408741 -3146718 -3160043 -3485191 -4004167 -4530707 -4930100 -5187032
12756e187032j06074J76308O15495J069943J376469J440158J229725P93445K79807
12747A688244q2092j54422m4077N3378N7319j8057j23387k24747l99947p23226
12737B8986j042110j120885q88617m40329N9611M70440P58429R36862R51806P66499
12727D80692M49630Q6153k92380o21683p91871q06337q04672r04944j107008j326084
12717e638504j503155j607271j495498r76819j04716P76187J280713J221186P09201
12708g338676P8689l50236m42455k26191J64570N64195R03479J242000J634476
12699c770149J965623K039968J805820J361722Q57615M29552J19477j27915l52115
12690D329598n74468q32948j059338j081141q34029m51639j18955P9367J30708
$$ plain form
12756 -5187032 -5293106 -5116798 -4501303 -3431360 -2054891 -614733 614992 1408437 1688244
12747 1688244 1606152 1451730 1407653 1461031 1518350 1500293 1376906 1152159 752212 28986
12737 28986 -1013124 -2134009 -3022626 -3462955 -3403344 -2932904 -2174475 -1237613 -285807 480692
12727 480692 930322 1016475 724095 102412 -689459 -1495796 -2300468 -3205412 -4312420 -5638504
12717 -5638504 -7141659 -8748930 -10244428 -11221247 -11325963 -10549776 -9269063 -8047877 -7338676
12708 -7338676 -7259987 -7610223 -8052678 -8278869 -8114299 -7550104 -6646625 -5404625 -3770149
12699 -3770149 -1804526 235442 2041262 3402984 4260599 4690151 4809628 4681713 4329598
12690 4329598 3755130 2922182 1862844 781703 -52326 -503965 -622920 -543553 -412845
12681d12845R9178J67284M53727Q08083R55558P55333L05503j39730m11423n13124
12671B067544m87308l65650k12961n3008J79398M66273O38693N25838N1081p42088
12661B067812j631605k274835k432690k109037j532664j004300o69903m80673
12653a0067895l22261j11707J45893L97461O32424Q60340J104950J411270J659529
12644d289996J587852J153788O18433K36172J9672j42462k67642k99888k41792
12635a625863r1318J95408N65993Q52982R18103P55121M47073P2624l06174o17964
12625A165985p86009p04299k97921K89202O90903O43372K15897l31330p48921
12616A36879q71913o47927j73912L07221N34875M06834J3573m89291j001066j448671
$$ plain form
12681 -412845 -313667 -146383 307344 1115427 2070985 2826318 3131821 2992091 2580668 2067544
12671 2067544 1580236 1214586 1001625 948617 1128015 1594288 2232981 2758819 2809900 2067812
12661 2067812 436207 -1838628 -4271318 -6380355 -7913019 -8917319 -9587222 -10067895
12653 -10067895 -10390156 -10501863 -10355970 -9958509 -9326085 -8465745 -7360795 -5949525 -4289996
12644 -4289996 -2702144 -1548356 -929923 -693751 -674079 -816541 -1084183 -1384071 -1625863
12635 -1625863 -1717181 -1521773 -955780 -102798 815305 1570426 2017499 2090123 1783949 1165985
12625 1165985 379976 -324323 -622244 -333042 357861 1001233 1217130 885800 136879
12616 136879 -735034 -1382961 -1556873 -1249652 -714777 -307943 -294370 -783661 -1784727 -3233398
12606c233398j686023j557522j051400l38994L60432R77967J534284J921113J923892
12597a149649J512230J002966P44316P40677P66771O75356M72797K07019j02048
12588D870435l93274n65728o26921o30435n16231k25980J25186L18585K18258
12579B573895j47347o10421r64503j098853j050852r25284q09262p72765q53428
12570d658820j032669j268135j489300j635958j712693j700657j500962j035566
12562a6034760l52874L67329R07539J179817J260813J237216J157180J086547
12554i191193J070892J064005R94542R12198R03781R23256Q62357P38046O88265
12545a033851P57224P84406N40540l4080p32150j213448j271379r96493o00092
$$ plain form
12606 -3233398 -4919421 -6476943 -7528343 -7867337 -7506905 -6528938 -4994654 -3073541 -1149649
12597 -1149649 362581 1365547 2109863 2850540 3617311 4292667 4765464 4972483 4870435
12588 4870435 4477161 3911433 3284512 2654077 2137846 1911866 2037052 2355637 2573895
12579 2573895 2426548 1816127 851624 -247229 -1298081 -2223365 -3032627 -3805392 -4658820
12570 -4658820 -5691489 -6959624 -8448924 -10084882 -11797575 -13498232 -14999194 -16034760
12562 -16034760 -16387634 -16020305 -15112766 -13932949 -12672136 -11434920 -10277740 -9191193
12554 -9191193 -8120301 -7056296 -6061754 -5149556 -4245775 -3322519 -2460162 -1722116 -1033851
12545 -1033851 -276627 507779 1048319 1014239 282089 -931359 -2202738 -3199231 -3799323
12536c799323k17953M4527J02460o159j16062j06683K9370K45857M73619O53602
12526b696745P59728Q20137R23412J108535J243427J165209Q68860M32173n7505
12517D567231m43565n68533l68677J24645P19621J113475J116440P99607M02910
12508G463154J26638J4839k0625j04377l01138n64533q07767r97943j112839j036311
12498B659098o45321o7400L52120M16728K28129j7570k03163l33133m68778n90303
12488A330407n79058l76390r6531J24328K99095N09583P31302Q73471R47939J050375
12478D814521J179951J166944Q66997L27305l02553q93623j391213j814148k166424
12469A787757k345184k182250j610920p42494K35877J157350J906718K404203
$$ plain form
12536 -3799323 -4017276 -3972749 -3870289 -3876448 -3992510 -4099193 -4069823 -3823966 -3350347 -2696745
12526 -2696745 -1937017 -1116880 -193468 915067 2158494 3323703 4192563 4624736 4567231
12517 4567231 4123666 3555133 3186456 3311101 4030722 5144197 6260637 7060244 7463154
12508 7463154 7589792 7604631 7584006 7479629 7178491 6613958 5806191 4808248 3695409 2659098
12498 2659098 2013777 1946377 2298497 2715225 2943354 2925784 2722621 2389488 1920710 1330407
12488 1330407 751349 374959 278428 402756 701851 1211434 1942736 2816207 3764146 4814521
12478 4814521 5994472 7161416 8028413 8355718 8053165 7159542 5768329 3954181 1787757
12469 1787757 -557427 -2739677 -4350597 -5093091 -4857214 -3699864 -1793146 611057
12461F11057K534889K181041J379113L79848n07681j059448j177613r34796n46294
12452B860116k29659p4060l3473n5384j75069l96763n71951n51282m29955m25949
12442h3429n82600p40072p17017n06070k54104n8321Q9130K27846L80035N29303
12432a715299O05001N03536K58022R2906J95668N28387Q55370R79498Q93346O24083
12422C820518J50081m18110p51332n94645p0995M47333O75190O07324M93437N52750
12412D911551P10356P18054M47163j8517m87351p68072p65404n68498l82593l32042
12402C464647l86074m94197o74580q95021j027300j017006r20351p23822l10654
12393b984358L05208Q42031J018388Q77060P00558O85663P95055Q74446Q67023
$$ plain form
12461 611057 3145946 5326987 6706100 7085948 6578267 5518819 4341206 3406410 2860116
12452 2860116 2630457 2556397 2522924 2467540 2292471 1895708 1323757 772475 342520 -83429
12442 -83429 -666029 -1406101 -2123118 -2629188 -2883292 -2941613 -2852483 -2624637 -2244602 -1715299
12432 -1715299 -1110298 -606762 -348740 -255834 -60166 468221 1323591 2303089 3196435 3820518
12422 3820518 3970599 3552489 2801157 2206512 2135517 2582850 3258040 3865364 4358801 4911551
12412 4911551 5621907 6339961 6787124 6768607 6281256 5513184 4747780 4179282 3796689 3464647
12402 3464647 3078573 2584376 1909796 1014775 -12525 -1029531 -1949882 -2673704 -2984358
12393 -2984358 -2679150 -1837119 -818731 58329 758887 1444550 2239605 3114051 3981074
12384C981074Q49191Q71808Q60366O67815K22365l82341r57688j335845j423640
12375C353105j244080q98801m42456J03837O63047J143021J489281J638346J522367
12366G327667J171194P86363O42255P75787R04112P49422K72465l51918q78869
12357A1398478j162599j184721r73207o21645l13277j93776k52449l90867n60115
12348E745822p21658p79167o60273l85947j00231J6831j4218j0736L5587o3272
12338C062738l42595o04194o80516o19057o03731p15057q75387j010749j113183
12329c501731j200311j211138r99617n47692l794N22571J011836J412564J615216
12320b902096J582850J414094J225769J030157P82545N05139K79232J26005q5576
$$ plain form
12384 3981074 4830265 5702073 6562439 7230254 7452619 7070278 6112590 4776745 3353105
12375 3353105 2109025 1210224 767768 871605 1534652 2677673 4166954 5805300 7327667
12366 7327667 8498861 9285224 9927479 10703266 11607378 12356800 12629265 12277347 11398478
12357 11398478 10235879 9051158 8077951 7456306 7143029 6949253 6696804 6305937 5745822
12348 5745822 5024164 4244997 3584724 3198777 3098546 3115377 3101159 3090423 3126010 3062738
12338 3062738 2720143 2115949 1435433 816376 212645 -502412 -1377799 -2388548 -3501731
12329 -3501731 -4702042 -5913180 -6912797 -7460489 -7464283 -6941712 -5929876 -4517312 -2902096
12320 -2902096 -1319246 94848 1320617 2350774 3133319 3638458 3917690 4043695 3958119
12311C958119n76085j352740k043547k242889j853317j047293j43754N03186P08728
12302d089592N45900J86739k46186o56735r41313j033897r34532p00463m28418
12293h298497j93604L2720L42432P29320J092135J370564J532655J498812J241531
12284f51932R11694P23305P17283P30500O26132M26929K51072J92645J83589O5619
12274D176836j90472m53599n82219n58035m62354l64621l17954m10648o22648
12265B14286o87390l95256P1359L73998M56190M74979N06452N25806N26699N18714
12255B585837M81351M32908M23195M71820N78922P28794Q71371R13502Q02535
12246H290235O17951N04110N07362M93494K60519k55651r25197j568855k014573
$$ plain form
12311 3958119 3382034 2029294 -14253 -2257142 -4110459 -5157752 -5301506 -4798320 -4089592
12302 -4089592 -3543692 -3356953 -3603139 -4259874 -5201187 -6235084 -7169616 -7870079 -8298497
12293 -8298497 -8492101 -8459381 -8116949 -7387629 -6295494 -4924930 -3392275 -1893463 -651932
12284 -651932 259762 983067 1700350 2430850 3056982 3483911 3734983 3927628 4111217 4176836
12274 4176836 3986364 3532765 2950546 2392511 1930157 1565536 1247582 836934 214286
12265 214286 -473104 -868360 -797001 -423003 33187 508166 1014618 1540424 2067123 2585837
12255 2585837 3067188 3500096 3923291 4395111 4974033 5702827 6574198 7487700 8290235
12246 8290235 8908186 9412296 9919658 10413152 10673671 10418020 9492823 7923968 5909395
12237E909395k081507j723191j086530l78194K11066N83612P54990P07959L79705
12228C277305j56828o40629q46940p69199n56812m38150n87235r22799j179655
12219b820942j175236r23056n44948j74415P1332J39630P8197k590N471J74442
12209e172115M73056O87252N94584K80758Q9468K41037O36795R80915J033196
12200a55054P18916P1219p39993j427458j866590k184367k437953k472527k130114
12191a2623921j433901n94458J30233N74991P06295O16619M93823N12792O40028
12182a0977499O32989L58506k7726k58067j66054K06867O14967Q25202Q18749
12173g972066P34989P43564R31181J211497J436168J538254J499290J353566J225417
$$ plain form
12237 5909395 3827888 2104697 1018167 639973 851039 1434651 2189641 2897600 3277305
12228 3277305 3120477 2479848 1632908 863709 306897 -131253 -718488 -1641287 -2820942
12219 -2820942 -3996178 -4919234 -5464182 -5638597 -5567265 -5427635 -5349438 -5352028 -5346557 -5172115
12209 -5172115 -4699059 -4011807 -3417223 -3136465 -3046997 -2805960 -2169165 -1188250 -155054
12200 -155054 563862 635081 -104912 -1532370 -3398960 -5583327 -8021280 -10493807 -12623921
12191 -12623921 -14057822 -14652280 -14522047 -13947056 -13240761 -12624142 -12130319 -11617527 -10977499
12182 -10977499 -10344510 -9986004 -10013730 -10271797 -10437851 -10230984 -9616017 -8790815 -7972066
12173 -7972066 -7237077 -6493513 -5562332 -4350835 -2914667 -1376413 122877 1476443 2701860
12164B701860J258839J439112J539319J324555P74925J07364m37380p98796j008380
12155F901418j054182r22061o54307l17433K4239K60772K70497P778m69285r91092
12145C056344j336985j405492j321224j282139j268666j013631l67315M43411
12137d495697J043281J252139J130173Q37852N47962L90172L92494N05254O48255
12128B251885P39005P19041N40502K02935k02307n79570r32817j290051j584824
12119a36201j667187j423136r70185n70391k96043n3218J68879L14837L61837
12110d270808L26518L00754M02775O20684P89451P17032L32802k00671n68720
12101a550183n82878l79396k68693l57557l99329j18510L83976P08451N92038
$$ plain form
12164 2701860 3960699 5399811 6939130 8263685 9038610 9145974 8708594 7909798 6901418
12155 6901418 5847236 4925175 4270868 3953435 3977674 4238446 4508943 4516721 4047436 3056344
12145 3056344 1719359 313867 -1007357 -2289496 -3558162 -4571793 -4939108 -4495697
12137 -4495697 -3452416 -2200277 -1070104 -232252 315710 705882 1098376 1603630 2251885
12128 2251885 2990890 3709931 4250433 4453368 4251061 3671491 2738674 1448623 -136201
12119 -136201 -1803388 -3226524 -4196709 -4767100 -5063143 -5116361 -4947482 -4632645 -4270808
12110 -4270808 -3944290 -3643536 -3240761 -2620077 -1830626 -1113594 -780792 -981463 -1550183
12101 -1550183 -2133061 -2512457 -2781150 -3138707 -3538036 -3656546 -3272570 -2564119 -1972081
12092a972081J07847m58611p76811o95951m09745k84287m91502q53668j057691
12083f892500r00407l42478M48591J119508J299198Q56892P9561n47330p64602
12074e643567o35886l56168o3798J98738M09681N39298N64711N35901N92748Q24811
12064c033531J130253J295010J205875R24680N71299K24799m0127j76473k45845
12055A855940l54716n15982o19215n34464k76773m9722o4634l09365n25131m25306
12045a819368M9469O57512J062651J121276R44000P02188M27607N3401m41893
12036B756843j036906j625784j955473j853508j438546r58124n31340j78849L1034
12027f790653J01033J99405M17958O61641Q42151R54568R89446R03310O73086
$$ plain form
12092 -1972081 -1864234 -2322845 -3099656 -3795607 -4205352 -4489639 -4981141 -5834809 -6892500
12083 -6892500 -7792907 -8135385 -7686794 -6567286 -5268088 -4411196 -4331635 -4878965 -5643567
12074 -5643567 -6279453 -6635621 -6699419 -6500681 -6091000 -5551702 -4986991 -4451090 -3858342 -3033531
12064 -3033531 -1903278 -608268 597607 1522287 2093586 2318385 2278258 2101785 1855940
12055 1855940 1501224 985242 366027 -168437 -445210 -494932 -559566 -868931 -1394062 -1819368
12045 -1819368 -1769899 -1112387 -49736 1071540 2015540 2717728 3145335 3198736 2756843
12036 2756843 1719937 94153 -1861320 -3714828 -5153374 -6111498 -6642838 -6821687 -6790653
12027 -6790653 -6689620 -6490215 -6072257 -5410616 -4568465 -3613897 -2624451 -1721141 -1048055
12018a048055L55029R8086K5630P4520K5230k50863o47823r27148q69081m62310
12008c626785l943J95019J11412j09002l63477n73856o69260o95549p70856r08842
11998g415139r69038q00805l85901J62546O65752R86778J101928J021872P22127
11989d909880K52166k52690p25145j133717j402501j471299j323175r67751m83487
11980a2417479l2991K65419M34087N30915N48913M89307M43575M77525N40713
11971h720016N63480N50057N39502N60546O48482P82630Q55146P89905O19639
11962b810629M38749L33490L37664M11832M64804M10253K45592N8554p9710j96531
11952c85932l86170o87131j013628j218870j198612r56316n77407j58692J82164
$$ plain form
12018 -1048055 -693026 -594940 -569310 -494790 -469560 -720423 -1368246 -2295394 -3164475 -3626785
12008 -3626785 -3630728 -3435709 -3324297 -3433299 -3796776 -4370632 -5039892 -5735441 -6506297 -7415139
11998 -7415139 -8384177 -9184982 -9570883 -9408337 -8742585 -7755807 -6653879 -5632007 -4909880
11989 -4909880 -4657714 -4910404 -5635549 -6769266 -8171767 -9643066 -10966241 -11933992 -12417479
11980 -12417479 -12450470 -12185051 -11750964 -11220049 -10671136 -10181829 -9738254 -9260729 -8720016
11971 -8720016 -8156536 -7606479 -7066977 -6506431 -5857949 -5075319 -4220173 -3430268 -2810629
11962 -2810629 -2371880 -2038390 -1700726 -1288894 -824090 -413837 -168245 -109691 -189401 -385932
11952 -385932 -772102 -1459233 -2472861 -3691731 -4890343 -5846659 -6424066 -6582758 -6400594
11943f400594L17602K31932M4998j30574k95866m66463n04308k74200J15017M59133
11933f903323P21172R62439J116474J082518R37549Q12476P19057O49170O37229
11924G34761P29357R55402J224403J283716R70898N17976K82256K56387J26895
11915G082051l06185q99022j317100j317459q69609j10646P21660J379777J749348
11906F112815J844020J641596J110152L59456l89094r05423j042162q45655n21926
11897G363779k24462J3249J87248K52906J44778r9247l56979n53281o53648o30340
11887E444003n22404m55288n60310q53004j188311j365337j291310j040075p66317
11878b598353o13280o42690p61256p94725o58220l92460j10232Q6681K22116M28098
$$ plain form
11943 -6400594 -6082992 -5851060 -5806062 -5936636 -6232502 -6698965 -7203273 -7477473 -7362456 -6903323
11933 -6903323 -6182151 -5219712 -4103238 -3020720 -2083171 -1270695 -551638 97532 734761
11924 734761 1464118 2419520 3643923 4927639 5898537 6416513 6698769 6955156 7082051
11915 7082051 6775866 5876844 4559744 3242285 2372676 2262030 2983690 4363467 6112815
11906 6112815 7956835 9598431 10708583 11068039 10678945 9773522 8731360 7885705 7363779
11897 7363779 7139317 7152566 7339814 7592720 7737498 7638251 7281272 6727991 6074343 5444003
11887 5444003 4921599 4466311 3906001 3052997 1864686 499349 -791961 -1832036 -2598353
11878 -2598353 -3211633 -3854323 -4615579 -5410304 -6068524 -6460984 -6571216 -6484535 -6262419 -5834321
11868e834321Q15203J350277J823843K012861J851829J379964O76288n7934n68454
11859C449556p67887p70778p29509o90780o05468m54752l19459l56872o45488
11850a891437j019253j213423j137129q96194o47650m72169l33782j57547M1797
11841g726787K09067L57136N26726P05865Q18290P69200N07484J11628k28136
11832c949527l72523l18358j87187j45598k50856m05141n09294n79881o63382
11823g381747p51376p95585p34640n56830l48686k36570k84669l89395l19891
11814a1799389L3568N51186J043908J391812J583403J645989J565303J321390
11806b662830R41228N30819K07075J681j01647j23155q1948o942M8695O2967P7776
$$ plain form
11868 -5834321 -5019118 -3668841 -1844998 167863 2019692 3399656 4075944 4018010 3449556
11859 3449556 2681669 1910891 1181382 490602 -114866 -569618 -889077 -1245949 -1891437
11850 -1891437 -2910690 -4124113 -5261242 -6157436 -6805086 -7277255 -7611037 -7768584 -7726787
11841 -7726787 -7517720 -7160584 -6633858 -5927993 -5109703 -4340503 -3833019 -3721391 -3949527
11832 -3949527 -4322050 -4640408 -4827595 -4973193 -5224049 -5629190 -6138484 -6718365 -7381747
11823 -7381747 -8133123 -8928708 -9663348 -10220178 -10568864 -10805434 -11090103 -11479498 -11799389
11814 -11799389 -11765821 -11214635 -10170727 -8778915 -7195512 -5549523 -3984220 -2662830
11806 -2662830 -1721602 -1190783 -983708 -982027 -1083674 -1206829 -1288777 -1295719 -1247024 -1184057 -1106281
11795a106281J63247L80042O98908R90970J152886J123193Q05818J72552n84244
11786C797091j135423j268262j041182p34043n85203n17799l01095R5357N39063
11777a151496R43006J255472J429776J412758J161492P72264M73827L75927L17910
11768F990936J11785k16976n55489q71398j122143j149417q02414j34986O02618
11759B852516J160227J394230J279714R20216M35803r1686n24482p20432o65249
11750F040857m56921k40053j40156j53393j71525j65866k26688l99349o37705
11741C449201q45678q47388n17702L0760N25874O94558M28436q3330n45057q06387
11731A483287p82169l95324K03806O27656O17400K96006l0847k10856k99828l79813
$$ plain form
11795 -1106281 -943034 -562992 135916 1126886 2279772 3402965 4208783 4381335 3797091
11786 3797091 2661668 1393406 352224 -381819 -967022 -1484821 -1785916 -1690559 -1151496
11777 -1151496 -208490 1046982 2476758 3889516 5051008 5823272 6297099 6673026 6990936
11768 6990936 7102721 6885745 6330256 5458858 4336715 3187298 2384884 2249898 2852516
11759 2852516 4012743 5406973 6686687 7606903 8042706 7951020 7426538 6706106 6040857
11750 6040857 5583936 5343883 5203727 5050334 4878809 4712943 4486255 4086906 3449201
11741 3449201 2603523 1756135 1238433 1269193 1795067 2489625 2918061 2834731 2289674 1483287
11731 1483287 701118 305794 509600 1137256 1754656 2050662 2019815 1808959 1509131 1129318
11721A129318m24433l61787k07997n3048L9155P7318J14018J42973R2484l5508
11711E12493j47611j65943p9296M8545J21622R9176l440j82189l99710n21591
11701g17944m45009k32115m7113K4619R4370L33567P64948J230709J537890J634414
11691D178336J578809J396054J105446P83439M98478K65675P7724q6710k43416
11682I553835l93149n21002n43826l59244L0835M99714Q58160R53580P96676N51254
11672A1426833L98235M64146P19386R44225R06272N16657j31121p96723j209757
11663A3238153j218119q73568l97407m3133P7962N2535J9065n050j12731l34573
11653A0403134n42339n79745l89475k3769L63254O05708O07883L46832r4219n35134
$$ plain form
11721 1129318 704885 343098 135101 82053 121208 198526 312544 455517 548001 512493
11711 512493 364882 198939 119643 168188 289810 388986 385546 203357 -196353 -717944
11701 -717944 -1162953 -1395068 -1442181 -1417562 -1323192 -989625 -224677 1006032 2543922 4178336
11691 4178336 5757145 7153199 8258645 9042084 9540562 9806237 9883961 9797251 9553835
11682 9553835 9160686 8639684 8095858 7736614 7767449 8267163 9125323 10078903 10875579 11426833
11672 11426833 11825068 12289214 13008600 13952825 14859097 15375754 15244633 14447910 13238153
11663 13238153 12020034 11146466 10749059 10705926 10783888 10836423 10855488 10850438 10737707 10403134
11653 10403134 9860795 9281050 8891575 8867806 9231060 9836768 10444651 10791483 10697264 10162130
11643A0162130q27181r64426j046761j158099j318877j426882j293333r03635
11635A222936m71368j30050K17751O12849Q59164Q03867N59441L53880L28105
11626D356575N03814P82122R57969Q69388N74377L07652K19510K31377K05315
11617I008099J13550k5564j99924l84988n49950o42497o11246n04593m08931k53615
11607E540341R9172N81351R48543J011666P02106N3213p64867j497535j950285
11598D723705k055068j837531j426036j008576o59644l06783J26372O36297J127399
11589f79865J412687J350310R54516L29330l50381q13550q94270p14623m64204
11580A29950j47301K55305N26640M02746o0423n71062r28364j077638j038106
$$ plain form
11643 10162130 9334949 8370523 7323762 6165663 4846786 3419904 2126571 1222936
11635 1222936 751568 621518 839269 1452118 2311282 3115149 3674590 4028470 4356575
11626 4356575 4860389 5642511 6600480 7469868 8044245 8351897 8571407 8802784 9008099
11617 9008099 9121649 9096085 8896161 8511173 7961223 7318726 6707480 6202887 5793956 5540341
11607 5540341 5639513 6220864 7169407 8181073 8883179 8936392 8171525 6673990 4723705
11598 4723705 2668637 831106 -594930 -1603506 -2263150 -2569933 -2443561 -1807264 -679865
11589 -679865 732822 2083132 3037648 3366978 3016597 2203047 1308777 594154 129950
11580 129950 -17351 237954 764594 1167340 1106917 535855 -392509 -1470147 -2508253
11571b508253r33709r32708j023709r86205o77493j52953M80155J104580J545643
11562d084652J620650J230145M53382m58462j220985j647444j729672j637629
11554g474667j536894j434689j321514j274670j282874j187680q94349m62930
11546a6870267J8899N13830R48194J164530J104417R31203Q42906Q55488Q70705
11537i620095Q51732Q18167P44016N76564L51844J67457P4880Q6357J56183J43801
11527e649094l3187k35661k23403P0647M84147Q16285J008187J136211J247181
11518a378687J255387J012192M99756j07962o41312j049573j324540j430236j340183
11509d505158j112722q60613o78778n49286k99104J99345Q19057J215837J108615
$$ plain form
11571 -2508253 -3441962 -4374670 -5398379 -6384584 -7062077 -7215030 -6734875 -5630295 -4084652
11562 -4084652 -2464002 -1233857 -780475 -1238937 -2459922 -4107366 -5837038 -7474667
11554 -7474667 -9011561 -10446250 -11767764 -13042434 -14325308 -15512988 -16407337 -16870267
11546 -16870267 -16851368 -16337538 -15389344 -14224814 -13120397 -12189194 -11346288 -10490800 -9620095
11537 -9620095 -8768363 -7950196 -7206180 -6629616 -6277772 -6110315 -6035435 -5949078 -5792895 -5649094
11527 -5649094 -5682281 -5917942 -6141345 -6070698 -5586551 -4770266 -3762079 -2625868 -1378687
11518 -1378687 -123300 888892 1388648 1280686 639374 -410199 -1734739 -3164975 -4505158
11509 -4505158 -5617880 -6478493 -7157271 -7706557 -8005661 -7806316 -6987259 -5771422 -4662807
11500d662807N29339k40490q68094j069333p57194j43101M22721O62934M89786
11491e636239Q0110k11181j10076L83596R80546J323428J274660R42285N87605
11482c85266N13672Q22234J264381J453124J213007O41710j0177m61021n40950
11473D510714l32881j42478k45575o64213j168472j481069j477015j226460q70956
11464c098405m83728j15529R1474N0461q1806p9087J23695N02083J034091J549037
11454e07714J723780J410716P81861J33122l67705p42459j045350j270400j322819
11445a206968j110516p28727l63274o9118J59021K78888K86929K27935J82446
$$ plain form
11500 -4662807 -4133468 -4373958 -5242052 -6311385 -7068579 -7211680 -6788959 -6126025 -5636239
11491 -5636239 -5556129 -5767310 -5877386 -5493790 -4513244 -3189816 -1915156 -972871 -385266
11482 -385266 128406 950640 2215021 3668145 4881152 5522862 5512685 5051664 4510714
11473 4510714 4177833 4035355 3789780 3125567 1957095 476026 -1000989 -2227449 -3098405
11464 -3098405 -3582133 -3697662 -3606188 -3555727 -3637533 -3716620 -3592925 -3090842 -2056751 -507714
11454 -507714 1216066 2626782 3408643 3541765 3174060 2431601 1386251 115851 -1206968
11445 -1206968 -2317484 -3046211 -3409485 -3478603 -3319582 -3040694 -2753765 -2525830 -2343384
$$ [...]
##END NTUPLES=NMR SPECTRUM
##END=
