##TITLE=31P ikalashn
109-2024-BAU
12.12.2024
##JCAMPDX= 6.0         $$ Bruker NMR JCAMP-DX V2.0
##DATA TYPE= NMR SPECTRUM
##DATA CLASS= NTUPLES
##ORIGIN= UXNMR, Bruker Analytische Messtechnik GmbH
##OWNER= root
$$ TOPSPIN		Version 1.3
$$ 2024-12-12 14:13:02.500 +0400  Irina@DPX200
$$ Compression mode = diff/dup
##.OBSERVE FREQUENCY= 81.01967998063
##.OBSERVE NUCLEUS= ^31P
##.ACQUISITION MODE= SIMULTANEOUS
##.ACQUISITION SCHEME= undefined
##.AVERAGES= 32
##.DIGITISER RES= 17
##SPECTROMETER/DATA SYSTEM= spect
##.PULSE SEQUENCE= zgpg
##.SOLVENT NAME= D2O
##.SHIFT REFERENCE= INTERNAL, D2O, 1, 298.5841
##AUDIT TRAIL= $$ (NUMBER, WHEN, WHO, WHERE, WHAT)
$$ ##TITLE= Audit trail, TOPSPIN		Version 1.3
$$ ##JCAMPDX= 5.01
$$ ##ORIGIN= Bruker BioSpin GmbH
$$ ##OWNER= Irina
$$ $$ F:/spectra/data/iren/nmr/P31dec/1/pdata/1/auditp.txt
$$ ##AUDIT TRAIL=  $$ (NUMBER, WHEN, WHO, WHERE, VERSION, WHAT)
(   1,<2024-12-12 14:11:35.515 +0400>,<Irina>,<DPX200>,<TOPSPIN 1.3>,
      <acquisition in progress>)
(   2,<2024-12-12 14:12:29.453 +0400>,<Irina>,<DPX200>,<TOPSPIN 1.3>,
      <Start of raw data processing
       efp BC_mod = 2 LB = 10 FT_mod = 6 PKNL = 1 PHC0 = 168.1131 PHC1 = 202.8011 SI = 32K 
       data hash MD5: 32K
       44 36 C5 27 3A E8 9D 80 02 7F BA 52 28 FD C5 ED>)
(   3,<2024-12-12 14:12:45.187 +0400>,<Irina>,<DPX200>,<TOPSPIN 1.3>,
      <apk 
       data hash MD5: 32K
       2C 1F 86 AD DB 61 8E 49 C1 D9 F8 96 4F 6D B0 87>)
(   4,<2024-12-12 14:12:48.031 +0400>,<Irina>,<DPX200>,<TOPSPIN 1.3>,
      <abs n ABSG = 5 
       data hash MD5: 32K
       2B 33 2C 18 5A DD 0C 7D 18 C5 56 E6 B0 BD C3 FA>)
$$ ##END=
$$ 
$$ $$ hash MD5
$$ $$ 12 5E CA 0A 80 E0 50 A0 81 88 1D 95 BB 78 A2 92
##$RELAX= 
##$RELAX= 
##$RELAX= 
##$RELAX= 
##$RELAX= 
##$RELAX= 
##$RELAX= 
##$RELAX= 
##$RELAX= 
##$RELAX= 
##$RELAX= 
$$ Bruker specific parameters
$$ --------------------------
##$DU= <F:/spectra>
##$EXPNO= 1
##$NAME= <P31dec>
##$PROCNO= 1
##$TYPE= <nmr>
##$USER= <iren>
##$AMP= (0..31)
100 100 100 100 100 100 100 100 100 100 100 100 100 100 100 100 100 100 
100 100 100 100 100 100 100 100 100 100 100 100 100 100 
##$ANAVPT= -1
##$AQSEQ= 0
##$AQ_mod= 1
##$AUNM= <au_zg>
##$AUTOPOS= <>
##$BF1= 81.014009
##$BF2= 200.13
##$BF3= 200.13
##$BF4= 200.13
##$BF5= 200.13
##$BF6= 200.13
##$BF7= 200.13
##$BF8= 200.13
##$BYTORDA= 1
##$CFDGTYP= 0
##$CFRGTYP= 5
##$CHEMSTR= <none>
##$CNST= (0..63)
1 1 145 1 1 1 1 1 1 1 1 1 1 1 1 1 1 1 1 1 1 1 1 1 1 1 1 1 1 1 1 1 1 1 
1 1 1 1 1 1 1 1 1 1 1 1 1 1 1 1 1 1 1 1 1 1 1 1 1 1 1 1 1 1 
##$CPDPRG= <waltz16>
##$CPDPRG1= <>
##$CPDPRG2= <waltz16>
##$CPDPRG3= <>
##$CPDPRG4= <mlev>
##$CPDPRG5= <mlev>
##$CPDPRG6= <mlev>
##$CPDPRG7= <mlev>
##$CPDPRG8= <mlev>
##$CPDPRGB= <>
##$CPDPRGT= <>
##$D= (0..63)
0 1 0 0 0 0 0 0 0 0.06 0 0.03 2e-005 3e-006 0 0 0.0002 0 0 0 0 0 0 0 0 
0 0 0 0 0 0 0 0 0 0 0 0 0 0 0 0 0 0 0 0 0 0 0 0 0 0 0 0 0 0 0 0 0 0 0 
0 0 0 0 
##$DATE= 1733998346
##$DBL= (0..7)
120 120 120 11 120 120 24 19 
##$DBP= (0..7)
$$ [...]
##$SW_h= 37037.037037037
##$TD= 32768
##$TD0= 1
##$TE= 300
##$TE2= 300
##$TE3= 300
##$TEG= 300
##$TL= (0..7)
0 120 53 12 22 120 120 120 
##$TP= (0..7)
150 150 150 150 150 150 150 150 
##$TP07= 0
##$TPNAME0= <>
##$TPNAME1= <>
##$TPNAME2= <>
##$TPNAME3= <>
##$TPNAME4= <>
##$TPNAME5= <>
##$TPNAME6= <>
##$TPNAME7= <>
##$TPOAL= (0..7)
0.5 0.5 0.5 0.5 0.5 0.5 0.5 0.5 
##$TPOFFS= (0..7)
0 0 0 0 0 0 0 0 
##$TUNHIN= 0
##$TUNHOUT= 0
##$TUNXOUT= 0
##$USERA1= <user>
##$USERA2= <user>
##$USERA3= <user>
##$USERA4= <user>
##$USERA5= <user>
##$V9= 5
##$VALIST= <valist>
##$VCLIST= <CCCCCCCCCCCCCCC>
##$VD= 0
##$VDLIST= <DDDDDDDDDDDDDDD>
##$VPLIST= <PPPPPPPPPPPPPPP>
##$VTLIST= <TTTTTTTTTTTTTTT>
##$WBST= 1024
##$WBSW= 4
##$XGAIN= (0..3)
0 0 0 0 
##$XL= 0
##$YL= 0
##$YMAX_a= 1224
##$YMIN_a= -2143
##$ZGOPTNS= <>
##$ZL1= 120
##$ZL2= 120
##$ZL3= 120
##$ZL4= 120
##$ABSF1= 298.5841
##$ABSF2= -158.5842
##$ABSG= 5
##$ABSL= 5
##$ALPHA= 0
##$AQORDER= 0
##$ASSFAC= 0
##$ASSFACI= 0
##$ASSFACX= 0
##$ASSWID= 0
##$AUNMP= <proc_1d>
##$AXLEFT= 0
##$AXRIGHT= 0
##$AXTYPE= 0
##$AXUNIT= <>
##$AZFE= 0.1
##$AZFW= 0.5
##$BCFW= 0
##$BC_mod= 2
##$BYTORDP= 0
##$COROFFS= 0
##$CY= 12.5935478210449
##$DATMOD= 1
##$DC= 0
##$DFILT= <>
##$DTYPP= 0
##$F1P= 47.1127640792319
##$F2P= -24.0371245302204
##$FCOR= 0.5
##$FTSIZE= 32768
##$FT_mod= 6
##$GAMMA= 0
##$GB= 0
##$INTBC= 1
##$INTSCL= 7.269226e-011
##$ISEN= 30
##$LB= 10
##$LEV0= 0
##$LPBIN= 0
##$MAXI= 12.09355
##$MC2= 0
##$MEAN= 0
##$ME_mod= 0
##$MI= 0.7550151
##$NCOEF= 0
##$NC_proc= -13
##$NLEV= 6
##$NOISF1= 298.5841
##$NOISF2= 270.0111
##$NSP= 0
##$NTH_PI= 0
##$NZP= 0
##$OFFSET= 298.5841
##$PC= 1.4
##$PHC0= 202.8384
##$PHC1= 158.1897
##$PH_mod= 1
##$PKNL= yes
##$PPARMOD= 0
##$PPDIAG= 0
##$PPIPTYP= 0
##$PPMPNUM= 100
##$PPRESOL= 1
##$PSCAL= 0
##$PSIGN= 0
##$REVERSE= no
##$SF= 81.014009
##$SI= 32768
##$SIGF1= 270.0111
##$SIGF2= -158.5842
##$SINO= 77.54984
##$SIOLD= 32768
##$SREGLST= <31P.CDCl3>
##$SSB= 0
##$STSI= 32768
##$STSR= 0
##$SW_p= 37037.037037037
##$SYMM= 0
##$S_DEV= 0
##$TDeff= 32768
##$TDoff= 0
##$TI= <>
##$TILT= no
##$TM1= 0
##$TM2= 0
##$TOPLEV= 0
##$USERP1= <user>
##$USERP2= <user>
##$USERP3= <user>
##$USERP4= <user>
##$USERP5= <user>
##$WDW= 1
##$XDIM= 32768
##$YMAX_p= 471156506
##$YMIN_p= -19209596
$$ End of Bruker specific parameters
$$ ---------------------------------
##NTUPLES= NMR SPECTRUM
##VAR_NAME=  FREQUENCY,     SPECTRUM/REAL,   SPECTRUM/IMAG
##SYMBOL=    X,             R,               I
##VAR_TYPE=  INDEPENDENT,   DEPENDENT,       DEPENDENT
##VAR_FORM=  AFFN,          ASDF,            ASDF
##VAR_DIM=   32768,         32768,           32768
##UNITS=     HZ,            ARBITRARY UNITS, ARBITRARY UNITS
##FACTOR=    1.13031516577767, 1,            1
##FIRST=     37037.037037037, 283174,        -13736048
##LAST=      0,             6527801,         -12667467
##MIN=       0,             -19209596,       0
##MAX=       37037.037037037, 471156506,     0
$$ Real data points
##PAGE= N=1
##DATA TABLE= (X++(R..R)), XYDATA
$$ [...]
16958A715010Q95414P77051K18545o12379j340646j618872j373596q52770m40378
16949b632621l72564o18255r64714j159762j055311o82081j86763L32944Q61400
16940f477727J302616J452300J178622O21195J10671j13989K3501M93606J167000
16931b42205J828902K235281K253682J899649J219607L27449n16718j025230j060508
16922F919909p08568k86863k16935o70149j387660j954646k134983j963276j624154
16913d027325j272745r62280o57570l31389n265L35054O97684Q83609O70950K18758
16903d450519j11448j75985m4404K14482N52404Q82431J097747J090262P59598
16894a85432J68751l36454m31035k08568l1204q3041k56569l59470l07565j72243
$$ plain form
16958 1715010 2610424 3387475 3606020 2993641 1652995 34123 -1339473 -2192243 -2632621
16949 -2632621 -3005185 -3623440 -4588154 -5747916 -6803227 -7485308 -7672071 -7339127 -6477727
16940 -6477727 -5175111 -3722811 -2544189 -1922994 -1812323 -1926312 -1902811 -1409205 -242205
16931 -242205 1586697 3821978 6075660 7975309 9194916 9522365 9005647 7980417 6919909
16922 6919909 6211341 5924478 5707543 5037394 3649734 1695088 -439895 -2403171 -4027325
16913 -4027325 -5300070 -6262350 -6919920 -7251309 -7256574 -6921520 -6223836 -5340227 -4669277 -4450519
16903 -4450519 -4561967 -4737952 -4782356 -4567874 -4015470 -3133039 -2035292 -945030 -185432
16894 -185432 -16681 -353135 -784170 -992738 -1023942 -1106983 -1363552 -1723022 -2030587 -2202830
16884b202830o8374l0796n0035j43696l21759n05807n77008n37816m93989n15889
16874e447999o12547p19224p10279n07002j20127M00676R42133J297113J353335
16865d123921J284653J328015J440955J373482R87599L90329k23355o92809q25180
16856I39768m76219K33581R37566J335173J402244J271511J035303O99968L09901
16847G688796o0321m15840p85644j119233j262188j068974n71954m320L33764
16838B734086K54344j94183p38765j049904r40849m09089L80080J130831J569982
16829B736533J571256J153433M17251m37196j125272j481081j575514j569199
16821c09789j521308j338324q91594j92233N24940Q89906P15393J45751n82627
$$ plain form
16884 -2202830 -2271204 -2302000 -2352035 -2495731 -2817490 -3323297 -3900305 -4438121 -4932110 -5447999
16874 -5447999 -6060546 -6779770 -7490049 -7997051 -8117178 -7716502 -6774369 -5477256 -4123921
16865 -4123921 -2839268 -1511253 -70298 1303184 2290783 2681112 2457757 1764948 939768
16856 939768 463549 697130 1634696 2969869 4372113 5643624 6678927 7378895 7688796
16847 7688796 7628475 7212635 6426991 5307758 4045570 2976596 2404642 2400322 2734086
16838 2734086 2988430 2794247 2055482 1005578 64729 -344360 35720 1166551 2736533
16829 2736533 4307789 5461222 5878473 5441277 4316005 2834924 1259410 -309789
16821 -309789 -1831097 -3169421 -4061015 -4253248 -3728308 -2838402 -2123009 -1977258 -2559885
16812b559885j285338j733231j654715j002897j23393N29165P71075P54027O45331
16803e659861M03502K0075l07419l90751k61217j30228k11206n02509p20115n91143
16793h350872j04025N98226J333357J958857K470652K875261L006691K656376
16785F444523J825189P98577K307l27110l22881k96767m25554o35853p76205q07919
16775E478307p79463p00362n44047l26019j05826J3726k7145j19186p4946J43307
16765B958346L88496M92114M42370L90058M25737M95545N31619N04538M44876
16756G073699M31586M44800L72402J74306j08533m14628o31918o39502m69372
16747F232840k81026j96101k51154l74796m81109o60803j019503j370498j429943
$$ plain form
16812 -2559885 -3845223 -5578454 -7233169 -8236066 -8359459 -7830294 -7059219 -6305192 -5659861
16803 -5659861 -5256359 -5236284 -5543703 -5934454 -6195671 -6325899 -6537105 -7039614 -7759729 -8350872
16793 -8350872 -8454897 -7856671 -6523314 -4564457 -2093805 781456 3788147 6444523
16785 6444523 8269712 9068289 9070596 8743486 8420605 8123838 7698284 7062431 6286226 5478307
16775 5478307 4698844 3998482 3454435 3128416 3022590 3036316 3009171 2889985 2815039 2958346
16765 2958346 3346842 3838956 4281326 4671384 5097121 5592666 6124285 6628823 7073699
16756 7073699 7505285 7950085 8322487 8496793 8388260 7973632 7341714 6702212 6232840
16747 6232840 5951814 5755713 5504559 5129763 4648654 3987851 2968348 1597850 167907
16738A67907j163080p26401k70147J43963N01804P56691Q82217R31299R65810
16729B190063J037566J154746J179375R36590M45091j37813p43659j377185j973197
16720B711577k332387k275725j835769j211113o86672m31232k97829m6496L49470
16711f056176P20347Q87393P68474M04949q4957n61206q72797q91192n89049q6578
16701f360792M19531P46621P77883N22198J36473j70815k59350r3563K31136N49553
16691c501125P75790R21338J043083J175669J252639J122401P14998J66940l08360
16682C363373n96217p27499p92960q64888r73392j045995r52304o44077k09206
16673c443165J65172L25986K83203J29495o4258k43587m12055n97225o71191m04298
$$ plain form
16738 167907 -995173 -1721574 -1991721 -1847758 -1345954 -589263 292954 1224253 2190063
16729 2190063 3227629 4382375 5561750 6498340 6943431 6805618 6061959 4684774 2711577
16720 2711577 379190 -1896535 -3732304 -4943417 -5630089 -6061321 -6359150 -6405646 -6056176
16711 -6056176 -5335829 -4448436 -3679962 -3275013 -3359970 -3921176 -4793973 -5685165 -6274214 -6360792
16701 -6360792 -5941261 -5194640 -4416757 -3894559 -3758086 -3928901 -4188251 -4281814 -4050678 -3501125
16691 -3501125 -2725335 -1803997 -760914 414755 1667394 2789795 3504793 3671733 3363373
16682 3363373 2767156 2039657 1246697 381809 -591583 -1637578 -2589882 -3233959 -3443165
16673 -3443165 -3277993 -2952007 -2668804 -2539309 -2603567 -2847154 -3259209 -3856434 -4527625 -4931923
16663d931923J90116P96576J110632J074805Q48876N98770L90922K68247K33174
16654E80195J72253j6762l21378o83418j001781j162070j147360j042966r45465
16645e568752q61507o96593l61473J53516P75015J358991J745230J865785J823765
16636B33977J778605J762712J657931J297809O34939j60613q16819j147086j125504
16627D115951r13815p92618q99416j128652j315748j424796j489780j463624j292084
16618f604582j007082o62238l00494K8516K63096L69211M20409N09316N96163
16609f387685O13178N55806L97557J38039j02970k00763j52371m8866o539r5454
16599e290068k44136k48081m119L29064N11346N01813M55280M54288M06298K17808
$$ plain form
16663 -4931923 -4741807 -3945231 -2834599 -1759794 -910918 -312148 78774 347021 580195
16654 580195 752448 735686 414308 -269110 -1270891 -2432961 -3580321 -4623287 -5568752
16645 -5568752 -6430259 -7126852 -7488325 -7334809 -6559794 -5200803 -3455573 -1589788 233977
16636 233977 2012582 3775294 5433225 6731034 7365973 7205360 6388541 5241455 4115951
16627 4115951 3202136 2409518 1510102 381450 -934298 -2359094 -3848874 -5312498 -6604582
16618 -6604582 -7611664 -8273902 -8574396 -8545880 -8282784 -7913573 -7493164 -6983848 -6387685
16609 -6387685 -5774507 -5218701 -4821144 -4683105 -4786075 -4986838 -5139209 -5188075 -5194614 -5290068
16599 -5290068 -5534204 -5782285 -5786404 -5457340 -4945994 -4444181 -3988901 -3534613 -3128315 -2910507
16589b910507n5741k52058k48988r1602P0824J52112J47154J02398R7480J51758
16579b837170K32771L46999M82615N57881M81890K36398o7382k40320j71947Q5823
16569h92442L86407N81619N45773J94720m09990j007796j326428j297374j066572
16560d292083q53677q07556r21526j015599q88148n76670l31419k70632k54147
16551a0211457j35609R7926M34237Q42431J213920J446140J563983J671997J780058
16542a296374J767603J562557J270748J062038R28140O30644o585q29220j463606
16533C625945j636670j369735r02786m13569J11498O92795J204872J497115J568136
16524D377601J495755J290258R89995P33469N80940M34108J63071k55196o82639
$$ plain form
16589 -2910507 -2966248 -3218306 -3467294 -3558896 -3488072 -3335960 -3188806 -3086408 -2988928 -2837170
16579 -2837170 -2604399 -2257400 -1774785 -1216904 -735014 -498616 -565998 -806318 -978265 -892442
16569 -892442 -506035 75584 621357 816077 406087 -601709 -1928137 -3225511 -4292083
16560 -4292083 -5145760 -5953316 -6874842 -7890441 -8778589 -9355259 -9686678 -9957310 -10211457
16551 -10211457 -10347066 -10249140 -9814903 -8972472 -7758552 -6312412 -4748429 -3076432 -1296374
16542 -1296374 471229 2033786 3304534 4366572 5294712 5925356 5918771 5089551 3625945
16533 3625945 1989275 619540 -283246 -696815 -585317 107478 1312350 2809465 4377601
16524 4377601 5873356 7163614 8153609 8887078 9468018 9902126 10065197 9810001 9127362
16515I127362r10670q82482p58960p26980q06387q20724o34493l67947k45993
16506B972726l74714p02475j043996j183515j020187n89171l5473M45377O71349
16497h60079N23509P0230m58070q57686j023135r16949n53976k3272N25731R10449
16487b663248J021980R53101R05527R49195R75515Q65891N78824J61542j90600
16478C557727k36412j740J92647P0638l24607o31717n02433J5992N88343R05500
16468C633938P86445K50425m26007q87444j024432j030051j134526j369885j492736
16459b694273j232873o73456r3001L36449N24281M78899L55296L17369L91696
16450b289613M85399N25324N34818N51470N60397N13897L61988J09569j94649
$$ plain form
16515 9127362 8216692 7334210 6575250 5848270 5041883 4221159 3586666 3218719 2972726
16506 2972726 2598012 1895537 851541 -331974 -1352161 -1941332 -1976805 -1531428 -860079
16497 -860079 -336570 -266340 -724410 -1582096 -2605231 -3522180 -4076156 -4099428 -3573697 -2663248
16487 -2663248 -1641268 -688167 217360 1166555 2142070 3007961 3586785 3748327 3557727
16478 3557727 3321315 3319575 3512222 3582860 3258253 2626536 2124103 2140095 2728438 3633938
16468 3633938 4420383 4670808 4244801 3357357 2332925 1302874 168348 -1201537 -2694273
16459 -2694273 -3927146 -4600602 -4693603 -4357154 -3832873 -3353974 -2998678 -2681309 -2289613
16450 -2289613 -1804214 -1278890 -744072 -192602 367795 881692 1243680 1353249 1158600
16441A158600m92220o88281p04169n43529k21838K79546Q69215J289887J326949
16432B274160J039059P43100O99284P79916O06701J04979l45535l54609J28358
16423E675413P52128R99803O90297J55222k02868l34904m55424o94683r82048
16414E602936j215140j373437j403982j196655p77424l13769O2786L07186L74449
16405F6950K52537M7620o6874M6369L83418P99711J083518J017099N67572J6712
16395D214632k98416k99081j82791k35388n84604j153476j733112j972293j625446
16386c869975q46242p241O09372R40341J120971J268521J303974J098356P20155
16377B338232M14498L48837M26013M13710K37343k6568l37707o83450r96787j196952
$$ plain form
16441 1158600 666380 -21901 -726070 -1269599 -1491437 -1211891 -342676 947211 2274160
16432 2274160 3313219 4056319 4755603 5535519 6142220 6247199 5901664 5547055 5675413
16423 5675413 6427541 7427344 8117641 8272863 8069995 7735091 7279667 6584984 5602936
16414 5602936 4387796 3014359 1610377 413722 -363702 -677471 -614685 -307499 66950
16405 66950 319487 367107 300233 346602 730020 1529731 2613249 3630348 4197920 4214632
16395 4214632 3916216 3617135 3434344 3198956 2614352 1460876 -272236 -2244529 -3869975
16386 -3869975 -4716217 -4723458 -4114086 -3173745 -2052774 -784253 519721 1618077 2338232
16377 2338232 2752730 3101567 3527580 3941290 4178633 4152065 3814358 3130908 2134121 937169
16367I37169j253627j169133r50581o34002l22613k13615m63042r52868j325048
16358f347360j304365r34121m47070j1667K82179L39023R7066l78517q69692j119502
16348a0694026r70366m26224K87761Q59987J122090J097442R25704P47923O90650
16339f359059Q25264J019533J016081P11126K78487J497l9692J2298J15361L80395
16329b038709P70166J041933J005988P17166L65166N8740j63879k96697l98371
16320A061503n00059n45155n45842o84933j093590j634799k069170k326125k461598
16311a0799768k455215k116654j187965L12758J784558K409264K054966J303960
16303h694096O92381M24581N15191Q64500J266277J554337J739224J892598J996069
$$ plain form
16367 937169 -316458 -1485591 -2436172 -3070174 -3392787 -3606402 -4069444 -5022312 -6347360
16358 -6347360 -7651725 -8585846 -9032916 -9044583 -8762404 -8423381 -8326315 -8704832 -9574524 -10694026
16348 -10694026 -11664392 -12090616 -11802855 -10942868 -9820778 -8723336 -7797632 -7049709 -6359059
16339 -6359059 -5533795 -4514262 -3498181 -2787055 -2508568 -2507071 -2546763 -2534465 -2419104 -2038709
16329 -2038709 -1268543 -226610 779378 1496544 1861710 1920450 1756571 1459874 1061503
16320 1061503 561444 16289 -529553 -1214486 -2308076 -3942875 -6012045 -8338170 -10799768
16311 -10799768 -13254983 -15371637 -16559602 -16246844 -14462286 -12053022 -9998056 -8694096
16303 -8694096 -8001715 -7577134 -7061943 -6197443 -4931166 -3376829 -1637605 254993 2251062
16294B251062J973882J735822J232690N83196L0606k84748m56586o26158p64789
16285E674977p57984n61547k35256Q7583K57506K21019N2353j37646l15136n80503
16275C705366j017123j471539j686968j619482j402197j140169q94362o59608
16267f186082l39686J23674O58934J137023J486701J679761J674877J447974J056375
16258B739551N75836L3551m88161q55035j049525j168968j240391j150400q49607
16249c453149n00585k09855J15476N50070J014907J315088J277591Q86840K64686
16240A261069m23427r89238j279787j317566j200768r28402n35643j94031m2229
16231e650022o3036j75767l20592m44298m91786m15245j71545K33605O67461R43864
$$ plain form
16294 2251062 4224944 5960766 7193456 7776652 7807258 7522510 7065924 6439766 5674977
16285 5674977 4916993 4355446 4120190 4207773 4465279 4686298 4738651 4601005 4285869 3705366
16275 3705366 2688243 1216704 -470264 -2089746 -3491943 -4632112 -5526474 -6186082
16267 -6186082 -6525768 -6402094 -5743160 -4606137 -3119436 -1439675 235202 1683176 2739551
16258 2739551 3315387 3348938 2860777 2005742 956217 -212751 -1453142 -2603542 -3453149
16249 -3453149 -3953734 -4163589 -4048113 -3498043 -2483136 -1168048 109543 996383 1261069
16240 1261069 837642 -151596 -1431383 -2748949 -3949717 -4878119 -5413762 -5607793 -5650022
16231 -5650022 -5713058 -5888825 -6209417 -6653715 -7145501 -7560746 -7732291 -7498686 -6831225 -5887361
16221e887361R51537P01036L34138M0503r4518j28504j51184j65899j60316j99641
16211d760209k99940l47694k32632L6540L30115M84840M22520K44790J58711K86027
16201c676932N86578Q98301J060466R93211P02901K97413m3699k11218k36477
16192C70544j75121J4666M32792R97690J352856J234635P83717L18631O2119Q8859
16182E481388K63548L45258K55478Q4996r4392k81156m70047o51425q62072j070198
16172C001378j128399r92187q10445p13025o66981n52696k66005K42371Q88958
16163i97031J433544J627909J389626Q59676K84772j95641n96744q82167r03305
16154B020639n81225K9959P45229J302861J611152J731760J641409J267855O53945
$$ plain form
16221 -5887361 -4935824 -4234788 -3900650 -3860147 -3954665 -4083169 -4234353 -4400252 -4560568 -4760209
16211 -4760209 -5060149 -5407843 -5640475 -5603935 -5273820 -4788980 -4366460 -4121670 -3962959 -3676932
16201 -3676932 -3090354 -2192053 -1131587 -138376 564525 861938 818239 607021 370544
16192 370544 195423 210089 642881 1640571 2993427 4228062 5011779 5330410 5392529 5481388
16182 5481388 5744936 6090194 6345672 6430668 6336276 6055120 5585073 4933648 4071576 3001378
16172 3001378 1872979 880792 70347 -642678 -1309659 -1862355 -2128360 -1885989 -997031
16163 -997031 436513 2064422 3454048 4313724 4598496 4402855 3806111 2923944 2020639
16154 2020639 1439414 1469373 2214602 3517463 5128615 6860375 8501784 9769639 10423584
16145A0423584l1405n77609q37108q51642p93088p24083n33303j38685L44161
16136F280822O62925N89916N0379p63828j431140j666589j583286j460301j436317
16127g57419j456362j337960r46663l66004K55768R14191J585184K068081K175339
16118B134155J922732J522954J198891R24455M80355j94767r09869j461191j743859
16109C873856j690175j322458p89329k73061J05559K98700K67489k7204n34813
16100i1436j061028j356120j252406p58265o4965O06354J113471J302539J080215
16091d81641O03683J13137l09678o30681p46960n70446j19148L84527O36691N51524
16081e68992K57729j06203m33581n79969m21770n888M51126P42753Q37623Q53966
$$ plain form
16145 10423584 10392179 9814570 8977462 8125820 7332732 6608649 6075346 5936661 6280822
16136 6280822 6943747 7533663 7584042 6820214 5389074 3722485 2139199 678898 -757419
16127 -757419 -2213781 -3551741 -4498404 -4864408 -4608640 -3694449 -2109265 -41184 2134155
16118 2134155 4056887 5579841 6778732 7703187 8183542 7988775 7078906 5617715 3873856
16109 3873856 2183681 861223 71894 -201167 -95608 203092 470581 443377 -91436
16100 -91436 -1152464 -2508584 -3760990 -4519255 -4584220 -3977866 -2864395 -1561856 -481641
16091 -481641 122042 235179 -74499 -705180 -1452140 -2022586 -2141734 -1757207 -1120516 -568992
16081 -568992 -311263 -417466 -851047 -1431016 -1852786 -1858674 -1407548 -664795 172828 1026794
16071A026794Q77031Q15215N21327N4797l95260p27751q77967p71830m48250q7154
16061a3048J48511K54304L68033N82370P80287P31236L38980k48693p55206r81917
16051A204857r27803p16881m39641j47321O0799Q2685q6617l66775o76102r78401
16041b991200j218806j299230j194413r77888p53483o10331n25183l92713j85417
16032a0148664N8019K97080M97625O35254O92042P26008Q88439J213303J499366
16023c641528J537056J327528J029452Q18944P32136O21753L57089r774k87939
16014B484717l41541k37392j19791k4149Q5732J77711J16515j98049o56819j018254
16004B68680j143302j060977q85550p34890o67122o43460n46462k40686L18375
$$ plain form
16071 1026794 1903825 2719040 3240367 3295164 2899904 2172153 1294186 522356 74106 -13048
16061 -13048 135463 389767 757800 1340170 2120457 2851693 3190673 2941980 2186774 1204857
16051 1204857 277054 -439827 -879468 -1026789 -965990 -883305 -969922 -1336697 -2012799 -2991200
16041 -2991200 -4210006 -5509236 -6703649 -7681537 -8435020 -9045351 -9570534 -9963247 -10148664
16032 -10148664 -10090645 -9793565 -9295940 -8660686 -7968644 -7242636 -6354197 -5140894 -3641528
16023 -3641528 -2104472 -776944 252508 1071452 1803588 2425341 2782430 2772656 2484717
16014 2484717 2143176 1905784 1785993 1761844 1847576 2025287 2141802 1943753 1286934 268680
16004 268680 -874622 -1935599 -2821149 -3556039 -4223161 -4866621 -5413083 -5653769 -5335394
15995e335394R72401J428445J555441J496275J388274J174695P80606K70226k15885
15986C515084n47518o53814n89570n22098n46180n40042l58541o1955J77394K29268
15976A02028M8447k98005o39538p92199o74837l54139O21K52299M02502N58300
15966a394521Q24263J162336J386794J357441J084540O58523J77094k40432n06237
15957D509801o96043r28124j133102j142698r17416n29851n5504M90873J083184
15948F81120J534259J590731J152728L68705m54714j061694j410671j584110j595159
15939g78805j402446j020195n67573k52427k03378l41444m90430n28546m07139
15930e992383j06792L52624Q35101J095416R78812O13111L20650K88671L86723
$$ plain form
15995 -5335394 -4362993 -2934548 -1379107 117168 1505442 2680137 3460743 3730969 3515084
15986 3515084 2967566 2313752 1724182 1202084 655904 115862 -242679 -304634 -127240 102028
15976 102028 150475 -147530 -787068 -1579267 -2254104 -2608243 -2607622 -2355323 -1952821 -1394521
15966 -1394521 -570258 592078 1978872 3336313 4420853 5079376 5256470 5016038 4509801
15957 4509801 3813758 2885634 1752532 609834 -307582 -837433 -892937 -402064 681120
15948 681120 2215379 3806110 4958838 5327543 4872829 3811135 2400464 816354 -778805
15939 -778805 -2181251 -3201446 -3769019 -4021446 -4224824 -4566268 -5056698 -5585244 -5992383
15930 -5992383 -6099175 -5746551 -4911450 -3816034 -2837222 -2224111 -1903461 -1614790 -1228067
15921a228067M07765L04744Q9760k31956n67286p38909o47147l94867j72904l0098
15911c208965J24002L14631M42675L78271O5800l86006p66550r25371q30402n23711
15901e315626q6931M05848R05270J354556J722438J985569K022426J685480J028307
15892E707337K90941l47780p69696q23154n55731k64896j58382k28909l95703
15883B454027o54376j072010j603300k044919k181226j908037j325613o79464
15875i014918j67865J36443K54601K62326K90108M24924N70577O30938P52233
15866e860633J149185J732037K123837K075961J653686J107647P02674N52401
15858E236795N30665M72274M14345M81123O51413P36756O00012L59686K15136
$$ plain form
15921 -1228067 -820302 -515558 -425798 -657754 -1225040 -1963949 -2611096 -3005963 -3178867 -3208965
15911 -3208965 -3084963 -2770332 -2327657 -1949386 -1883586 -2269592 -3036142 -3961513 -4791915 -5315626
15901 -5315626 -5402557 -4996709 -4091439 -2736883 -1014445 971124 2993550 4679030 5707337
15892 5707337 5998278 5650498 4880802 4057648 3501917 3237021 3078639 2849730 2454027
15883 2454027 1799651 727641 -875659 -2920578 -5101804 -7009841 -8335454 -9014918
15875 -9014918 -9182783 -9046340 -8791739 -8529413 -8239305 -7814381 -7243804 -6612866 -5860633
15866 -5860633 -4711448 -2979411 -855574 1220387 2874073 3981720 4684394 5236795
15858 5236795 5767460 6239734 6654079 7135202 7786615 8523371 9123383 9483069 9698205
15849I698205J06033j39988m43818n80101n48731n64781o58097o42773m99963
15840E725986l99551m03405m65385n47472n80240n16070m07985l27455k83164
15831A795259k51609k44179l52160o33701r62653j124731j010174o22211q1157
15822c487316L33452L78423Q1150l46166p45095j070153j333956j526705j500095
15813i216461j050918j90630P86722J554519J991004K148702K077396J807899
15805i1767J458174J182606J042398R95155R61196Q63950O89573M24680m7634
15796G478331p43941j413247j719636j509507r32671l86074k23052l61108m00741
15787b11646j57701K49608O47875R05408R57322P98162M66318R4719j41065j80536
$$ plain form
15849 9698205 9804238 9664250 9220432 8640331 8091600 7526819 6868722 6225949 5725986
15840 5725986 5326435 4923030 4457645 3910173 3329933 2813863 2405878 2078423 1795259
15831 1795259 1543650 1299471 947311 313610 -649043 -1773774 -2783948 -3406159 -3487316
15822 -3487316 -3153864 -2775441 -2694291 -3040457 -3785552 -4855705 -6189661 -7716366 -9216461
15813 -9216461 -10267379 -10458009 -9671287 -8116768 -6125764 -3977062 -1899666 -91767
15805 -91767 1366407 2549013 3591411 4586566 5547762 6411712 7101285 7525965 7478331
15796 7478331 6734390 5321143 3601507 2092000 1159329 773255 550203 189095 -211646
15787 -211646 -369347 -119739 528136 1433544 2390866 3189028 3655346 3750065 3609000 3428464
15777C428464j43067k06377m11034o43515p99261q40983p58598o16251n57965
15768a548587o93061j027568j396023j507182j221905p10207k64736J5435K03515
15759h150319K62503Q7074k44868m96912n24316l70935j29387J11583K54005K90062
15749h911510L01552K99901K76252K84050L30994L86238M74833O20032P45713
15740e191945P58437O58971N15972M03573L25028J99415k0033k91386n64820q05255
15730d012043r11507p81818m73286j17239K24638M90268N77699M29593J30413
15721d443282j26255k00185o4225J71455K87313J60547j18847l59365m32049l36885
15711e461778j70082n1226m6394j23745j31344R6468N05991Q55890J005391J034056
$$ plain form
15777 3428464 3285397 3079020 2667986 2024471 1225210 384227 -374371 -990622 -1548587
15768 -1548587 -2241648 -3269216 -4665239 -6172421 -7394326 -8104533 -8369269 -8353834 -8150319
15759 -8150319 -7887816 -7800742 -8045610 -8542522 -9066838 -9437773 -9567160 -9455577 -9201572 -8911510
15749 -8911510 -8609958 -8310057 -8033805 -7749755 -7418761 -7032523 -6557690 -5937658 -5191945
15740 -5191945 -4433508 -3774537 -3258565 -2854992 -2529964 -2330549 -2350582 -2641968 -3206788 -4012043
15730 -4012043 -4923550 -5705368 -6178654 -6295893 -6071255 -5580987 -5003288 -4573695 -4443282
15721 -4443282 -4569537 -4769722 -4833947 -4662492 -4375179 -4214632 -4333479 -4692844 -5124893 -5461778
15711 -5461778 -5631860 -5683086 -5729480 -5853225 -5984569 -5888101 -5382110 -4526220 -3520829 -2486773
15701b486773J069303J098824J023183Q24569O53364P10205J006102J291571J320482
15692F510830J105960P95249M57439R7147k83974o85835j115432j507523j651748
15683C722113j358286p02446M1199O53792J018424J074314Q91824O59656N70214
15674F570804P40640J101523J374091J268049O93422j82380j074991j814046k357985
15665F319127k656654k652532k369065j927723j457289j003203o11923l68566
15657f727828k85956k96482l44049m34861n36406m73368j18204M02710Q47864
15648g966580J093121J145493J020752P45289M16018J36562o4525j70053j46241
15639c790164o1976q5381k87671n38406o67025o81121o94319o77278m74807m4955
$$ plain form
15701 -2486773 -1417470 -318646 704537 1529106 2182470 2892675 3898777 5190348 6510830
15692 6510830 7616790 8412039 8869478 8966625 8682651 7996816 6881384 5373861 3722113
15683 3722113 2363827 1661381 1702580 2356372 3374796 4449110 5340934 6000590 6570804
15674 6570804 7311444 8412967 9787058 11055107 11748529 11566149 10491158 8677112 6319127
15665 6319127 3662473 1009941 -1359124 -3286847 -4744136 -5747339 -6359262 -6727828
15657 -6727828 -7013784 -7310266 -7654315 -8089176 -8625582 -9098950 -9217154 -8814444 -7966580
15648 -7966580 -6873459 -5727966 -4707214 -3961925 -3545907 -3409345 -3473870 -3643923 -3790164
15639 -3790164 -3852140 -3937521 -4225192 -4763598 -5430623 -6111744 -6806063 -7483341 -7958148 -8003103
15629h003103M37741P52239Q47555Q26836P97884P86216P17451N27821K82495
15620b026865Q3130m7338j00057k865K75723O28309Q96166R92015R36529Q10690
15610B445437O88620O36923P03629Q44017R55147R53821P36863K65612l13735
15601G916334q00260j106438j219368j147537r27013n99557k46469K3779J71076
15592B064547K43361K99904L53059L41593J89236p3194l21241m55804m38163k52845
15582A950453P8969M13063N62501M86053K32906j51737o06111j070772j448800
15573D46525j588948j494871j351803j260262j185317j071112q45314m66111L1518
15564h785695O10752J188429J540139J489861J151670Q35788P18352O93629N54757
$$ plain form
15629 -8003103 -7565362 -6813123 -5965568 -5138732 -4340848 -3554632 -2837181 -2309360 -2026865
15620 -2026865 -1943735 -1991073 -2091130 -2093995 -1818272 -1189963 -293797 698218 1634747 2445437
15610 2445437 3134057 3770980 4474609 5318626 6273773 7227594 7964457 8230069 7916334
15601 7916334 7116074 6009636 4790268 3642731 2715718 2116161 1869692 1893471 2064547
15592 2064547 2307908 2607812 2960871 3302464 3491700 3418506 3097265 2641461 2203298 1950453
15582 1950453 2029422 2442485 3004986 3491039 3723945 3572208 2966097 1895325 446525
15573 446525 -1142423 -2637294 -3989097 -5249359 -6434676 -7505788 -8351102 -8817213 -8785695
15564 -8785695 -8174943 -6986514 -5446375 -3956514 -2804844 -1969056 -1250704 -557075 -2318
15555b318K07316k51151n93667o81698n98249n07485m34423k71748J9913L00668
15545b812842L87675K71435J07572R457m3866o9512j5328J48320L59398N15811
15535a141880N78967N93773O83003R64034J378916J707072J710552J288021N73518
15526H335976j57336o80717r72169j133407j257436j443137j742000k043840k174190
15517c268256k122991k014399j868246j600284j211475p97186m56749k80663k92553
15508a3912802l67192l02485P985M99202R99849J307722J310458J077042P77397
15499h602824N47191M58514N66998Q68106J209732J380636J279252R59483O03231
15490g29681L90834L15948K42505J33584P8434J36746K46522K73318J23373j68706
$$ plain form
15555 -2318 204998 -46153 -639820 -1321518 -1919767 -2427252 -2861675 -3133423 -3113510 -2812842
15545 -2812842 -2425167 -2153732 -2046160 -2036703 -2080569 -2150081 -2165409 -2017089 -1657691 -1141880
15535 -1141880 -562913 30860 713863 1677897 3056813 4763885 6474437 7762458 8335976
15526 8335976 8178640 7497923 6525754 5392347 4134911 2691774 949774 -1094066 -3268256
15517 -3268256 -5391247 -7405646 -9273892 -10874176 -12085651 -12882837 -13339586 -13620249 -13912802
15508 -13912802 -14279994 -14582479 -14574494 -14075292 -13075443 -11767721 -10457263 -9380221 -8602824
15499 -8602824 -8055633 -7597119 -7030121 -6162015 -4952283 -3571647 -2292395 -1332912 -729681
15490 -729681 -338847 -22899 219606 353190 431624 568370 814892 1088210 1211583 1042877
15480A042877m88430q01048j089628j193616r58253m46117J33402O13154R42911
15471b244748J131417J153776R75206O42883K87103J8296j77487m05997o83147
15462F97302q53027p61723m23288k9427J70865P3309k17373m92838n85896m68499
15452b890595k48631l2785J63690L65187N91292Q24581J040659J276322J508782
15443B598502J555501J276062P05031L2838m63149o72253p35606p76223p49616
15434B771087o12067m38186k84188j29102k0279n2501j62449j74109l7590J77774
15424A038390M07413N31684L76544j14606p74216j272459j341768r71453l86611
15415b507082J24607L98788M87144N29583N18769L19508r5604n79407r59002j159757
$$ plain form
15480 1042877 554447 -246601 -1336229 -2529845 -3488098 -3934215 -3800813 -3187659 -2244748
15471 -2244748 -1113331 40445 1015651 1658534 1945637 1963933 1786446 1380449 697302
15462 697302 -155725 -917448 -1340736 -1370163 -1199298 -1125989 -1343362 -1836200 -2422096 -2890595
15452 -2890595 -3139226 -3172011 -3008321 -2643134 -2051842 -1227261 -186602 1089720 2598502
15443 2598502 4154003 5430065 6135096 6167934 5704785 5032532 4296926 3520703 2771087
15434 2771087 2159020 1720834 1436646 1307544 1287265 1234764 1072315 898206 860616 1038390
15424 1038390 1445803 1977487 2354031 2239425 1465209 192750 -1149018 -2120471 -2507082
15415 -2507082 -2382475 -1983687 -1496543 -966960 -448191 -128683 -224287 -803694 -1762696 -2922453
15405b922453j192735j066099q19989o33677o53164p61944p40861n35841k84865
15396i611628j33911m9308J41926N44101J056595J457320J622246J599775J469554
15387a903330J235579Q74544L99630j15964n45163p73930q04474p39969o54582
15378c027659n34611l56585j46969N1540J99240K20819L1820l60494q07806j084221
15368e814926j050006p58886m05784j33811J38079N84670J173485J636881J723261
15359b907037J430149J022504P94633Q19960R71803J097723J101950R65986P03556
15350F001227K84950k56642p40061j019107j155134j278645j370673j249254p45178
15341a528517J23258J091890J766410J880425J461029P59053K5539n86279r34735
$$ plain form
15405 -2922453 -4115188 -5181287 -6001276 -6634953 -7288117 -8050061 -8790922 -9326763 -9611628
15396 -9611628 -9745539 -9794847 -9652921 -9108820 -8052225 -6594905 -4972659 -3372884 -1903330
15387 -1903330 -667751 206793 606423 490459 -54704 -828634 -1633108 -2373077 -3027659
15378 -3027659 -3562270 -3918855 -4065824 -4014284 -3815044 -3594225 -3562405 -3922899 -4730705 -5814926
15368 -5814926 -6864932 -7623818 -8029602 -8163413 -8025334 -7440664 -6267179 -4630298 -2907037
15359 -2907037 -1476888 -454384 340249 1160209 2132012 3229735 4331685 5297671 6001227
15350 6001227 6286177 6029535 5289474 4270367 3115233 1836588 465915 -783339 -1528517
15341 -1528517 -1405259 -313369 1453041 3333466 4794495 5553548 5579087 4992808 4058073
15332D058073r33860o89816m08683k37738k22364k85460l33352l24632j97838
15323D24330J1968O5080k21497p28933j141959j201087q43823j85134O02823J355096
15313a863136J916537K192913K226808K105792J789567J181928L53578m22433
15305I481554q80942r49755p89749p12774q84980j127879j147132q48801l75579
15296A763963O7700L64575N02178M57695K13978j29112m45153o72906p98095q52972
15286D71851q74075q63897q19993p69367p41276p42227p49209o54939l20966K10279
15276e853819P05203R99563J113907J096201R29327O39097L72328K44518J43956
15267C90281o8162k77353l26678l19558m75125q10104j128329j238103j073818
$$ plain form
15332 4058073 3124213 2434397 2025714 1787976 1565612 1280152 946800 622168 424330
15323 424330 436298 501378 279881 -449052 -1591011 -2792098 -3635921 -3821055 -3218232 -1863136
15313 -1863136 53401 2246314 4473122 6578914 8368481 9550409 9903987 9481554
15305 9481554 8600612 7650857 6861108 6148334 5263354 4135475 2988343 2139542 1763963
15296 1763963 1831663 2196238 2698416 3156111 3370089 3240977 2795824 2122918 1324823 471851
15286 471851 -402224 -1266121 -2086114 -2855481 -3596757 -4338984 -5088193 -5743132 -6064098 -5853819
15276 -5853819 -5148616 -4149053 -3035146 -1938945 -1009618 -370521 1807 246325 390281
15267 390281 322119 44766 -281912 -601470 -1076595 -1886699 -3015028 -4253131 -5326949
15258e326949o71350j34462M05411Q46130J125840J214003J084489O75576L387
15249g77925o89948j124551j229326j051355o37043j11821L39713O65208R53145
15240c663903J177367J165750Q36424K64951l49240p58630q34414n98723j81912
15231b942330J92163L81457L96346K45298p785j56473q4848R2943K68349M39395
15221a175485N27666M19594J61721o9764o9941K43193O12798O41567K47470l30603
15211A208216q73052j325059j658431j769019j570318j112891n26792P5499N56987
15202f994860P18078M61187l7930m57439n66782k97327K49253Q08370J111260
15193e006190J099163R07304P14807O49945P28180Q25483P31743L51904j28264
$$ plain form
15258 -5326949 -5998299 -6132761 -5727350 -4881220 -3755380 -2541377 -1456888 -781312 -777925
15249 -777925 -1467873 -2592424 -3821750 -4873105 -5510148 -5621969 -5282256 -4617048 -3663903
15240 -3663903 -2486536 -1320786 -484362 -219411 -568651 -1327281 -2161695 -2760418 -2942330
15231 -2942330 -2750167 -2368710 -1972364 -1727066 -1734851 -1891324 -1976172 -1883229 -1614880 -1175485
15221 -1175485 -647819 -228225 -66504 -136268 -206209 36984 649782 1291349 1538819 1208216
15211 1208216 335164 -989895 -2648326 -4417345 -5987663 -7100554 -7627346 -7551847 -6994860
15202 -6994860 -6276782 -5815595 -5853525 -6310964 -6877746 -7175073 -6925820 -6117450 -5006190
15193 -5006190 -3907027 -2999723 -2284916 -1634971 -906791 -81308 650435 1002339 874075
15184H74075l85117l16031j50748j74718m45325p73906r06685p51275m74317l31736
15174c835783l52064l56952k58923j17075k9410k3252m0987m8612n4110q3250
15164e200418j79301l40963n09647o65978q65819j127563j297524j154752p06924
15155a2048889k01853J78338M63269P69806J144748J534382J861630K110353K253751
15146a934465K179744J874189J490500J185763J007880Q61224O26991L07598o647
15137G592777k49361m24135n74336p61548j008580j184011j118337p95798l22071
15128A154600J48338M56617M81533K56664L2781L2517K34794M90261O59541O16526
15118D564172L18213r7612m09266n74878p14320q29324p84328n12840j08114K80448
$$ plain form
15184 874075 488958 172927 22179 -152539 -597864 -1371770 -2278455 -3029730 -3504047 -3835783
15174 -3835783 -4187847 -4544799 -4803722 -4920797 -4950207 -4973459 -5014446 -5063058 -5117168 -5200418
15164 -5200418 -5379719 -5720682 -6230329 -6896307 -7762126 -8889689 -10187213 -11341965 -12048889
15155 -12048889 -12250742 -12072404 -11609135 -10839329 -9694581 -8160199 -6298569 -4188216 -1934465
15146 -1934465 245279 2119468 3609968 4795731 5803611 6664835 7291826 7599424 7592777
15137 7592777 7343416 6919281 6344945 5583397 4574817 3390806 2272469 1476671 1154600
15128 1154600 1302938 1759555 2241088 2497752 2530533 2563050 2797844 3288105 3947646 4564172
15118 4564172 4882385 4784773 4375507 3800629 3086309 2256985 1472657 959817 851703 1132151
15108A132151N74140P52410Q12189P72808O51173M50887K54758K23959L84419
15099F008894N67772N89581L54041j13737o64843j112985j319465j237193r64295
15090B107770o83372m60544k11257J25862M84564P42116Q33574P42204N27597
15081D208514L73960L96550M88540M70295K99457J07236M6167P6900k9519m41382
15071E996718j078354j661242j923404j793444j393466r25120o11043o25832r26163
15062d941350j202736j131020o81679j04793L31313M74562K91821j24075n28937
15053g616894o54773m67828j65229N4001J00050l604j17359r5761M0072J87088
15043h740237L63168O17954Q93257J127510J374284J689764J949698J946812J630615
$$ plain form
15108 1132151 1706291 2458701 3270890 4043698 4694871 5145758 5400516 5624475 6008894
15099 6008894 6576666 7166247 7520288 7406551 6741708 5628723 4309258 3072065 2107770
15090 2107770 1424398 963854 752597 878459 1363023 2105139 2938713 3680917 4208514
15081 4208514 4582474 4979024 5467564 5937859 6237316 6344552 6390719 6467619 6438100 5996718
15071 5996718 4918364 3257122 1333718 -459726 -1853192 -2778312 -3389355 -4015187 -4941350
15062 -4941350 -6144086 -7275106 -7956785 -8061578 -7730265 -7255703 -6963882 -7087957 -7616894
15053 -7616894 -8271667 -8739495 -8904724 -8850723 -8750673 -8754277 -8871636 -8967397 -8927325 -8740237
15043 -8740237 -8377069 -7759115 -6865858 -5738348 -4364064 -2674300 -724602 1222210 2852825
15034B852825J137277O17858J22955l15304o23602p72621q14656p92722p12488
15025F99522o08748n94796p31197q80683q64793o91805n22575m42476m11298m51327
15015e500176o25391q12502q35085p58275p48577p66005o15479k40318J73565
15006a0728243M47129O23411Q34379J099130J346952J480576J410263J156081
14998b330322Q60407O59706O05691P07591R33256J155286J231707J161706J049679
14989F034707R05339O39563K27505k73481p44606j000487r17983o15832m07023
14980C847702m74044o58345o85483n06915l23581k85710l35784l17217j10981
14971A49642K16497M21809L14785p6950n64453r27849j022509q88876p32693p20229
$$ plain form
15034 2852825 3990102 4607960 4730915 4415611 3792009 3019388 2204732 1412010 699522
15025 699522 90774 -504022 -1235219 -2115902 -2980695 -3672500 -4195075 -4637551 -5048849 -5500176
15015 -5500176 -6125567 -6938069 -7773154 -8531429 -9280006 -10046011 -10661490 -10901808 -10728243
15006 -10728243 -10281114 -9657703 -8823324 -7724194 -6377242 -4896666 -3486403 -2330322
14998 -2330322 -1469915 -810209 -204518 503073 1436329 2591615 3823322 4985028 6034707
14989 6034707 6940046 7579609 7807114 7533633 6789027 5788540 4870557 4254725 3847702
14980 3847702 3373658 2715313 2029830 1522915 1199334 913624 577840 260623 149642
14971 149642 366139 787948 1102733 1025783 461330 -466519 -1489028 -2377904 -3110597 -3830826
14961c830826q27315q75522p58797n41772k84460m0858M7665q3050k66387k75497
14951g736819o0448K96542O94551J032696J275763J475116J668418J796612J743802
14942B186233J450022R08377J40606p18990j449543j926538k184721k307208k308614
14933f210376k142637j792655j281525o70060q3818L55780O52003R25466J235203
14924i012619J494538J637351J726021J861838K070233K290877K430594K410478
14916F909311K209455J819710J224756M84436k53615q32741j113594r91403n42040
14907H914275o1485J53358M3160k15388m49859n90650o20454o10977o75634q27174
14897E059172j002029j182698j393390j629021j838515j986753k119660k233614
$$ plain form
14961 -3830826 -4658141 -5533663 -6292460 -6834232 -7118692 -7159550 -7111885 -7194935 -7461322 -7736819
14951 -7736819 -7797267 -7500725 -6806174 -5773478 -4497715 -3022599 -1354181 442431 2186233
14942 2186233 3636255 4544632 4685238 3966248 2516705 590167 -1594554 -3901762 -6210376
14933 -6210376 -8353013 -10145668 -11427193 -12097253 -12181071 -11825291 -11173288 -10247822 -9012619
14924 -9012619 -7518081 -5880730 -4154709 -2292871 -222638 2068239 4498833 6909311
14916 6909311 9118766 10938476 12163232 12647668 12394053 11561312 10447718 9456315 8914275
14907 8914275 8852790 9006148 9049308 8833920 8384061 7793411 7172957 6561980 5886346 5059172
14897 5059172 4057143 2874445 1481055 -147966 -1986481 -3973234 -6092894 -8326508
14889h326508k077931j372774k81183O60035J147563J278615J219063J083544
14881f669576R55520Q23822O38118M39588L21469K92903K37130O3039j66720l26273
14871c390980l23946j51874O8472J86539J49624J7579p8485J0641L48347Q38809
14861b325274J289413J512793J429596J165781R44357Q47113P70540N72404K71813
14852F478536N4100J9037Q7198J27944M3587j39234k70996k82218k33709j51919
14842E732326O359K38403M60433N94918O19290N43851L63647M5294l56935o65636
14832G581950p52626o96545o97008q45775j055093j228179j400725j651262j939371
14823b684634k111508k043397j719632j215747o20337m601N10028P64215P23932
$$ plain form
14889 -8326508 -10404439 -11777213 -12058396 -11398361 -10250798 -8972183 -7753120 -6669576
14881 -6669576 -5714056 -4890234 -4252116 -3812528 -3491059 -3198156 -2961026 -2897987 -3064707 -3390980
14871 -3390980 -3714926 -3866800 -3798328 -3611789 -3462165 -3444586 -3523071 -3512430 -3164083 -2325274
14861 -2325274 -1035861 476932 1906528 3072309 4016666 4863779 5634319 6206723 6478536
14852 6478536 6532636 6551673 6638871 6766815 6810402 6671168 6400172 6117954 5884245 5732326
14842 5732326 5738685 5977088 6437521 7032439 7651729 8195580 8559227 8604521 8247586 7581950
14832 7581950 6829324 6132779 5435771 4589996 3534903 2306724 905999 -745263 -2684634
14823 -2684634 -4796142 -6839539 -8559171 -9774918 -10395255 -10399856 -9889828 -9125613 -8401681
14814h401681N53751M67560N73546Q75587J272324J540318J484043J131156O93815
14805A90419L76883K18190J12395J0942k1763M1223R7608K5213j73671l83016
14795D94423m89602m78186m27369l97848l83280l48173k77827k28729k08458m2369
14785b787418L65530P70703Q68719O23708J82698l56971r47504j430330j553908
14776d264773j207030n44312J41698O16265Q33523R10879R41491Q92341P25436
14767i54482M95260L06076K18987J90837J55380J25617J27495J04765J1730j04635
14757F77030j75431j67972j49993k23982l02767j94492L7123J28698J3507j00862
14747d59141k5330K13672M69352O14483O07102M84113L17666J81583J08316O4885
$$ plain form
14814 -8401681 -7847930 -7380370 -6806824 -5931237 -4658913 -3118595 -1634552 -503396 190419
14805 190419 567302 785492 897887 908829 887066 928289 1025897 1051110 877439 494423
14795 494423 4821 -473365 -900734 -1298582 -1681862 -2030035 -2307862 -2536591 -2745049 -2787418
14785 -2787418 -2421888 -1651185 -782466 -158758 23940 -333031 -1280535 -2710865 -4264773
14776 -4264773 -5471803 -6016115 -5874417 -5258152 -4424629 -3513750 -2572259 -1679918 -954482
14767 -954482 -459222 -153146 65841 256678 412058 537675 665170 769935 781665 677030
14757 677030 501599 333627 183634 -40348 -343115 -537607 -500484 -371786 -358279 -459141
14747 -459141 -484471 -270799 198553 813036 1420138 1904251 2221917 2403500 2511816 2576701
14737B576701n4270l29729o85974r95316j230123j351776j242838q96406m60853
14728d670584o6428K33902M22683M78713L54692O2879k74955n23570n99145m71034
14718e052847j74989K26207O45072R55901J102651J066006P45568J26568n54280
14709i14143j012767j145314r86593o22111j74010K22615M84982N87361N50009
14700c009971M70322M30497M22539M17439L87781K88322J25791k4198j30492k36541
14690h58511l67461m94235n50953m22611k4361N37603J026674J284304J258273
14681A388722R64350N15090M1111l68991o03340n94316l97584j15532J60845L26950
14671A317305K51686r0642n07838p44044o73982l93624j61500j39683k56981l19396
$$ plain form
14737 2576701 2522431 2192702 1506728 511412 -718711 -2070487 -3313325 -4209731 -4670584
14728 -4670584 -4737012 -4503110 -4080427 -3601714 -3247022 -3184143 -3459098 -3982668 -4581813 -5052847
14718 -5052847 -5227836 -5001629 -4356557 -3400656 -2298005 -1231999 -486431 -359863 -914143
14709 -914143 -1926910 -3072224 -4058817 -4680928 -4854938 -4632323 -4147341 -3559980 -3009971
14700 -3009971 -2539649 -2109152 -1686613 -1269174 -881393 -593071 -467280 -491478 -621970 -858511
14690 -858511 -1225972 -1720207 -2271160 -2693771 -2718132 -2180529 -1153855 130449 1388722
14681 1388722 2353072 2868162 2909273 2540282 1936942 1342626 945042 829510 990355 1317305
14671 1317305 1568991 1478349 970511 226467 -447515 -841139 -1002639 -1142322 -1399303 -1718699
14661a718699j68352J82830N13354N60527K69869j75840n95590r65149j303433
14652c400483j564975j695285j665143j438145r86190l71702K11718N70228O90228
14643i649749P31465Q07035Q51756Q01437P30595O98419O41927M99938K84985
14634c602192N8453j02886j40184L202L14093O10911O58202M15946J02865j1209
14624a692799J55191M43623O48599P10332O50363M96552L06327J42171L1030n8706
14614A832683j49943k13325k44166k45632j56976K6291J59834J31486j0631j88736
14604I40885l69796m77283m20783k38901q2890k700J00796K70903L91315L34695
14594D46241J83597J47503K69538L96073L84736K22385o0599m39841q03290r68309
$$ plain form
14661 -1718699 -1887051 -1704221 -1190867 -630340 -360471 -536311 -1131901 -2097050 -3400483
14652 -3400483 -4965458 -6660743 -8325886 -9764031 -10750221 -11121923 -10910205 -10339977 -9649749
14643 -9649749 -8918284 -8111249 -7259493 -6458056 -5727461 -5029042 -4387115 -3887177 -3602192
14634 -3602192 -3543739 -3646625 -3786809 -3783607 -3469514 -2858603 -2200401 -1784455 -1681590 -1692799
14624 -1692799 -1537608 -1093985 -445386 264946 915309 1411861 1718188 1860359 1891389 1832683
14614 1832683 1682740 1469415 1225249 979617 822641 848932 1008766 1140252 1129621 940885
14604 940885 571089 93806 -326977 -565878 -648768 -651468 -550672 -279769 111546 446241
14594 446241 629838 777341 1046879 1442952 1827688 2050073 1989474 1549633 746343 -221966
14584b21966q58933o18916m81633m47163k66248J71739N98689O21510K05089k87379
14574a585211n17077m70881l84653m52627o54819q54657r44629q56463n64918
14565g285935j64381J72961M07730O44999R17192J167304J370971J497259J443089
14556A71189J093686M54781k80335q72176j201522j261891j116038q85535o77876
14547d575717n22060l94011k58864j25419n1996p3356j78382l68703o78143j043875
14537h270526j237181j068934o06961q0271L56217O42251O99152N05599J75822
14528h884832r2972j01146J73500N23908P77828R27979J037363J153811J205071
14519c279490J055936O97066K69127k2973l8403J50327L60307N14238O04737O43574
$$ plain form
14584 -221966 -1080899 -1699815 -2181448 -2628611 -2894859 -2723120 -2124431 -1502921 -1297832 -1585211
14574 -1585211 -2102288 -2573169 -2957822 -3410449 -4065268 -4919925 -5864554 -6721017 -7285935
14565 -7285935 -7450316 -7277355 -6869625 -6224626 -5307434 -4140130 -2769159 -1271900 171189
14556 171189 1264875 1719656 1439321 567145 -634377 -1896268 -3012306 -3897841 -4575717
14547 -4575717 -5097777 -5491788 -5750652 -5876071 -5928067 -6001423 -6179805 -6548508 -7226651 -8270526
14537 -8270526 -9507707 -10576641 -11183602 -11263873 -10907656 -10265405 -9566253 -9060654 -8884832
14528 -8884832 -8977804 -9078950 -8905450 -8381542 -7603714 -6675735 -5638372 -4484561 -3279490
14519 -3279490 -2223554 -1526488 -1257361 -1280334 -1318737 -1168410 -808103 -293865 310872 954446
14509I54446O64375O32473M55537J02340l52147p74866j028202r82829n94710
14500i23583k5050M58600P05492P08834N13237K04166j12380l49126m64205m81174
14490B34811m75088n29764o64068q36245r88487j023404q12321l28209K68418
14481e154357P47636R81182R98474Q71746O34494L39746O0625j46394k49571k26057
14471a142476j04471j0712o0023k35213l76293l19355o8740K26930M03769M12297
14461a274287L61072L18992J80468j14489m01784m48073j74382L12250Q57639
14452c82594J342881J650483J711256J630447J549644J379155R32139K85796k75609
14443I823598o24678q37847r75221j020421r22641o26373k00855J15849K09932
$$ plain form
14509 954446 1618821 2251294 2706831 2809171 2457024 1682158 653956 -328873 -923583
14500 -923583 -948633 -490033 215459 924293 1437530 1641696 1529316 1180190 715985 234811
14490 234811 -240277 -770041 -1434109 -2270354 -3258841 -4282245 -5094566 -5422775 -5154357
14481 -5154357 -4406721 -3425539 -2427065 -1555319 -920825 -581079 -520454 -666848 -916419 -1142476
14471 -1142476 -1246947 -1257659 -1317682 -1552895 -1929188 -2248543 -2317283 -2090353 -1686584 -1274287
14461 -1274287 -913215 -594223 -413755 -528244 -930028 -1378101 -1552483 -1240233 -382594
14452 -382594 960287 2610770 4322026 5952473 7502117 8881272 9813411 10099207 9823598
14443 9823598 9198920 8361073 7385852 6365431 5442790 4816417 4615562 4731411 4941343
14434D941343L07746O38246J059019J218300R47698L92442j68175n17407n77412
14425H241800m54489l73723m61364o24863o54520m17964J0702L63234L66883p0630
14415E925066q27157j583984j981117j875797j376935o75706O8164P09245J105256
14406e12965J209960J146446J120149J231464J394418J460455J371529J192272
14398I613728J032755R46201Q86634P24717L34390k54079q07788j089870j018460
14389A0368228o91767l72734k47307j95259k0673K25506L84631M42231M82895
14380A0375751N39407N21391L49460Q4111k51645p30162j261820j530413j333975
14371F762105q98256o51767p56301j052075j325487j440203j282656p82608j05556
$$ plain form
14434 4941343 5249089 5887335 6946354 8164654 9112352 9504794 9336619 8819212 8241800
14425 8241800 7787311 7413588 6952224 6327361 5672841 5254877 5265579 5628813 5995696 5925066
14415 5925066 5097909 3513925 1532808 -342989 -1719924 -2395630 -2327466 -1618221 -512965
14406 -512965 696995 1843441 2963590 4195054 5589472 7049927 8421456 9613728
14398 9613728 10646483 11592684 12479318 13204035 13538425 13284346 12476558 11386688 10368228
14389 10368228 9676461 9303727 9056420 8861161 8840488 9065994 9450625 9892856 10375751
14380 10375751 10915158 11436549 11786009 11870120 11618475 10888313 9626493 8096080 6762105
14371 6762105 5863849 5212082 4455781 3403706 2078219 638016 -644640 -1427248 -1532804
14362a532804L96781N77346O07224O90680Q50708R82276J087406J307652J609258
14353F576527J716497J476105J024858N92000L10819J60859j5103l80028q83946
14344A0578588j272493j365262j197965q92827n61130k75815m7653J50462L89385
14335E505290P11633J051429J355097J665010K055932K551948L043797L315095
14327B1255231L191259K717642K146758J674393J274702Q24238L81038J51989
14319C3617250J87213L46055M99526O28608P86682J038051J341768J535852J533207
14310D1514212J436703J432049J681913K287914L265389M571454O159876Q025000
14302G0374510J0165278J2560455J5259711J8217926K0799148K1552954J8874613
$$ plain form
14362 -1532804 -1136023 -558677 48547 739227 1589935 2572211 3659617 4967269 6576527
14353 6576527 8293024 9769129 10793987 11385987 11696806 11857665 11842562 11462534 10578588
14344 10578588 9306095 7940833 6742868 5850041 5288911 5013096 4965443 5115905 5505290
14335 5505290 6216923 7268352 8623449 10288459 12344391 14896339 17940136 21255231
14327 21255231 24446490 27164132 29310890 30985283 32259985 33084223 33465261 33617250
14319 33617250 33804463 34150518 34650044 35278652 36065334 37103385 38445153 39981005 41514212
14310 41514212 42950915 44382964 46064877 48352791 51618180 56189634 62349510 70374510
14302 70374510 80539788 93100243 108359954 126577880 147377028 168929982 187804595
14295A87804595J2583449M888759j162764m030887l860333j329398K986908Q664222
14287B06544551J5352548K2746531L0613134L8611669M5465636M7864354M1061967
14280D48260390K2896116j914016k4190320l7832441m2769246m2084137l8823979
14273B83542367l4771426l0623906k6638862k2983386j9719695j6778641j4065985
14266A17960466j1599455r512498p924284o818026o024089n316773m601590l954303
14258F2209448l432643l001980k640438k367761k186033k087480k077769k109227
14250D2306117k042651j783563j418937j133470j052186j183420j435193j676182
14242C0580515j812252j772621j528408j156935p39793k72208K54433P96995J242010
$$ plain form
14295 187804595 200388044 205276803 204114039 200083152 196222819 194893421 197880329 206544551
14287 206544551 221897099 244643630 275256764 313868433 359334069 407198423 448260390
14280 448260390 471156506 469242490 445052170 407219729 364450483 322366346 283542367
14273 283542367 248770941 218147035 191508173 168524787 148805092 132026451 117960466
14266 117960466 106361011 96848513 88924229 82106203 76082114 70765341 66163751 62209448
14258 62209448 58776805 55774825 53134387 50766626 48580593 46493113 44415344 42306117
14250 42306117 40263466 38479903 37060966 35927496 34875310 33691890 32256697 30580515
14242 30580515 28768263 26995642 25467234 24310299 23570506 23298298 23552731 24349726 25591736
14233B5591736J419621J254972Q32946K55175m19091j107444j715919k147513
14225B3964483k300754k163004j830781j456845j186449j081701j089663j074836
14217A1780450r46507q02397q40087j052553j217505j200347j022635p25469l28212
14208C644738R4865M15898N54131N05809L22736P2430j71972l36174l95244l69343
14198D337874l21755l40382m36146n24147n52390n35625m47462k17403J23289
14189A085853L80596M22925L44391L26095M72574P54474J051161J233979J241730
14180G313778J098235P79995J83260o74831j560600k199855k457777k314999j803570
14171a636364j068929l44708K61208P87436J242032J570928J714172J652931J417977
$$ plain form
14233 25591736 27011357 28266329 29099275 29354450 28935359 27827915 26111996 23964483
14225 23964483 21663729 19500725 17669944 16213099 15026650 13944949 12855286 11780450
14217 11780450 10833943 10031546 9191459 8138906 6921401 5721054 4698419 3972950 3644738
14208 3644738 3739603 4155501 4709632 5215441 5538177 5610607 5438635 5102461 4707217 4337874
14198 4337874 4016119 3675737 3239591 2715444 2163054 1627429 1179967 962564 1085853
14189 1085853 1466449 1889374 2233765 2559860 3032434 3786908 4838069 6072048 7313778
14180 7313778 8412013 9192008 9375268 8700437 7139837 4939982 2482205 167206 -1636364
14171 -1636364 -2705293 -3050001 -2788793 -2001357 -759325 811603 2525775 4178706 5596683
14162E596683J045982O01851K03801l2016q5414m0970o563o1888j85539k47586
14152F788341j75712m9243q683j43434m30884p15931q02682o20438k78850M5725
14142C608209K31454K32815Q6750j09097k88146m17869m42035l54697k57024k36658
14132B053702l03677m31752n77368o98450p48569o92298n91655o02705p74609
14123c367381r63584r87622p74390m22686j65910j80662m20371o63154o04627
14114h550387J9386J170260K427011L268540L411604K863191J810182N87861m43421
14105F564227j110226j414924j374424j024955n08625n4026J45771J34489J55252
14096A512559K95571M25750M49327L70483K50154J95501K81664M62384O11476
$$ plain form
14162 5596683 6642665 7244516 7448317 7416301 7330887 7289917 7283354 7221466 7035927 6788341
14152 6788341 6612629 6563386 6554703 6411269 5980385 5264454 4461772 3841334 3562484 3608209
14142 3608209 3839663 4072478 4159228 4050131 3761985 3344116 2902081 2547384 2290360 2053702
14132 2053702 1750025 1318273 740905 42455 -706114 -1398412 -1990067 -2592772 -3367381
14123 -3367381 -4330965 -5318587 -6092977 -6515663 -6681573 -6862235 -7282606 -7945760 -8550387
14114 -8550387 -8531001 -7360741 -4933730 -1665190 1746414 4609605 6419787 7007648 6564227
14105 6564227 5454001 4039077 2664653 1639698 1131073 1077047 1222818 1357307 1512559
14096 1512559 1808130 2233880 2683207 3053690 3303844 3499345 3781009 4243393 4854869
14087D854869O06406L75851l3328m19389n36176l04086J36162N60118Q14482Q67794
14077F922703P75984O70582O73285P76786Q66450Q05209N14863N5602m03939p32835
14067A0924690r15790r84715r49892q28269o56345m21341j16482J66645L25823
14058F544324L47651K71247J43550J3925r6964j64559j17339Q0449L42100N22919
14048G887303M86254J78220k86908p10494r50624r71201q08640n39812k74120
14039D009978j20057j23200k62016m75235o49848p14162p08401o57497n37630
14030b38068l35617j0826M28169Q53208J126464J179923J026602P62367M91764
14021E283986K26196o5589l49228n11798m65887k52486q945J54147K55023L14053
$$ plain form
14087 4854869 5461275 5837126 5803798 5384409 4848233 4544147 4680309 5240427 6054909 6922703
14077 6922703 7698687 8369269 9042554 9819340 10685790 11490999 12005862 12061464 11657525 10924690
14067 10924690 10008900 9024185 8074293 7246024 6589679 6168338 6051856 6218501 6544324
14058 6544324 6891975 7163222 7306772 7320697 7223733 7059174 6941835 7022284 7364384 7887303
14048 7887303 8373557 8551777 8264869 7554375 6603751 5632550 4823910 4284098 4009978
14039 4009978 3889921 3766721 3504705 3029470 2379622 1665460 957059 299562 -238068
14030 -238068 -573685 -584511 -156342 696866 1823330 3003253 4029855 4792222 5283986
14021 5283986 5510182 5444593 5095365 4583567 4117680 3865194 3856249 4010396 4265419 4579472
14011D579472J86511k49272p97429j112730j105682r81674r55449j020221r69908
14002b426382o14959L453O51988J109233J255436J079243O95611K90518J082j12456
13992A932767l8200J46144L30226M81860N42229L88736M9924k92372n24363o08504
13982B408447m71690p0030M50811P91453P82749N18567J85284j07243l42374n48783
13972C597191p19799p63031n48264k2014O47912J099489J070194O32419M5973
13963E040070n20982r86540j228244j142692p92553m05351j91607k26626m72106
13954i26631q26225j181346j400994j334626r98486o22120m07917l23542k10136
13945h232023Q074K74518M20602K92525l8653k90413k18877J77951O82042J040898
$$ plain form
14011 4579472 4765983 4516711 3719282 2606552 1500870 519196 -436253 -1456474 -2426382
14002 -2426382 -3041341 -3037888 -2385900 -1276667 -21231 1058012 1753623 2044141 2045223 1932767
13992 1932767 1894567 2040711 2370937 2852797 3395026 3783762 3833686 3541314 3016951 2408447
13982 2408447 1936757 1866727 2317538 3108991 3891740 4410307 4595591 4488348 4145974 3597191
13972 3597191 2877392 2114361 1566097 1544083 2191995 3291484 4361678 4994097 5040070
13963 5040070 4519088 3532548 2304304 1161612 369059 -36292 -227899 -454525 -926631
13954 -926631 -1752856 -2934202 -4335196 -5669822 -6668308 -7290428 -7698345 -8021887 -8232023
13945 -8232023 -8223949 -7949431 -7528829 -7236304 -7274957 -7565370 -7784247 -7606296 -6924254 -5883356
13935e883356J154549J115462J067235J062630J072326J073584J038902Q81772
13927B583104N43959O6075m90261j037228j416797j494018j242558p45277j66235
13918c399236L31359O98006R44755R58980N95285l1104n69614p61816n67049q5009
13908a885443M52383P43755O45284L76971L27900N89922R30588J173832J326078
13899D681270J397972J328654J041771N30874r5743o38214r19511r46295q52461
13890E528317p52531p36171p90292p45492n46185m07162n43455r03041j215405
13881a111417j224153r36755n84617l27063j85573j41941j80404k88933l98069
13872e378925l63296p2304L85741P07549N99764N5724n96732j002274j088631
$$ plain form
13935 -5883356 -4728807 -3613345 -2546110 -1483480 -411154 662430 1701332 2583104
13927 2583104 3127063 3193138 2702877 1665649 248852 -1245166 -2487724 -3233001 -3399236
13918 -3399236 -3067877 -2369871 -1425116 -466136 129149 98045 -471569 -1233385 -1800434 -1885443
13908 -1885443 -1433060 -689305 -44021 332950 660850 1250772 2181360 3355192 4681270
13899 4681270 6079242 7407896 8449667 8980541 8884798 8246584 7327073 6380778 5528317
13890 5528317 4775786 4039615 3249323 2503831 1957646 1550484 1007029 103988 -1111417
13881 -1111417 -2335570 -3272325 -3856942 -4184005 -4369578 -4511519 -4691923 -4980856 -5378925
13872 -5378925 -5742221 -5814525 -5428784 -4721235 -4121471 -4065747 -4662479 -5664753 -6753384
13863f753384j001363q84921q12817p58667n96242k75476Q4964L47590M80748
13854a0169568N37381O02516P29409Q23509P20647M91852L89214M72887N74511
13845d827642N73623N04715M23121L39676K83036L05097M08814N36130O17160
13836h36270O13827N40738L93838J10952l17952q08765j287113j648960j672343
13827d912048j239308n60025r680J86641L0046l18635n34651k81329M43445J211813
13817e983731J572498J469693J134790P14897J93073m09839r25781j130827r11978
13808d277205l71008J93355M79080M36449L03921L63978O61527R97986J142344
13799f9573R92062N93473L7312n79441j091718j343729j298918j013973n91130
$$ plain form
13863 -6753384 -7754747 -8639668 -9452485 -10211152 -10807394 -11082870 -10997906 -10650316 -10169568
13854 -10169568 -9632187 -9029671 -8300262 -7476753 -6756106 -6264254 -5875040 -5402153 -4827642
13845 -4827642 -4254019 -3749304 -3326183 -2986507 -2703471 -2398374 -1989560 -1453430 -836270
13836 -836270 -222443 318295 712133 823085 505133 -303632 -1590745 -3239705 -4912048
13827 -4912048 -6151356 -6711381 -6721061 -6534420 -6504374 -6823009 -7357660 -7638989 -7195544 -5983731
13817 -5983731 -4411233 -2941540 -1806750 -1091853 -898780 -1308619 -2234400 -3365227 -4277205
13808 -4277205 -4648213 -4454858 -3975778 -3539329 -3235408 -2871430 -2209903 -1211917 -69573
13799 -69573 922489 1515962 1553274 973833 -117885 -1461614 -2760532 -3774505 -4365635
13790d365635j15672L82561Q39738J111834J080219P65428L41879J3561j34101
13781h0188j65926j75732j42967J9797L11875O54276R60878J095539R45099N54865
13771C977516L8979n02763r24391j107850j073587r01966o61621m20454k36358
13762a812495j01590J19473N30665R84334J235114J180486Q56005L64064j95795
13753C160261p67316j277052j604458j641735j304662n92051K77970R83614J317553
13744a447876J257202R95462Q45598J006280J419988J817667J894221J493269
13736I281811P05038j64622q28027j270626j670853k104197k443565k491666k174240
13727c160947j676844j306635j193757j229162j222466j013344n85646j02643
$$ plain form
13790 -4365635 -4481307 -4098746 -3259008 -2147174 -1066955 -301527 40352 53913 -80188
13781 -80188 -246114 -421846 -564813 -545016 -233141 421135 1382013 2477552 3422651 3977516
13771 3977516 4016495 3513732 2589341 1481491 407904 -494062 -1155683 -1576137 -1812495
13762 -1812495 -1914085 -1794612 -1263947 -279613 955501 2135987 2991992 3356056 3160261
13753 3160261 2392945 1115893 -488565 -2130300 -3434962 -4027013 -3749043 -2765429 -1447876
13744 -1447876 -190674 804788 1650386 2656666 4076654 5894321 7788542 9281811
13736 9281811 9986849 9822227 8994200 7723574 6052721 3948524 1504959 -986707 -3160947
13727 -3160947 -4837791 -6144426 -7338183 -8567345 -9789811 -10803155 -11388801 -11491444
13719a1491444L06428O88684J118749J468811J440850R31877K12395l45027n46673
13710f215350m14992r4122K93336P17358J142695J481428J691289J795423J804418
13701B201483J667085J327863Q13179K10101l59964p34920p84865n51543k74951
13692C513468j98725l67545o19342p39336o21609l16207J5101K61086M74939P13782
13682B115612R37937J089443J095149Q88235N27363K09603N2944l2014j95291
13673F688981m69146p49630q97536q48958o58117m33504k73406k04008j52266
13664B002410r3408j11924k47042m31357n62661o08725o26891o23853n37343l46399
13654b187193o0800L02123O30181P85321P61862O39387M79483L92595M92848O74794
$$ plain form
13719 -11491444 -11185016 -10496332 -9377583 -7908772 -6467922 -5536045 -5323650 -5668677 -6215350
13710 -6215350 -6630342 -6724464 -6431128 -5713770 -4571075 -3089647 -1398358 397065 2201483
13701 2201483 3868568 5196431 6009610 6219711 5859747 5124827 4339962 3788419 3513468
13692 3513468 3314743 2947198 2327856 1588520 966911 650704 665805 926891 1401830 2115612
13682 2115612 3053549 4142992 5238141 6126376 6653739 6863342 6916286 6884272 6688981
13673 6688981 6219835 5470205 4572669 3723711 3065594 2632090 2358684 2154676 2002410
13664 2002410 1909002 1797078 1550036 1118679 556018 -52707 -679598 -1303451 -1840794 -2187193
13654 -2187193 -2247993 -1945870 -1315689 -530368 231494 870881 1350364 1742959 2235807 2910601
13644B910601P04164N35515L53820L09542L46011K98583P9639k37242m73987m75451
13634D351195k27280Q0090K06421J58626J30538K09213L11605L21164K28191J07531
13624E877294l5808k94553o26776q17665p81411o54962o12044o96926p33548m86194
13614A37407J2547M66805O59405O66490P26688R41430J148261J157369R70629
13605F887031O74735L07060p5724l43002m43659n05272o99460j032656j330053
13596C439000j396533j121746n76715j0137L76595N62550O22687O02892M82596
13587B981189K48359l9369k89486m61015n61585n95486n30498l64526j51920O2779
13577B98442K19732K41229J34684p93q9497j48011k31994l60939m62678l98657
$$ plain form
13644 2910601 3614765 4150280 4504100 4813642 5159653 5458236 5537875 5300633 4826646 4351195
13634 4351195 4123915 4204005 4410426 4569052 4699590 4908803 5220408 5541572 5769763 5877294
13624 5877294 5841486 5546933 4920157 4102492 3321081 2666119 2054075 1357149 623601 137407
13614 137407 149954 616759 1276164 1942654 2669342 3610772 4759033 5916402 6887031
13605 6887031 7561766 7868826 7793102 7450100 7006441 6501169 5801709 4769053 3439000
13596 3439000 2042467 920721 344006 333869 710464 1273014 1895701 2498593 2981189
13587 2981189 3229548 3190179 2900693 2439678 1878093 1282607 752109 387583 235663 298442
13577 298442 518174 759403 894087 893294 803797 655786 423792 62853 -399825 -798482
13567g98482j39072J51823K93398K51116O8893j56683k63581j99005j17523j76047
13557a085163k90401k49374q1812j6475j08129j73855m8340J95821L12273J33292
13547a412163k61169o30776q05291p55078n32878k22902N1750J49987K1167k53617
13537d650970m82268m99433l31391p4401K21215M48206N03827M47669L88947L67683
13527c660916L97262M62133N53147P29904R88850J185126J206218J063269Q02802
13518C727795M56479J23104m3802J8734K08153L23999K40436K803j99337j60725
13508D697639J28326L77439K59372j79179n91646p63723p56980p44154q16634
13499A610460r54827j113859j173212r49366m55728J5644K20393J97928Q0460
$$ plain form
13567 -798482 -937554 -785731 -492333 -241217 -172324 -329007 -592588 -791593 -909116 -1085163
13557 -1085163 -1375564 -1624938 -1706750 -1723225 -1831354 -2005209 -2053549 -1857728 -1545455 -1412163
13547 -1412163 -1673332 -2304108 -3109399 -3864477 -4397355 -4620257 -4568507 -4418520 -4397353 -4650970
13537 -4650970 -5133238 -5632671 -5964062 -6038463 -5817248 -5369042 -4865215 -4417546 -4028599 -3660916
13527 -3660916 -3263654 -2801521 -2248374 -1518470 -529620 655506 1861724 2924993 3727795
13518 3727795 4184274 4307378 4263576 4282310 4490463 4814462 5054898 5057701 4858364 4697639
13508 4697639 4825965 5203404 5462776 5283597 4691951 3928228 3171248 2427094 1610460
13499 1610460 655633 -458226 -1631438 -2580804 -3036532 -3020888 -2800495 -2602567 -2522107
13490b522107q9871k73782l93847m33324m25719l30650r6352K04407M71342O49434
13480c240469O69777N02749K02979j38578m08391m93243l81765k42161k94580
13471c823682n24856o95742o61066m73181k49746q7486l0468J3543J90725M95480
13461e846479Q16997J079915J249092J293316J228239J162740J221289J441830
13453C646939J786305K109250K161689J795655J082212K10105o10697j203084
13445A0978374j481936j470201j251188r33245o54402n12852n14751n89182o19861
13436B950756n58691m31674k07815J36725M27801M08689N5508m63325j028814
13427A289160j515972j717811j525126j016738l33148M04145J039661J371902
$$ plain form
13490 -2522107 -2611978 -2885760 -3279607 -3712931 -4138650 -4469300 -4565652 -4361245 -3889903 -3240469
13480 -3240469 -2570692 -2067943 -1864964 -2003542 -2411933 -2905176 -3286941 -3529102 -3823682
13471 -3823682 -4348538 -5044280 -5705346 -6178527 -6428273 -6515759 -6546227 -6532684 -6341959 -5846479
13461 -5846479 -5029482 -3949567 -2700475 -1407159 -178920 983820 2205109 3646939
13453 3646939 5433244 7542494 9704183 11499838 12582050 12792155 12181458 10978374
13445 10978374 9496438 8026237 6775049 5841804 5187402 4674550 4159799 3570617 2950756
13436 2950756 2392065 1960391 1752576 1889301 2317102 2725791 2781299 2317974 1289160
13427 1289160 -226812 -1944623 -3469749 -4486487 -4819635 -4415490 -3375829 -2003927
13419b003927J304913R48554M96459P8739k19312l08621j49901J98462O26467
13410I71833J063292J500401J858696J885833J445790P52005R4731m41710q98948
13401H231923j250795j396913j285930r73604o20784l86836k76886j95878j25507
13392A718790j36431k56123l97018m58104m31307l25485j25758J14825L14318
13383A7707M85967O76403Q51607R50097R53870Q28739M99611k7174o09856j058386
13373C568585j213793j033475o47409k15556J97275N75577R13783J120365J052102
13364D317454P50519M35049K84365K57619J14399l12119q60652j159889j035758
13355B790987o54572k61910j6870k8184l15315p54659j105575j084007n74401
$$ plain form
13419 -2003927 -699014 249540 745999 824738 605426 296805 146904 345366 971833
13410 971833 2035125 3535526 5394222 7280055 8725845 9477850 9572581 9130871 8231923
13401 8231923 6981128 5584215 4298285 3324681 2703897 2317061 2040175 1844297 1718790
13392 1718790 1582359 1326236 929218 471114 39807 -285678 -411436 -296611 17707
13383 17707 503674 1180077 2031684 2981781 3935651 4764390 5264001 5236827 4626971 3568585
13373 3568585 2354792 1321317 673908 458352 655627 1231204 2144987 3265352 4317454
13364 4317454 5067973 5503022 5787387 6045006 6159405 5847286 4986634 3826745 2790987
13355 2790987 2136415 1874505 1857635 1829451 1514136 759477 -346098 -1430105 -2004506
13346b004506K06475Q90235J214041J127970Q04995M98543L33167K18232J44l08624
13336B980672n54954o84754q27954j082168j323387j279881p73829O8610Q55771
13327b621874J235302J134555P33029K93216L886q3371j8372J31078K43609J27284
13317A178342k48551o04691o26066l52610j53321k87895o46904r79769j163366
13308c884831j180698r95482n75499l5086L86203N19868L51382j7595m25753p09219
13298f566710p74401o40123l81134r6706J11434K23914L35184N72719R50747J298478
13288d966598J403609J221547R32517P23650N32918J88565k29121m21371k95716
13279i10000m2426J49993K16547J71581O7649m8358j85051l55072n16807o03655
$$ plain form
13346 -2004506 -1798031 -907796 306245 1434215 2239210 2737753 3070920 3289152 3289296 2980672
13336 2980672 2425718 1740964 913010 -169158 -1492545 -2772426 -3546255 -3477645 -2621874
13327 -2621874 -1386572 -252017 481012 774228 778114 694743 676371 807449 1051058 1178342
13317 1178342 929791 325100 -300966 -653576 -806897 -1094792 -1741696 -2721465 -3884831
13308 -3884831 -5065529 -6061011 -6636510 -6671596 -6285393 -5765525 -5414143 -5431738 -5857491 -6566710
13298 -6566710 -7341111 -7981234 -8362368 -8459074 -8347640 -8123726 -7788542 -7215823 -6265076 -4966598
13288 -4966598 -3562989 -2341442 -1408925 -685275 -152357 36208 -192913 -614284 -910000
13279 -910000 -952426 -802433 -585886 -414305 -346656 -395014 -580065 -935137 -1451944 -2055599
13269b055599o06628o12930o82571p29125o30225l69456O794L84775N62581M52497
13259d279887K06491M5183K9916M0341l1669j63603k97190l71689k82762L5694
13249e069175N00850Q58027Q32441M43446M7421m3917J13775K60295K81812J96470
13239a578555j2876l16982n10639l99723n8647K94500N10459N52666N51248O65919
13229c02630Q68795J033609J073299R32744O42403L53218K14792K38659L17960
13220E372849L98762M99885N59094M56969J49022k71323o26391q24513q98566
13211D815788q52662o60475m17984k99082l57795n09659o53466o89429n58209
13202a82973l48641k51231l55893n22439n13164k60899J18048N09621Q25746R83945
$$ plain form
13269 -2055599 -2662227 -3275157 -3957728 -4686853 -5317078 -5686534 -5679740 -5294965 -4732384 -4279887
13259 -4279887 -4073396 -4028213 -3998297 -3957956 -3989625 -4153228 -4450418 -4822107 -5104869 -5069175
13249 -5069175 -4568325 -3710298 -2877857 -2434411 -2386990 -2430907 -2317132 -2056837 -1775025 -1578555
13239 -1578555 -1591431 -1908413 -2419052 -2818775 -2877422 -2582922 -2072463 -1519797 -968549 -302630
13229 -302630 566165 1599774 2673073 3605817 4248220 4601438 4816230 5054889 5372849
13220 5372849 5771611 6271496 6830590 7287559 7436581 7165258 6538867 5714354 4815788
13211 4815788 3963126 3302651 2884667 2585585 2227790 1718131 1064665 375236 -182973
13202 -182973 -531614 -782845 -1138738 -1661177 -2174341 -2435240 -2317192 -1807571 -981825 2120
13192B120R41872O84273K93951j6031j35191j67811k36594l64259n31583o68773
13182a98026o60216m87827k56187o1871M7456J9016j92767n34289q14524q40851
13172c980086n97235k10034J85596M79247N93369N21793L32299J18305l1670l1361
13162b619777J34495L87084O60646R39018J204779J426831J556256J554281J448972
13153F692585J267234R20309L71507j44532l45388j97045J31534M36454N95141
13144I727799N81339L73661k0917n22091j031696j420229j552536j460438j345101
13135C329791j279775j103559o75482r0579M18742P32088Q73325Q65484O90734
13126C760769L65074p3482o17212j236427j853117k375712k698281k757768k593691
$$ plain form
13192 2120 943992 1628265 1922216 1906185 1770994 1603183 1366589 1002330 470747 -198026
13182 -198026 -858242 -1346069 -1602256 -1664127 -1616671 -1597655 -1790422 -2324711 -3139235 -3980086
13172 -3980086 -4577321 -4787355 -4601759 -4122512 -3529143 -3007350 -2675051 -2556746 -2588416 -2619777
13162 -2619777 -2485282 -2098198 -1437552 -498534 706245 2133076 3689332 5243613 6692585
13153 6692585 7959819 8880128 9251635 9107103 8761715 8564670 8696204 9132658 9727799
13144 9727799 10309138 10682799 10661882 10139791 9108095 7687866 6135330 4674892 3329791
13135 3329791 2050016 946457 270975 180396 599138 1331226 2204551 3070035 3760769
13126 3760769 4125843 4052361 3435149 2198722 345605 -2030107 -4728388 -7486156 -10079847
13117a0079847k249614j736891j118484n08945j9553K73476L89053M64724O58829
13108a3927252J037456J539555K017490K313686K326262K062187J674763J357795
13100D01942J217218J228370J230438J080829P95659M56914J27200j71123m67494
13091E899953p56488r39872r02425o71747m61663m59597o56532q47009q00761
13082e96141n34131l10030l72802p46462j242803j591233j597446j241371o30098
13073h862517J11207Q52342J396399J528397J230423P39008K98589k7550k98116
13064c031818n81019q56568r80661q46859n65459l43450k32961j66641j21471
13055g726907q9141n3945m9141r7498j24970j9063K68090O77539J087234J366279
$$ plain form
13117 -10079847 -12329461 -14066352 -15184836 -15693781 -15713334 -15439858 -15050805 -14586081 -13927252
13108 -13927252 -12889796 -11350241 -9332751 -7019065 -4692803 -2630616 -955853 401942
13100 401942 1619160 2847530 4077968 5158797 5954456 6411370 6538570 6367447 5899953
13091 5899953 5143465 4203593 3301168 2629421 2167758 1708161 1051629 204620 -596141
13082 -596141 -1130272 -1440302 -1813104 -2559566 -3802369 -5393602 -6991048 -8232419 -8862517
13073 -8862517 -8751310 -7898968 -6502569 -4974172 -3743749 -3004741 -2706152 -2733702 -3031818
13064 -3031818 -3612837 -4469405 -5450066 -6296925 -6862384 -7205834 -7438795 -7605436 -7726907
13055 -7726907 -7816048 -7869993 -7919134 -8016632 -8141602 -8160665 -7892575 -7215036 -6127802 -4761523
13045d761523J382250J082873N53972m7136n74978r36987j063393r14748n71892
13036e851562j83153J82891N18812P69579Q35594O44614K42283j85132m13421
13027c439495l59939j17196J95326M61375N78803N62515N01913M52861M27913
13018g35924L95745L08305J64279J3501j02792k28344m38893o95481q67843q50549
13008c037996n89485j45026K94741N75350O93379P12530O19663M03305J38360
12999c35179p9420j80033j46111J8863K99759O21379Q33382P59812L55293k24684
12989A923061p77853j190642j414633j408759j110318m95178L05105J050657J532581
12980a585979J653108J457632J073784O00048J28350j82331j78238J42304N67072
$$ plain form
13045 -4761523 -3379273 -2296400 -1742428 -1789564 -2364542 -3301529 -4364922 -5279670 -5851562
13036 -5851562 -6034715 -5851824 -5333012 -4563433 -3727839 -3083225 -2840942 -3026074 -3439495
13027 -3439495 -3799434 -3916630 -3721304 -3259929 -2681126 -2118611 -1616698 -1163837 -735924
13018 -735924 -340179 -31874 132405 145906 43114 -185230 -624123 -1319604 -2187447 -3037996
13008 -3037996 -3627481 -3772507 -3477766 -2902416 -2209037 -1496507 -876844 -473539 -335179
12999 -335179 -414599 -594632 -740743 -721880 -422121 199258 1032640 1792452 2147745 1923061
12989 1923061 1145208 -45434 -1460067 -2868826 -3979144 -4474322 -4169217 -3118560 -1585979
12980 -1585979 67129 1524761 2598545 3198593 3326943 3144612 2966374 3108678 3675750
12971C675750Q26506Q38096P12010N54195M01121K82943K24172J88427O2837k07718
12961G558339n36487q02588r41297r21662o93618k40070L44051Q47479J044672
12952E658819Q37717L17541k79595p24103r60952j071945j086007r27537n61391
12943A202547j17320K21483L69289K91959L8614k46267m53852n54165n29433l32640
12933a09785m1471R7963j7548k11725k82924k02738n9918Q3770J99627K59365
12923b85384L18823M32272N30414N06949L15737M1723j33390q3015K08945O38225
12913B491299J005993J129184Q74212K08019o35662j210292j230021q03327k49300
12904A580105J67082L23400K68037J41035K629j43845k44929k75954k57575k11074
$$ plain form
12971 3675750 4502256 5340352 6052362 6606557 7007678 7290621 7514793 7703220 7766057 7558339
12961 7558339 7021852 6219264 5277967 4356305 3662687 3422617 3766668 4614147 5658819
12952 5658819 6496536 6814077 6534482 5810379 4849427 3777482 2691475 1763938 1202547
12943 1202547 1085227 1306710 1675999 1967958 2006572 1760305 1306453 752288 222855 -109785
12933 -109785 -151256 -53293 -70841 -282566 -565490 -768228 -828146 -744376 -544749 -285384
12923 -285384 33439 465711 996125 1503074 1818811 1860534 1727144 1644129 1853074 2491299
12913 2491299 3497292 4626476 5500688 5708707 5073045 3862753 2632732 1829405 1580105
12904 1580105 1747187 2070587 2338624 2479659 2482288 2338443 2093514 1817560 1559985 1348911
12894A348911j83727k10369k51041j94064M7676L56363M45924J72620l09462p45785
12884D77046j017200j150823j184348j083433q04457m10260n1580J76921L42205
12875d705929O12091J060450J599429K078194K365340K355139K005859J447279
12867H817852R10242N18371K47113P13l27569p66498j269333j728831j939541
12858D462519j808403j521377j283643j044642o49051r3850N33412J168232J700178
12849A463375J957307J894654J698998J555953J386997R88608M16547k5155j98621
12840A1138663k78559m73504p97226j101732j232540j185438j075473r70838q65753
12831C157600p46665n87289l83811k57459m09900q55405j329352j533230j382319
$$ plain form
12894 1348911 1165184 954815 703774 509710 557386 913749 1359673 1532293 1222831 477046
12884 477046 -540154 -1690977 -2875325 -3958758 -4763215 -5173475 -5225055 -5048134 -4705929
12875 -4705929 -4093838 -3033388 -1433959 644235 3009575 5364714 7370573 8817852
12867 8817852 9728094 10246465 10493578 10494291 10166722 9400224 8130891 6402060 4462519
12858 4462519 2654116 1132739 -150904 -1195546 -1844597 -1938447 -1405035 -236803 1463375
12849 1463375 3420682 5315336 7014334 8570287 9957284 10945892 11362439 11337284 11138663
12840 11138663 10860104 10386600 9589374 8487642 7255102 6069664 4994191 4023353 3157600
12831 3157600 2410935 1823646 1439835 1182376 772476 -82929 -1412281 -2945511 -4327830
12822d327830j040603o91287l63539r6190N88k3959M7003L21182O86124R52331
12812d536180J013601Q81520O36254L95497K94559M38518Q31611J335161J761316
12803C051857J999128K002326J782870J397879Q94226L38508j55303n26598p78933
12794A0005960q68436p45025m57343j51681J2873n6126l18768o43388r40453j192413
12784D645200j376505j433154j326225j090889q27794o23573m91032m31297m27247
12775c382516l94030l09265k92605m41129o66293p94775p80431p32083p49088
12766h542215p42437n64021k61780J6637K36164M40541O61287Q85115J025787
12757f844922J047371J084833J281559J561756J660846J396252Q61030L08588
$$ plain form
12822 -4327830 -5368433 -6059720 -6423259 -6519449 -6518861 -6542820 -6495817 -6174635 -5488511 -4536180
12812 -4536180 -3522579 -2641059 -2004805 -1609308 -1314749 -876231 -44620 1290541 3051857
12803 3051857 5050985 7053311 8836181 10234060 11128286 11466794 11311491 10784893 10005960
12794 10005960 9137524 8392499 7935156 7783475 7796348 7740222 7421454 6778066 5837613 4645200
12784 4645200 3268695 1835541 509316 -581573 -1409367 -2032940 -2523972 -2955269 -3382516
12775 -3382516 -3776546 -4085811 -4378416 -4819545 -5485838 -6280613 -7061044 -7793127 -8542215
12766 -8542215 -9284652 -9848673 -10110453 -10093816 -9857652 -9417111 -8755824 -7870709 -6844922
12757 -6844922 -5797551 -4712718 -3431159 -1869403 -208557 1187695 2048725 2357313
12749B357313p5253k45011k32792p7357J93495N24996P95096Q62402P60863P03702
12739E567454P58543P32270M74801O0134l91344q47155j236082j410374j346315
12730B361932j176398r83656p20851l28294J51907O60737J253063J929495K485605
12721E633540K730501K680281K455086K092221J505761O56030k63425r56902j341827
12712A5191266j550164j684593j743458j707979j560849j316869j051435p93043
12704C782876n51601m04525l86324m68620o16848p32973o89681n04841l41793
12695i14330k68918j74552J3166K18514L87927N70708P97593J011503J131014
12686B772625J094152Q75874N21436J36482j84608m05945n38356n76021m84281
$$ plain form
12749 2357313 2282060 2037049 1804257 1726900 1920395 2445391 3240487 4102889 4863752 5567454
12739 5567454 6325997 7058267 7533068 7593202 7201858 6354703 5118621 3708247 2361932
12730 2361932 1185534 201878 -518973 -847267 -695360 -34623 1218440 3147935 5633540
12721 5633540 8364041 11044322 13499408 15591629 17097390 17753420 17489995 16533093 15191266
12712 15191266 13641102 11956509 10213051 8505072 6944223 5627354 4575919 3782876
12704 3782876 3231275 2826750 2440426 1971806 1354958 621985 -67696 -572537 -914330
12695 -914330 -1183248 -1357800 -1344634 -1126120 -738193 -167485 630108 1641611 2772625
12686 2772625 3866777 4742651 5264087 5400569 5215961 4810016 4271660 3695639 3211358
12677C211358k86814n7424J84304M38981O04612N68204L29429n7232n04446q73158
12667C557814j075390j137283j118251j034753q59822n77675k28950J07061L38620
12658b028629L74970J91711j40631n14490q26193r63321q89088p32434o12903
12649f141008m73503j75929K82577O87112Q14414P03034N60201M57318L41318
12640b944466K25332K16021L71294O00501P48873O53682J86092n33079j102048
12631a577798j191554q04236k20410K52624N47222Q06928J110899J356531J400223
12622A680429J214342R41772P87990Q01092Q14482O94155N18884L72545J97718
12613H023409l6791k94004n48391q12553j135461j519855j911152k241697k394308
$$ plain form
12677 3211358 2924544 2867120 3051424 3490405 4095017 4663221 4992650 4935418 4430972 3557814
12667 3557814 2482424 1345141 226890 -807863 -1667685 -2245360 -2474310 -2367249 -2028629
12658 -2028629 -1653659 -1461948 -1602579 -2117069 -2943262 -3906583 -4795671 -5528105 -6141008
12649 -6141008 -6614511 -6790440 -6507863 -5820751 -5006337 -4303303 -3743102 -3285784 -2944466
12640 -2944466 -2719134 -2503113 -2131819 -1531318 -782445 -128763 57329 -475750 -1577798
12631 -1577798 -2769352 -3573588 -3793998 -3541374 -2994152 -2187224 -1076325 280206 1680429
12622 1680429 2894771 3836543 4624533 5425625 6240107 6934262 7453146 7825691 8023409
12613 8023409 7986618 7692614 7144223 6331670 5196209 3676354 1765202 -476495 -2870803
12604b870803k248205j817702j272478q22704n20579k07691K48128P91154J272017
12595g448863J559298J595876J415867J116905P91676M93561K59614J8051l83839
12586e81854r40949j430295j593368j352744q64435l35226J44269N78643R56562
12577e419397J149877J001172N42967M334l35632k66330K12893Q11539J127721
12568a170856R70726M57498j65917o79703r55891r61194p25064l68484p8749K2825
12558c654809n524j3677L1728L6605r597O1568M17557R92498J515155J754851
12548A126355J661016J286966P04554L8501n23776q41202r38977r76922j039465
12539D97050j025040q41070n45901k60187p2917l5241j58375m09189p19108j021929
$$ plain form
12604 -2870803 -5119008 -6936710 -8209188 -9031892 -9552471 -9760162 -9512034 -8720880 -7448863
12595 -7448863 -5889565 -4293689 -2877822 -1760917 -969241 -475680 -216066 -198015 -581854
12586 -581854 -1522803 -2953098 -4546466 -5899210 -6763645 -7098871 -6954602 -6375959 -5419397
12577 -5419397 -4269520 -3268348 -2725381 -2721047 -3056679 -3323009 -3110116 -2298577 -1170856
12568 -1170856 -200130 257368 91451 -588252 -1544143 -2505337 -3230401 -3598885 -3677634 -3654809
12558 -3654809 -3660333 -3674010 -3642282 -3605677 -3615274 -3553706 -3136149 -2143651 -628496 1126355
12548 1126355 2787371 4074337 4778891 4817392 4293616 3452414 2513437 1536515 497050
12539 497050 -527990 -1369060 -1914961 -2175148 -2248065 -2283306 -2441681 -2850870 -3569978 -4591907
12529d591907j262995j327152j109718o57801j59911J95078L36987K51504m5691
12520h371606l62237m36336k49592k9267J6687j29905l19243m01483l30663j17404
12510a0731049K06310N86433R39821J170827J209544J063411Q10492M94058J33395
12501d116758j72848k78494j39819J06678K71942L05928K88880L14585L96657
12492c023249M02897K04722j43885n15146q11674q74626n56734N7608P02767J187198
12482c370122J437537J418164J155490P53033L86584K38749L62354O40624Q90816
12473C913229J012471R97209Q42286N73939L28282K32316K29563J80229R9641
12464H409165J44397L18585M11227K88655J6822k83229n57235p96663r36066r13932
$$ plain form
12529 -4591907 -5854902 -7182054 -8291772 -8949573 -9109484 -8914406 -8577419 -8325915 -8371606
12520 -8371606 -8733843 -9170179 -9419771 -9449038 -9432351 -9562256 -9881499 -10282982 -10613645 -10731049
12510 -10731049 -10524739 -9938306 -8998485 -7827658 -6618114 -5554703 -4744211 -4250153 -4116758
12501 -4116758 -4289606 -4568100 -4707919 -4601241 -4329299 -4023371 -3734491 -3419906 -3023249
12492 -3023249 -2620352 -2415630 -2559515 -3074661 -3886335 -4760961 -5317695 -5260087 -4557320 -3370122
12482 -3370122 -1932585 -514421 641069 1394102 1780686 2019435 2381789 3022413 3913229
12473 3913229 4925700 5922909 6765195 7339134 7667416 7899732 8129295 8309524 8409165
12464 8409165 8553562 8872147 9283374 9572029 9588851 9305622 8748387 7951724 7015658 6101726
12454F101726p70147n75730m20850m28639o17424q60570j044187j172276j299834
12445a087931j436112j557057j534967j173174n00481J88297O14746P06103O20308
12436e160268O03876P77704J055733J265180J317412J231951J097786R66384P42022
12427C897780L63420j1254j89971j17367J50805M84465O87080N90316K27889j74305
12417E908858m44908n89609o36243n42462k86253P5462L85544M53614K49776l8600
12407D535179j64390l9228J85828K83226J78133J2542n753K05360N13194O37415
12397F341506L68360k06417p55106j044417j144788j277723j545854j841352j990677
12388c096468j889129j533656j041935n97083l08480j43103k1875M1736m2626
$$ plain form
12454 6101726 5331579 4755849 4334999 3906360 3288936 2428366 1384179 211903 -1087931
12445 -1087931 -2524043 -4081100 -5616067 -6789241 -7289722 -7101425 -6486679 -5780576 -5160268
12436 -5160268 -4556392 -3778688 -2722955 -1457775 -140363 1091588 2189374 3155758 3897780
12427 3897780 4261200 4249946 4059975 3942608 4093413 4577878 5264958 5855274 6083163 5908858
12417 5908858 5463950 4874341 4238098 3695636 3409383 3484845 3870389 4324003 4573779 4535179
12407 4535179 4370789 4331561 4517389 4800615 4978748 4991290 4985537 5190897 5704091 6341506
12397 6341506 6709866 6503449 5748343 4703926 3559138 2281415 735561 -1105791 -3096468
12388 -3096468 -4985597 -6519253 -7561188 -8158271 -8466751 -8609854 -8631729 -8589993 -8632619
12379h632619k60870m50541m74402l29889r3481J40358K82457L66537M93884O46659
12369h311907P79243R69591J260508J461521J374940J071463P35375M59403L30255
12360A30392M20882O10982O45452M04608N3639j27219n3270J19455K49600L64432
12350B818953N29176O54989N39755J03728m99995r90545j185584j145048j063966
12341b38537j083929j159121j075290o93730j07905M64564Q44260R65400Q48032
12332a236256N27859N7808m09959o40817n07732j11574L09519N81490O89834O99972
12322c9856P22612Q96057J277592J736003K022945K003776J693203J142482M73968
12313A1928782j17650m58662m59276k19763k2995n3783k41071m40962n63952n19842
$$ plain form
12379 -8632619 -8893489 -9344030 -9818432 -10148321 -10241802 -10101444 -9818987 -9452450 -8958566 -8311907
12369 -8311907 -7532664 -6563073 -5302565 -3841044 -2466104 -1394641 -659266 -199863 130392
12360 130392 551274 1162256 1807708 2212316 2265955 2138736 2085466 2204921 2454521 2818953
12350 2818953 3348129 4003118 4542873 4646601 4146606 3156061 1970477 825429 -238537
12341 -238537 -1322466 -2481587 -3556877 -4250607 -4358512 -3893948 -3049688 -2084288 -1236256
12332 -1236256 -708397 -650589 -1060548 -1701365 -2209097 -2320671 -2011152 -1429662 -739828 -39856
12322 -39856 682756 1578813 2856405 4592408 6615353 8619129 10312332 11454814 11928782
12313 11928782 11811132 11352470 10893194 10673431 10650436 10596653 10355582 9914620 9350668 8830826
12303H830826k19650L01573Q23878J045984P75322P7622p59779j445911j835668
12294G594197j890201j635086j204279p41596k52997K54065O34449P78289P78809
12285D315650Q07456Q44006P02782L70773M4687j31112j60496j33730q8920K7807
12275F598903K00921K67031J03900j93740l89810l26940j12544m1766k68421o66076
12265E171458j014033j169292j050947o32916j4962N65577Q75499Q90901P22983
12256D344268M01242m6066m26164n19931l26847m9590J53224K59181K41016P1423
12246D101756j48315k48686j75749m8759j9862j19322k48967k82288j65953O5999
12236B709854L05159L84721J58125l66811r54001j298772j342209j295128j311260
$$ plain form
12303 8830826 8611176 8912749 9736627 10782611 11557933 11635555 10875776 9429865 7594197
12294 7594197 5703996 4068910 2864631 2123035 1870038 2124103 2758552 3536841 4315650
12285 4315650 5123106 5967112 6669894 7040667 7085354 6954242 6793746 6660016 6571096 6598903
12275 6598903 6799824 7066855 7170755 6977015 6587205 6260265 6147721 6105955 5837534 5171458
12265 5171458 4157425 2988133 1937186 1304270 1289308 1854885 2730384 3621285 4344268
12256 4344268 4745510 4699444 4273280 3753349 3426502 3376912 3530136 3789317 4030333 4101756
12246 4101756 3953441 3704755 3529006 3480247 3460385 3341063 3092096 2809808 2643855 2709854
12236 2709854 3015013 3399734 3557859 3191048 2237047 938275 -403934 -1699062 -3010322
12227c010322j292167j050076o05617j42112K27880M36258M34053L01516K02182
12218d498405J76698J08348o6034k38034k67050j58849k2121J06468K44038L37154
12208d277787L38935L06173L46459N06404O95653Q32720Q95016P91099M55006
12199H89678l638l67341n43907o24669o97856p40524o64817m33186n8878M50023
12189b795115R97263J344993J280548Q52187L48609P648j70306k75972k84859
12180A304996j37386Q9503K31840K20349P6947j71986m51421o61989p98234q94086
12170a191467q85262o75379l12209O5925M10730P31243R72136J045283R22824
12161A083824O38616K74552n0196k60594l64789l28119p8255K99617O07880P25192
$$ plain form
12227 -3010322 -4302489 -5352565 -5958182 -6100294 -5872414 -5436156 -5002103 -4700587 -4498405
12218 -4498405 -4321707 -4213359 -4279393 -4517427 -4784477 -4943326 -4965447 -4858979 -4614941 -4277787
12208 -4277787 -3938852 -3632679 -3286220 -2779816 -2084163 -1251443 -356427 434672 889678
12199 889678 886040 518699 -25208 -649877 -1347733 -2088257 -2753074 -3186260 -3245138 -2795115
12189 -2795115 -1797852 -452859 827689 1679876 2028485 2036133 1865827 1589855 1304996
12180 1304996 1167610 1257113 1488953 1709302 1786249 1614263 1162842 500853 -297381 -1191467
12170 -1191467 -2076729 -2752108 -3064317 -2998392 -2587662 -1856419 -884283 161000 1083824
12161 1083824 1722440 1996992 1946796 1686202 1321413 993294 915039 1214656 1822536 2547728
12151B547728O47888M51038K16628j7969k56693m95975o95362p99446p48456n21092
12141C28289j90683J49963M57821O56271O29102L57017k9543l30266l90726k10961
12131A426284N6878K50138L00145J95097k4867k29394k73596j02853J63615K74101
12121B035548O9554l69499p74226q97518o71253j56132N18797J176290J620528
12112B552089J693398J390548R06115M90741K39494O4699q9450j51199j00805
12103F995630m9625r7819k53573m67454o43053o39156l86863l947K85484K95095
12093E034719k802m72328r44140j231931j146347p15962k37112k1563k12071p37328
12083f86865j311933j574000j325289o99988p6364L01635M66451M83797L50123
$$ plain form
12151 2547728 3195616 3646654 3863282 3845313 3588620 3092645 2397283 1597837 849381 328289
12141 328289 137606 287569 745390 1401661 2030763 2387780 2358237 2027971 1637245 1426284
12131 1426284 1483162 1733300 2033445 2228542 2203675 1974281 1700685 1597832 1761447 2035548
12121 2035548 2105102 1735603 961377 63859 -607394 -763526 -244729 931561 2552089
12112 2552089 4245487 5636035 6542150 7032891 7272385 7337084 7247634 7096435 6995630
12103 6995630 6946005 6848186 6594613 6127159 5484106 4844950 4458087 4454140 4739624 5034719
12093 5034719 5031917 4559589 3615449 2383518 1237171 521209 284097 262534 50463 -686865
12083 -686865 -1998798 -3572798 -4898087 -5598075 -5674439 -5372804 -4906353 -4422556 -4072433
12074d072433J18232q5461j61495j09455r606N5758P9027R9314J12390J68279
12064c805450M23179R20924J454612J766496J805283J687962J503711J254095
12056G010812R15500M47295j79650q51169j255801j129865n69832R2641O28209
12047E108140R94095J186124J100847O31953j42472j021496j853746k522264k879930
12038F01251k827606k399318j752963j103856n79877j75070J47006M17908O42802
12029g029723P32186N95474L07012L2303k00504m75757p83384r97024r67329o32486
12019i419232j00291L81012N73943M03350k5293m83490p38065p44713o29665m53745
12009a1236189j64948K71337P81757J209286J450768J535757J551992J530149
$$ plain form
12074 -4072433 -3954201 -4039662 -4201157 -4310612 -4320218 -4264460 -4185433 -4086119 -3973729 -3805450
12064 -3805450 -3382271 -2461347 -1006735 759761 2565044 4253006 5756717 7010812
12056 7010812 7926312 8373607 8193957 7342788 6086987 4957122 4387290 4479931 5108140
12047 5108140 6102235 7288359 8389206 9021159 8878687 7857191 6003445 3481181 601251
12038 601251 -2226355 -4625673 -6378636 -7482492 -8062369 -8237439 -8090433 -7672525 -7029723
12029 -7029723 -6297537 -5702063 -5395051 -5362748 -5563252 -6039009 -6822393 -7819417 -8786746 -9419232
12019 -9419232 -9519523 -9138511 -8564568 -8161218 -8186511 -8670001 -9408066 -10152779 -10782444 -11236189
12009 -11236189 -11401137 -11129800 -10348043 -9138757 -7687989 -6152232 -4600240 -3070091
12001c070091J455432J305923J024481N82414Q1238k68238l11013j10307Q3606
11992G73445N7290j63855l62627l54904j35460J40693L09148L16965J95969R574
11982G86238j74536l21248m19413m16384k37862K9960J75106J75710K36527M78608
11972C12706Q28912J137630J186578P69657m369p07648j022359r54296o74466
11963H72345l77890k30512k94010n15616p98556j068117j260818j267601r86063
11954e926838m14498K98592Q65927J061012R44477P30313M95047K12288q8991
11945a822671l88675o71539p99558o30710k55212R0695L09229M67929N89604O44964
11935b465944O84702P29078O77692M78388K14676k2399k43382n09546q00731r60277
$$ plain form
12001 -3070091 -1614659 -308736 715745 1298159 1379397 1111159 800146 689839 773445
11992 773445 830735 666880 304253 -50651 -186111 -45418 263730 580695 776664 786238
11982 786238 611702 290454 -128959 -545343 -783205 -753245 -578139 -402429 -165902 312706
11972 312706 1141618 2279248 3465826 4235483 4231114 3523466 2501107 1546811 872345
11963 872345 494455 263943 -30067 -545683 -1344239 -2412356 -3673174 -4940775 -5926838
11954 -5926838 -6341336 -6042744 -5176817 -4115805 -3171328 -2441015 -1945968 -1733680 -1822671
11945 -1822671 -2211346 -2882885 -3682443 -4313153 -4568365 -4477670 -4168441 -3700512 -3110908 -2465944
11935 -2465944 -1781242 -1052164 -374472 103916 318592 296193 52811 -456735 -1257466 -2217743
11925b217743q20225m11802J6371J82017n3953n62042r48984q91495m41833J01779
11915f047910M25681L64256P2968n3595K00640O21641Q46686P65614N38144L40488
11905a925387J85175k6909l35631o70028r07566r42521p68294n32697m00084l66720
11895f690662k60645L1832L74073O13582P94771R59767J036189R45085O43106
11886a552902J88497j38046L838O34800J351185J663808J386398O74504j45046
11877D067036p24413q43841n56906j40632J63253K88573K82956K17925J15041
11868B868992o3765l26001n51328m88677k2948N78327R12615Q58849O21196M29566
11858D816826L24257K53339J65751l7442l81417o86310p86798p67315p86185q48381
$$ plain form
11925 -2217743 -3037968 -3449770 -3433399 -3251382 -3305335 -3867377 -4816361 -5707856 -6149689 -6047910
11915 -6047910 -5622229 -5257973 -5185005 -5238600 -5037960 -4416319 -3569633 -2804019 -2265875 -1925387
11905 -1925387 -1740212 -1767121 -2102752 -2772780 -3680346 -4622867 -5391161 -5923858 -6323942 -6690662
11895 -6690662 -6951307 -6919475 -6545402 -5931820 -5137049 -4177282 -3141093 -2196008 -1552902
11886 -1552902 -1364405 -1502451 -1498613 -863813 487372 2151180 3537578 4212082 4067036
11877 4067036 3342623 2498782 1941876 1801244 1964497 2253070 2536026 2753951 2868992
11868 2868992 2805227 2479226 1927898 1439221 1416273 1994600 2907215 3766064 4387260 4816826
11858 4816826 5141083 5394422 5560173 5522731 5141314 4455004 3668206 2900891 2114706 1266325
11848A266325q75187q27061p18825n96655n06610m55459m08023l43030k31765
11839c696290q460L16056O11690P74277P94561O61295L67010L2614j87432k96084
11829f30763l97425n45718p17033q17037p58692o13270n36517n25531m17170j49295
11819f108451J51222L53293M57616N36402O02596O54698P32915P38069M55283
11810a426357j40684q22654j361347j662662j688372j472331j151875q51856n95578
11801a1173716l35876n0756J68975K42792K25871J94092J61736J32553J76877
11792a0257452L69588O49373Q74102R59554R01515P35807M66219O4114l84799
11783e621979o49705n83481k41509K03167N39410O19895M60426K08651M4653Q1413
$$ plain form
11848 1266325 391138 -435923 -1154748 -1751403 -2258013 -2713472 -3121495 -3464525 -3696290
11839 -3696290 -3704750 -3388694 -2777004 -2002727 -1208166 -546871 -179861 -147247 -334679 -630763
11829 -630763 -1028188 -1573906 -2290939 -3107976 -3866668 -4479938 -5016455 -5541986 -5959156 -6108451
11819 -6108451 -5957229 -5603936 -5146320 -4609918 -4007322 -3352624 -2619709 -1881640 -1426357
11810 -1426357 -1567041 -2389695 -3751042 -5413704 -7102076 -8574407 -9726282 -10578138 -11173716
11801 -11173716 -11509592 -11560348 -11391373 -11148581 -10922710 -10728618 -10566882 -10434329 -10257452
11792 -10257452 -9887864 -9238491 -8364389 -7404835 -6503320 -5767513 -5301294 -5237180 -5621979
11783 -5621979 -6271684 -6855165 -7096674 -6893507 -6354097 -5734202 -5273776 -5065125 -5020472 -4939059
11773d939059K82026N29762P33145Q25081P60364N33703K15498p5500k57466l16854
11763a709300k94084k55505k51212k65453k49161j86107o6177J34537L89358O02078
11753b151026P01331P09207P08430O62157L77308j80419p26760r54709q30181
11744a684662m86418n6290K98733M26751L01203K0540k82372n33294o77973n92577
11734c266359k26831K09333M25108L86787L14301L94575O18151Q44508Q99327
11725E98900O33292N3918o08355j070417j197331j012765o22488j63977K51548
11716c137675N76870Q12918R52231R43006P41774L80430m6388m52626p62181q96666
11706h88307q85233q82558j018076j273078j505629j560979j367387r56274m06984
$$ plain form
11773 -4939059 -4657033 -4127271 -3394126 -2569045 -1808681 -1274978 -1059480 -1134980 -1392446 -1709300
11763 -1709300 -2003384 -2258889 -2510101 -2775554 -3024715 -3210822 -3276999 -3142462 -2753104 -2151026
11753 -2151026 -1449695 -740488 -32058 630099 1007407 826988 100228 -854481 -1684662
11744 -1684662 -2171080 -2227370 -1928637 -1501886 -1200683 -1180143 -1462515 -1995809 -2673782 -3266359
11734 -3266359 -3493190 -3283857 -2858749 -2471962 -2157661 -1763086 -1144935 -300427 598900
11725 598900 1232192 1286110 677755 -392662 -1589993 -2602758 -3225246 -3389223 -3137675
11716 -3137675 -2560805 -1747887 -795656 147350 889124 1269554 1223166 770540 8359 -888307
11706 -888307 -1773540 -2656098 -3674174 -4947252 -6452881 -8013860 -9381247 -10337521 -10744505
11697a0744505J68803O29103Q65294Q81188P55725N95414N14917N29348N39095
11688e265618M81004M33915N01827O05595N50823L35133J63672J29925J39686
11679a924038J04043K8947k475J15475L76785O28170P06037N68509L36540K28030
11669A166023M13474Q45300J275380J454792J247907O94964L0395m66394o66799
11660E995042o89976q23272j239793j797359k172829k148649j774950j278852
11652e930638q59781n86990m16586k81336j77106j29966j32030j69648k67749
11643h951830n01178r04478j309646j407616j077026n27156n1215J82346J40160
11634a4407639j03897m34051o91214o68897k68567M23157J222035J886320K187912
$$ plain form
11697 -10744505 -10575702 -9946599 -9081305 -8200117 -7444392 -6848978 -6334061 -5804713 -5265618
11688 -5265618 -4784614 -4350699 -3848872 -3243277 -2692454 -2357321 -2193649 -2063724 -1924038
11679 -1924038 -1819995 -1791048 -1793523 -1678048 -1301263 -673093 32944 601453 937993 1166023
11669 1166023 1579497 2424797 3700177 5154969 6402876 7097840 7128235 6661841 5995042
11660 5995042 5305066 4481794 3242001 1444642 -728187 -2876836 -4651786 -5930638
11652 -5930638 -6790419 -7377409 -7793995 -8075331 -8252437 -8382403 -8514433 -8684081 -8951830
11643 -8951830 -9453008 -10357486 -11667132 -13074748 -14151774 -14678930 -14730145 -14547799 -14407639
11634 -14407639 -14511536 -14945587 -15636801 -16305698 -16574265 -16151108 -14929073 -13042753 -10854841
11625a0854841K074969J684457J233461R33961Q49725Q44591Q25871R40463J298448
11616a68895J716427J919134J813168J488710J096362P54237N06312L39449J95125
11607I660029j6091l14424n70052o50566o66541q95466j373681j760925j722781
11598A689502j333397r17008n88123k48157J03768L98922O37345Q53452J065396
11589A661700J223401J266660J154708Q17557K54083l95141r54223j372077j690035
$$ plain form
11625 -10854841 -8779872 -7095415 -5861954 -4927993 -4078268 -3233677 -2407806 -1467343 -168895
11616 -168895 1547532 3466666 5279834 6768544 7864906 8619143 9125455 9464904 9660029
11607 9660029 9643938 9329514 8759462 8108896 7442355 6546889 5173208 3412283 1689502
11598 1689502 356105 -560903 -1149026 -1397183 -1293415 -894493 -257148 596304 1661700
11589 1661700 2885101 4151761 5306469 6124026 6378109 5982968 5028745 3656668 1966633
$$ [...]
##END NTUPLES=NMR SPECTRUM
##END=
