##TITLE=31P ikalashn
108-2024-BAU
12.12.2024
##JCAMPDX= 6.0         $$ Bruker NMR JCAMP-DX V2.0
##DATA TYPE= NMR SPECTRUM
##DATA CLASS= NTUPLES
##ORIGIN= UXNMR, Bruker Analytische Messtechnik GmbH
##OWNER= root
$$ TOPSPIN		Version 1.3
$$ 2024-12-12 14:24:07.937 +0400  Irina@DPX200
$$ Compression mode = diff/dup
##.OBSERVE FREQUENCY= 81.01967998063
##.OBSERVE NUCLEUS= ^31P
##.ACQUISITION MODE= SIMULTANEOUS
##.ACQUISITION SCHEME= undefined
##.AVERAGES= 32
##.DIGITISER RES= 17
##SPECTROMETER/DATA SYSTEM= spect
##.PULSE SEQUENCE= zgpg
##.SOLVENT NAME= D2O
##.SHIFT REFERENCE= INTERNAL, D2O, 1, 298.5841
##AUDIT TRAIL= $$ (NUMBER, WHEN, WHO, WHERE, WHAT)
$$ ##TITLE= Audit trail, TOPSPIN		Version 1.3
$$ ##JCAMPDX= 5.01
$$ ##ORIGIN= Bruker BioSpin GmbH
$$ ##OWNER= Irina
$$ $$ F:/spectra/data/iren/nmr/P31dec/1/pdata/1/auditp.txt
$$ ##AUDIT TRAIL=  $$ (NUMBER, WHEN, WHO, WHERE, VERSION, WHAT)
(   1,<2024-12-12 14:22:51.140 +0400>,<Irina>,<DPX200>,<TOPSPIN 1.3>,
      <acquisition in progress>)
(   2,<2024-12-12 14:23:46.265 +0400>,<Irina>,<DPX200>,<TOPSPIN 1.3>,
      <Start of raw data processing
       efp BC_mod = 2 LB = 8 FT_mod = 6 PKNL = 1 PHC0 = 202.8384 PHC1 = 158.1897 SI = 32K 
       data hash MD5: 32K
       6A 36 6D AC 22 F3 32 1A D7 3E 72 8E 2A EA 08 88>)
(   3,<2024-12-12 14:23:48.281 +0400>,<Irina>,<DPX200>,<TOPSPIN 1.3>,
      <apk 
       data hash MD5: 32K
       81 FE 66 CC 7E 5F 08 9C 94 1B 7B BB 5B DA ED AF>)
(   4,<2024-12-12 14:23:55.812 +0400>,<Irina>,<DPX200>,<TOPSPIN 1.3>,
      <pk fgphup PHC0 = 1.6 PHC1 = 0 
       data hash MD5: 32K
       7B D2 88 8D BC 34 FE 7A D9 BF 21 18 FA D4 FA 3C>)
(   5,<2024-12-12 14:23:57.937 +0400>,<Irina>,<DPX200>,<TOPSPIN 1.3>,
      <abs n ABSG = 5 
       data hash MD5: 32K
       D5 14 00 EE 51 96 D5 0D 09 B9 B1 93 5B ED 01 02>)
$$ ##END=
$$ 
$$ $$ hash MD5
$$ $$ 69 AC A7 5B 14 B1 8C 34 97 AE 2A BA BB 7C C4 72
##$RELAX= 
##$RELAX= 
##$RELAX= 
##$RELAX= 
##$RELAX= 
##$RELAX= 
##$RELAX= 
##$RELAX= 
##$RELAX= 
##$RELAX= 
##$RELAX= 
$$ Bruker specific parameters
$$ --------------------------
##$DU= <F:/spectra>
##$EXPNO= 1
##$NAME= <P31dec>
##$PROCNO= 1
##$TYPE= <nmr>
##$USER= <iren>
##$AMP= (0..31)
100 100 100 100 100 100 100 100 100 100 100 100 100 100 100 100 100 100 
100 100 100 100 100 100 100 100 100 100 100 100 100 100 
##$ANAVPT= -1
##$AQSEQ= 0
##$AQ_mod= 1
##$AUNM= <au_zg>
##$AUTOPOS= <>
##$BF1= 81.014009
##$BF2= 200.13
##$BF3= 200.13
##$BF4= 200.13
##$BF5= 200.13
##$BF6= 200.13
##$BF7= 200.13
##$BF8= 200.13
##$BYTORDA= 1
##$CFDGTYP= 0
##$CFRGTYP= 5
##$CHEMSTR= <none>
##$CNST= (0..63)
1 1 145 1 1 1 1 1 1 1 1 1 1 1 1 1 1 1 1 1 1 1 1 1 1 1 1 1 1 1 1 1 1 1 
1 1 1 1 1 1 1 1 1 1 1 1 1 1 1 1 1 1 1 1 1 1 1 1 1 1 1 1 1 1 
##$CPDPRG= <waltz16>
##$CPDPRG1= <>
##$CPDPRG2= <waltz16>
##$CPDPRG3= <>
##$CPDPRG4= <mlev>
##$CPDPRG5= <mlev>
##$CPDPRG6= <mlev>
##$CPDPRG7= <mlev>
##$CPDPRG8= <mlev>
##$CPDPRGB= <>
##$CPDPRGT= <>
##$D= (0..63)
$$ [...]
##$SW_h= 37037.037037037
##$TD= 32768
##$TD0= 1
##$TE= 300
##$TE2= 300
##$TE3= 300
##$TEG= 300
##$TL= (0..7)
0 120 53 12 22 120 120 120 
##$TP= (0..7)
150 150 150 150 150 150 150 150 
##$TP07= 0
##$TPNAME0= <>
##$TPNAME1= <>
##$TPNAME2= <>
##$TPNAME3= <>
##$TPNAME4= <>
##$TPNAME5= <>
##$TPNAME6= <>
##$TPNAME7= <>
##$TPOAL= (0..7)
0.5 0.5 0.5 0.5 0.5 0.5 0.5 0.5 
##$TPOFFS= (0..7)
0 0 0 0 0 0 0 0 
##$TUNHIN= 0
##$TUNHOUT= 0
##$TUNXOUT= 0
##$USERA1= <user>
##$USERA2= <user>
##$USERA3= <user>
##$USERA4= <user>
##$USERA5= <user>
##$V9= 5
##$VALIST= <valist>
##$VCLIST= <CCCCCCCCCCCCCCC>
##$VD= 0
##$VDLIST= <DDDDDDDDDDDDDDD>
##$VPLIST= <PPPPPPPPPPPPPPP>
##$VTLIST= <TTTTTTTTTTTTTTT>
##$WBST= 1024
##$WBSW= 4
##$XGAIN= (0..3)
0 0 0 0 
##$XL= 0
##$YL= 0
##$YMAX_a= 3741
##$YMIN_a= -4418
##$ZGOPTNS= <>
##$ZL1= 120
##$ZL2= 120
##$ZL3= 120
##$ZL4= 120
##$ABSF1= 298.5841
##$ABSF2= -158.5842
##$ABSG= 5
##$ABSL= 5
##$ALPHA= 0
##$AQORDER= 0
##$ASSFAC= 0
##$ASSFACI= 0
##$ASSFACX= 0
##$ASSWID= 0
##$AUNMP= <proc_1d>
##$AXLEFT= 0
##$AXRIGHT= 0
##$AXTYPE= 0
##$AXUNIT= <>
##$AZFE= 0.1
##$AZFW= 0.5
##$BCFW= 0
##$BC_mod= 2
##$BYTORDP= 0
##$COROFFS= 0
##$CY= 12.5935478210449
##$DATMOD= 1
##$DC= 0
##$DFILT= <>
##$DTYPP= 0
##$F1P= 47.1127640792319
##$F2P= -24.0371245302204
##$FCOR= 0.5
##$FTSIZE= 32768
##$FT_mod= 6
##$GAMMA= 0
##$GB= 0
##$INTBC= 1
##$INTSCL= 7.269226e-011
##$ISEN= 30
##$LB= 8
##$LEV0= 0
##$LPBIN= 0
##$MAXI= 12.09355
##$MC2= 0
##$MEAN= 0
##$ME_mod= 0
##$MI= 0.7550151
##$NCOEF= 0
##$NC_proc= -8
##$NLEV= 6
##$NOISF1= 298.5841
##$NOISF2= 270.0111
##$NSP= 0
##$NTH_PI= 0
##$NZP= 0
##$OFFSET= 298.5841
##$PC= 1.4
##$PHC0= 178.7557
##$PHC1= 173.6647
##$PH_mod= 1
##$PKNL= yes
##$PPARMOD= 0
##$PPDIAG= 0
##$PPIPTYP= 0
##$PPMPNUM= 100
##$PPRESOL= 1
##$PSCAL= 0
##$PSIGN= 0
##$REVERSE= no
##$SF= 81.014009
##$SI= 32768
##$SIGF1= 270.0111
##$SIGF2= -158.5842
##$SINO= 77.54984
##$SIOLD= 32768
##$SREGLST= <31P.CDCl3>
##$SSB= 0
##$STSI= 32768
##$STSR= 0
##$SW_p= 37037.037037037
##$SYMM= 0
##$S_DEV= 0
##$TDeff= 32768
##$TDoff= 0
##$TI= <>
##$TILT= no
##$TM1= 0
##$TM2= 0
##$TOPLEV= 0
##$USERP1= <user>
##$USERP2= <user>
##$USERP3= <user>
##$USERP4= <user>
##$USERP5= <user>
##$WDW= 1
##$XDIM= 32768
##$YMAX_p= 304279669
##$YMIN_p= -642173
$$ End of Bruker specific parameters
$$ ---------------------------------
##NTUPLES= NMR SPECTRUM
##VAR_NAME=  FREQUENCY,     SPECTRUM/REAL,   SPECTRUM/IMAG
##SYMBOL=    X,             R,               I
##VAR_TYPE=  INDEPENDENT,   DEPENDENT,       DEPENDENT
##VAR_FORM=  AFFN,          ASDF,            ASDF
##VAR_DIM=   32768,         32768,           32768
##UNITS=     HZ,            ARBITRARY UNITS, ARBITRARY UNITS
##FACTOR=    1.13031516577767, 1,            1
##FIRST=     37037.037037037, -208109,       497306
##LAST=      0,             159108,          405695
##MIN=       0,             -642173,         0
##MAX=       37037.037037037, 304279669,     0
$$ Real data points
##PAGE= N=1
##DATA TABLE= (X++(R..R)), XYDATA
$$ [...]
15847A02319n2156j9688J3038L3967M2514M3265M2627M0062K9433P424j4013k1643
$$ 102319 50163 30475 43513 77480 119994 163259 205886 245948 275381 282805 268792 247149
15835B47149j8458q515L649N183r344k5119k3495q857M286J2515K2125L4012L8248
$$ 247149 228691 220176 223825 229008 219664 194545 171050 162193 166479 178994 201119 235131 273379
15822B73379K5696l502l4783m8888l9345j6736J974P515N471P340R179j764j9752
$$ 273379 299075 295573 260790 211902 172557 155821 157795 165310 170781 178121 187300 185536 165784
15809A65784k9028l5399n5091q1185r0867p4292m8198l2626k6195j6131R93K2990
$$ 165784 136756 101357 46266 -34919 -125786 -200078 -248276 -280902 -307097 -323228 -322235 -299245
15797b99245M5265N5545M8061K9673R777k990q03J1715J7951J0885l189j1425
$$ -299245 -253980 -198435 -150374 -120701 -110924 -113914 -114717 -103002 -85051 -74166 -77355 -88780
15785h8780o903J066L278M171R714J3805J4361J8369K4369K0130N526r029k0470
$$ -88780 -95683 -94617 -91339 -87168 -77454 -63649 -49288 -30919 -6550 13580 19106 10077 -10393
15772a0393k3333j7561j1207r546j0665q025j565P645J9097K4788J5833L51l321
$$ -10393 -33726 -51287 -62494 -72040 -82705 -90730 -92295 -84650 -65553 -40765 -24932 -24581 -27902
15759b7902R340K5698L1949L4202M2385M4879L2377J7162J1201R829J2387K3641
$$ -27902 -18562 7136 39085 73287 115672 160551 192928 210090 221291 231120 243507 267148
15747B67148L5475L3386J4368j1234l2091m9753o7769p3852o4465n2531m1054
$$ 267148 302623 336009 350377 339143 307052 257299 189530 115678 51213 -1318 -42372
15736d2372k6593r065P319J9184K7682K8064J7099M548N608K0080L0859L0589
$$ -42372 -68965 -78030 -70711 -51527 -23845 4219 21318 25866 31474 51554 82413 113002
15724A13002K6208J9813K782k6178n4146o3951m9531k2075L314J7613K1489J7988
$$ 113002 139210 159023 161805 135627 81481 17530 -32001 -54076 -50762 -33149 -11660 6328
15712F328R860l518k3241m2300m8539m0479k9703k4068k6004l3238l2358j2018
$$ 6328 16188 12670 -10571 -52871 -101410 -141889 -171592 -195660 -221664 -254902 -287260 -299278
15700b99278J4638K2901L942k8031m8668m8510l4182j1231J8269N1247Q4901J11237
$$ -299278 -284640 -261739 -257797 -285828 -334496 -383006 -417188 -428419 -410150 -358903 -274002 -162765
15688a62765J22759J18451R1123M1441q271l3505l4025k9233k3940r992J1513
$$ -162765 -40006 78445 169568 211009 202738 169233 135208 105975 82035 72043 83556
15677H3556K6610K5972J2902j0630l9918n5998l9291j485K8377M2559M3552K8250
$$ 83556 110166 136138 149040 138410 98492 42494 3203 1718 30095 72654 116206 144456
15665A44456O475n470l038Q207J6985J8263J3926M903r859l3233o1314p7836o9428
$$ 144456 150931 145461 142423 150630 167615 185878 199804 204707 194848 161615 100301 22465 -46963
15652d6963l8674l232J1430o816m1759o4981o2577m2857j7110Q130J8579N922
$$ -46963 -85637 -88869 -77439 -84255 -126014 -190995 -253572 -296429 -313539 -305409 -286830 -280908
15640b80908j4387j7094k257P858P365M225N61q516k3154l0965k1621N428M0545
$$ -280908 -295295 -312389 -314646 -306788 -299423 -295198 -294637 -303153 -326307 -357272 -378893 -373465 -332920
15627c32920O6414P7628P6379N8916L5610K8400L4564L1488N285l6261p1000q4329
$$ -332920 -266506 -188878 -112499 -53583 -17973 10427 44991 76479 81764 45503 -25497 -109826
15615a09826p6724n8678m1502k8889k1782j4170O291M2384Q1001J04156J04982
$$ -109826 -186550 -245228 -286730 -315619 -337401 -351571 -345280 -302896 -221895 -117739 -12757
15604a2757Q9257N8953J9107j2930k6149k4297k0225k4018l1076l1992k6349j7882
$$ -12757 76500 135453 154560 141630 115481 91184 70959 46941 15865 -16127 -42476 -60358
15592f0358j0075l957K484J3018K7071L8447M1630L4765K1848J1374P684O717
$$ -60358 -70433 -74390 -71906 -58888 -31817 6630 48260 83025 104873 116247 123931 130648
15580A30648j024k6221n9879p4125n7323k6133q063j1092k2519l1146k4770K059
$$ 130648 129624 103403 43524 -30601 -87924 -114057 -122120 -133212 -155731 -186877 -211647 -209588
15568b09588L1152L7625J6180j0034j6962q134J684P412P819J84j2211j8786j7587
$$ -209588 -178436 -140811 -124631 -134665 -151627 -159761 -158077 -150665 -142846 -142662 -154873 -173659 -191246
15555a91246k0355l0684l5089k0616N287K4004K6033J7722Q375j822j3573k2350
$$ -191246 -211601 -242285 -277374 -297990 -292703 -268699 -242666 -224944 -216569 -218391 -231964 -254314
15543b54314j9086m139J1220K6740M1280M4638L5961K3707J1834P037R350N395
$$ -254314 -273400 -277539 -266319 -239579 -198299 -153661 -117700 -93993 -82159 -75122 -65772 -60377
15531f0377m291m789L723J0395J8447L1999L8133K9710J1850q072k0064j7856
$$ -60377 -64668 -69457 -65734 -55339 -36892 -4893 33240 62950 74800 66728 46664 28808
15519B8808l812J2170K5914L7759M1413L6337L0954K8520K7343J9668l760l7162
$$ 28808 24996 37166 63080 100839 142252 178589 209543 238063 265406 285074 281314 244152
15507B44152o2755o8448n1439j9188J1253J8763q30k6706m4269n2591n2474m6237
$$ 244152 181397 112949 61510 42322 53575 72338 71508 44802 533 -52058 -104532 -150769
15495a50769l1812j3315J630J4125K7810M3935N6025N6607M8515M3656M8677N4051
$$ -150769 -182581 -195896 -194266 -180141 -152331 -108396 -52371 4236 52751 96407 145084 199135
15483A99135M4778K3742M768j0865k7763m5914n5546m6865k1989M159J9235K4873
$$ 199135 243913 267655 272423 261558 233795 187881 132335 85470 63481 67640 86875 111748
15471A11748K5119J4773m694k1718k9757k8480k2004k1439l1764l7397k3805O91
$$ 111748 136867 151640 146946 125228 95471 66991 44987 23548 -8216 -45613 -69418 -68727
15459f8727K3161L3568K8630K2885L1437M8039N2399L5987O753j8128l2293m3561
$$ -68727 -45566 -11998 16632 39517 70954 118993 171392 207379 214132 196004 163711 120150
15447A20150m9992m4840l0395j5927m654M815L520q571j9286k6157l5720m1883
$$ 120150 70158 25318 -5077 -21004 -25658 -20843 -17323 -25894 -45180 -71337 -107057 -148940
15435a48940l0119p283Q788J5262J5556J2628J4513K5088M0756N3085M9949L4278
$$ -148940 -179059 -186342 -177554 -162292 -146736 -134108 -119595 -94507 -53751 -666 49283 83561
15423H3561K2830J7827O202j2019k1684j8966j4000j7653l3166n3422o5927o1739
$$ 83561 106391 124218 130420 118401 96717 77751 63751 46098 12932 -40490 -106417 -168156
15411a68156m5103l0760k6533k6917k3575j2228K277O747J403Q122L4648O3680
$$ -168156 -213259 -244019 -270552 -297469 -321044 -333272 -330995 -324248 -322845 -314723 -280075 -216395
15399b16395Q7556J04316J01023P4921N0589M7819N3829N0791L7871K2456P691
$$ -216395 -128839 -24523 76500 151421 202010 249829 303658 354449 392320 414776 422467
15388D22467q608k2632k4300j3879n913j2206k9254m4676n3116n2874l8192j6703
$$ 422467 413859 391227 366927 353048 347135 334929 305675 260999 207883 155009 116817 100114
15376A00114r369k2821m0030m9232n3186m7742k3667Q839K7113K4765R054j1113
$$ 100114 90745 67924 27894 -21338 -74524 -122266 -145933 -137094 -109981 -85216 -76162 -87275
15364h7275k3354j9437n947O933J5812K0319K2296K3419J9767R881k803j1589
$$ -87275 -110629 -130066 -136013 -129080 -113268 -92949 -70653 -47234 -27467 -17586 -20389 -31978
15352c1978j2230p420L86J0401J9856K7368K6563J0460j7495m4097n6361n2933
$$ -31978 -44208 -51628 -51242 -40841 -20985 6383 32946 43406 25911 -18186 -74547 -127480
15340a27480l8345j2876K3605N5939O3557M4245O274l7503o6532o3862l2145L361
$$ -127480 -165825 -178701 -155096 -99157 -35600 8645 14919 -22584 -89116 -152978 -185123 -181762
15328a81762J8954J8496K5220M4574N9431O2964O0161M9107L0863J2186l948j5079
$$ -181762 -162808 -144312 -119092 -74518 -15087 47877 108038 157145 188008 200194 196246 181167
15316A81167j7983j2474l430j069j1454k5716l4463l7422l9876m8875o1845o9857
$$ 181167 163184 150710 147280 146211 134757 109041 74578 37156 -2720 -51595 -113440 -183297
15304a83297o3961m6589l0316j8512p747M405J7164K8412L3735K9806K2420K2355
$$ -183297 -247258 -293847 -324163 -342675 -350422 -346017 -328853 -300441 -266706 -236900 -214480 -192125
15292a92125L3349M7997N5738N3929M7199M3849M9934N8468N1663K8745P601k680
$$ -192125 -158776 -110779 -55041 -1112 46087 89936 139870 198338 250001 278746 286347 283667
15280B83667p194j4899k2469k2631k5226m0412n7980o4650n9855m8359l3898k0077
$$ 283667 276473 261574 239105 216474 191248 150836 92856 28206 -31649 -80008 -113906 -133983
15268a33983q313k75N948J4784K6260L9419N5303O8460O6718N0998L6479K9938
$$ -133983 -142296 -142571 -136623 -121839 -95579 -56160 -857 67603 134321 185319 221798 251736
15256B51736K1782K873k0900l6487l4125j5099J613l671k5351m7332n6354m8949
$$ 251736 273518 276391 255491 219004 184879 169780 171393 167722 142371 95039 38685 -10264
15244a0264l8239k7354n704J9001K6525J2482l881n005P160K6119M2874M5253
$$ -10264 -48503 -75857 -81561 -62560 -36035 -23553 -27434 -32439 -25279 840 43714 88967
15232H8967M0537M0168L5702J8023j2239m2760o0515o1875m7203k4573p320l84
$$ 88967 129504 169672 205374 223397 211158 168398 107883 46008 -1195 -25768 -33088 -33472
15220c3472L659J3673K5285K5886J6029J1655J8751K5913K6560K7636L5186M5260
$$ -33472 -29813 -16140 9145 35031 51060 62715 81466 107379 133939 161575 196761 242021
15208B42021M7406M0911L7389M0173L9654K7417N195j3696k6719m3653o0129o5254
$$ 242021 289427 330338 367727 407900 447554 474971 480166 466470 439751 396098 335969 270715
15196B70715o2972n5379l3419j433K3416L0617K3849J3398K894j1603k6416l6022
$$ 270715 207743 152364 118945 117512 140928 171545 195394 208792 211686 200083 173667 137645
15184A37645m2740l8922j1349K9724N9363O0141L0766j2087m4970n9217o0821
$$ 137645 94905 55983 44634 74358 133721 193862 224628 212541 167571 108354 47533
15173D7533n4985m5457l2392j9497j6035k4923l3666k7225r152N029J0678J5866
$$ 47533 -7452 -52909 -85301 -104798 -120833 -145756 -179422 -206647 -215799 -210770 -200092 -184226
15161a84226K4545L0321K8641K6756L4010M7413N3404M0870J2588j4745k1580
$$ -184226 -159681 -129360 -100719 -73963 -39953 7460 60864 101734 114322 99577 77997
15150G7997o078J2848K4646K6431Q745k8796o4517o7388l4856N241L1161M2596
$$ 77997 71919 84767 109413 135844 144589 115793 51276 -16112 -50968 -45727 -14566 28030
15138B8030M6167M5337M9824O3247P1207N9576K8069j6332o0096q6837r3396r0874
$$ 28030 74197 119534 169358 232605 303812 363388 391457 375125 315029 228192 134796 43922
15126D3922q4300p0971n2829l3237j7680j3268j6715j9687k2795k6542k3869m115
$$ 43922 -40378 -111349 -164178 -197415 -215095 -228363 -245078 -264765 -287560 -314102 -337971 -342086
15114c42086L0831O2595O9979M9317K4010J3065J3130P911j2399l7734m9112m1837
$$ -342086 -311255 -248660 -178681 -129364 -105354 -92289 -79159 -71248 -83647 -121381 -170493 -212330
15102b12330l0566k3641j0500J2481L0674L1129J5385k971o484J0012L7997O5571
$$ -212330 -242896 -266537 -277037 -264556 -233882 -202753 -187368 -190339 -196823 -186811 -148814 -83243
15090h3243P5331O1579M0145K5454J7786J5192J2943L103j3784k9273l9366m6534
$$ -83243 -7912 53667 93812 119266 137052 152244 165187 168290 154506 125233 85867 39333
15078C9333m5609k9580r685j134j37N019J0101l24j6997j5373K651J6099J6031
$$ 39333 -6276 -35856 -45541 -46675 -46812 -41793 -31692 -32016 -49013 -64386 -61735 -45636 -29605
15065b9605N235j7822m7479o0456m5216j7066J3065M6751P1855O8164L7492N278
$$ -29605 -24370 -42192 -89671 -150127 -195343 -212409 -199344 -152593 -80738 -12574 24918 30196
15053C0196j3283k5012l6075l9487k1442J6701N0006N9495N3421M8664M9512M9397
$$ 30196 16913 -8099 -44174 -83661 -105103 -88402 -38396 21099 74520 123184 172696 222093
15041B22093M2854K9436O332k8587o1886p2063n9844m5513m0689m1288m0173l6231
$$ 222093 264947 294383 300715 272128 210242 138179 78335 32822 -7867 -49155 -89328 -125559
15029a25559l1636j9345R596M5273O6638O4792N1167M0834L4792K6379J5473M596
$$ -125559 -157195 -176540 -166944 -121671 -55033 9759 60926 101760 136552 162931 178404 183000
15017A83000j1628l5819n5472n9137m6344j3897L0832N6455M1277N871j8518k3890
$$ 183000 171372 135553 80081 20944 -25400 -39297 -8465 47990 89267 95138 76620 52730
15005E2730j2641L284J2476J4620J0705O75j0021j6185j7580j0392Q716L2913
$$ 52730 40089 43373 55849 70469 81174 81849 71828 55643 38063 27671 36387 69300
14993F9300N2493O1301O2432O4327O4137N0660J7243k4289n2062o0069n9174n8624
$$ 69300 121793 183094 245526 309853 373990 424650 441893 417604 365542 305473 246299 187675
14981A87675n7790n3993m7395l8179k1306J1338N2069P2934O3414L9649J9341
$$ 187675 129885 75892 28497 -9682 -30988 -19650 32419 105353 168767 208416 227757
14970B27757R936N687n101j7230j6552o363j534n931m945Q183K7149M7060N7042
$$ 227757 237693 243380 238279 221049 204497 198134 196600 190669 185724 193907 221056 268116 325158
14957C25158M4820J5930j2279k7183j8504J2052L6146K8883k775k8607k8170q003
$$ 325158 369978 385908 373629 346446 327942 339994 376140 405023 402248 373641 345471 337468
14945C37468J3072K1056J5493L735p724k0238l7970n9701p6914p8924o9953o0856
$$ 337468 350540 371596 387089 390824 383100 362862 324892 265191 188277 109353 39400 -21456
14933b1456n0702k9900o726o8j2509k7266k7978j6917p860o792q009k146J1862
$$ -21456 -72158 -102058 -108784 -108852 -121361 -148627 -176605 -193522 -201382 -208174 -216183 -218329 -206467
14920b06467K0778J7597J5455J9275J7011M188j5081k7187j7325M647J5580J3212
$$ -206467 -185689 -168092 -152637 -133362 -116351 -112163 -127244 -154431 -171756 -167109 -151529 -138317
14908a38317J4399K3709K6661J4724o184k0168j7333q607q920k0048l2208l4131
$$ -138317 -123918 -100209 -73548 -58824 -65008 -85176 -102509 -111116 -120036 -140084 -172292 -206423
14896b06423k3040l744J5087K7160K8439J9206K647r972j1195r254j0007j5769
$$ -206423 -229463 -233207 -218120 -190960 -162521 -143315 -140668 -150640 -161835 -171089 -181096 -196865
14884a96865k6353l6574m0178l2397j6181k55J1601K5283M4019N9012N8618L5100
$$ -196865 -223218 -259792 -299970 -332367 -348548 -348803 -337202 -311919 -267900 -208888 -150270 -115170
14872a15170K074j2636o633j980q849j6385r362K0226O1849Q9967Q8266N8262
$$ -115170 -113096 -125732 -132365 -134345 -143194 -159579 -168941 -148715 -86866 3101 91367 149629
14860A49629J4648k0009l5627m0351l9551k6826l366J3861J4940J0214P553L42
$$ 149629 164277 144268 108641 68290 28739 1913 -1453 12408 27348 37562 45115 45457
14848D5457j3111j5799p605r284k3628l9205m8500n0955m4872l1591j6549q49
$$ 45457 32346 16547 8942 -342 -23970 -63175 -111675 -162630 -207502 -239093 -255642 -256491
14836b56491J1050J6364J0258r503k2101p404K0881L6705L6195K5441O331j4173
$$ -256491 -245441 -229077 -218819 -228322 -250423 -257827 -236946 -200241 -164046 -138605 -132274 -146447
14824a46447k7671l2272k3815Q06L8901P9377R9008Q2721M8142K5607J8749J2334
$$ -146447 -174118 -206390 -230205 -229399 -190498 -111121 -12113 70608 118750 144357 163106 175440
14812A75440k80r906m588O407O610J69q74O344J7218K4858J9537k758k5106k9196
$$ 175440 175160 165254 160666 167073 173683 173852 172978 179322 196540 221398 240935 238177 213071 183875
14798A83875k2510k1155k7087k6569r953J0690K3027L2224L9850L6586J8862q817
$$ 183875 161365 140210 113123 86554 76601 87291 110318 142542 182392 218978 237840 229023
14786B29023l7663n5639n1092l0318j7923k0893k6997l6655m8037m2361j4298
$$ 229023 191360 135721 84629 54311 36388 15495 -11502 -48157 -96194 -138555 -152853
14775a52853J9976N0775P5792Q7385Q2788O3519L2322l210l1224m4026m4663l9711
$$ -152853 -132877 -82102 -6310 81075 163863 227382 259704 256494 225270 181244 136581 96870
14763I6870l5222l3202k8839j7680R85K1755K9420J6022n090j3588o085M639Q573
$$ 96870 61648 28446 -393 -18073 -17088 4667 34087 50109 45019 31431 25346 29985 38558
14750C8558N072p48l96O772J0899K865j4837k5692j8293j70J5143K3225K4132
$$ 38558 43630 42882 42486 49258 60157 63022 48185 22493 4200 4030 19173 42398 66530
14737F6530J9672J5204R735l051j8361k5562k5645k8247l6453l9228k2984J0105
$$ 66530 86202 101406 111141 108090 89729 64167 38522 10275 -26178 -65406 -88390 -78285
14725g8285M4713O5778O4488M5090K2731P389p388k4604l3847k8788j8290j5268
$$ -78285 -33572 32206 96694 141784 164515 171904 164516 139912 106065 77277 58987 43719
14713D3719j6582r158O918J6796J7450J4763N714p413j9151k9917l8249m4755
$$ 43719 27137 17979 24897 41693 59143 73906 79620 72207 53056 23139 -15110 -59865
14701e9865n2238n4068m2683j8629J0285L2616M7044N5914N5265M7619M0298K5203
$$ -59865 -112103 -166171 -208854 -227483 -217198 -184582 -137538 -81624 -26359 21260 61558 86761
14689H6761r921m8088n9145m3453k1500l182J4380K8283L0495K1800R861L930
$$ 86761 76840 28752 -30393 -73846 -95346 -98528 -84148 -55865 -25370 -3570 6291 10221
14677A0221M699O571M871l580j2467q142N667J2505O489p383j7669j3098Q584
$$ 10221 14920 21491 26362 22782 10315 2173 7840 20345 26834 19451 1782 -11316 -2732
14664b732L5893N3374N6186M9962M5338M4698L3503R125p342p338n204j3843k9867
$$ -2732 33161 86535 142721 192683 238021 282719 316222 325347 318005 310667 305463 291620 261753
14651B61753m3858n2721n5197m7065l2842k5722k3847j8001j5037k5175l7364
$$ 261753 217895 165174 109977 62912 30070 4348 -19499 -37500 -52537 -77712 -115076
14640a15076l1869j3778j374P340J7393J9454J5238J9654L0468L7749M2041M1999
$$ -115076 -146945 -160723 -162097 -154757 -137364 -117910 -102672 -83018 -52550 -14801 27240 69239
14628F9239L3483J5082o436k0227k3768k1425j1836j261p853l1329m9701m8452
$$ 69239 102722 117804 111368 91141 67373 45948 34112 32851 24998 -6331 -56032 -104484
14616a04484l0955r659R33Q43L130P583M114k839j934P884J6262K0772K8100L6914
$$ -104484 -135439 -145098 -144165 -143322 -140192 -132609 -128495 -131334 -133268 -125384 -109122 -88350 -60250 -23336
14602b3336M5229M6451K5773j6165n2869o6021o2896n2072m1755m2080n0954n5149
$$ -23336 21893 68344 94117 77952 25083 -40938 -103834 -155906 -197661 -239741 -290695 -345844
14590c45844m6826k5282N941M0056O3659O1671M3540L1132K2871Q532l674J842
$$ -345844 -392670 -417952 -412011 -371955 -308296 -246625 -203085 -171953 -149082 -140550 -144224 -142382
14578a42382K2705L9664M3115M0920M0913M3522M4645M3735M2952M3248M7260
$$ -142382 -119677 -80013 -36898 4022 44935 88457 133102 176837 219789 263037 310297
14567C10297N2904N5457N4202M2690J0118l6010p3804r0146q5331o6270m6687
$$ 310297 363201 418658 472860 515550 525668 489658 415854 325708 240377 174107 127420
14556A27420l8548m3120n4240o3221o3933o0653n8305n6900n1102l4127o439J7976
$$ 127420 88872 45752 -8488 -71709 -135642 -196295 -254600 -311500 -362602 -396729 -403168 -385192
14544c85192K3332J5540P156K470J383Q04J634J3923M2143P2709R0006R0374P3847
$$ -385192 -361860 -346320 -339164 -336694 -335311 -334507 -332873 -318950 -276807 -204098 -114092 -23718 50129
14531E0129M0353N851p849n842o435j4179j8010j0917Q58R941J2939J2381J0755
$$ 50129 90482 96333 88484 82642 76207 62028 44018 33101 33959 43900 56839 69220 79975
14518G9975N085q153k6896l8800l4802j9573K901K8395M3449L6126R271k3244
$$ 79975 85060 76907 50011 11211 -23591 -43164 -40263 -11868 31581 67707 76978 53734
14506E3734m4421m4359l3127k2024n903J5539L3152M4945N2195N0343L6314J4601
$$ 53734 9313 -35046 -68173 -90197 -96100 -80561 -47409 -2464 49731 100074 136388 150989
14494A50989o052j0764K783J5340J3639J361j4956k4050k4646k9294l9040l9078
$$ 150989 144937 134173 136956 152296 165935 167296 152340 128290 103644 74350 35310 -3768
14482c768k0586M911K3855L6287M2833L5332J0171j7487k6912k1315j8474k1861
$$ -3768 -24354 -19443 4412 40699 83532 118864 129035 111548 84636 63321 44847 22986
14470B2986k6301k9923k6639j1338Q132K1598K2589J3680N379l109j3455j5791
$$ 22986 -3315 -33238 -59877 -71215 -63083 -41485 -18896 -5216 163 -2946 -16401 -32192
14458c2192r923p213q601k873J4601L4720N1650N6617L9048R280j6264l6810m9386
$$ -32192 -42115 -49328 -57929 -60802 -46201 -11481 40169 96786 135834 145114 128850 92040 42654
14445D2654m6067k5442N738L1445L7156K1983j299j1446J883L0138N7414O8682
$$ 42654 -3413 -28855 -23117 8328 45484 67467 66168 54722 56605 86743 144157 212839
14433B12839N6926K8248q157m1940n1871l2703r112o590l1754o7826q4726p3480
$$ 212839 269765 298013 289856 247916 196045 163342 154230 147640 115886 48060 -36666 -110146
14421a10146m7333j5653J5010L4611L6798K2402M18j6533j9475q770Q032K4626
$$ -110146 -157479 -173132 -158122 -123511 -86713 -64311 -63893 -80426 -99901 -108671 -100639 -76013
14409g6013L3889L4752K8261P357k6520n2685n5614m3506k8406q266J8840M3708
$$ -76013 -42124 -7372 20889 28246 1726 -50959 -106573 -150079 -178485 -186751 -167911 -124203
14397a24203N8038N8373M8701L3676J9727J2872P537J520j885o673j5024k2933
$$ -124203 -66165 -7792 40909 74585 94312 107184 114721 116241 114356 107683 92659 69726
14385F9726k5399k1957j5081r063p236n096M302K4834M3483L5657n319n7563r3167
$$ 69726 44327 22370 7289 -1774 -9010 -14106 -9804 15030 58513 94170 88851 31288 -61879
14372f1879j00627p8627m0026n982J3270J6232J2252J7397L1543M2873N2802O1836
$$ -61879 -162506 -241133 -281159 -287141 -273871 -257639 -245387 -227990 -196447 -153574 -100772 -38936
14360c8936N8250L8743J0814j3886k2208j6260q267k580O997K5836M4479M3059
$$ -38936 19314 58057 68871 54985 32777 16517 8250 5670 12667 38503 82982 126041
14348A26041J7559q898j6539j5309k3724m3925o5630p3280n7086k2046J8884N1287
$$ 126041 143600 134702 118163 102854 79130 35205 -30425 -103705 -160791 -182837 -163953 -112666
14336a12666O4568N7163L3109K777k1533l7618m8115m9593l6775r769K0608L9236
$$ -112666 -48098 9065 42174 44951 23418 -14200 -62315 -111908 -148683 -158452 -137844 -98608
14324i8608M2805L6471K0672k855k6899m3708m9809m2809k0217J3271M0341M8810
$$ -98608 -55803 -19332 1340 -1515 -28414 -72122 -121931 -164740 -184957 -171686 -131345 -82535
14312h2535M0849K3999J8244L9406O6690O8973M5206J2160j8260m2051n5810n5832
$$ -82535 -41686 -17687 557 39963 106653 175626 220832 232992 214732 172681 116871 61039
14300F1039m5246l3457k5178j9435j3487j244J6210L1338L7656L0930J7350P220
$$ 61039 15793 -17664 -42842 -62277 -75764 -77008 -60798 -29460 8196 39126 56476 63696
14288F3696K783n363l1780o5202p6200n7754k8540p407J553M186P676J6986K7015
$$ 63696 66479 61116 29336 -35866 -112066 -169820 -198360 -205767 -204214 -200028 -192352 -175366 -148351
14275a48351L0304L2508L6369M0305M4251L8919J4716k1938n1727o0322m6108
$$ -148351 -118047 -85539 -49170 -8865 35386 74305 89021 67083 15356 -44966 -91074
14264i1074j2501K5665M3508L1060M184j9584l3398l1309j7159J191K3665L5307
$$ -91074 -103575 -77910 -34402 -3342 842 -18742 -52140 -83449 -100608 -99417 -75752 -40445
14252d0445J7586k1815n2582n1845k8896r182k768K755J7630L6241M8079M3650
$$ -40445 -22859 -44674 -97256 -149101 -177997 -187179 -189947 -187192 -169562 -133321 -85242 -41592
14240d1592K4005M178j210Q014J6061J2610M529J525J973L19l325n161j355J0856
$$ -41592 -17587 -13409 -14619 -6605 9456 22066 26595 28120 30093 30412 27087 21926 20571 31427
14226C1427K7143L6379L6507K9168J7479J1168J2945J3725J4363J8000J4879P15
$$ 31427 58570 94949 131456 160624 178103 189271 202216 215941 230304 248304 263183 263898
14214B63898j8124k8739k0448J468J8137K2671K3892K0003N735j0362k0846l1884
$$ 263898 245774 217035 196587 198055 216192 238863 262755 282758 288493 278131 257285 225401
14202B25401m5714n0928l9638j8011P42R781J5012K2521L0177L3316K6512J2424
$$ 225401 179687 128759 89121 71110 71852 81633 96645 119166 149343 182659 209171 221595
14190B21595o09q593m384O653O22k3070m0517m0062k7762j7384j3971j4186j2816
$$ 221595 220986 212393 208009 214662 215284 192214 151697 111635 83873 66489 52518 38332 25516
14177B5516q792o120k560Q206K0229K1840J3972O347O895J8051L2948M1682M2128
$$ 25516 16724 10604 8044 16250 36479 58319 72291 78638 85533 103584 136532 178214 220342
14164B20342L5965K7606J6248l685k3125l0174l2222l7894m4112m7469m4794l3817
$$ 220342 256307 283913 300161 296476 273351 243177 210955 173061 128949 81480 36686 2869
14152B869j8811j260K0157L6563L2670O829k2927l7970l6390k7143j8526j4348
$$ 2869 -15942 -17202 2955 39518 72188 79017 56090 18120 -18270 -45413 -63939 -78287
14140g8287j5761k1800k9854l6487l7381k8769j2583J562P753J0778J7446K9304
$$ -78287 -94048 -115848 -145702 -182189 -219570 -248339 -260922 -259360 -251607 -240829 -223383 -194079
14128a94079M2700N5912O5340O0863M5129L4953L3275K9446J9731J0763P495J2910
$$ -194079 -151379 -95467 -30127 30736 75865 110818 144093 173539 193270 204033 211528 224438
14116B24438K2958K0950L896j4357k9160m0249m1663l2833j8410J737K3653K8919
$$ 224438 247396 268346 272242 257885 228725 188476 146813 113980 95570 97307 120960 149879
14104A49879J3879m619j3771m067K4259N1216N7065M5599L5510L4409L8078M5689
$$ 149879 163758 159139 145368 141301 165560 216776 273841 319440 354950 389359 427437 473126
14092D73126N3297N0976L7644K7690L3927M7614N0377L5609J0779r049k0855l5682
$$ 473126 526423 577399 615043 642733 676660 724274 774651 810260 821039 811990 791135 755453
14080G55453n2367n8631n2490l7835j5158J2276M1332O5223P7925Q4697Q9585
$$ 755453 703086 644455 591965 554130 538972 551248 592580 657803 735728 820425 910010
14069I10010Q9753Q6039Q4689R3524J17932J50733J71877J67049J36012Q4709
$$ 910010 999763 1085802 1170491 1264015 1381947 1532680 1704557 1871606 2007618 2092327
14059B092327K8991j5431n3367r7573j44441j79446j93853j86690j65590j43133
$$ 2092327 2121318 2105887 2052520 1954947 1810506 1631060 1437207 1250517 1084927 941794
14049I41794j28934j20583j01454o8916m2878l7704m8139o1948p1644p2343o7579
$$ 941794 812860 692277 590823 521907 479029 441325 393186 331238 259594 187251 119672
14038A19672o6220o7190o4005n0319k9858k0738k3972j9328j179J6233K1137J4172
$$ 119672 53452 -13738 -77743 -128062 -157920 -178658 -202630 -221958 -223137 -206904 -185767 -171595
14026a71595L326j0062k3043k3665j0948K32K230J298M927J4554K4144K9390L0029
$$ -171595 -168269 -178331 -201374 -225039 -235987 -235755 -233525 -232227 -227300 -212746 -188602 -159212 -129183
14013a29183K3610J0349l254o657K645J3173J7599J8238K0761L6714O1179O9996
$$ -129183 -105573 -95224 -98478 -105135 -102490 -89317 -71718 -53480 -32719 3995 65174 135170
14001A35170N1990K0072q070k5962m1439o1359p6624p4405n3876k5945J221K6433
$$ 135170 187160 207232 199162 173200 131761 70402 -6222 -80627 -134503 -160448 -159227 -132794
13989a32794M4875M5908L4326K2996J0276o984k3993l2664l3001k8508j7268J311
$$ -132794 -87919 -42011 -7685 15311 25587 18603 -5390 -38054 -71055 -99563 -116831 -115520
13977a15520K5726M6945M8946L1364J1903J958o733k2206l1410j3449K7790N5533
$$ -115520 -89794 -42849 6097 37461 49364 51322 44589 22383 -9027 -22476 5314 60847
13965F0847M4382J1555j4394k9253l9341m2844l7947k6278j0427mj026q972j6583
$$ 60847 105229 116784 102390 73137 33796 -9048 -46995 -73273 -83700 -83704 -84730 -93702 -110285
13952a10285j4976p10K0859M4587O2256O6398O0669M4697P814m1420p6756q3623
$$ -110285 -125261 -125971 -105112 -60525 1731 68129 128798 173495 181309 139889 63133 -20490
13940b0490o7804m3197j7645Q140K9620L6473K0890p842k5198j7897Q732M1672
$$ -20490 -88294 -131491 -149136 -140996 -111376 -74903 -54013 -61855 -87053 -104950 -96218 -54546
13928e4546O5827O9922N1210J6728j6326l5363m0550l2859j3853O58j810n829
$$ -54546 11281 81203 132413 149141 132815 97452 56902 24043 10190 10848 9038 3209
13916C209j230M50r411k2251k8364k9064l0086m0780n7336o4276n8400m2042j8673
$$ 3209 1979 2429 -6982 -29233 -57597 -86661 -116747 -157527 -214863 -279139 -337539 -379581 -398254
13903c98254R20J2958K4535L9599N4122O2655O0426M4425K1478O573J2309K7328
$$ -398254 -397334 -384376 -359841 -320242 -266120 -203465 -143039 -98614 -77136 -70563 -58254 -30926
13891c0926K3477k406k6725k9257j3522J55J546j34R780L0479L9618K3377n328
$$ -30926 -7449 -9855 -36580 -65837 -79359 -79204 -77658 -77792 -68012 -37533 2085 25462 20134
13878B0134k4368k0553o945p177k1189l0573k3588m504J8419M3250O9051Q4991
$$ 20134 -4234 -24787 -31732 -38909 -60098 -90671 -114259 -118763 -100344 -57094 11957 96948
13866I6948P6289M6061J1764j2872j7608k415J3105J0346r279l4002m9035m4984
$$ 96948 173237 219298 231062 218190 200582 198167 211272 221618 212339 178337 129302 84318
13854H4318k7274j0793k717O412K2575L3839K9789J0408k0368n2777p2399o9392
$$ 84318 57044 46251 43534 49946 72521 106360 136149 146557 126189 73412 1013 -68379
13842f8379m7403k4814j5428j8914k6322k3265k490K6951M8382M8254K8825R555
$$ -68379 -115782 -140596 -156024 -174938 -201260 -224525 -227015 -200064 -151682 -103428 -74603 -65048
13830f5048K783K100p91j0437l0405n1890n6644l8796j3259O948K3287L2860L0370
$$ -65048 -62265 -60165 -60956 -71393 -101798 -153688 -210332 -249128 -262387 -255439 -232152 -199292 -168922
13817a68922K3184J5705M887o577j2169r330j492L353K792n194j8835k4404j5610
$$ -168922 -145738 -130033 -125146 -131723 -143892 -153222 -154714 -151361 -148569 -153763 -172598 -197002 -212612
13804b12612l085l593j7989k9814l2792k9746j8021K276K1602K3171K640j9745
$$ -212612 -215697 -219290 -237279 -267093 -299885 -329631 -347652 -345376 -323774 -300603 -297963 -317708
13792c17708k7298k3992j9580j5636p936N954K6761M8199O2719P0213P0852O2887
$$ -317708 -345006 -368998 -388578 -404214 -412150 -406196 -379435 -331236 -268517 -198304 -127452 -64565
13780f4565M8538K6996k448k3440k8511l0560k9007j6120j591L498J1460L6973
$$ -64565 -16027 10969 8521 -14919 -43430 -73990 -102997 -119117 -120708 -117210 -105750 -68777
13768f8777O3478O7968M9792K5709J2384P574j22q934o605L344Q037N494m061
$$ -68777 -5299 62669 112461 138170 150554 158128 158006 149072 142467 145811 153848 159342 155281
13755A55281k1780m2111n2092m1661j9782L8J7534K8980K6647J3449n055k1592
$$ 155281 133501 91390 39298 -2363 -22145 -22107 -4573 24407 51054 64503 59448 37856
13743C7856k6084k0247p475R037J0605j2318m0539n0849l7577j0890J2718K1597
$$ 37856 11772 -8475 -15950 -6913 3692 -8626 -49165 -100014 -137591 -148481 -135763 -114166
13731a14166J5035O505R268J6652J8516J6923K1741M0595O1638O1986L3347o046
$$ -114166 -99131 -92626 -83358 -66706 -48190 -31267 -9526 31069 92707 154693 188040 181994
13719A81994l4562l9579k1305L308J2346M170k485j349k432j4612l8562n8051
$$ 181994 147432 107853 86548 89856 102202 106372 103887 102538 100106 85494 46932 -11119
13707a1119m9241k2806j1518k5408m4689m1998j3419K3685N4042P1223O7647M0060
$$ -11119 -60360 -83166 -94684 -120092 -164781 -206779 -220198 -196513 -142471 -71248 -3601 36459
13695C6459P990j0059j4814j5879k3131l7114m7437m6596l6191k1930j0851n926
$$ 36459 44449 34390 19576 3697 -19434 -56548 -103985 -150581 -186772 -208702 -219553 -225479
13683b25479n064o883q596m919p4o97l245J673J9341L6195K6921n392k9899l5875
$$ -225479 -230543 -237426 -246022 -250941 -251015 -251712 -254957 -253284 -233943 -197748 -170827 -176219 -206118 -241993
13669b41993l7628l7788k5006j233J5762J4452o97j7925k6319k0469j529K1284
$$ -241993 -279621 -317409 -342415 -343648 -327886 -313434 -314131 -332056 -358375 -378844 -380373 -359089
13657c59089L5487L9536M1286L9105K3565J176j1807j5528j7302j4303k711J0536
$$ -359089 -323602 -284066 -242780 -203675 -180110 -178934 -190741 -206269 -223571 -237874 -240585 -230049
13645b30049J5642J0191P408K1451L6696K9317O640r152j1918p089M925K2893
$$ -230049 -214407 -204216 -196808 -175357 -138661 -109344 -102704 -111856 -123774 -130863 -125938 -103045
13633a03045M2266O5536R3845J11927J04287P2056K7550j5423m5077n7529n5493
$$ -103045 -60779 4757 98602 210529 314816 386872 414422 398999 353922 296393 240900
13622B40900l4737J98K4088J9886m002k6208l0014k2440k4666l7121m0622l1442
$$ 240900 206163 206361 230449 250335 246333 220125 190111 167671 143005 105884 65262 33820
13610C3820k1857j4897o034o81o896k0314k5555j1222R538J8604J3883j043k0974
$$ 33820 11963 -2934 -8968 -9649 -16545 -36859 -62414 -73636 -64098 -45494 -31611 -32654 -53628
13597e3628l4469l3328j9904j856N741l755k3421m4992n5292m3827j5211J5581
$$ -53628 -88097 -121425 -141329 -143185 -137444 -141199 -164620 -209612 -264904 -308731 -323942 -308361
13585c08361L4929M0494L4188K1598J3339J0795J0531J1713J0880P397N086J483
$$ -308361 -273432 -232938 -198750 -177152 -163813 -153018 -142487 -130774 -119894 -112497 -107411 -105928
13573a05928j0137k5623k9750j6930k179L635Q819J6266J6038P528m880j5118
$$ -105928 -116065 -141688 -171438 -188368 -190547 -186912 -178093 -161827 -145789 -138261 -143141 -158259
13561a58259j2014j425L350N726J7231L7762N8953O8343N3873K5293J901p394
$$ -158259 -170273 -171698 -168348 -162622 -145391 -107629 -48676 19667 73540 98833 100734 93340
13549I3340o9J6556K3703J5681N678j275j0784j9878j9016o938P687J6369K0364
$$ 93340 93271 109827 133530 149211 154889 153614 142830 122952 103936 96998 104685 121054 141418
13536A41418K4109K3367J7847J5460J0893m553k1183k9021l4938m8944o5606p4407
$$ 141418 165527 188894 206741 222201 233094 228541 207358 178337 143399 94455 28849 -45558
13524d5558p2770n7775k7470P079L0010L4381K4217J0270o022k8522m7582m6256
$$ -45558 -118328 -176103 -203573 -196494 -166484 -132103 -107886 -97616 -103638 -132160 -179742 -225998
13512b25998k2015J1963L3884L5271K7640K2280K4347K5842J8942J2144J1211
$$ -225998 -248013 -236050 -202166 -166895 -139255 -116975 -92628 -66786 -47844 -35700 -24489
13501b4489J0253N078k419j3757l0955m0809k7329K896L2777N6843P4334P5272
$$ -24489 -14236 -9158 -11577 -25334 -56289 -97098 -124427 -121531 -88754 -31911 42423 117695
13489A17695N7800L5303J7833O012n763j3432r777o062j4427l1113m2033l8047
$$ 117695 175495 210798 228631 234643 228880 215448 205671 199609 185182 154069 112036 73989
13477G3989k5245j5387j6559k4334l1273l9983m4776k8104O073L0065K7769J1573
$$ 73989 48744 33357 16798 -7536 -38809 -78792 -123568 -151672 -145599 -115534 -87765 -76192
13465g6192L134M164K80r671j2468m514L413M035N54o474j7937l0232l2238j8959
$$ -76192 -73058 -68894 -68614 -78285 -90753 -95267 -91854 -87819 -87265 -93739 -111676 -141908 -174146 -193105
13451a93105l322M283J1571K5354L1237K0299R714J2021J7948J5984L489j2569
$$ -193105 -196427 -192144 -180573 -155219 -123982 -103683 -93969 -81948 -64000 -48016 -44527 -57096
13439e7096k1517k1087j1679J1134M1645O2504O7838N9668L0422k5195r0122j31198
$$ -57096 -78613 -99700 -111379 -100245 -58600 3904 71742 131410 161832 136637 46515 -84683
13427h4683j28398q2891k2497J1888J3488J0679J6204K4487L5233M2094L9189
$$ -84683 -213081 -295972 -318469 -306581 -293093 -282414 -266210 -241723 -206490 -164396 -125207
13416a25207K7871P945j3757k3345j4634K674R533J039q682n154J2247L1784M0207
$$ -125207 -97336 -89391 -103148 -126493 -141127 -138453 -128920 -127881 -136563 -141717 -129470 -97686 -57479
13403e7479L7404L0567K1251Q395p224j8567j7447p391j52k054o766r969j5600
$$ -57479 -20075 10492 31743 40138 32914 14347 -3100 -10491 -10643 -12697 -19463 -29432 -45032
13390d5032k3613k9719l1307k8009j6355N886K8880M1646L8612J8904k747j3352
$$ -45032 -68645 -98364 -129671 -157680 -174035 -168149 -139269 -97623 -59011 -40107 -42854 -56206
13378e6206j5729m407J7985L0653L5469N0441P0172P5638O0703L4475J6524J6472
$$ -56206 -71935 -76342 -58357 -27704 7765 58206 128378 204016 264719 299194 315718 332190
13366C32190K6688L3976K2310o135l2511m7156n0393m6737m4839n2120o9329q9207
$$ 332190 358878 392854 415164 409029 376518 329362 278969 232232 187393 135273 65944 -23263
13354b3263r5175p3061l5567j5123j7313j8019j407K7372N8104Q1863Q8048P3874
$$ -23263 -118438 -191499 -227066 -242189 -259502 -277521 -278928 -251556 -193452 -111589 -23541 50333
13342E0333N0066K5309l001l4095n7853o3124m9831l2327k4261j9613n753J2003
$$ 50333 100399 125708 122707 88612 30759 -32365 -82196 -114523 -138784 -158397 -164150 -152147
13330a52147J7215K589j7278k5407k5441k7179l1992l6374l3510j9880L242L1143
$$ -152147 -134932 -132343 -149621 -175028 -200469 -227648 -259640 -296014 -329524 -349404 -346162 -315019
13318c15019N4375O3151N3342L3979K3115K2941J7592j432k9249n6939o8418n5943
$$ -315019 -260644 -197493 -144151 -110172 -87057 -64116 -46524 -47956 -77205 -134144 -202562 -258505
13306b58505l1177m758J6582K4642J7484J290r376m916Q187J6814J1554l745j0445
$$ -258505 -289682 -294440 -277858 -253216 -235732 -234442 -243818 -248734 -240547 -223733 -212179 -215924 -226369
13293b26369m753l707j4581k8347l3954k5050M522M3843O2725M5446R472k3793
$$ -226369 -231122 -234829 -249410 -277757 -311711 -336761 -332239 -288396 -225671 -180225 -170753 -194546
13281a94546m5766m4799k1161Q374K7061L2072L5601M2079L7760J6290l501n928
$$ -194546 -240312 -285111 -306272 -297898 -270837 -238765 -203164 -161085 -123325 -107035 -110536 -116464
13269a16464J578P598J2988K3634L9811N0180N0058M4088L3950K2213R098l488
$$ -116464 -114886 -107288 -94300 -70666 -30855 19325 69383 113471 147421 169634 178732 175244
13257A75244m471Q427K0506J7859M13j6939j9391j051K7160M6249M9194M1870
$$ 175244 170773 179200 199706 217565 217978 201039 181648 180597 207757 254006 303200 345070
13245C45070L0967J4282j1166l7798n2168n2031n1737n4892n1177l9078k9858
$$ 345070 376037 390319 379153 341355 289187 237156 185419 130527 79350 40272 10414
13234A0414k5609j3917M225J8972K4974K3800K1763K1756K2507K3829K6980K9691
$$ 10414 -15195 -29112 -24887 -5915 19059 42859 64622 86378 108885 132714 159694 189385
13222A89385K5119R229r339j6869j0253M445J3293N501m998k904M659J1605J7654
$$ 189385 214504 223733 214394 197525 187272 191717 205010 210511 205513 202609 207268 218873 236527
13209B36527J3321k144j7546k7826l0508k2498n842R114J1733O075K651K596Q84
$$ 236527 249848 247704 230158 202332 171824 149326 143484 152598 164331 170406 173057 175653 176537
13196A76537o160m348J9038M9769O5841O0140L5183m648m1499n1291k5001J6650
$$ 176537 170377 166029 185067 234836 300677 360817 396000 391352 349853 298562 273561 290211
13184B90211M1234M1296K9614J6891P148J385K063Q363J4738J4003M249p003j3426
$$ 290211 331445 372741 402355 419246 426394 427779 429842 438205 452943 466946 471195 464192 450766
13171D50766j5289j3473j0036o314j048M522O628L929L925R461R776K020o623
$$ 450766 435477 422004 411968 405654 404606 409128 415756 419685 423610 433071 442847 444867 438244
13158D38244j3294j2072m860k667n141p591j3947k6673l3447k8456j9823n615
$$ 438244 424950 412878 408018 405351 400210 392619 378672 351999 318552 290096 270273 264658
13146B64658J8766L7106L7275K9144K4732K5951K3293Q741j6345m2601n5543m6978
$$ 264658 283424 320530 357805 386949 411681 437632 460925 469666 453321 410720 355177 308199
13134C08199k8130k0871l1192l9687k7058j526J5990J9269J5845K0980M0980N9212
$$ 308199 280069 259198 228006 188319 161261 159735 175725 194994 210839 231819 272799 332011
13122C32011N4896K6110j3814n1177p0620n9726l0620o220Q866K2777M3471O3905
$$ 332011 386907 413017 399203 348026 277406 217680 187060 180840 189706 212483 255954 319859
13110C19859O7625N6193M2111L0479K3900K2664K3629K4730K3990K1012K3143
$$ 319859 387484 443677 485788 516267 540167 562831 586460 611190 635180 656192 679335
13099F79335M1572Q0212J18351J25285J02871P9447P3984Q5442J10423J51890
$$ 679335 720907 801119 919470 1044755 1147626 1227073 1301057 1386499 1496922 1648812
13089A648812K03154K56051L17265L91720M70806N36784N65624N36126M48134
$$ 1648812 1851966 2108017 2425282 2817002 3287808 3824592 4390216 4926342 5374476
13080E374476L14001J40030p1274k99756m95862o13209o37585n89648n16627m60593
$$ 5374476 5688477 5828507 5757233 5457477 4961615 4348406 3710821 3121173 2604546 2143953
13070B143953m16595l45821k42690j49313r7549q2936q9306r6776q8353o5999
$$ 2143953 1727358 1381537 1138847 989534 891985 809049 719743 622967 534614 468615
13060D68615m4071k8872j3758K405L544j7707l7696l3176j2202K192J499J825
$$ 468615 424544 395672 381914 384319 387863 370156 332460 299284 287082 289274 290773 292598
13048B92598J5048L0876L8409L8201L5113L1538K9564L4929M9035O0102N6449
$$ 292598 307646 338522 376931 415132 450245 481783 511347 546276 595311 655413 711862
13037G11862L8931J7734o420l6640n6328m7038j8750N868J8794K3596K4234J7396
$$ 711862 750793 768527 762107 725467 669139 622101 603351 609219 628013 651609 675843 693239
13025F93239L445k893M742J7262K6166K7502J7860k176j7495j7717j7280k9016
$$ 693239 696684 693791 698533 715795 741961 769463 787323 785147 767652 749935 732655 703639
13013G03639l6837k4666r524j0987j9276k3139l2539m5537m5358l2180j5257k75
$$ 703639 666802 642136 632612 621625 602349 579210 546671 501134 455776 423596 408339 408064
13001D08064M208o372k0943k7817k9681l2840l2931k3290o311J0635J6586M655
$$ 408064 412272 405900 384957 357140 327459 294619 261688 238398 232087 242722 259308 263963
12989B63963k2271n3100o9490n8493k6995M134J8411J3868o54j7533l3907m4530
$$ 263963 241692 188592 119102 60609 33614 37748 56159 70027 69373 51840 17933 -26597
12977b6597m2439k6663o205J893j2011l6128m7302l5002r170J6378M0271O0780
$$ -26597 -69036 -95699 -101904 -100011 -112022 -148150 -195452 -230454 -239624 -223246 -182975 -122195
12965a22195P1080O7421M8853K2639K898n49L486M275L835L296K136K470O068
$$ -122195 -51115 16306 65159 87798 90696 90147 93633 97908 101743 105039 107175 109645 115713
12952A15713Q247K927r384k2610k7498j3894J3810L6106M3107L8095K5799J2206
$$ 115713 123960 126887 117503 94893 67395 53501 67311 103417 146524 184619 210418 222624
12940B22624N355J0211K0053J6964o058l2407m3449l9693l1342k3618j4311j390
$$ 222624 227979 238190 258243 275207 269149 236742 193293 153600 122258 98640 84329 82939
12928H2939R617R717P70k146O226J8049L1725M4318M4948L2326J0907j4704l4737
$$ 82939 92556 102273 103043 100897 107123 125172 156897 201215 246163 278489 289396 274692 239955
12915B39955l0441L878L8901M4453K4584J923o061j938J534K395L460O956J4830
$$ 239955 209514 213392 252293 296746 321330 323253 317192 315254 316788 319183 322643 329599 344429
12902C44429K2406J8689K133j6474k9612l8073m1901l5559j7033K387J6169L0318
$$ 344429 366835 385524 387657 371183 341571 303498 261597 226038 209005 211392 227561 257879
12890B57879M8727O5813P1707N9652L5181J3004l797k4122m9367o6328o3564l5627
$$ 257879 306606 372419 444126 503778 538959 551963 548166 524044 474677 408349 344785 309158
12878C09158J2791N4076O6891N9948M5147K2735M749O846J9470K5757J8785k518
$$ 309158 321949 376025 442916 502864 548011 570746 575495 582341 601811 627568 646353 643835
12866F43835l2479o3007q5491r4983r0086o4079k0379J8963L6455L0510J0786
$$ 643835 611356 548349 462858 367875 277789 213710 193331 212294 248749 279259 290045
12855B90045o659j2950j2236o290L318O209L6m507k319K978R254J3578J4708J0110
$$ 290045 283386 270436 258200 251910 255228 261437 261473 256966 254647 257625 266879 280457 295165 305275
12841C05275l461k1239l4703l5366k1085l275Q107J1860J3319J5757J3980R771
$$ 305275 301814 280575 245872 210506 189421 186146 194253 206113 219432 235189 249169 258940
12829B58940J0341J4557J6949J2963K480j0615j7406j5292p751J2532M9192Q2757
$$ 258940 269281 283838 300787 313750 316230 305615 288209 272917 265166 277698 326890 409647
12817D09647Q8553O2025K1529p251j5315j3845j4090j1480j302Q619J2446J0301
$$ 409647 498200 560225 581754 574503 559188 545343 531253 519773 518471 527090 539536 549837
12805E49837P397J2348K7276M6433N9333O4377O3651N0377K4971L478o682n112
$$ 549837 557234 569582 596858 643291 702624 767001 830652 881029 906000 909478 902796 897684
12793H97684J2407L6926M8197L8987J9912O490N540J3339K0889K3486K3132K1384
$$ 897684 910091 947017 995214 1034201 1054113 1060603 1066143 1079482 1100371 1123857 1146989 1168373
12781A168373J8681J5887J0052j403j3734k4719l2536k6601O41L7692O3059O7868
$$ 1168373 1187054 1202941 1212993 1211590 1197856 1173137 1140601 1114000 1114641 1152333 1215392 1283260
12769A283260O1302N1254L7375J9695M932K10R62j287N15K0842N7552R3948J21122
$$ 1283260 1344562 1395816 1433191 1452886 1457818 1458028 1458990 1457703 1458218 1479060 1536612 1630560 1751682
12756A751682J39965J43996J31775J26908J53640K08164K74452L47488M35650
$$ 1751682 1891647 2035643 2167418 2294326 2447966 2656130 2930582 3278070 3713720
12747C713720N44911O65828P73010Q18431P36048M90845J44961j59943l19165
$$ 3713720 4258631 4924459 5697469 6515900 7251948 7742793 7887754 7727811 7408646
12738G408646l33285k63803j74400j06363o5643l8696j6317M409J8792J8387J001
$$ 7408646 7075361 6811558 6637158 6530795 6465152 6426456 6410139 6414548 6433340 6451727 6452728
12727F452728l3952p9125j14985j21476r5834o2823n3395q2170j40824j97878
$$ 6452728 6418776 6339651 6224666 6103190 6007356 5944533 5891138 5808968 5668144 5470266
12717E470266k24118k16682j88103j49160j13247r9614j15808j57105k06619k39591
$$ 5470266 5246148 5029466 4841363 4692203 4578956 4479342 4363534 4206429 3999810 3760219
12707C760219k43739k26111k04674j95563j99671k03003j89847j57056j18638
$$ 3760219 3516480 3290369 3085695 2890132 2690461 2487458 2297611 2140555 2021917
12698B021917q9628p0454n2940l8677l3983l1261k0626q483r712k5256l8383m4604
$$ 2021917 1932289 1861835 1808895 1770218 1736235 1704974 1684348 1675865 1666153 1640897 1602514 1557910
12686A557910n3262o3671p0429p3429p3120o7671n3635l2746j7215j2302q681
$$ 1557910 1504648 1440977 1370548 1297119 1223999 1156328 1102693 1069947 1052732 1040430 1031749
12675A031749j274J891n353j5721j2846M830K1619K5568J7458Q640K447q669j9718
$$ 1031749 1030475 1032366 1027013 1011292 998446 1003276 1024895 1050463 1067921 1076561 1079008 1070339 1050621
12662A050621j7763n732Q040K1529L2874L3705J6505j3601l3516l0548j5173L199
$$ 1050621 1032858 1027126 1035166 1056695 1089569 1123274 1139779 1126178 1092662 1062114 1046941 1050140
12650A050140K0326L3563M4664N5930O2868N7905M2350K0020o832k9515l8176
$$ 1050140 1070466 1104029 1148693 1204623 1267491 1325396 1367746 1387766 1380934 1351419 1313243
12639A313243k7740n34K8281L8869K2910r332l9660n4968n1865l5872j3052J0515
$$ 1313243 1285503 1284969 1313250 1352119 1375029 1365697 1326037 1271069 1219204 1183332 1170280 1180795
12627A180795K9483M7681O6689Q1035Q9372R3985R3610P9074M9857K0887L973
$$ 1180795 1210278 1257959 1324648 1405683 1495055 1589040 1682650 1761724 1811581 1832468 1836441
12616A836441O27J1048K6293L2777K7071Q071k3270m7859m0571q736K2596M5794
$$ 1836441 1837068 1848116 1874409 1907186 1934257 1942328 1919058 1871199 1830628 1821892 1844488 1890282
12604A890282P0660R7482J10221J11270J23526J54182J85392J98091J93564J89188
$$ 1890282 1960942 2058424 2168645 2279915 2403441 2557623 2743015 2941106 3134670 3323858
12594C323858J91698J88958J61593J03556L5430j5481m3748n9106o5868o5684
$$ 3323858 3515556 3704514 3866107 3969663 4005093 3989612 3945864 3886758 3820890 3755206
12584C755206o8749q2051r5629r0529n8009p851L6088N9351P1464Q9413J17514
$$ 3755206 3686457 3604406 3508777 3418248 3360239 3352388 3388476 3447827 3519291 3608704 3726218
12573C726218J44438J54576J42980J17183Q5630N8589N3129P4648J09899J43670
$$ 3726218 3870656 4025232 4168212 4285395 4371025 4429614 4482743 4557391 4667290 4810960
12563D810960J68261J81245J86995J92680J97413J97773J95931K05053K35029
$$ 4810960 4979221 5160466 5347461 5540141 5737554 5935327 6131258 6336311 6571340
12554F571340K81025L30900L76914M16592M45941M62210M65719M63004M73560
$$ 6571340 6852365 7183265 7560179 7976771 8422712 8884922 9350641 9813645 10287205
12545A0287205N16227N98070P09647Q35448R82323J153046J312621J393697J317832
$$ 10287205 10803432 11401502 12111149 12946597 13928920 15081966 16394587 17788284 19106116
12536A9106116J089462Q56802P72268Q60853J065707J326721J613457J923186
$$ 19106116 20195578 21052380 21824648 22685501 23751208 25077929 26691386 28614572
12528B8614572K257521K629891L073985L606551M231529M980320N898055P023579
$$ 28614572 30872093 33501984 36575969 40182520 44414049 49394369 55292424 62316003
12520F2316003Q396475J0075679J2144668J4676913J7706231K1203056K4981268
$$ 62316003 70712478 80788157 92932825 107609738 125315969 146519025 171500293
12513A71500293K8520428L0791774L0262370K5350965J5514068K339771j0795552
$$ 171500293 200020721 230812495 261074865 286425830 301939898 304279669 293484117
12506B93484117k0748676k6278451k7934559k7018518k4761846k2001060j9194394
$$ 293484117 272735441 246456990 218522431 191503913 166742067 144741007 125546613
12499A25546613j6552205j4153255j2027316j0189848q639258p352991o292496
$$ 125546613 108994408 94841153 82813837 72623989 63984731 56631740 50339244
12492E0339244n410433m659306m007452l447105k970540k567585k237756j976715
$$ 50339244 44928811 40269505 36262053 32814948 29844408 27276823 25039067 23062352
12484B3062352j769774j597424j441553j302239j190095j095521r93415q75427
$$ 23062352 21292578 19695154 18253601 16951362 15761267 14665746 13672331 12796904
12476A2796904p60748o71173o13107n77330n46851n09862m60574m05092l57035
$$ 12796904 12036156 11364983 10751876 10174546 9627695 9117833 8657259 8252167 7895132
12467G895132l17626k83601k55932k32705k16330k10251k15918k28613k31046
$$ 7895132 7577506 7293905 7037973 6805268 6588938 6378687 6162769 5934156 5703110
12458E703110k14617j91889j76317j64901j60349j73659j93658j95398j77484
$$ 5703110 5488493 5296604 5120287 4955386 4795037 4621378 4427720 4232322 4054838
12449D054838j50869j17717q2818o1843o3522p3803q0233q0566p4448o1494m3489
$$ 4054838 3903969 3786252 3703434 3641591 3578069 3504266 3424033 3343467 3269019 3207525 3164036
12438C164036l0074l0475l7076k8925o96L2479N9316P8495R8922J26031J38799
$$ 3164036 3133962 3103487 3066411 3037486 3036790 3069269 3128585 3207080 3306002 3432033 3570832
12427C570832J15116N9804j2288q4409j42204j85350k12792k19555k08384j87470
$$ 3570832 3685948 3745752 3733464 3649055 3506851 3321501 3108709 2889154 2680770 2493300
12417B493300j63392j43750j35686j37264j30324j05366p7100n6489l6789j7218
$$ 2493300 2329908 2186158 2050472 1913208 1782884 1677518 1600418 1543929 1507140 1489922
12407A489922q286j4545l2282m9703n6040n9062o8922p6074p4736p1702o6354
$$ 1489922 1481636 1467091 1434809 1385106 1329066 1270004 1201082 1125008 1050272 978570 912216
12396I12216n2523l5071k1653p380J8584N1249P2069P1690N2934L1628K6237L0955
$$ 912216 859693 824622 802969 795589 814173 865422 937491 1009181 1062115 1093743 1119980 1150935
12384A150935L1209K7542K7869L1848K4672N30k0400j8551O854M2754P1751Q4741
$$ 1150935 1182144 1209686 1237555 1269403 1294075 1294605 1274205 1255654 1262508 1305262 1377013 1461754
12372A461754Q8109R2225J02001J05953R3317P0863M3042R008j8365j7883M107
$$ 1461754 1549863 1642088 1744089 1850042 1943359 2014222 2057264 2066272 2047907 2030024 2034131
12361B034131K6579M5004N8831O3098N1695K0793k1069n1956o2767o9219q5971
$$ 2034131 2060710 2105714 2164545 2227643 2279338 2300131 2279062 2227106 2164339 2095120 2009149
12350B009149j01709r3068o3033m3232n1015p1454q2648p3728n3308l3963k1838
$$ 2009149 1907440 1814372 1751339 1708107 1657092 1585638 1502990 1429262 1375954 1341991 1320153
12339A320153k3662l8043m6969l8625k3317q667P866J4827p114n2547q7188r1184
$$ 1320153 1296491 1258448 1211479 1172854 1149537 1140870 1148736 1163563 1156449 1103902 1016714 925530
12327I25530p5903o0691n8364o0492n2378l2312o383J2777J4239K212q121l682
$$ 925530 849627 788936 730572 670080 617702 585390 579007 591784 606023 608235 600114 596432
12315E96432R648J3710L181r637j0525l020j484j0380k3902l6259l9493k5783
$$ 596432 606080 619790 622971 613334 602809 599789 598305 587925 564023 527764 488271 462488
12303D62488j88K6408N1941O8483O0105L1210Q007N444J0829K501k0604m1740
$$ 462488 462300 488708 540649 609132 669237 700447 708454 713898 724727 727228 706624 664884
12291F64884m6855m0063l0981k1449j1096K664J9241L1910L6476L4949K3576j167
$$ 664884 618029 577966 546985 525536 514440 517104 536345 568255 604731 639680 663256 662089
12279F62089k7729m4628m9717m0230k0122K970K6066M4144N2805M7717K8314L372
$$ 662089 634360 589732 540015 499785 479663 482633 508699 552843 605648 653365 681679 685051
12267F85051k3828n4545p5512p9988p7880o8774m4050j2785Q411J6101K4268M8540
$$ 685051 661223 606678 531166 451178 373298 304524 260474 247689 256100 272201 296469 345009
12255C45009P5336Q0823O4085L6064N645j8402l1265l1647k1626l511K0623L7736
$$ 345009 420345 501168 565253 601317 606962 588560 557295 525648 504022 500511 521134 558870
12243E58870L5445J5014q538k0191k6041l7125n0102n6778n2957l6367o589K4357
$$ 558870 594315 609329 600791 580600 554559 517434 467332 410554 357597 321230 314641 338998
12231C38998L6920K7193P321m532M006K2590K4906Q5k7498k2133J4042M4495M6248
$$ 338998 375918 403111 410432 405900 409906 432496 457402 457487 429989 407856 421898 466393 512641
12218E12641K4337J202o27P519q30k3911l5796k6864j5103j1825o997R67J119
$$ 512641 536978 538180 537553 545072 544242 520331 484535 457671 442568 430743 423746 424713 425832
12205D25832m728k699J2988L6384N6969P1528Q2366P7565N1693J9677n465k0671
$$ 425832 421104 418405 431393 467777 524746 596274 678640 756205 807898 827575 822110 801439
12193H01439k9867m3122o3673q3260r0285p2873k9900K1474N7757O3264M1032
$$ 801439 771572 728450 664777 581517 491232 418359 388459 409933 467690 530954 571986
12182E71986J2217o370r948J194K3695N0032O7314O4261M2780J1510k2371m8816
$$ 571986 584203 577833 567885 569079 592774 642806 710120 774381 817161 828671 806300 757484
12170G57484o3769p5355q0707o8190m1198j8221j2650j9595k9570l6180l1383
$$ 757484 693715 618360 537653 469463 428265 410044 397394 377799 348229 312049 280666
12159B80666j8921p252M998J8641K7077K7065K5239L2037M4994M5733L0291J1489
$$ 280666 261745 254493 259491 278132 305209 332274 357513 389550 434544 480277 510568 522057
12147E22057j7j960O98R828K4053K6079O379k0813l7920m6039m9111m9263n5040
$$ 522057 522040 520080 520778 530606 554659 580738 587117 566304 528384 482345 433234 383971 328931
12134C28931o3048n3303k2004J1820K6861J6475q372k3506j3354Q540K1514J7851
$$ 328931 265883 212580 190576 202396 229257 245732 237360 213854 200500 209040 230554 248405
12122B48405K147j3298j8606j6391j0215K790K1162L9409N1611N5483N1248L6167
$$ 248405 250552 237254 218648 202257 192042 194832 215994 255403 307014 362497 413745 449912
12110D49912J4827M319M085m742k8752n4449o2919n4591m7005l8791j2718K2379
$$ 449912 464739 469058 473143 468401 439649 385200 322281 267690 220685 181894 169176 191555
12098A91555L4638J7841q925l6995n6762n2224k2450J2963L7996N1950M8595K1457
$$ 191555 226193 244034 235109 198114 141352 89128 66678 79641 117637 169587 218182 239639
12086B39639j9424n5788p0927o1810m1575k6917k4384k4742j7592p070K897J7234
$$ 239639 220215 164427 93500 31690 -9885 -36802 -61186 -85928 -103520 -110590 -107693 -90459
12074i0459L4612M3236L6149K0954J1969K1565M6261O1479N0075K2571R69n270
$$ -90459 -55847 -12611 23538 44492 56461 78026 124287 185766 235841 258412 259381 254111
12062B54111k168k533q415o809P733K4500K8850J7080l37j5282k9169m5410o3027
$$ 254111 251943 249410 240995 234186 241919 266419 295269 312349 312012 296730 267561 222151 159124
12049A59124o8398n6961m3808l9756m4366m9908m5970k5953K632J7829J3917M995
$$ 159124 90726 33765 -10043 -49799 -94165 -144073 -190043 -215996 -213364 -195535 -181618 -176623
12037a76623M066P511J0573J2798R156N108R078J6199J6210M582j3582k3796j8748
$$ -176623 -172557 -165046 -154473 -141675 -132519 -127411 -118333 -102134 -85924 -81342 -94924 -118720 -137468
12024a37468q248r86N741J9680M1998O0028O0280M4126K3881J396k7191n0481
$$ -137468 -145716 -146702 -140961 -121281 -79283 -19255 41025 85151 109032 110428 83237 32756
12012C2756n5095m3396k6496j0481N324J8522L0401M9308O6939O4490M3773J9481
$$ 32756 -22339 -65735 -92231 -102712 -97388 -78866 -48465 843 67782 132272 176045 195526
12000A95526j642r972j679J4277K9746L2279J7531k956j7068j8401q948J617N705
$$ 195526 193884 183912 182233 196510 226256 258535 276066 273110 256042 237641 228693 230310 236015
11987B36015L524r04k557N136J9526L0869L5858L0560J1694j4526l6121m4162
$$ 236015 239539 238635 236078 241214 260740 291609 327467 358027 369721 355195 319074 274912
11975B74912m1072l3381k3985j6737j5888k2385k7048j9928p206k159o367j1983
$$ 274912 233840 200459 176474 159737 143849 121464 94416 74488 67282 65123 58756 46773
11963D6773j3600q181j369L27M307P816o568l5362n3884m8307k3367J0581M1467
$$ 46773 33173 24992 23623 23950 28257 36073 29505 -5857 -59741 -108048 -131415 -120834 -79367
11950g9367O0306O8687O7003M9551K0774q575l3952n5638p4451q3636p0596l7333
$$ -79367 -19061 49626 116629 166180 186954 178379 144427 88789 14338 -69298 -139894 -177227
11938a77227n769O187m813l3762o0467o5131n4729m0466k1395N707L7651N5854
$$ -177227 -182996 -176809 -181622 -215384 -275851 -340982 -395711 -436177 -457572 -451865 -414214 -358360
11926c58360M9509K7712R210J0955K8621M2556M2370K8442N683r960o684P374
$$ -358360 -308851 -281139 -271929 -260974 -232353 -189797 -147427 -118985 -113302 -123262 -129946 -122572
11914a22572K2779L7988M5691L7059K0118J1960J4332J7790J5664M219j4701k5973
$$ -122572 -99793 -61805 -16114 20945 41063 53023 67355 85145 100809 105028 90327 64354
11902F4354j8786k915N732K187o309p093L097J7989K8400K7059J1587j4116l4426
$$ 64354 45568 42653 48385 50572 44263 37170 40267 58256 86656 113715 125302 111186 76760
11889G6760l3167j1696N972N407K77J552O98j3748l5170m6350m3480l6610l3516
$$ 76760 43593 31897 37869 43276 43553 45105 45803 32055 -3115 -49465 -92945 -129555 -163071
11876a63071l3734l0298j3107J8960N1825P2558P2853M5755P422q476J1218M8149
$$ -163071 -196805 -227103 -240210 -221250 -169425 -96867 -24014 21741 29163 20687 31905 80054
11864H0054P8320Q5119O8340M8314L7878K7674J0581q760k7243m5753o2097o7983
$$ 80054 158374 243493 311833 360147 398025 425699 436280 427520 400277 354524 292427 224444
11852B24444n8972m6686m4537n0664n9596o6855o9328o5657n0363k2470N546K0630
$$ 224444 165472 118786 74249 23585 -36011 -102866 -172194 -237851 -288214 -310684 -305138 -284508
11840b84508K5131K2405Q786p743j6365k6880m3540m8920k8770J6450O7232R2663
$$ -284508 -259377 -236972 -228186 -235929 -252294 -279174 -322714 -371634 -400404 -383954 -316722 -224059
11828b24059Q2175N2971L0731K4869K3442J7468J0118M435r10q030j1748n053
$$ -224059 -141884 -88913 -58182 -33313 -9871 7597 17715 22150 21240 13210 1462 -3591
11816c591J0362K5804L3300K9220K0475J8137J9402J7681R642m925k5133m9184
$$ -3591 6771 32575 65875 95095 115570 133707 153109 170790 180432 175507 150374 101190
11804A01190o9311p7377o7300m3608j9440k410R079K1305L1633K9805K0062J6882
$$ 101190 31879 -45498 -112798 -156406 -175846 -178256 -169177 -147872 -116239 -86434 -66372 -49490
11792d9490J8342Q402j4410l5442m2857l6686k3518j0184M074K1767L6556M1898
$$ -49490 -31148 -22746 -37156 -72598 -115455 -152141 -175659 -185843 -181769 -160002 -123446 -81548
11780h1548M1916M8655O5498P9592Q0311P2367N9293L7428R877j2845k5482k4195
$$ -81548 -39632 9023 74521 154113 234424 306791 366084 403512 413389 400544 375062 350867
11768C50867j0532q94q234k8879m6175m9463m3555l5087k7860k6132k8565l0241
$$ 350867 340335 339441 331207 302328 256153 206690 163135 128048 100188 74056 45491 15250
11756A5250l0467k3381m542J5267K3080K0455J7007J5705J3979J1269M210r298
$$ 15250 -15217 -38598 -43140 -27873 -4793 15662 32669 48374 62353 73622 77832 68534
11744F8534k1057k2586j0427J2597L2313L4700K2967J0316L154O85q14r186l0116
$$ 68534 47477 24891 14464 27061 59374 94074 117041 127357 130511 131196 130382 121196 91080
11731I1080n6274p0115o0902l8425j6182P392L6775O5799Q2548P0615K9322j8746
$$ 91080 34806 -35309 -96211 -134636 -150818 -143426 -106651 -40852 41696 112311 141633 122887
11719A22887n1848o1057n1039l5435k2902j0780J868J6134L0304L2811J7360n150
$$ 122887 71039 9982 -41057 -76492 -99394 -110174 -108306 -92172 -61868 -29057 -11697 -16847
11707a6847k1588k7327k2313p923J1849L0244M0565L8113K6715J1883o003k3580
$$ -16847 -38435 -65762 -88075 -95998 -84149 -53905 -13340 24773 51488 63371 57368 33788
11695C3788l8608m7842m4379l1259j8606r624m083L399J9359L7669M6970M0667
$$ 33788 -4820 -52662 -97041 -128300 -146906 -156530 -160613 -157214 -137855 -100186 -53216 -12549
11683a2549K1911N427M563J5992K7545L2547L2909L3329L2030K2440P755p126
$$ -12549 9362 14789 19352 35344 62889 95436 128345 161674 193704 216144 223899 216773
11671B16773k1532l0801l1406k8423k7900k7556k4956k1640k1739k3974k1616
$$ 216773 195241 164440 133034 104611 76711 49155 24199 2559 -19180 -43154 -64770
11660f4770n828K1186L9399L6617J7555r9m435k804r3Q233J9122K2092J5706R011
$$ -64770 -70598 -49412 -10013 26604 44159 44060 39625 36821 36728 44961 64083 86175 101881 110892
11646A10892Q332P184n96o768p088o559q102j1897k0566l2145l7199l0087j1658
$$ 110892 119224 126408 125812 119044 111956 105397 97295 85398 64832 32687 -4512 -34599 -46257
11633d6257J4713M2280N7627N1037L3099K2004J9426J1909o967k6071l9883n4807
$$ -46257 -31544 10736 68363 119400 152499 174503 193929 205838 198871 172800 132917 78110
11621G8110o6667o3413n0052m5743n2488n1836l3750p578J7518L6699M6864M6967
$$ 78110 11443 -51970 -102022 -147765 -200253 -252089 -285839 -293417 -275899 -239200 -192336 -145369
11609a45369L5200R868k0406l4594j9174J9905N9770P4119N6366K0299j7195m3239
$$ -145369 -110169 -100301 -120707 -155301 -174475 -154570 -94800 -20681 35685 55984 38789 -4450
11597d450n0575m4624l7502l0712j9918r237j454M155R285J9230L2370L9587L3439
$$ -4450 -55025 -99649 -137151 -167863 -187781 -197018 -198472 -194317 -185032 -165802 -133432 -93845 -60406
11584f0406K2069J7760J8838J3943O26n764K155J7597L3225L5191J7852l559j4915
$$ -60406 -38337 -20577 -1739 12204 12830 7066 9221 26818 60043 95234 113086 109527 94612
11571I4612j8122k4201l5392m2703l6546j2401J9910L5772K2816p314l1403l0307
$$ 94612 76490 52289 16897 -25806 -62352 -74753 -54843 -19071 3745 -3569 -34972 -65279
11559f5279o116K4581M9094N8096M3982J0986k4277m9524o1000n8097m6212l0718
$$ -65279 -71395 -46814 2280 60376 104358 115344 91067 41543 -19457 -77554 -123766 -154484
11547a54484q754J6302K8692K1024J512j7680k9278k8651j5003J109P771K447
$$ -154484 -163238 -146936 -118244 -97220 -95708 -113388 -142666 -171317 -186320 -185211 -177440 -174993
11535a74993m207L897K0465K3777J3832J1241J8980J8389N887m167n627m955o99
$$ -174993 -179200 -175303 -154838 -131061 -117229 -105988 -87008 -68619 -62732 -66899 -72526 -77481 -78180
11522g8180J7502L9454L9811J6566m145l038O117j881k2779l1369k0879n046N591
$$ -78180 -60678 -21224 18587 35153 31008 27970 34087 32206 9427 -21942 -42821 -47867 -42276
11509d2276R155j232k2005k9204j3079J0838K7666L6482L9469L3403J7380o909
$$ -42276 -33121 -34353 -56358 -85562 -98641 -87803 -60137 -23655 15814 49217 66597 59688
11497E9688l2351m0102k1523J0264L7517M8091M3721L9794M0699K9269l085l3234
$$ 59688 27337 -12765 -34288 -24024 13493 61584 105305 145099 185798 215067 211982 178748
11485A78748l6340k5882k3563k5923k5521j9187j469K3158L9246L9259K7127J0195
$$ 178748 142408 116526 92963 67040 41519 22332 20863 44021 83267 122526 149653 159848
11473A59848n542j5463k1895k5115j5340O363K8644M4492M4224J9454k4097o3287
$$ 159848 154306 138843 116948 91833 76493 82856 111500 155992 200216 219670 195573 132286
11461A32286p2951n0698j7174K174j036o923M032K1143K4718J0154j2672k8335
$$ 132286 59335 8637 -8537 -6363 -7399 -14322 -10290 10853 35571 45725 33053 4718
11449D718k4126J47K4986L5722L2408J9260k785k8660m5118m1343j7661J4544
$$ 4718 -19408 -19261 5725 41447 73855 93115 90330 61670 16552 -24791 -42452 -27908
11437b7908M3089N6184M3391J6037j849q566j3906j5027l385K2676N8250R1160
$$ -27908 15181 71365 114756 130793 128944 120378 106472 91445 88060 110736 168986 260146
11425B60146J02133Q0002L2266j6970m4061n0531m4603k6711j0199r475j9125
$$ 260146 362279 442281 474547 457577 413516 362985 318382 291671 281472 271997 252872
11414B52872k3451j9389j5789j9412k7792l6094m3612m5728l5053j3705J0698
$$ 252872 229421 210032 194243 174831 147039 110945 67333 21605 -13448 -27153 -16455
11403a6455L0642L8573L3238K6074K7291L4132L6272K4400P990K532N414K649
$$ -16455 14187 52760 85998 112072 139363 173495 209767 234167 242157 244689 250103 252752
11391B52752q248j7371j9979j3465J165J8061L5811N1063N2228L3337J450l1953
$$ 252752 244504 227133 207154 193689 194854 212915 248726 299789 352017 385354 386804 354851
11379C54851n8156o7538n5786l4272j5529q79J0843J1113l938k3843l9885m5158
$$ 354851 296695 229157 173371 139099 123570 122691 133534 144647 140709 116866 76981 31823
11367C1823l7186k3063o936J0158K5743L5292L1600K0155J2678J4960K3366K6037
$$ 31823 -5363 -28426 -35362 -25204 539 35831 67431 87586 100264 115224 138590 164627
11355A64627J6004m333k3704l1081k5589j3303O41Q408p93k2142l5564l0945j8127
$$ 164627 180631 176298 152594 121513 95924 82621 83262 91670 90877 68735 33171 2226 -15901
11342a5901j0983p745l483k85k83q43K944Q881J3643K3675M0932O0242P2069P5148
$$ -15901 -26884 -34629 -38112 -38397 -38680 -39523 -36579 -27698 -14055 9620 50552 110794 182863 258011
11328B58011P5362O9392N1192K0703j0803k5595j4698J0985L3631L5584J1112
$$ 258011 333373 402765 453957 474660 463857 438262 423564 434549 468180 503764 514876
11317E14876k3484m8079m9796l0412l689J8224K8758L0186K7846K1500J7733K4613
$$ 514876 491392 443313 393517 363105 359416 377640 406398 436584 464430 485930 503663 528276
11305E28276K9740J3912j8794m8755o8588p8387p6000o3584m8416l3340j3661
$$ 528276 558016 571928 553134 504379 435791 357404 281404 217820 169404 136064 122403
11294A22403O756J6690J3089k99j9596l4700l1693j0047J4646K8234L4712L5905
$$ 122403 129159 145849 158938 158639 139043 104343 72650 62603 77249 105483 140195 176100
11282A76100K0384r625l2810l6446k6412j4202q997j4643k1655j4001Q730K5311
$$ 176100 196484 186859 154049 117603 91191 76989 67992 53349 31694 17693 26423 51734
11270E1734K3521J8495K0959K4707K7588L4226M3182M3879K5157p840l3526l7297
$$ 51734 75255 93750 114709 139416 167004 201230 244412 288291 313448 305608 272082 234785
11258B34785k4240j0752k048Q178J6693J4246P748R627J4199Q404q224j9546j5930
$$ 234785 210545 199793 197745 205923 222616 236862 244610 254237 268436 276840 268616 249070 233140
11245B33140n318N64k911j1234j4546q309M697K0032L3377M0739L8959L5907L6534
$$ 233140 227822 228386 225475 214241 199695 191386 196083 216115 249492 290231 329190 365097 401631
11232D01631K8029O469j1487j1344K909J7878K3445J1744j3590m0304n9207o3502
$$ 401631 429660 436129 424642 413298 416207 434085 457530 469274 455684 415380 356173 292671
11220B92671n1275l1799k7338m6834p0533p4066n3256j6020K4946N1056N6255
$$ 292671 241396 209597 182259 135425 64892 -9174 -62430 -78450 -53504 -2448 53807
11209E3807M8947L4401J7710J784j1858k3676l7300m7102m8117m3623l4713j9898
$$ 53807 102754 137155 154865 156649 144791 121115 83815 36713 -11404 -55027 -89740 -109638
11197a09638o61J7211K6007K4384J7731P808k535q233n613N441J0561Q21j5630
$$ -109638 -110299 -93088 -67081 -42697 -24966 -17158 -19693 -27926 -33539 -28098 -17537 -16716 -32346
11184c2346k6178k1365o156O063J4486K7950M4968N8795O4888N7086L4414R908
$$ -32346 -58524 -79889 -86045 -79982 -65496 -37546 7422 66217 131105 188191 222605 232513
11172B32513l341o460j1671k2023k8584l3629m7781o9265p9155o7065m3733k4982
$$ 232513 229172 222712 211041 189018 160434 126805 79024 9759 -69396 -136461 -180194 -205176
11160b05176j6914k0232l1889l3678j7784j517M629L586o34l031O107L4910P5202
$$ -205176 -222090 -242322 -274211 -307889 -325673 -327190 -322561 -318975 -319609 -322640 -316533 -281623 -206421
11147b06421J01551R4812O0595J7830j6543l5656l6991j8072J7370N7342P8059
$$ -206421 -104870 -10058 50537 68367 51824 16168 -20823 -38895 -21525 35817 113876
11136A13876O1394K0457j1490j8696j3167j4513k7668l9426m1266l6323l0083
$$ 113876 175270 195727 184237 165541 152374 137861 110193 70767 29501 -6822 -36905
11125c6905k8976k9703k3756j3463p681p855j4036k2749k5582k0371j0493q795
$$ -36905 -65881 -95584 -119340 -132803 -140484 -148339 -162375 -185124 -210706 -231077 -241570 -250365
11113b50365k1433l1158k5522j0087N435J5881K0286J9141J5177J2620J4754J8813
$$ -250365 -271798 -302956 -328478 -338565 -333130 -317249 -296963 -277822 -262645 -250025 -235271 -216458
11101b16458J8445R319l726j2745j4984j1991o509l157l185M194K6222M7959M8785
$$ -216458 -198013 -188694 -192420 -205165 -220149 -232140 -238649 -241806 -244991 -240797 -214575 -166616 -117831
11088a17831L6611K8172K4062K1211J7133J4642K0104L0053L3188K1294j952k0896
$$ -117831 -81220 -53048 -28986 -7775 9358 24000 44104 74157 107345 128639 126687 105791
11076A05791k6185k1896j8606k3811l9858n7728n9786m3799k5755j5235q146m386
$$ 105791 79606 57710 39104 15293 -24565 -82293 -142079 -185878 -211633 -226868 -235014 -239400
11064b39400k407J0545L8169O7194Q0027O6731L5639R343N664K7396N6257O6050
$$ -239400 -241807 -231262 -193093 -125899 -45872 20859 56498 65841 71505 98901 155158 221208
11052B21208N2735K9172O817o856j5165k4393l6275m9891n9865o3154o3607o5730
$$ 221208 273943 303115 309932 303076 287911 263518 227243 177352 117487 54333 -9274 -75004
11040g5004o0144l6316p47L2813N6058O4470N4670L5169K1875J8111J6026R890
$$ -75004 -135148 -171464 -172211 -139398 -83340 -18870 35800 70969 92844 110955 126981 136871
11028A36871K218M803K6620N5311O4027L4491k0445o6877q8945r2750r1057r3247
$$ 136871 139089 143892 170512 225823 289850 324341 303896 237019 148074 55324 -35733 -128980
11016a28980r2919p2839l1339J3921M8676O9795P8068P1172M8927K2475J906j3184
$$ -128980 -221899 -294738 -326077 -312156 -263480 -193685 -115617 -44445 4482 26957 28863 15679
11004A5679k2649k0635r961m377j0079j3512K036K2118K0801K625j2448k2039
$$ 15679 -6970 -27605 -37566 -41943 -52022 -65534 -63498 -41380 -20579 -17954 -30402 -52441
10992e2441l0552l6241l2484j3206K1002O2252R1075R0624O4892K4866k6941p3750
$$ -52441 -82993 -119234 -151718 -164924 -143922 -81670 9405 100029 164921 189787 162846 89096
10980H9096q4943n6569j9608n859j6296l2287m1372m0513l1395j5666P222K6966
$$ 89096 4153 -52416 -72024 -77883 -94179 -126466 -167838 -208351 -239746 -255412 -248190 -221224
10968b21224K8759J7843J3054J1025P10m524L510O675n629k2717l1135k3157l859
$$ -221224 -192465 -174622 -161568 -150543 -149833 -154357 -150847 -144172 -149801 -172518 -203653 -226810 -230669
10955b30669J3013J9467J6217J0394R439P997n948l0170m8781m6841k3934J190
$$ -230669 -217656 -198189 -181972 -171578 -162139 -154142 -160090 -190260 -239041 -285882 -309816 -308626
10943c08626J5871K2191K1595J1459J663M765J3595J6596J8347K1122J6669R563
$$ -308626 -292755 -270564 -248969 -237510 -235847 -231082 -217487 -200891 -182544 -161422 -144753 -135190
10931a35190J2921K3392L0368K9564J4356r934k0617j1000n30j820j348J0239
$$ -135190 -122269 -98877 -68509 -38945 -24589 -34523 -55140 -66140 -66670 -68490 -69838 -59599
10919e9599K1856K1109J1361M306L732N751P639J2254K4457M6820O4284N4430
$$ -59599 -37743 -16634 -5273 -967 2765 8516 16155 28409 52866 99686 163970 218400
10907B18400K2220j4654m4633o0220o2924n6413m1627k1278j466R621J1386J3439
$$ 218400 240620 225966 181333 121113 58189 1776 -39851 -61129 -62595 -52974 -41588 -28149
10895b8149K4947M1106M3938K2757j1510l7929n1743n8004n5085m3986l3248k3311
$$ -28149 -3202 37904 81842 104599 93089 55160 3417 -54587 -109672 -153658 -186906 -210217
10883b10217j0516Q65R907K2300L7424M5719L8194J5697j0884k2756p362K1871
$$ -210217 -220733 -219868 -209961 -187661 -150237 -104518 -66324 -50627 -61511 -84267 -91629 -69758
10871f9758L6840K6192M486p642r114j2012k0187k8730l5181l8734l8289l1459
$$ -69758 -32918 -6726 -2240 -9882 -18996 -31008 -51195 -79925 -115106 -153840 -192129 -223588
10859b23588j9104r548q610p628J143Q775N109Q95J4015L9350N4159M7867L2699
$$ -223588 -242692 -252240 -260850 -268478 -267335 -258560 -253451 -252556 -238541 -199191 -145032 -97165 -64466
10846f4466K3004J6366R739Q508R987J0035Q494N681P593J7982K9918L4094L0716
$$ -64466 -41462 -25096 -15357 -6849 3138 13173 21667 27348 34941 52923 82841 116935 147651
10833A47651K8083K4949J0526j2716k3521j1260J1705L5066N2548M9760K3497
$$ 147651 175734 200683 211209 198493 174972 163712 175417 210483 263031 312791 336288
10822C36288p505l2010n4716p7668j01975j25509j31741j07220o3084k2034Q090
$$ 336288 328783 296773 242057 164389 62414 -63095 -194836 -302056 -365140 -387174 -379084
10811c79084K8290L2787K3491J5683J6790J8232J7127J7080K0604L1599M7456
$$ -379084 -350794 -318007 -294516 -278833 -262043 -243811 -226684 -209604 -189000 -157401 -109945
10800a09945N5299M8742L4775K6344K6786K5055J2684n217j8416k6631l5464l9832
$$ -109945 -54646 -5904 28871 55215 82001 107056 119740 114523 96107 69476 34012 -5820
10788e820k7737j41K6050L3251J8278r929l6009m3031k7058n606N616J2275J8831
$$ -5820 -33557 -33698 -7648 25603 43881 33952 -2057 -45088 -72146 -77752 -72136 -59861 -41030
10775d1030K1602K1624K1108J2283r249k9754k9452R79M0828O1941N8076L3752
$$ -41030 -19428 2196 23304 35587 26338 -3416 -32868 -31889 8939 70880 128956 162708
10763A62708J014k3949l3913k8773j3141KM513R270K2991M6570O5329O4674N2938
$$ 162708 163722 139773 105860 77087 63946 63948 68461 77731 100722 147292 212621 277295 330233
10750C30233M5134L9957L0644J6928K32k0277m0769n0088m5934l5275k4516k0363
$$ 330233 375367 415324 445968 462896 463128 442851 402082 351994 306060 270785 246269 225906
10738B25906k6239l0837k4742k0542k8171l9927m5485l9956k5271r974j903J437
$$ 225906 199667 168830 144088 123546 95375 55448 9963 -29993 -55264 -65238 -67141 -65704
10726f5704N504J0077P334j0378l3406m4710l6941j2897J6023M1635O2485P3280
$$ -65704 -60200 -50123 -42789 -53167 -86573 -131283 -168224 -181121 -165098 -123463 -60978 12302
10714A2302O6240M6571K8008J3985J33r751j0119j4473l7226o7255p9150o0883
$$ 12302 78542 125113 153121 167106 167239 157488 147369 132896 95670 28415 -50735 -111618
10702a11618k6392l673q878l1038m1763k9372j1870m038j363J495M476J3535L3693
$$ -111618 -138010 -141683 -150561 -181599 -223362 -252734 -264604 -268642 -270005 -268510 -264034 -250499 -216806
10689b16806N7871O9754N8920L9425K9730K8792L1436L6221L8553L8821L6747
$$ -216806 -158935 -89181 -30261 9164 38894 67686 99122 135343 173896 212717 249464
10678B49464K5287P455m301j3067l1507n2274n5882m3215l0038k1193j4757q589
$$ 249464 274751 282206 277905 264838 233331 181057 125175 81960 51922 30729 15972 7383
10666G383r96J698o992j7434j9623j8244j4908n162N580P147N58j520O625J5897
$$ 7383 6387 8085 1093 -16341 -35964 -54208 -69116 -74278 -68698 -61551 -60993 -62513 -55888 -39991
10652c9991J9010J4215L470j738R400L2565N3489O0320M7498K5894J1308j902
$$ -39991 -20981 -6766 -3296 -5034 4366 36931 90420 150740 198238 224132 235440 233538
10640B33538k5983n5655p1354o2530l9491j3476Q263J5813J1419O734P130J3374
$$ 233538 207555 151900 80546 18016 -21475 -34951 -26688 -10875 544 7278 14408 27782
10628B7782J8124J5107J4445J6169J0080M254Q574J8499K2278J2411L712J4159
$$ 27782 45906 61013 75458 91627 101707 105961 114535 133034 155312 167723 171435 185594
10616A85594L1675K8415J531k7796m1067k8212J401K5651L7984M1428L7930K9159
$$ 185594 217269 245684 247215 219419 178352 150140 151541 177192 215176 256604 294534 323693
10604C23693J8565J0307M458m854k4968n1690o3164m4001j2215O102J4015K6046
$$ 323693 342258 352565 357023 352169 327201 275511 212347 168346 156131 162233 176248 202294
10592B02294L6292L6674L5764M3632N5173N1116K1615k3341o6034r2330j00157
$$ 202294 238586 275260 311024 354656 409829 460945 482560 459219 393185 300855 200698
10581B00698r0779o9663m8909l5934k7178j3694L865J4683K0703L3723N0580N9587
$$ 200698 109919 40256 -8653 -44587 -71765 -85459 -81594 -66911 -46208 -12485 38095 97682
10569I7682N5922M3186K7893Q708j5734l8309n9449q1175q8667p1588m1147j3315
$$ 97682 153604 196790 224683 233391 217657 179348 119899 38724 -49943 -121531 -162678 -175993
10557a75993Q682K9891M7690N2188L7722J0024j1591j5397p506L171R478L613
$$ -175993 -167311 -137420 -89730 -37542 180 10204 -1387 -16784 -24290 -21119 -11641 -8028
10545h028j1732j8313r507L238J1857R586j805q490o224j733J953K064j235o288
$$ -8028 -19760 -38073 -47580 -44342 -32485 -22899 -24704 -33194 -39418 -41151 -39198 -37134 -38369 -44657
10531d4657j5877k4813k6268k0449q272Q950K2965K6900J9158J643j9996m0975
$$ -44657 -60534 -85347 -111615 -132064 -140336 -131386 -108421 -81521 -62363 -60720 -80716 -121691
10519a21691n9101p5673q1283o4952l8210j8697n488J3562L8664N5284N5180M6293
$$ -121691 -180792 -256465 -337748 -402700 -440910 -459607 -465095 -451533 -412869 -357585 -302405 -256112
10507b56112M0003M0306M1910L8767K9119J1498r172k2352j9413k392J1139O127
$$ -256112 -216109 -175803 -133893 -95126 -66007 -54509 -63681 -86033 -105446 -107838 -96699 -90572
10495i0572o981o091J8067O0278J00078J09784Q4897M6402J6313O569J1828J7621
$$ -90572 -97553 -103644 -85577 -25299 74779 184563 269460 315862 332175 338744 350572 368193
10483C68193J2000o517k4229k8453k5658k7707l6246m7424n0923l8889k0196n998
$$ 368193 380193 373676 349447 320994 295336 267629 231383 183959 133036 94147 73951 67953
10471F7953J06k265j4511k9607l1537j6741N524K2299K2522M211j8607k1368J022
$$ 67953 68059 65794 51283 21676 -9861 -26602 -21078 1221 23743 27954 9347 -12021 -10999
10458a0999L1356N3111N5068L4019O093p216o615l950m114o047o379k207P371
$$ -10999 20357 73468 128536 162555 168648 161432 154817 150867 146753 140706 134327 132120 139491
10445A39491J9197K6844K1793M890j3898k9610l4013k4622j8602k8720m2999m6455
$$ 139491 158688 185532 207325 212215 198317 168707 134694 110072 91470 62750 19751 -26704
10433b6704l7149j9043r99J0414J9380K4888J6497l817k1138k6797k1365j5743
$$ -26704 -63853 -82896 -83895 -73481 -54101 -29213 -12716 -16533 -37671 -64468 -85833 -101576
10421a01576k4390m5461o0968n4195l1252j2870n020J72J0973K6225L9399N0327
$$ -101576 -125966 -171427 -232395 -286590 -317842 -330712 -335732 -335560 -324587 -298362 -258963 -208636
10409b08636N8237O1492O0763N7931N4533M8268L7367K0908j609k8556n6218p6723
$$ -208636 -150399 -88907 -28144 29787 84320 132588 169955 190863 189254 160698 104480 27757
10397B7757q4340p7917o1537m4999l2096j3041J3289L2019L3058J9395L851k032
$$ 27757 -56583 -134500 -196037 -241036 -273132 -286173 -272884 -240865 -207807 -188412 -184561 -186593
10385a86593J717R687J9226L5542N9929P3269N7280K1280j7286m5727n1210k8172
$$ -186593 -184876 -175189 -155963 -120421 -60492 12777 70057 91337 74051 28324 -22886 -51058
10373e1058J0594L9473M7378L6613J0819j9412l3775k3751o061m445j9933l4435
$$ -51058 -40464 -991 46387 83000 93819 74407 40632 16881 10820 6375 -13558 -47993
10361d7993l7967l1584k4274j9557q304J1451K8644L5492L7879M6502O2697P5208
$$ -47993 -85960 -117544 -141818 -161375 -169679 -158228 -129584 -94092 -56213 -9711 52986 128194
10349A28194P0076M9609K5043N640J39Q262K1855L6453M7536M7636K9635n202
$$ 128194 198270 247879 272922 278562 278701 286963 308818 345271 392807 440443 470078 464876
10337D64876l9250n9379p1126p5502o5698m2901j2903J7935L4910L1793J5965
$$ 464876 425626 366247 295121 219619 153921 111020 98117 116052 150962 182755 198720
10326A98720l285j4984j5664j4204j9961l4584m9305n1766l8932k0993r436m537
$$ 198720 195435 180451 164787 150583 130622 96038 46733 -5033 -43965 -64958 -74394 -78931
10314g8931m234r265j6439j9305j7925j7146k3712l4337k7558K581K8761L3015
$$ -78931 -83165 -92430 -108869 -128174 -146099 -163245 -186957 -221294 -248852 -246271 -217510 -184495
10302a84495K4019J4755J6025K7018L4469L6340M0053M5251M7162M3324L6106
$$ -184495 -160476 -145721 -129696 -102678 -68209 -31869 8184 53435 100597 143921 180027
10291A80027L1918K9768K6423J8013l023l7865p6301j00174r6604p1620m0411
$$ 180027 211945 241713 268136 286149 283126 245261 168960 68786 -27818 -99438 -139849
10280a39849j6561p169r070j6075j7339l556K2409N0556O7999O3281L7632N258
$$ -139849 -156410 -163579 -172649 -188724 -206063 -209619 -187210 -136654 -68655 -5374 32258 37516
10268C7516k0919l4788l3820j8163L734J2966k934k2970j5015K1033N3962N5833
$$ 37516 16597 -18191 -52011 -70174 -66440 -53474 -56408 -79378 -94393 -73360 -19398 36435
10256C6435L1112J528k0777l6125m5049m2846k7934o499J4527L0273L4281K2812
$$ 36435 67547 69075 48298 12173 -32876 -75722 -103656 -110155 -95628 -65355 -31074 -8262
10244h262K516j6745k9858l5721l7288l7083l6949m0685m6453m5338l5723k5421
$$ -8262 -5746 -22491 -52349 -88070 -125358 -162441 -199390 -240075 -286528 -331866 -367589 -393010
10232c93010k2227k3987j7355J477J9589L1234M1352M8379M9720N1095N7517O8416
$$ -393010 -415237 -439224 -456579 -455102 -435513 -404279 -362927 -314548 -264828 -213733 -156216 -87800
10220h7800P6584O8796L9729L394k2282k9267j6686M689J2983l371l3733o1974
$$ -87800 -11216 57580 97309 100703 78421 49154 32468 37157 50140 46769 13036 -48938
10208d8938p6054p4856o9959o2687m3659j6138J0364L7239O4175P7775P5209O8663
$$ -48938 -124992 -199848 -269807 -332494 -376153 -392291 -381927 -344688 -280513 -202738 -127529 -58866
10196e8866O0727M9289M0897M4814N9412P4541Q3899Q4173O8635K8010k8014p0567
$$ -58866 1861 51150 92047 136861 196273 270814 354713 438886 507521 535531 507517 436950
10184D36950q7768q5700o5227l4588j3132j1036k8133n3444o3433n3977m2132
$$ 436950 349182 263482 198255 163667 150535 139499 111366 57922 -5511 -59488 -101620
10173a01620l7973l5764k9927k5817k6680k3960j2033L707J6782K4472K8231K3852
$$ -101620 -139593 -175357 -205284 -231101 -257781 -281741 -293774 -290067 -273285 -248813 -220582 -196730
10161a96730J0301J8K281J3460K2955K3314K0573K4382L3160L9712L4222J7520
$$ -196730 -186429 -186411 -184130 -170670 -147715 -124401 -103828 -79446 -46286 -6574 27648 45168
10149D5168P231P982R709O985j26o170j0707j6781j7914j3427j2862j4496q482
$$ 45168 52399 60381 70090 77075 76949 70779 60072 43291 25377 11950 -912 -15408 -23890
10136b3890K771Q484Q239Q360O922j707j4313j8117m631J8953L7588M1987L2623
$$ -23890 -21119 -12635 -4396 3964 10886 9179 -5134 -23251 -27882 -8929 28659 70646 103269
10123A03269J3852r191k8376l7455l9070l5241k1021M91J4300J7102J6319J6915
$$ 103269 117121 107930 79554 42099 3029 -32212 -53233 -52742 -38442 -21340 -5021 11894
10111A1894K3049K8119K1377Q743M661J6487L8608M8575L1273J800j6219j6470
$$ 11894 34943 63062 84439 93182 97843 114330 152938 201513 232786 234586 218367 201897
10099B01897p413n166j3661j9951k2238k8179k5152p776L653N41p647r772o023
$$ 201897 194484 189318 175657 155706 133468 105289 80137 72361 76014 76555 68908 59136 53113
10086E3113m329q816j4897j9173k6633l3896k9382q110K1804M7283N9863N4469
$$ 53113 48784 39968 25071 5898 -20735 -54631 -84013 -92123 -70319 -23036 36827 91296
10074I1296L1578J136k4026l8870n5606q2620j01788r5665p0326l6302N779M9794
$$ 91296 122874 124010 99984 61114 5508 -77112 -178900 -274565 -344891 -381193 -375414 -325620
10062c25620P6845P6657N8492L7120K3247J5720Q270K021k08m476j8939l5277
$$ -325620 -248775 -172118 -113626 -76506 -53259 -37539 -29269 -27248 -27456 -31932 -50871 -86148
10050h6148l7344k9772k9202l1568k2601r779m761j973L667J2881K4829L9934
$$ -86148 -123492 -153264 -182466 -214034 -236635 -246414 -251175 -253148 -249481 -236600 -211771 -171837
10038a71837N4109O1696O8052P4870P1299M9848J5060k0665m4671m9835m0585
$$ -171837 -117728 -56032 12020 86890 158189 208037 223097 202432 157761 107926 67341
10027F7341k2405P61J6105J0344j2234l2954l8082k6952q510N431N937K739Q942
$$ 67341 44936 45697 61802 72146 59912 26958 -11124 -38076 -46586 -41155 -35218 -32479 -23537
10014b3537J9025K3728K2713J9367J4466R621J835j6151l6667m3974l4198j1055
$$ -23537 -4512 19216 41929 61296 75762 85383 87218 71067 34400 -9574 -43772 -54827
10002e4827K0120M4839M4839J6247k6163n3434m6957j3435K7330N6241O4605N2686
$$ -54827 -34707 10132 54971 71218 45055 -8379 -55336 -68771 -41441 14800 79405 132091
9990A32091L2692J7081O012j0496l5623n2232n1347m2699l7978m0851m6554m3913
$$ 132091 164783 181864 187876 177380 141757 89525 38178 -4521 -42499 -83350 -129904 -173817
9978a73817l1938k3405k3474l2879n4423q0303q6298n9243j6938J5796L5110N5566
$$ -173817 -205755 -229160 -252634 -285513 -339936 -420239 -506537 -565780 -582718 -566922 -531812 -476246
9966d76246P7301P9803N6043K7601J4883J2469R094O058J2272K9414M6713N3350
$$ -476246 -398945 -319142 -263099 -235498 -220615 -208146 -199052 -192994 -180722 -151308 -104595 -51245
9954e1245N0534M8045M5851L7564K6865J4785l515k7539n6288p8547p1701l0023
$$ -51245 -711 47334 93185 130749 157614 172399 168884 141345 85057 6510 -65191 -95214
9942i5214J7498L5566K1580j841j4244j1508m061K051Q018R427J670j2193j8170
$$ -95214 -77716 -42150 -20570 -22411 -36655 -48163 -52224 -50173 -42155 -32728 -31058 -43251 -61421
9929f1421k951K2319L6241L2085J1592j6816m0692m9199l2738N736N2796Q8825
$$ -61421 -64372 -42053 -5812 26273 37865 21049 -19643 -68842 -101580 -95844 -43048 45777
9917D5777R5793P6690N6032M7195L4168P875j6786k1041k737K2094L1820J5080
$$ 45777 141570 218260 274292 321487 355655 363530 346744 325703 322966 345060 376880 391960
9905C91960k0991n7433p6624p5874o3914m6325k7184q167Q832K0087K7837L6967
$$ 391960 370969 313536 236912 161038 97124 50799 23615 15448 24280 44367 72204 109171
9893A09171M7939N1905L2594o478l8463n0656n2355n1416m4551k7431q690l937
$$ 109171 157110 209015 241609 235131 196668 146012 93657 42241 -2310 -29741 -38431 -42368
9881d2368j8246l6014m2843l8982k4793m283J2185J6768R843p687l3733n1825
$$ -42368 -60614 -96628 -139471 -178453 -203246 -207529 -195344 -178576 -168733 -176420 -210153 -261978
9869b61978n1584l9969k3327j258K3971M4398M9152L5751J9263J5382J7701J0863
$$ -261978 -313562 -353531 -376858 -378116 -354145 -309747 -260595 -224844 -205581 -190199 -172498 -161635
9857a61635l943j6264j4595P93R519k744k1555k3629n321J4081K1295K3146J7633
$$ -161635 -165578 -181842 -196437 -195644 -186125 -188869 -210424 -234053 -239374 -225293 -203998 -180852 -163219
9844a63219K482k203J1060K0621J5207L688q407j4842p915N215J0539R071N429
$$ -163219 -160737 -162940 -151880 -131259 -116052 -112364 -120771 -135613 -143528 -138313 -127774 -118703 -113274
9831a13274m403j7484k2981k3863k8529k5639p297J5057K9126L1906K6912K1281
$$ -113274 -117677 -135161 -158142 -182005 -210534 -236173 -243470 -228413 -199287 -167381 -140469 -119188
9819a19188J9821K1859K2911K1110J3063k280j7773k5811k0609n976J533q058
$$ -119188 -99367 -77508 -54597 -33487 -20424 -22704 -40477 -66288 -86897 -92873 -91340 -99398
9807i9398k3376k5803o439K8072N4177N0592J9456j8727l7096k1457J4674M8245
$$ -99398 -122774 -148577 -155016 -126944 -72767 -22175 -2719 -21446 -58542 -79999 -65325 -17080
9795a7080O4413O2741M7271J9543j2102l0921k6697j1877l808j355L131N919J303
$$ -17080 47333 110074 157345 176888 164786 133865 107168 95291 91483 90128 93259 99178 100481
9782A00481m501m294L332J3723J6673J0947O836P893Q869L830l611L40J9169M5257
$$ 100481 95980 91686 95018 108741 125414 136361 143197 151090 159959 163789 160178 160518 179687 224944
9768B24944O2821N1517J1075l5529o9412q0834o7913l4795O571L2457K9200N256
$$ 224944 287765 339282 350357 314828 245416 164582 96669 61874 68445 100902 130102 135358
9756A35358j9910l5831m9120o4127p0279n7169l3485r739J3941L0593L5867L7327
$$ 135358 115448 79617 30497 -33630 -103909 -161078 -194563 -204302 -190361 -159768 -123901 -86574
9744h6574L9832M4419M7988M4577L3232K3807K5175K6261J5763M937O996J2525
$$ -86574 -46742 -2323 45665 90242 123474 147281 172456 198717 214480 219417 226413 238938
9732B38938O720p135j7840j9975j5830p685K699J5610L2113L0358m561m8764p6335
$$ 238938 245658 238523 220683 200708 184878 177193 179892 195502 227615 257973 253412 204648 128313
9719A28313q5009p4964m7879j7761P386K6666M0923M6014L4855J7849O782l225
$$ 128313 43304 -31660 -79539 -97300 -89914 -63248 -22325 23689 58544 76393 83175 79950
9707G9950j2742j7571k3682l5344m4030m1407l2445k8175j9765M491K8250L3579
$$ 79950 67208 49637 25955 -9389 -53419 -94826 -127271 -155446 -175211 -170720 -142470 -108891
9695a08891K6705J4871j022j2911j2793j950R990Q069j2232l6177m9246m9289
$$ -108891 -82186 -67315 -68337 -81248 -94041 -95991 -86001 -77932 -90164 -126341 -175587 -224876
9683b24876l8251j8865K489J2234j471k9410m8963m6768j8508K6233O2746P6794
$$ -224876 -263127 -281992 -279503 -267269 -268740 -298150 -347113 -393881 -412389 -386156 -323410 -246616
9671b46616P4705O5119M8144K6816J2532N551j940j1091k1872l4454m4135m7353
$$ -246616 -171911 -106792 -58648 -31832 -19300 -13749 -15689 -26780 -48652 -83106 -127241 -174594
9659a74594m3645l2231j0901J0942J8686K2879L5069M2044K8264k881l2560m5394
$$ -174594 -218239 -250470 -261371 -250429 -231743 -208864 -173795 -131751 -103487 -106368 -138928 -184322
9647a84322m0061k7320j4700M85J5960K2838K0563J5597Q140q811l2283m4237
$$ -184322 -224383 -251703 -266403 -265918 -249958 -227120 -206557 -190960 -182820 -191631 -223914 -268151
9635b68151l1519o075J1193J7438J9319K1437L0355M5783N9030O3236N9514N5047
$$ -268151 -299670 -305745 -294552 -277114 -257795 -236358 -206003 -160220 -101190 -37954 21560 76607
9623G6607M6659K8661N832j6773l9500n9619p5048q3063p8744o6100n6800n3590
$$ 76607 123266 151927 157759 140986 101486 41867 -33181 -116244 -194988 -261088 -317888 -371478
9611c71478m9017l8980j6589K1180N3358N8870M8295M4224N0691N6180N1963L6663
$$ -371478 -420495 -459475 -476064 -454884 -401526 -342656 -294361 -250137 -199446 -143266 -91303 -54640
9599e4640J4548m496o854R103K8836M0496M0144K5923R98j9832j9743p807l580
$$ -54640 -40092 -44588 -51442 -42339 -13503 26993 67137 93060 94058 74226 54483 46676 43096
9586D3096n936m063L724J3376K4879L1697J9716q456l3630m5492m5965m1048l6007
$$ 43096 37160 33097 36821 50197 75076 106773 126489 118033 84403 38911 -7054 -48102 -84109
9573h4109l4298l7716m5788m9793l5953j1619M557R188P956P451J2732K1751K7269
$$ -84109 -118407 -156123 -201911 -251704 -287657 -299276 -294719 -285531 -277575 -270124 -257392 -235641 -208372
9560b08372K3595J7540J7805K3018K7103K3120J0364l023l977J0697K8038L4202
$$ -208372 -184777 -167237 -149432 -126414 -99311 -76191 -65827 -68850 -72827 -62130 -34092 110
9548A10K7582J6252N055l079n181l042K183N574k656k2341m3591n2875m2270k2348
$$ 110 27692 43944 48999 45920 40739 37697 39880 45454 42798 20457 -23134 -76009 -118279 -140627
9534a40627q816p68M884N941Q352J4282K3222L8451N2140M8441K2793j7424n3885
$$ -140627 -149443 -150211 -145327 -139386 -131034 -116752 -93530 -55079 -2939 45502 68295 50871 -3014
9521c014o2266l6361M748L7520M0962J3542j7723k6032r710M120q874l6211m9729
$$ -3014 -65280 -101641 -96893 -59373 -18411 -4869 -22592 -48624 -58334 -54214 -63088 -99299 -149028
9508a49028l8449j3154Q375K0000K4129J9390N772q355m448K4745N3580N2691
$$ -149028 -187477 -200631 -192256 -172256 -148127 -128737 -122965 -131320 -135768 -111023 -57443 -4752
9496d752L1399K2093K9874K3490j1543m9931o3580m8457j9275P952L0772N1289
$$ -4752 26647 48740 78614 102104 90561 40630 -22950 -71407 -90682 -82730 -51958 -669
9484f69O5291O5965M6529R594k1128k4856j9006l0829n4381o5871n6983l2482
$$ -669 64622 130587 177116 186710 165582 140726 121720 90891 36510 -29361 -86344 -118826
9472a18826j370J7856J7954J1546J2344K2949L2287L2248L0670K9714K2765M815
$$ -118826 -120196 -102340 -84386 -72840 -60496 -37547 -5260 26988 57658 87372 110137 114952
9460A14952k1672m4601n2272m3122k4537m542J0052J9036K6184L1524L5761L4761
$$ 114952 93280 48679 -3593 -46715 -71252 -75794 -65742 -46706 -20522 11002 46763 81524
9448H1524K0465l44j0820j2189k1940l9939m7122l3929o361J8317K3459J4386
$$ 81524 101989 101645 90825 78636 56696 16757 -30365 -64294 -70655 -52338 -28879 -14493
9436a4493R000J6305K8527K7900Q724j4323k7660l6093m4336m4287k8969m912
$$ -14493 -5493 10812 39339 67239 75963 61640 33980 -2113 -46449 -90736 -119705 -124617
9424a24617J5222K9130L8660M1710L5864K4576J1238j0148l5403m4242k8590l077
$$ -124617 -109395 -80265 -41605 105 35969 60545 71783 61635 26232 -18010 -46600 -49677
9412d9677J6037K2401J2450r966k7068k8212j5809K924J6658J3004p873k8903
$$ -49677 -33640 -11239 1211 -8755 -35823 -64035 -79844 -76920 -60262 -47258 -55131 -84034
9400h4034l6431l6360l4852k5366j1774q943j7272j8902l644J1600J0737Q254
$$ -84034 -120465 -156825 -191677 -217043 -228817 -237760 -255032 -273934 -277578 -265978 -255241 -246987
9388b46987J4144J5320M181r584j6120j8331k2404k1334n582J6737K4425J2861
$$ -246987 -232843 -217523 -213342 -222926 -239046 -257377 -279781 -301115 -306697 -289960 -265535 -252674
9376b52674P55l2R770K6027L4394K2173l191k2390k5977j1567J6559M0184M3558
$$ -252674 -251919 -251951 -242181 -216154 -181760 -159587 -162778 -185168 -211145 -222712 -206153 -165969 -122411
9363a22411L2268J8033O221p72k127R57Q339J7505K1554J5940l913l1754n2100
$$ -122411 -90143 -72110 -65889 -66661 -68788 -67831 -59492 -41987 -20433 -4493 -8406 -40160 -92260
9350i2260o1311o1097m9711k8532n519J2226J9780J6822R030J49m600K610K4781
$$ -92260 -153571 -214668 -264379 -292911 -298430 -286204 -266424 -249602 -240572 -240423 -245023 -242413 -217632
9337b17632N0192N8357M0000J838l6360m8666k6201J4722N1073O7546O4972N2156
$$ -217632 -167440 -109083 -69083 -67245 -103605 -152271 -178472 -163750 -112677 -45131 19841 71997
9325G1997L7522K5667J5851O746j408j292J4484L9516N6745N4363L4291Q538j0796
$$ 71997 109519 135186 151037 157783 156375 155083 169567 209083 265828 320191 354482 363020 352224
9312C52224k0002k4675k8625l1095l3697m0820n0532m9323k9917Q47L0195M8249
$$ 352224 332222 307547 278922 247827 214130 173310 122778 73455 43538 44385 74580 122829
9300A22829N6828N7264M1817J5938l438j0058j3223k1969k9315k4473j1067o59
$$ 122829 179657 236921 278738 294676 291238 281180 267957 245988 216673 192200 181133 180474
9288A80474o037k9353m9452n3812n5340o0146o3240o0158n1972m2050k9763j5294
$$ 180474 174437 145084 95632 41820 -13520 -73666 -136906 -197064 -249036 -291086 -320849 -336143
9276c36143k373O456J2437R926n914k3428k9194k4945j5470j516J3612K2659K4024
$$ -336143 -338516 -332060 -319623 -309697 -315611 -339039 -368233 -393178 -408648 -410164 -396552 -373893 -349869
9263c49869K5474K8897K6542J6158O454J725j402l478m421l630N822K6914N4386
$$ -349869 -324395 -295498 -268956 -252798 -246344 -244619 -246021 -249499 -253920 -257550 -251728 -224814 -170428
9250a70428P6372P8143N7888K9051O092m371j182R242J3743J38k7437m5376m1001
$$ -170428 -94056 -15913 41975 71026 77118 72747 71565 80807 94550 94688 67251 21875 -19126
9237a9126k9982k8760l3550l5664l2363j6045J5948M8229N9992M6768K7011J5566
$$ -19126 -49108 -77868 -111418 -147082 -179445 -195490 -179542 -131313 -71321 -24553 2458 18024
9225A8024J2627J8696K8207K7317J5436O590O953R698O100n479j4527j3560r096
$$ 18024 30651 49347 77554 104871 120307 126897 133850 143548 149648 144169 129642 116082 106986
9212A06986j021J4002K7561K5769O908r788q973p10m634k1903l8746m8596n0737
$$ 106986 105965 119967 147528 173297 180205 170417 161444 160734 156100 134197 95451 46855 -3882
9199c882m4222k8757n805J6431K2172P769j4393l6431n1822n6646n7836n5768
$$ -3882 -48104 -76861 -82666 -66235 -44063 -36294 -50687 -87118 -138940 -195586 -253422 -309190
9187c09190l8852r270J4290K0954J7650J5588J7269J5293R014J4708L3023M1201
$$ -309190 -348042 -357312 -343022 -322068 -304418 -288830 -271561 -256268 -247254 -232546 -199523 -158322
9175a58322K6741J234j1638m997P929J7904K0906J5381J200j9771l9173m7259
$$ -158322 -131581 -130347 -141985 -146982 -139053 -121149 -100243 -84862 -83662 -103433 -142606 -189865
9163a89865l8266j9451m417L595L197l333m041J4288M5452O9918P9323O9844M2566
$$ -189865 -228131 -247582 -251999 -248404 -245207 -248540 -252581 -238293 -192841 -122923 -43600 26244 68810
9150F8810J2592r521k4857l0650k7853k4819k7648l5171l6502k1498L87J1130
$$ 68810 81402 71881 47024 16374 -11479 -36298 -63946 -99117 -135619 -157117 -156730 -145600
9138a45600Q481P347K2332M7828O2627N4472L3290J5398j658k1849k8298r142
$$ -145600 -137119 -129772 -107440 -59612 3015 57487 90777 106175 104517 82668 54370 45228
9126D5228K1830L7345K3369p519l2128l7263k6072o307K0658M4774M8936L8084
$$ 45228 67058 104403 127772 120253 88125 50862 24790 18483 39141 83915 132851 170935
$$ [...]
##END NTUPLES=NMR SPECTRUM
##END=
