##TITLE=31P ikalashn
107-2024
11.12.2024
##JCAMPDX= 6.0         $$ Bruker NMR JCAMP-DX V2.0
##DATA TYPE= NMR SPECTRUM
##DATA CLASS= NTUPLES
##ORIGIN= UXNMR, Bruker Analytische Messtechnik GmbH
##OWNER= root
$$ TOPSPIN		Version 1.3
$$ 2024-12-11 11:19:27.031 +0400  Irina@DPX200
$$ Compression mode = diff/dup
##.OBSERVE FREQUENCY= 81.01967998063
##.OBSERVE NUCLEUS= ^31P
##.ACQUISITION MODE= SIMULTANEOUS
##.ACQUISITION SCHEME= undefined
##.AVERAGES= 32
##.DIGITISER RES= 17
##SPECTROMETER/DATA SYSTEM= spect
##.PULSE SEQUENCE= zgpg
##.SOLVENT NAME= DMSO
##.SHIFT REFERENCE= INTERNAL, DMSO, 1, 298.5841
##AUDIT TRAIL= $$ (NUMBER, WHEN, WHO, WHERE, WHAT)
$$ ##TITLE= Audit trail, TOPSPIN		Version 1.3
$$ ##JCAMPDX= 5.01
$$ ##ORIGIN= Bruker BioSpin GmbH
$$ ##OWNER= Irina
$$ $$ F:/spectra/data/iren/nmr/P31dec/1/pdata/1/auditp.txt
$$ ##AUDIT TRAIL=  $$ (NUMBER, WHEN, WHO, WHERE, VERSION, WHAT)
(   1,<2024-12-11 11:18:09.578 +0400>,<Irina>,<DPX200>,<TOPSPIN 1.3>,
      <acquisition in progress>)
(   2,<2024-12-11 11:19:03.593 +0400>,<Irina>,<DPX200>,<TOPSPIN 1.3>,
      <Start of raw data processing
       efp BC_mod = 2 LB = 8 FT_mod = 6 PKNL = 1 PHC0 = 166.2636 PHC1 = 223.8461 SI = 32K 
       data hash MD5: 32K
       D4 2B 1C F8 41 69 81 1E D8 53 3C 89 37 E2 0D F3>)
(   3,<2024-12-11 11:19:05.984 +0400>,<Irina>,<DPX200>,<TOPSPIN 1.3>,
      <apk 
       data hash MD5: 32K
       18 DC 31 F8 E7 D6 C2 12 0A 88 42 52 05 51 ED AB>)
(   4,<2024-12-11 11:19:12.218 +0400>,<Irina>,<DPX200>,<TOPSPIN 1.3>,
      <pk fgphup PHC0 = 5 PHC1 = 0 
       data hash MD5: 32K
       35 66 2C 95 DD 44 19 66 0F 2E B6 1B 6A AA D6 21>)
(   5,<2024-12-11 11:19:14.171 +0400>,<Irina>,<DPX200>,<TOPSPIN 1.3>,
      <abs n ABSG = 5 
       data hash MD5: 32K
       48 D8 E8 C9 85 48 D5 78 BA 38 AE F1 3F 6D D7 70>)
$$ ##END=
$$ 
$$ $$ hash MD5
$$ $$ 67 EE 59 68 E4 82 17 93 EE 4D 57 05 03 89 70 D0
##$RELAX= 
##$RELAX= 
##$RELAX= 
##$RELAX= 
##$RELAX= 
##$RELAX= 
##$RELAX= 
##$RELAX= 
##$RELAX= 
##$RELAX= 
##$RELAX= 
$$ Bruker specific parameters
$$ --------------------------
##$DU= <F:/spectra>
##$EXPNO= 1
##$NAME= <P31dec>
##$PROCNO= 1
##$TYPE= <nmr>
##$USER= <iren>
##$AMP= (0..31)
100 100 100 100 100 100 100 100 100 100 100 100 100 100 100 100 100 100 
100 100 100 100 100 100 100 100 100 100 100 100 100 100 
##$ANAVPT= -1
##$AQSEQ= 0
##$AQ_mod= 1
##$AUNM= <au_zg>
##$AUTOPOS= <>
##$BF1= 81.014009
##$BF2= 200.13
##$BF3= 200.13
##$BF4= 200.13
##$BF5= 200.13
##$BF6= 200.13
##$BF7= 200.13
##$BF8= 200.13
##$BYTORDA= 1
##$CFDGTYP= 0
##$CFRGTYP= 5
##$CHEMSTR= <none>
##$CNST= (0..63)
1 1 145 1 1 1 1 1 1 1 1 1 1 1 1 1 1 1 1 1 1 1 1 1 1 1 1 1 1 1 1 1 1 1 
1 1 1 1 1 1 1 1 1 1 1 1 1 1 1 1 1 1 1 1 1 1 1 1 1 1 1 1 1 1 
##$CPDPRG= <waltz16>
##$CPDPRG1= <>
##$CPDPRG2= <waltz16>
##$CPDPRG3= <>
##$CPDPRG4= <mlev>
##$CPDPRG5= <mlev>
##$CPDPRG6= <mlev>
##$CPDPRG7= <mlev>
##$CPDPRG8= <mlev>
##$CPDPRGB= <>
##$CPDPRGT= <>
##$D= (0..63)
0 1 0 0 0 0 0 0 0 0.06 0 0.03 2e-005 3e-006 0 0 0.0002 0 0 0 0 0 0 0 0 
$$ [...]
##$SW_h= 37037.037037037
##$TD= 32768
##$TD0= 1
##$TE= 300
##$TE2= 300
##$TE3= 300
##$TEG= 300
##$TL= (0..7)
0 120 53 12 22 120 120 120 
##$TP= (0..7)
150 150 150 150 150 150 150 150 
##$TP07= 0
##$TPNAME0= <>
##$TPNAME1= <>
##$TPNAME2= <>
##$TPNAME3= <>
##$TPNAME4= <>
##$TPNAME5= <>
##$TPNAME6= <>
##$TPNAME7= <>
##$TPOAL= (0..7)
0.5 0.5 0.5 0.5 0.5 0.5 0.5 0.5 
##$TPOFFS= (0..7)
0 0 0 0 0 0 0 0 
##$TUNHIN= 0
##$TUNHOUT= 0
##$TUNXOUT= 0
##$USERA1= <user>
##$USERA2= <user>
##$USERA3= <user>
##$USERA4= <user>
##$USERA5= <user>
##$V9= 5
##$VALIST= <valist>
##$VCLIST= <CCCCCCCCCCCCCCC>
##$VD= 0
##$VDLIST= <DDDDDDDDDDDDDDD>
##$VPLIST= <PPPPPPPPPPPPPPP>
##$VTLIST= <TTTTTTTTTTTTTTT>
##$WBST= 1024
##$WBSW= 4
##$XGAIN= (0..3)
0 0 0 0 
##$XL= 0
##$YL= 0
##$YMAX_a= 4627
##$YMIN_a= -892
##$ZGOPTNS= <>
##$ZL1= 120
##$ZL2= 120
##$ZL3= 120
##$ZL4= 120
##$ABSF1= 298.5841
##$ABSF2= -158.5842
##$ABSG= 5
##$ABSL= 5
##$ALPHA= 0
##$AQORDER= 0
##$ASSFAC= 0
##$ASSFACI= 0
##$ASSFACX= 0
##$ASSWID= 0
##$AUNMP= <proc_1d>
##$AXLEFT= 0
##$AXRIGHT= 0
##$AXTYPE= 0
##$AXUNIT= <>
##$AZFE= 0.1
##$AZFW= 0.5
##$BCFW= 0
##$BC_mod= 2
##$BYTORDP= 0
##$COROFFS= 0
##$CY= 12.5935478210449
##$DATMOD= 1
##$DC= 0
##$DFILT= <>
##$DTYPP= 0
##$F1P= 47.1127640792319
##$F2P= -24.0371245302204
##$FCOR= 0.5
##$FTSIZE= 32768
##$FT_mod= 6
##$GAMMA= 0
##$GB= 0
##$INTBC= 1
##$INTSCL= 7.269226e-011
##$ISEN= 30
##$LB= 8
##$LEV0= 0
##$LPBIN= 0
##$MAXI= 12.09355
##$MC2= 0
##$MEAN= 0
##$ME_mod= 0
##$MI= 0.7550151
##$NCOEF= 0
##$NC_proc= -10
##$NLEV= 6
##$NOISF1= 298.5841
##$NOISF2= 270.0111
##$NSP= 0
##$NTH_PI= 0
##$NZP= 0
##$OFFSET= 298.5841
##$PC= 1.4
##$PHC0= 176.7467
##$PHC1= 207.5653
##$PH_mod= 1
##$PKNL= yes
##$PPARMOD= 0
##$PPDIAG= 0
##$PPIPTYP= 0
##$PPMPNUM= 100
##$PPRESOL= 1
##$PSCAL= 0
##$PSIGN= 0
##$REVERSE= no
##$SF= 81.014009
##$SI= 32768
##$SIGF1= 270.0111
##$SIGF2= -158.5842
##$SINO= 77.54984
##$SIOLD= 32768
##$SREGLST= <31P.CDCl3>
##$SSB= 0
##$STSI= 32768
##$STSR= 0
##$SW_p= 37037.037037037
##$SYMM= 0
##$S_DEV= 0
##$TDeff= 32768
##$TDoff= 0
##$TI= <>
##$TILT= no
##$TM1= 0
##$TM2= 0
##$TOPLEV= 0
##$USERP1= <user>
##$USERP2= <user>
##$USERP3= <user>
##$USERP4= <user>
##$USERP5= <user>
##$WDW= 1
##$XDIM= 32768
##$YMAX_p= 392137806
##$YMIN_p= -4368129
$$ End of Bruker specific parameters
$$ ---------------------------------
##NTUPLES= NMR SPECTRUM
##VAR_NAME=  FREQUENCY,     SPECTRUM/REAL,   SPECTRUM/IMAG
##SYMBOL=    X,             R,               I
##VAR_TYPE=  INDEPENDENT,   DEPENDENT,       DEPENDENT
##VAR_FORM=  AFFN,          ASDF,            ASDF
##VAR_DIM=   32768,         32768,           32768
##UNITS=     HZ,            ARBITRARY UNITS, ARBITRARY UNITS
##FACTOR=    1.13031516577767, 1,            1
##FIRST=     37037.037037037, -659914,       -11206
##LAST=      0,             -520840,         1350549
##MIN=       0,             -4368129,        0
##MAX=       37037.037037037, 392137806,     0
$$ Real data points
##PAGE= N=1
##DATA TABLE= (X++(R..R)), XYDATA
$$ [...]
17340g55999k21770r3244L4120J33691J97605K17426J79445J18835R4565J03979
17330H653Q6514K6353k5281k6288K4147R0268J25139J02361M7197r885p6345j44896
17318B27937j86469j75778j21760n3548r183M330K7844P9291J14541Q4085J4769
17307F059k7426m4971n2022k9494Q654J0273o1491j57424j79719j09996k0286
17296f57843M0900Q0645J25469J66006J62174J01344j3423j52427k43168k34778
17286f25101j54618p9219m1170M966Q5882J58716J83887J65145J05950m63j08977
17275c05002j51389j21462p3793k3387M7027J14336J56316J72046J62863J14195
17265I1750J9204r3940j70004j77904j22145m0767J5789M0721O5434R8413J23809
$$ y = [-755999, -977769, -1071013, -1036893, -903202, -705597, -488171, -308726, -189891, -95326, 8653, 95167, 121520, 96239, 69951, 94098, 184366, 309505, 411866, 459063, 449178, 372833, 227937, 41468, -134310, -256070, -309618, -318801, -314471, -286627, -207336, -92795, -8710, 6059, -21367, -66338, -118360, -147854, -139200, -128927, -190418, -347842, -527561, -637557, -657843, -616943, -536298, -410829, -244823, -82649, 18695, 5272, -147155, -390323, -625101, -779719, -858938, -900108, -895142, -809260, -650544, -466657, -301512, -195562, -196025, -305002, -456391, -577853, -651646, -675033, -628006, -513670, -357354, -185308, -22445, 91750, 110954, 17014, -152990, -330894, -453039, -493806, -478017, -437296, -371862, -273449, -149640]
17254a49640J20122P8013K2762j8548l0498R346J10008K08430K28457J60836M9821
17243G89109j8970j8944m1096j34875k04800j54934k9243O4006Q4428Q3623J19142
17232E37446J55231J12777J2972o2652r5958j17426j28054j14534q8854p0153
17222A40795o0794o1127q8998j59231k53661l03385k79472k15352j29172l1586
17212a441983O9008J46986J55327R8891N6329P0833J02778J00498O9471M0389
17202e31473M1143Q4729J44485J75700J61556J26984O8960k5080j06290j24964
17192A5750q3008j6769L9058O7811N7631j2071j11567j28834m1108M1639N8185
17181a13283L4445Q201j647O951J6196K3609O5208J13615Q8409K8445K4844M3140
$$ y = [-149640, -29518, 48495, 71257, 52709, 22211, 31557, 141565, 349995, 578452, 739288, 789109, 770139, 751195, 710099, 575224, 370424, 215490, 186247, 250253, 334681, 418304, 537446, 692677, 805454, 818426, 755774, 659816, 542390, 414336, 299802, 210948, 140795, 80001, 18874, -70124, -229355, -483016, -786401, -1065873, -1281225, -1410397, -1441983, -1372975, -1225989, -1070662, -971771, -915442, -844609, -741831, -641333, -571862, -531473, -490330, -405601, -261116, -85416, 76140, 203124, 272084, 247004, 140714, 15750, -67258, -84027, -44969, 22842, 80473, 68402, -43165, -171999, -213107, -171468, -113283, -78838, -70637, -72284, -65333, -49137, -25528, 39680, 153295, 241704, 270149, 294993, 338133]
17169C38133p151j01161j31526q1348k1958m241j4225j2870M763L887k9034o9964
17157a26695r7073j02569r4664r3573j15344j46608j58639j21077l6167M9597
17147a042812P8353M3056K107O406N1151R2100J15202J38656J46753J10611M3695
17136b14722k6626p6738r0748o4032j1255K7323J9559k879K882K2427L1629L6314
17124c46866L0714P65m2507p2562p8641p9742q1081q9912j25519j71534j87604
17113a244489j43086m6479O1720J35851J40127P2974n641k5348r312l3584r9828
17102a197095j38888j15619p3386n4094n6093p5207j10746j49077j63326j30573
17092b264104m2197O0223J16957J34554J71326K31137K55926K19206J67998J51105
$$ y = [338133, 330982, 229821, 98295, 16947, -5011, -9252, -23477, -36347, -31584, -27697, -56731, -126695, -223768, -326337, -421001, -514574, -629918, -776526, -935165, -1056242, -1092409, -1042812, -964459, -921403, -919296, -912890, -861739, -769639, -654437, -515781, -369028, -258417, -214722, -241348, -318086, -408834, -472866, -484121, -456798, -437239, -440118, -437236, -414809, -383180, -346866, -316152, -315387, -357894, -430456, -509097, -588839, -669920, -759832, -885351, -1056885, -1244489, -1387575, -1434054, -1372334, -1236483, -1096356, -1023382, -1029023, -1054371, -1063683, -1097267, -1197095, -1335983, -1451602, -1524988, -1579082, -1635175, -1710382, -1821128, -1970205, -2133531, -2264104, -2306301, -2246078, -2129121, -1994567, -1823241, -1592104, -1336178, -1116972, -948974, -797869]
17082g97869J59594J66374J36480L7940j06478k22623k63851k55854k21746j40211
17072a508244j7336N9926K4602n6992q4520l0455Q3062K03728K66740K47031J89501
17061f22957J45906J09967O1315N8510J56510K75557L07232K36999J00344m2046
17051G87337j24814j30449j14678j39521j66145j44748j11883q9551o7735n2760
17041c54947m0949k6158l8987j01862j59050j50451j03802n9154r69Q8267J80160
17030g67902K28268K16322J65445R3041L0288K7013P9613J33011J34043P0705
17020D09847k2161j11008j81462k20512j84506m8238J03619J80711J78192J42028
17010B46510J10866O6759j358m2289k3894K9752R2643J29539J13599P1090K7788
$$ y = [-797869, -638275, -471901, -335421, -297481, -403959, -626582, -890433, -1146287, -1368033, -1508244, -1525580, -1465654, -1441052, -1498044, -1582564, -1613019, -1529957, -1326229, -1059489, -812458, -622957, -477051, -367084, -305769, -247259, -90749, 184808, 492040, 729039, 829383, 787337, 662523, 532074, 417396, 277875, 111730, -33018, -144901, -234452, -302187, -354947, -395896, -422054, -461041, -562903, -721953, -872404, -976206, -1035360, -1036329, -948062, -767902, -539634, -323312, -157867, -64826, -34538, -7525, 72088, 205099, 339142, 409847, 387686, 276678, 95216, -125296, -309802, -358040, -254421, -73710, 104482, 246510, 357376, 424135, 422777, 380488, 356594, 386346, 478989, 608528, 722127, 793217, 821005]
16999H21005j2674m1044m5062l7785m3622o1301p7863j01664j31580j50424j63258
16988d5272j79855j74847j18972l7653K8540O3063M5822K65j2652K0180O0997
16977c50384P2455L3441l6741q6334q6055l6175M3482R8381O7793l6755j05989
16966d22881p0022J8120R3757J33077J30890J05230P8306O2275N8279M0672o107
16955B21596l4858k448N0486Q7405J22095J51960J65287J44699R2165N4591O4135
16944A117113P3279L2882m6777j35964k11267k78378l41140l45660k66235j67674
16934e69821r7722m5339N489M8360P2985Q3730R4225J08086J22262J21875Q9171
16923C3301M3219K7863N7826J02949J02105K8806n3565r5297j30294j86281k17381
$$ y = [821005, 808331, 767287, 722225, 684440, 640818, 579517, 501654, 399990, 268410, 117986, -45272, -225127, -399974, -518946, -556599, -528059, -464996, -419174, -418909, -431561, -411381, -350384, -277929, -244488, -281229, -367563, -453618, -489793, -446311, -347930, -280137, -316892, -422881, -492903, -474783, -381026, -247949, -117059, -11829, 66477, 128752, 187031, 227703, 221596, 186738, 184290, 234776, 322181, 444276, 596236, 761523, 906222, 998387, 1052978, 1117113, 1190392, 1223274, 1176497, 1040533, 829266, 550888, 209748, -135912, -402147, -569821, -667543, -712882, -707393, -659033, -586048, -502318, -408093, -300007, -177745, -55870, 33301, 76520, 104383, 162209, 265158, 367263, 396069, 342504, 247207, 116913, -69368, -286749]
16912b86749j79862r3549j236O7874Q7947M7105j9247m9591n13J30086K74559
16901b3176L39290L04229J99368O5874l7815p2860m0785J2520K6295p683n9544
16890G05713j16323j58205j58043j38111j46302j67855j49153r0962m7847n4939
16880e22027q9050j15524j12038o5941r050j966m3455p5848o6439l0815J471r451
16868a140133o5512j05415p3904K3111J51772L01656M15701L89935K34251O7500
16858A98962o4739j95361l25423l96678l48337k09934p3019l491r049m1560l7533
16847a506162K4089J05105J41286J16440Q1579J10546K28355L53960L90849L19949
16837C65996J97794P4558l5652j24964j97257k48524k54451k10674j44176p8913
$$ y = [-286749, -466611, -560160, -561396, -493522, -405575, -358470, -377717, -427308, -427821, -297735, -23176, 316114, 620343, 819711, 885585, 847770, 774910, 734125, 746645, 772940, 765257, 705713, 589390, 431185, 273142, 135031, -11271, -179126, -328279, -419241, -467088, -522027, -611077, -726601, -838639, -904580, -913630, -915596, -959051, -1034899, -1101338, -1132153, -1130682, -1140133, -1205645, -1311060, -1384964, -1361853, -1210081, -908425, -492724, -102789, 131462, 198962, 134223, -61138, -386561, -783239, -1131576, -1341510, -1414529, -1418020, -1427069, -1468629, -1506162, -1482073, -1376968, -1235682, -1119242, -1037663, -927117, -698762, -344802, 46047, 365996, 563790, 638348, 602696, 477732, 280475, 31951, -222500, -433174, -577350, -656263]
16827f56263l4850l1912o1994r7171j00954m7974J8001L0143j0388o3035q7935
16816a144332l8358Q6627J78589J61539J18906J23340J53114J90746K41020K80715
16806C51906K57764J57877J7371j02691j43420q9466J4655J02885J20987M9845
16796G37713o3652j43979j30598k6568P8850J30692J40777J17682P3953J0601
16786I25471j01019k50075l50494l30764k15006q4441J6769Q2054J11688J00741
16776i5076M2434l8202j08062j55191j61471j22526o6380k8282q252L3847J09045
16765e98116J80091K18625K09857J32654j1491j38657j74938j73150j99106k10654
16755g64885j35106L0456J93176K45230J91760J12367M1406k3184o1203o9852
$$ y = [-656263, -691113, -723025, -785019, -882190, -983144, -1031118, -1013117, -982974, -993362, -1056397, -1144332, -1182690, -1096063, -917474, -755935, -637029, -513689, -360575, -169829, 71191, 351906, 609670, 767547, 784918, 682227, 538807, 449341, 463996, 566881, 687868, 737713, 674061, 530082, 399484, 372916, 451766, 582458, 723235, 840917, 914870, 925471, 824452, 574377, 223883, -106881, -321887, -406328, -389559, -307505, -195817, -95076, -52642, -90844, -198906, -354097, -515568, -638094, -704474, -732756, -741008, -707161, -598116, -418025, -199400, 10457, 143111, 131620, -7037, -181975, -355125, -554231, -764885, -899991, -869535, -676359, -431129, -239369, -127002, -85596, -108780, -169983, -239835]
16745b39835p2348p3013n1320R722R1055J58864J99913J95470J20838o6q2936
16734B56344o1456J9099O3432N4900N8388Q1182M0013r1747k35162l13160l32885
16723d61052l03426j98552n6122M1683R1204J21386J13142N3841j260l660K4642
16712e78174P6978J47845J98094K24153K32809K05256J54861J37431J55847J45680
16702A100780R5980O3767O3135K0622j20558l39945n45548n99055m25951j31543
16692h18316R8307J95266J97369J51629P8072k5997j33425j84534j42543m2598
16682f26770P824m6272j48630k31632k71378k67097k28153j42888R568J76880
16672a768548K70510K64914J83859M6040j06101j95322j76582j06020q0980j02244
$$ y = [-239835, -312183, -385196, -436516, -426794, -335739, -176875, 23038, 218508, 339346, 339280, 256344, 194888, 213987, 277419, 332319, 390707, 471889, 511902, 420155, 184993, -128167, -461052, -764478, -963030, -1019152, -977469, -886265, -764879, -651737, -597896, -599156, -602816, -578174, -501196, -353351, -155257, 68896, 301705, 506961, 661822, 799253, 955100, 1100780, 1196760, 1260527, 1323662, 1344284, 1223726, 883781, 338233, -260822, -686773, -818316, -720009, -524743, -327374, -175745, -97673, -123670, -257095, -441629, -584172, -626770, -618946, -665218, -813848, -1045480, -1316858, -1583955, -1812108, -1954996, -1945428, -1768548, -1498038, -1233124, -1049265, -1003225, -1109326, -1304648, -1481230, -1587250, -1668230, -1770474]
16662a770474r7381n3825K287O7317J37860J81772J76507J38328P9475K6030l212
16651a115316q624J5078P1425J53726K38208K90158K87361K50812K15435J69211
16641E67474Q2928j0784n8541o0297m8352n4791q9030j19694j01563m0581k325
16630F4444k7289j08821j98143k13586j19125K8313J22336J03181K0970m7345
16620c75065j05343j74789k32546k50195k20715j56644q3418q788O7578J27109
16610a412816J55993J69347J73699J59017J10490L7590r475l649J1328M446K4005
16599e80025J02197J71084J79460J79319K09451J96838P2008r7909j97294k05283
16589B9846j75191j31821p5815r336N4812P1073L4391J8070O3127J25006J64420
$$ y = [-1770474, -1867855, -1921680, -1919393, -1852076, -1714216, -1532444, -1355937, -1217609, -1138134, -1112104, -1115316, -1123940, -1108862, -1037437, -883711, -645503, -355345, -67984, 182828, 398263, 567474, 650402, 639618, 581077, 520780, 472428, 417637, 328607, 208913, 107350, 66769, 64444, 37155, -71666, -269809, -483395, -602520, -574207, -451871, -348690, -327720, -375065, -480408, -655197, -887743, -1137938, -1358653, -1515297, -1598715, -1607503, -1539925, -1412816, -1256823, -1087476, -913777, -754760, -644270, -606680, -616155, -619804, -608476, -604030, -580025, -477828, -306744, -127284, 52035, 261486, 458324, 530332, 432423, 235129, 29846, -145345, -277166, -352981, -362317, -307505, -236432, -202041, -183971, -120844, 4162, 168582]
16578A68582J75923J50847P8306m6317j50896j29340k1801N8393O8561J0961q3893
16567B79326j56480j60928q8760K2327J01268J10256O7602n403j06366k05328
16557a42486k48546k16755j36648m0809N3695J32134J82618K00384K01599K14906
16547B00092K30363K05008J14209k0111j34813j97077k45618l03426l18385k44859
16537g14617j09550J2145P1594R7349J36052J95833K65192L12931K93797K13449
16527G74175J30687P7089J5359p9294j44488j43547j39111j75087k17972k15446
16517a17635j29785o46J00408J60691J46829N360j81357k39494j34300J6907J17902
16506b55120J86342K38901K34315J78995J11018L0092p1094j74587k36431k41833
$$ y = [168582, 344505, 495352, 573658, 527341, 376445, 247105, 225304, 283697, 352258, 363219, 279326, 122846, -38082, -126842, -104515, -3247, 107009, 174611, 169208, 62842, -142486, -391032, -607787, -744435, -785244, -731549, -599415, -416797, -216413, -14814, 200092, 430455, 635463, 749672, 729561, 594748, 397671, 152053, -151373, -469758, -714617, -824167, -812022, -740428, -643079, -507027, -311194, -46002, 266929, 560726, 774175, 904862, 981951, 997310, 918016, 773528, 629981, 490870, 315783, 97811, -117635, -247420, -248066, -147658, 13033, 159862, 165222, -16135, -255629, -389929, -373022, -255120, -68778, 170123, 404438, 583433, 694451, 724543, 653449, 478862, 242431, 598]
16496E98k38338k54460k50125j94209j12479m4420k7918o9750j13625j01231l6841
16485a442798N0021J05704R3393Q2018J38319K07775K01151J25105N4439m3q1375
16474d66291j54203j29583k5246M9996J7041r9609k07402k45806k10577j47940
16464a619620r4100p4256r0731j38426j89732j30359J04975L60979M45578L70547
16454a055145K18905O3097P828R7213K63058L81823L67881K32776N5252p7163
16444E55525j31750j40764j39078j27028q6298j8053N6411J40900K16782K18476
16434E45123J23100p185j04871j71243k14302k14408j49599j8762Q8279P8113
16424d5755k9077j39090j68515j08929k5742R105l864l555K7386O3880R8419J53413
$$ y = [598, -237740, -492200, -742325, -936534, -1049013, -1093433, -1121351, -1191101, -1304726, -1405957, -1442798, -1392777, -1287073, -1193680, -1111662, -973343, -765568, -564417, -439312, -384873, -384916, -466291, -620494, -750077, -775323, -725327, -708286, -807895, -1015297, -1261103, -1471680, -1619620, -1713720, -1787976, -1878707, -2017133, -2206865, -2337224, -2232249, -1871270, -1425692, -1055145, -836240, -773143, -765315, -668102, -405044, -23221, 344660, 577436, 632688, 555525, 423775, 283011, 143933, 16905, -69393, -87446, -31035, 109865, 326647, 545123, 668223, 661038, 556167, 384924, 170622, -43786, -193385, -212147, -123868, -45755, -74832, -213922, -382437, -491366, -517108, -508003, -511867, -515422, -488036, -424156, -325737, -172324]
16412a72324K38394L13919L34554K88003J73202k2601k55340m05348l85605k37766
16402a30912p8007K3173O1768P6830Q2774L7554m8226j18421j63354j75489j30680
16391e62990n0684L4105J27827K29606L31447M02855L94462L04759J37552o1493
16381A287446j39152l1189J48004K85095L35037K87018J42818o0517k39741l19328
16371A695491k90156j97813o1848J04644K25371K23860J05684o5289k07872k51428
16361A280644j95762j02891k4871k699j9935J1554Q4830Q1240k8682j62365k46918
16350F74145k71062k36692j58508q7140o0004m2386M0061J85914K98389K95769
16340F38486J70997n829j16819j15500n1772K7883Q9992J01187P3891N0125M6127
$$ y = [-172324, 66070, 379989, 714543, 1002546, 1175748, 1153147, 897807, 492459, 106854, -130912, -208919, -185746, -123978, -47148, 35626, 73180, 24954, -93467, -256821, -432310, -562990, -613674, -579569, -451742, -222136, 109311, 512166, 906628, 1211387, 1348939, 1287446, 1148294, 1117105, 1265109, 1550204, 1885241, 2172259, 2315077, 2254560, 2014819, 1695491, 1405335, 1207522, 1145674, 1250318, 1475689, 1699549, 1805233, 1739944, 1532072, 1280644, 1084882, 981991, 957120, 954421, 934486, 946040, 1030870, 1112110, 1083428, 921063, 674145, 403083, 166391, 7883, -79257, -139261, -181647, -141586, 44328, 342717, 638486, 809483, 803654, 686835, 571335, 519563, 547446, 637438, 738625, 812516, 862641, 908768]
16329I08768L9055M484k7812m8580q2342j15363r6962j1390O1255M7396L987N1370
16317G33866J97410L15077L25726K90527K77346K38729N7815l23111p05442p62974
16307F44969n40204l09983j90325j52013j02994M256J21845J66232R1375n1970
16297c18812j57453j61723j03435l7137K4617O3424N8724K6934J0613M4589J08917
16286d40742J19614L8732q1825j80567k33634k51332k48024k33264k19191j93442
16276a923675j51954j10867n8620K0168J08599J61938J59743J37576J31078J43284
16266a382730J81757K37149K49776J67984K3902n4562J1125J47643K05418J25858
16256h6680J2308l2340p01P9411J71981K15013J57605N4320k991j9072o3471j30713
$$ y = [908768, 947823, 952307, 924495, 875915, 793573, 678210, 581248, 569858, 631113, 678509, 682496, 733866, 931276, 1246353, 1572079, 1862606, 2139952, 2378681, 2436496, 2113385, 1407943, 644969, 104765, -205218, -395543, -547556, -650550, -646294, -524449, -358217, -266842, -318812, -476265, -637988, -741423, -778560, -753943, -690519, -631795, -604861, -594248, -549659, -440742, -321128, -282396, -364221, -544788, -778422, -1029754, -1277778, -1511042, -1730233, -1923675, -2075629, -2186496, -2245116, -2224948, -2116349, -1954411, -1794668, -1657092, -1526014, -1382730, -1200973, -963824, -714048, -546064, -522162, -576724, -565599, -417956, -212538, -86680, -74372, -106712, -107413, -28002, 143979, 358992, 516597, 570917, 567926, 548854, 485383, 354670]
16244C54670j42474q6616j7777K2188J1336q998p168j6463n1555r2283j16211
16233a51351j18574q7852J6924J80694K77072K11752N0775n5128n4632j6295j227
16222B52158k1235o9001j04628p2844L300K7680l0362j24425j98519k06118j39367
16211f83361m4812J1817K8399N0237Q3776J04834J07547J20340J32527Q7393j3232
16200a4535j20389k01908k33469k30050k28036j97968q8785P4870K06864K56334
16190g77072K46263K12209J55112Q5648N2142P4134J09022J20069R2510J3654
16180C83691q4337j61508k24119k83958l19320l00102k34884j39421l3154L7593
16170a359519M3021J1204l65K5986Q3400J78901K83674K86369J23274p3740j52041
$$ y = [354670, 212196, 125580, 107803, 129991, 141327, 132329, 125161, 108698, 57143, -35140, -151351, -269925, -357777, -340853, -160159, 116913, 328665, 379440, 324312, 269680, 253385, 252158, 230923, 161922, 57294, -15550, -12250, 15430, -14932, -139357, -337876, -543994, -683361, -728173, -716356, -687957, -637720, -553944, -449110, -341563, -221223, -88696, -1303, -14535, -134924, -336832, -570301, -800351, -1028387, -1226355, -1315140, -1240270, -1033406, -777072, -530809, -318600, -163488, -77840, -25698, 48436, 157458, 277527, 370037, 383691, 299354, 137846, -86273, -370231, -689551, -989653, -1224537, -1363958, -1397112, -1359519, -1316498, -1305294, -1305659, -1279673, -1196273, -1017372, -733698, -447329, -324055, -397795, -549836]
16159e49836j01002m168K7083n5999j71653j90844j03638j6326J4531L6465R3731
16148a021656J50330J43183P4935K2140L5432R3722J41274J40466P8764k6928
16138a68338q5984m0551M0526O9841L6115j1276k4017l044K5649M9294N4122R787
16126d7876o9528j22011j28350r8788l2494M4229Q5842R5267R8325Q5916P0798
16115a8670O2541K1041n0694r5561n8934L8683J09617J05386M0377m6199j07648
16104f1j15508q1620l6198p263K987J0097J2397m663k3549N564Q3045J36463J15518
16091I7209K3441j05535k32518k98173k49236j35187k9831P3408J97216K91951
16081c67255K84323J76458N6904R522L5284J05118J95716K44565J77124J7279
$$ y = [-549836, -650838, -655006, -627923, -683922, -855575, -1046419, -1150057, -1166383, -1151852, -1115387, -1021656, -871326, -728143, -653208, -631068, -595636, -501914, -360640, -220174, -141410, -168338, -254322, -294873, -254347, -184506, -148391, -159667, -183684, -186728, -161079, -111785, -57663, -47876, -117404, -239415, -367765, -466553, -499047, -454818, -368976, -273709, -175384, -89468, -18670, 43871, 64912, 14218, -81343, -140277, -101594, 8023, 113409, 153786, 107587, -61, -115569, -197189, -233387, -240650, -237663, -227566, -215169, -219832, -243381, -237817, -154772, -18309, 97209, 120650, 15115, -217403, -515576, -764812, -899999, -929830, -856422, -659206, -367255, -82932, 93526, 150430, 159952, 195236, 300354, 496070, 740635, 917759, 935038]
16071I35038j27477j99579j99142j43585p4940l1547m9468j24114j74665j41587
16061c31066o7114k0480p389l994k6964q0572j05812n2053O4819J75910K28103
16050b26612K13319J52494O9663J8543N8039J53311K12388J89931J20613N6077
16040A017766L364m6145q9530j07027p5335Q83P3302Q0341L0774j2588k9542j5557
16028H30706L4123P1889P1750N4165J6987l3495p6936j09128j44306j71221j55628
16017C88906r3587N551J01025J38414R8679K1195m0896p7801r0492q6035p5503
16006B89456m9530J2787P6881P5558K7361P715L0099M8105J837j08236k19451
15995A92582l02558l39005l18797k68552k11703j67315j39250j02318l8759N0140
$$ y = [935038, 807561, 607982, 408840, 265255, 190315, 158768, 109300, -14814, -189479, -331066, -398180, -418660, -426049, -430043, -457007, -537579, -643391, -695444, -630625, -454715, -226612, -13293, 139201, 208864, 227407, 285446, 438757, 651145, 841076, 961689, 1017766, 1021130, 974985, 885455, 778428, 703093, 703976, 777278, 857619, 888393, 875805, 846263, 830706, 864829, 936718, 1008468, 1062633, 1079620, 1046125, 969189, 860061, 715755, 544534, 388906, 295319, 300870, 401895, 540309, 638988, 660183, 619287, 541486, 450994, 364959, 289456, 239926, 252713, 329594, 405152, 432513, 440228, 470327, 518432, 520269, 412033, 192582, -109976, -448981, -767778, -1036330, -1248033, -1415348, -1554598, -1656916, -1695675, -1645535]
15985a645535J56421K42762K62257K30468J98204J67325J32448J20682J15430
15976a9538O6490j4772o4563p8988j04681j40668j40446p5566J9242P1745O6150
15965d15595M5349M0681N2274N7317M2804K9109L5210O3992J03000J09744N7370
15954B21255j0955m4601m9002l5077J813L0093N37n3782p2797q2897j14008j34405
15942c43826j21246q4634n0855l3231j3968N674L028n708J9528Q2436J36654J42083
15930b64065J16324J03790R9937P0925K0973j5408j6014r969m5789j34311k19581
15919b93188k36114j58896j8892R5829J11261L0137n2637m0898O0514J63033J88332
15908a51519J24063P125r2414j33357j58894k01136k31401k38371k45502k44521
$$ y = [-1645535, -1489114, -1246352, -984095, -753627, -555423, -388098, -255650, -134968, -19538, 46952, 32180, -32383, -111371, -216052, -356720, -497166, -572732, -553490, -481745, -415595, -370246, -329565, -277291, -219974, -177170, -148061, -112851, -48859, 54141, 163885, 221255, 210300, 165699, 116697, 81620, 83433, 113526, 114063, 60281, -12516, -95413, -209421, -343826, -465072, -549706, -600561, -633792, -647760, -642086, -639058, -644766, -625238, -542802, -406148, -264065, -147741, -43951, 55986, 126911, 147884, 132476, 116462, 106493, 60704, -73607, -293188, -529302, -688198, -707090, -611261, -500000, -469863, -522500, -563398, -502884, -339851, -151519, -27456, -20331, -112745, -246102, -404996, -606132, -837533, -1075904, -1321406, -1565927]
15898a565927k01881j19602j3392R0436J45067J41948J01042N2693J5462l6579
15888a390733j05182j44241j40253j09894l5022R8058K31335K93271K55795J24993
15878i21873k6882q5670k3672P3053J31230J45634J25175Q7868O9922J03735J60143
15867a61337J59360P5597m6817j35085j22176l038J08197Q7404k2370r1657r0051
15856b41973o0349j8503M3384J04788J30065J20419J08562R9666N6308l2965j09027
15845B00375r6858j3584P4203J25078J23171J09819J22728J43873J44834R6918
15835A030557R75r8142j54346j69386j84424k01407j71814o1088R8337K23563
15825C12825K62079K12179R2282n2501j50730j66547j29610q4719m0444K536L0154
$$ y = [-1565927, -1767808, -1887410, -1900802, -1810366, -1665299, -1523351, -1422309, -1369616, -1354154, -1390733, -1495915, -1640156, -1780409, -1890303, -1925325, -1827267, -1595932, -1302661, -1046866, -921873, -948755, -1034425, -1058097, -985044, -853814, -708180, -583005, -495137, -425215, -321480, -161337, -1977, 73620, 26803, -108282, -230458, -233496, -125299, -37895, -60265, -151922, -241973, -302322, -320825, -277441, -172653, -42588, 77831, 186393, 286059, 342367, 309402, 200375, 103517, 89933, 164136, 289214, 412385, 522204, 644932, 788805, 933639, 1030557, 1031532, 933390, 779044, 609658, 425234, 223827, 52013, -9075, 89262, 312825, 574904, 787083, 879365, 826864, 676134, 509587, 379977, 295258, 254814, 257350, 287504]
15814B87504K9541J0590l516O09L3103Q3450P2281m9496j80542k05499j47806
15803f9781j08169j17415j37993j54209j68211j82068k09588k40197k35914j73353
15793a796898p0034K5404N9728L5075L0886J05014K10893K49579K01485J23042
15783h25826L8627l7214r4286j60478k15101j93671j07400q754P0735J05636R1597
15772a336135O3145M6175L8237O8620J57354K35748K41958J97553J32247P6147
15762g8951N9625O5421K4060p4234j52700j57269j11529o7118l7333j9635j4588
15751e64251m943M3300J05974J11929O2884M7260R5672J71885K35948K24347J09790
15740F39795n5465j96884k46657k09824j66424j57733j42409p3400K0264P0527
$$ y = [287504, 317045, 327635, 324119, 324728, 357831, 441281, 513562, 464066, 283524, 78025, -69781, -177950, -295365, -433358, -587567, -755778, -937846, -1147434, -1387631, -1623545, -1796898, -1866932, -1841528, -1781800, -1746725, -1715839, -1610825, -1399932, -1150353, -948868, -825826, -787199, -824413, -918699, -1079177, -1294278, -1487949, -1595349, -1604103, -1533368, -1427732, -1336135, -1272990, -1226815, -1188578, -1119958, -962604, -726856, -484898, -287345, -155098, -78951, -19326, 46095, 70155, -4079, -156779, -314048, -425577, -492695, -530028, -549663, -564251, -569194, -525894, -419920, -307991, -245107, -197847, -102175, 69710, 305658, 530005, 639795, 584330, 387446, 140789, -69035, -235459, -393192, -535601, -609001, -588737, -518210]
15730e18210O9935N3965L2665M173k1599o0467j39906k24415k42261j79702o0788
15719a286610Q0541J86947J98429J12987K1045p408K1108P3429J06018J03189
15709c90325R3610Q0655N2836K8000L6331P8573J19426J15991O2950N963m6767
15698B37243j05085j23931q9148p2716j10856j36044r1190o499P7519J48503J72914
15687i9290J28565M1168m4783p1994j8819N3750Q4741P9704N7798J4738l8438
15676A87140q2635j08778j11613p5900K8788J93930L25571L43110K66888J39215
15666A105716j3523j59256k47802k46247k01587j74980j75336j81400j78413j52417
15656f25245p8798K7191J20337J65880J51097J01642N2716N264m7405r7776j26612
$$ y = [-518210, -448275, -394310, -361645, -357472, -379071, -439538, -579444, -803859, -1046120, -1225822, -1286610, -1206069, -1019122, -820693, -707706, -686661, -694069, -672961, -599532, -493514, -390325, -296715, -216060, -163224, -135224, -98893, -20320, 99106, 215097, 278047, 284010, 237243, 132158, 8227, -80921, -153637, -264493, -400537, -491727, -498226, -420707, -272204, -99290, 29275, 70443, 25660, -46334, -65153, -11403, 73338, 153042, 210840, 225578, 187140, 104505, -4273, -115886, -191786, -162998, 30932, 356503, 699613, 966501, 1105716, 1092193, 932937, 685135, 438888, 237301, 62321, -113015, -294415, -472828, -625245, -704043, -676852, -556515, -390635, -239538, -137896, -85180, -79916, -127321, -225097, -351709]
15645c51709j30717j36314j41752j16973p0290j4800O5584J58776K28495K45718
15635b63982K23274K35368K88421K78796J53721K2427k9778q0756j77374k61612
15625C88505k68212j88064o9215R44j5599n9879o5194k9188M709J4528L148o15
15613b84132K3066L8844J4605k6812m6141m0008k7629j0777P349J0694J4144L2908
15601b93889O3820O8232r493j33705k00546j77590j32543j02295l8931O2331J22498
15590g72111P8084l2328r6525o0907K5851R8070J38361J61318J62563J21502N0436
15579a25686r013l5530n6250q2450q7069q3419r8698j18529j25643j21349j15438
15568a059074r4242l2196M1556J02228J40225J06754k332r5038j10268m8903M1044
$$ y = [-351709, -482426, -618740, -760492, -877465, -947755, -962555, -896971, -738195, -509700, -263982, -40708, 194660, 483081, 761877, 915598, 938025, 908247, 827491, 650117, 388505, 120293, -67771, -136986, -136042, -151641, -211520, -276714, -305902, -301193, -286665, -283517, -284132, -261066, -222222, -207617, -234429, -280570, -320578, -348207, -358984, -351635, -340941, -326797, -293889, -230069, -161837, -171330, -305035, -505581, -683171, -815714, -918009, -956940, -894609, -772111, -694027, -726355, -822880, -883787, -857936, -759866, -621505, -460187, -297624, -176122, -125686, -134699, -170229, -226479, -308929, -395998, -479417, -578115, -696644, -822287, -943636, -1059074, -1153316, -1185512, -1143956, -1041728, -901503, -794749, -797081, -892119, -1002387, -1051290, -1010246]
15557a010246P9179O2504N0493O6902R8617J21575R1868M577q1868j07809n2236
15546f76444L7836P5676K8312o5419j28084j07144l9863L6969J52402K89085L69837
15535b6837L28613J74714N785r6140j48972j72582j37123l6629O1192P4678J2453
15524C9152o5060j32740j77624j78431j32505m3230P7457J85657K48037K66357
15514H7070K61446K48312K08147J14284o582p8458p1497k3704J7260L7909N0634
15503H44821O8122O5460R537o5791r9918p0965j2221K781m5662q8110p0852j3423
15491E23779J7506k5660q3850o0386K6385O3818J8172k8574k2794J5594M8663
15480D92653O5696J04776J71400K19676K20436J90099J47773N8950j06556k79232
$$ y = [-1010246, -931067, -868563, -818070, -751168, -652551, -530976, -439108, -434531, -516399, -624208, -676444, -638608, -562932, -534620, -600039, -728123, -835267, -875130, -838161, -685759, -396674, -26837, 301776, 476490, 482275, 386135, 237163, 64581, -72542, -109171, -47979, 26699, 39152, -25908, -158648, -336272, -514703, -647208, -690438, -612981, -427324, -179287, 87070, 348516, 596828, 804975, 919259, 912677, 834219, 762722, 739018, 756278, 794187, 844821, 912943, 978403, 987940, 922149, 822231, 751266, 739045, 741826, 696164, 608054, 537202, 523779, 541285, 515625, 431775, 371389, 397774, 461592, 479764, 451190, 428396, 443990, 492653, 558349, 663125, 834525, 1054201, 1274637, 1464736, 1612509, 1671459, 1564903, 1285671]
15470A285671l55326l25537k29794j01644k832k132q4817j53018j39957o5378
15460a74764m237P63k4342n5354j01548j40339j61116j90759k06699j48746j0482
15449a217623J53427K59649K28295R7168J6086N5392J44953J97345J80956J03472
15439B19120K1513p030j6173o2926j27569j77881k13721k11938j66969j49780
15429h93354j88980k10324j74144j05036l2364J5997L7630M4454M9957P3268J16563
15418a266333J66561K24554K84880L24070L26094K92352K40827J87154J31100
15409I11259R5322R4208R0653M4939n2847j75021k46435k23287j61579j55527
15399B21685k33402l00441k66178j40566M959J12130J94826K61681K72156K05930
$$ y = [1285671, 930345, 604808, 375014, 273370, 270538, 268406, 183589, 30571, -109386, -174764, -179001, -178238, -202580, -257934, -359482, -499821, -660937, -851696, -1058395, -1207141, -1217623, -1064196, -804547, -576252, -479084, -462998, -407606, -262653, -65308, 115648, 219120, 240633, 233603, 217430, 154504, 26935, -150946, -364667, -576605, -743574, -893354, -1082334, -1292658, -1466802, -1571838, -1604202, -1588205, -1550575, -1506121, -1456164, -1382896, -1266333, -1099772, -875218, -590338, -266268, 59826, 352178, 593005, 780159, 911259, 1006581, 1100789, 1191442, 1236381, 1183534, 1008513, 762078, 538791, 377212, 221685, -11717, -312158, -578336, -718902, -713943, -601813, -406987, -145306, 126850, 332780]
15389C32780J05426J6581l3629l2797k0151k6563l8076n1314p9775j24534j47782
15378i9834j00077l080N8341N4366P398p3283j43504j36391n1529L1495M3220
15367d12878J1727J9356R8543J97795K46446K30048K07888K25576K47677K37924
15357A310102J87757Q9575k2056q9428j00654r4834j22023j84837k38355k39351
15347D95896j94345j33622o6359L379M3334J5246n8061j15423j25059p5689Q324
15336b02379P5973J07037J23606J40208J28826O5569j6921p0589r4332j28730
15326A28268j92021k30198j68007k4635J20525J94341J51790L1333r6322j69988
15316b54914j56401r8670n0909l3496k6899J268N3262J03393J23982R5520L5852
$$ y = [332780, 438206, 454787, 421158, 388361, 368210, 341647, 303571, 252257, 172482, 47948, -99834, -199911, -202991, -144650, -90284, -82886, -156169, -299673, -436064, -487593, -456098, -412878, -401151, -381795, -283252, -85457, 160989, 391037, 598925, 824501, 1072178, 1310102, 1497859, 1587434, 1565378, 1475950, 1375296, 1280462, 1158439, 973602, 735247, 495896, 301551, 167929, 101570, 104949, 148283, 163529, 105468, -9955, -135014, -210703, -202379, -126406, -19369, 104237, 244445, 373271, 438840, 421919, 351330, 256998, 128268, -63753, -293951, -461958, -486593, -366068, -171727, -19937, 11396, -84926, -254914, -411315, -509985, -560894, -594390, -621289, -620021, -566759, -463366, -339384, -243864, -208012]
15305b08012L057J2290J9661Q998M905J3867L0461N8961O9787L4305j2206k7226
15293H848k1291j3760Q285L4330R686p9260j69623j85254r2061O4262J57559J11751
15281a66528N275m8150k0491M8830J07980J06842L6375m7697j13545j60273j42842
15270c94224m7768L9349L0181m0197q3054o5045n160O2986R7782O2457k831n5170
15258d00694j13916j69888j98668j79871j07847k0032N8811J06362R1649L526
15248i30568j34172k45536k53357j65086n2130O2936K10189L53220L87697K73759
15238d93048R2854l1014n7834l4400j9107m5352j08707j59057j53438j16239q6134
15227a211476m3489L7959J16947J53842J65304J69652J60478J33113R4095N2653
$$ y = [-208012, -204955, -192665, -173004, -164006, -159101, -145234, -114773, -55812, 13975, 48280, 36074, 8848, -12443, -26203, -17918, 16412, 26098, -53162, -222785, -408039, -500100, -435838, -278279, -166528, -161253, -209403, -229894, -181064, -73084, 33758, 70133, 22436, -91109, -251382, -394224, -441992, -402643, -372462, -412659, -495713, -560758, -565918, -502932, -405150, -342693, -345524, -400694, -514610, -684498, -883166, -1063037, -1170884, -1190916, -1132105, -1025743, -934094, -930568, -1064740, -1310276, -1563633, -1728719, -1780849, -1717913, -1507724, -1154504, -766807, -493048, -400194, -431208, -489042, -523442, -542549, -587901, -696608, -855665, -1009103, -1125342, -1211476, -1254965, -1217006, -1100059, -946217, -780913, -611261, -450783, -317670, -223575, -170922]
15217a70922J5159M781L5111N7826L6582P098j3003k5489k6868k0013l697N674
15205i7761k3500r1088j55867j81215j52639j01433p7871n9226J6122J45521K47244
15194e31713K59899K08096J55258J27814J13860R9608N0790m3137j49705k28095
15184F2675k31114j40782J9466J86373K77236K73953K27906J81555J39831O1064
15174A058163p5527j90925k14855j76202j27268r1436p0709o3529l7636L4969
15164D5045J05056J13049M9632p8585k01796k00816q3319L0233P2817P7717J08142
15153C7175J77110K40629K39478J46143J2339q9062j39762j49754j58805j90753
15143A24738k09531j63300m2410J08861K36426L16023L10593J92042K1351j10347
$$ y = [-170922, -155763, -150982, -115871, -58045, -21463, -14365, -27368, -52857, -79725, -99738, -103435, -97761, -121261, -212349, -368216, -549431, -702070, -803503, -881374, -940600, -924478, -778957, -531713, -271814, -63718, 91540, 219354, 333214, 432822, 483612, 440475, 290770, 62675, -168439, -309221, -289755, -103382, 173854, 447807, 675713, 857268, 997099, 1058163, 982636, 791711, 576856, 400654, 273386, 181950, 111241, 47712, 10076, 45045, 150101, 263150, 312782, 234197, 32401, -168415, -251734, -221501, -148684, -70967, 37175, 214285, 454914, 694392, 840535, 852874, 763812, 624050, 474296, 315491, 124738, -84793, -248093, -290503, -181642, 54784, 370807, 681400, 873442, 894793, 784446]
15133G84446j59286j50485j40354j24502o4741L0464J13144J21535M2463o3219
15123C89465j43423j70222j17222j5299L5773k1228j34921k04334j95017j61080
15113g37508j34653q9973q81J13591K03149K32718K15211J88358J71273J48203
15103C09488J07613O0083P867o8696j63699k13399j71047n4893P0080J30791J07544
15092A21732L9150j8641k6315L852J2519k5647r9929j65211j61440j03848m7651
15081d71429J089N8108J06924R4857L977j09633j67020j42114p4483N461J10663
15070e83600K11547K18552J05109m9187j31141r2888o332M0334M1263M0172P4507
15059a31664J33105J48295P6976k9064p5328n2564l4169n2884p8165p4896l3352
$$ y = [784446, 625160, 474675, 334321, 209819, 145078, 175542, 288686, 410221, 452684, 389465, 246042, 75820, -41402, -56701, -20928, -42156, -177077, -381411, -576428, -737508, -872161, -962134, -963015, -849424, -646275, -413557, -198346, -9988, 161285, 309488, 417101, 477184, 485051, 416355, 252656, 39257, -131790, -186683, -116603, 14188, 121732, 160882, 142241, 115926, 119778, 132297, 106650, 6721, -158490, -319930, -423778, -471429, -470340, -412232, -305308, -210451, -206474, -316107, -483127, -625241, -699724, -694263, -583600, -372053, -153501, -48392, -97579, -228720, -321608, -327940, -287606, -246343, -206171, -131664, 1441, 149736, 226712, 197648, 122320, 69756, 35587, -17297, -95462, -170358, -203710]
15048b03710K4238O3082O1851L0285k9596j19542j81131j53256l7770J06201K15506
15037b23842K58870K41017J85190J03303m864j28905k54050l48789l59903k88116
15027h20089j95765j23767o0694K6973J45266K56655L08504K56685J21288k0710
15017a05654j01735r9979n4618l6835o6920r0563o1071J6466J19763K14942K62875
15006c329K65566K44042J70906L1644q9005r8544j8873L6983k4810j87386l40983
14995a3789l84124l33485k55233j42060J9293J67961K42105K64748K82270K97535
14985A45221K87070K10206N0361j40753k92050l79181m04460l71331k78513j52730
14975a326160n3448k8106l6069J9914J44161K34054K18091J36982O1332K445m0953
$$ y = [-203710, -179472, -116390, -54539, -24254, -53850, -173392, -354523, -507779, -545549, -439348, -223842, 35028, 276045, 461235, 564538, 559674, 430769, 176719, -172070, -531973, -820089, -1015854, -1139621, -1200315, -1173342, -1028076, -771421, -462917, -206232, -84944, -105654, -207389, -307368, -361986, -398821, -465741, -556304, -617375, -600909, -481146, -266204, -3329, 262237, 506279, 677185, 708829, 619824, 521280, 502407, 539390, 514580, 327194, -13789, -397913, -731398, -986631, -1128691, -1109398, -941437, -699332, -434584, -152314, 145221, 432291, 642497, 692858, 552105, 260055, -119126, -523586, -894917, -1173430, -1326160, -1379608, -1407714, -1443783, -1423869, -1279708, -1045654, -827563, -690581, -629249, -626804, -667757]
14964f67757m6650k303O5021J02356J01202P8046M8037L8424M1696K7212m711
14953b19427j0370J7879L4114N754o7258j36691j66889j56529j13511o9829n1848
14942i34605n4087p7511j25282j62517j43205m6906J00722K41026L36527L82114
14932d83724L69049L01670K31928J90052J82785K09824K44088K61776K27968P6168
14922A811584j59476l32357l61930k86714j78866p0345J6127O5844Q6415Q0600
14912F70882L7785m7395j46739k45236l62650m89143n44784m70704k97883j07032
14902b002899K8334R7804J37024J47051J03127L4647J4498N5523J03899J38042
14892a142950J56877J28481M1907n9453j04338m8388O7125J44146J30025P4981
$$ y = [-667757, -714407, -716710, -651689, -549333, -448131, -370085, -322048, -283624, -241928, -214716, -219427, -229797, -211918, -177804, -172050, -239308, -375999, -542888, -699417, -812928, -882757, -934605, -988692, -1066203, -1191485, -1354002, -1497207, -1544113, -1443391, -1202365, -865838, -483724, -114675, 186995, 418923, 608975, 791760, 1001584, 1245672, 1507448, 1735416, 1811584, 1652108, 1319751, 957821, 671107, 492241, 421896, 438023, 503867, 590282, 670882, 708667, 661272, 514533, 269297, -93353, -582496, -1127280, -1597984, -1895867, -2002899, -1974565, -1876761, -1739737, -1592686, -1489559, -1454912, -1440414, -1384891, -1280992, -1142950, -986073, -857592, -815685, -875138, -979476, -1027864, -960739, -816593, -686568, -611587]
14882f11587P0765J14341J15723N1324k7352q3930j12962j12890q2944m9189k9300
14871g58001o858L1781Q1855J48173K05002K01852J28736K6165m4937r0567j49676
14860b26475j83189j39740o2667k9902n0127n8162q151N7686P5622K0177o8138
14849f73066j04250m1218P1244J41295J37677R4758J9559j07907k24638k57072
14839i43618k47922k27906j43814o013R3879J25490J54128K21683K62986K13850
14829d97257J37822J39464J85064J73149Q6542k4341j04309j17100n0351P3145
14819A828K19737L48264L68791K71208J66860P8926n1142k03612k76016k33273
14809F91571j45171o5866j5537k5582p0874p8048j6160P0831J08780N4348o7012
$$ y = [-611587, -540822, -426481, -310758, -259434, -286786, -370716, -483678, -596568, -679512, -728701, -758001, -764859, -733078, -651223, -503050, -298048, -96196, 32540, 58705, 13768, -76799, -226475, -409664, -549404, -612071, -641973, -692100, -750262, -758413, -700727, -625105, -604928, -673066, -777316, -818534, -747290, -605995, -468318, -373560, -354001, -461908, -686546, -943618, -1191540, -1419446, -1563260, -1569273, -1475394, -1349904, -1195776, -974093, -711107, -497257, -359435, -219971, -34907, 138242, 224784, 200443, 96134, -20966, -71317, 1828, 221565, 569829, 938620, 1209828, 1376688, 1455614, 1404472, 1200860, 924844, 691571, 546400, 480534, 464997, 439415, 368541, 290493, 274333, 345164, 453944, 508292, 441280]
14798D41280j79838k17006j74069j08379m8295J0229M1808J7405l9601r3880j41866
14787d92212j73990j75250j33760l9342M5615N3027J4502J0162O2542J30120J77891
14776e20695K07528K30885K34486K25000K32198K19292J36889M716j30828k34487
14766F04984k78222k53800j83915j09074o3938m4177j2834N1925J35173J97283
14756D3405K15308J97770J47830O5309j9857o2085o3780p6340j18247j64706j96637
14745c2030j95052j33201p369J44636K50857K49334J58590M6894m2049q2099n9972
14734B98539j210M7099Q6494J44034J84075J32715j078j27436j76462j44545o9538
14723C72687k3900n0421j12460j60972j54310n9166J05562K42547K50462J31639
$$ y = [441280, 261442, 44436, -129633, -238012, -286307, -276078, -234270, -216865, -256466, -350346, -492212, -666202, -841452, -975212, -1014554, -968939, -915912, -901410, -891248, -828706, -698586, -520695, -313167, -82282, 152204, 377204, 609402, 828694, 965583, 970299, 839471, 604984, 326762, 72962, -110953, -220027, -283965, -328142, -340976, -289051, -153878, 43405, 258713, 456483, 604313, 669622, 649765, 587680, 523900, 447560, 329313, 164607, -32030, -227082, -360283, -367652, -223016, 27841, 277175, 435765, 482659, 440610, 358511, 298539, 297329, 344428, 430922, 574956, 759031, 891746, 890668, 763232, 586770, 442225, 372687, 348787, 298366, 185906, 24934, -129376, -188542, -82980, 159567, 410029, 541668]
14713E41668o329o4367l4458l491k9058q6195j46320j87323j94031j85335j82620
14702e77859j73601j38459q1788k2658K0995M1308M7724O2789Q8776Q9958M6216
14691e96599j485o914L0153N8947M3310J5704L5716J04470J72448K10598K16779
14680B83127K01781J52694N1804o9174j32958q8380P984O4664O0676L4424K1708
14669E88350J6467k3814j01481j37425p9865J8090Q8508J21402J24581J01005
14659G15818N1509k0126q8687j41128j88679k09822j81420j39139j30233j36380
14649d68287j29465j25067j24154j19611j15029p2532K3413J12661J44146J37527
14639g36398J47637J79169J92243J82788J85701K22197K77634L22373L10386J73284
$$ y = [541668, 535339, 470972, 436514, 433023, 403965, 317770, 171450, -15873, -209904, -395239, -577859, -751460, -889919, -971707, -994365, -973370, -932062, -884338, -821549, -732773, -642815, -596599, -598084, -604998, -574845, -515898, -472588, -456884, -421168, -316698, -144250, 66348, 283127, 484908, 637602, 689406, 620232, 487274, 398894, 406878, 471542, 532218, 566642, 588350, 604817, 581003, 479522, 342097, 262232, 280322, 368830, 490232, 614813, 715818, 767327, 747201, 658514, 517386, 328707, 118885, -62535, -201674, -331907, -468287, -597752, -722819, -846973, -966584, -1081613, -1154145, -1130732, -1018071, -873925, -736398, -588761, -409592, -217349, -34561, 151140, 373337, 650971, 973344, 1283730, 1457014]
14629A457014q4188l53560m94785m30760k39049n1770Q2894J58213J52424Q8927
14619B85360M7587M4608L9764L5601L0161r509q0851j56911k29044k78044k56953
14608e28231j52470r540J16227J80226J83833J44087N2663n2723j03354r4847
14598b64129o9163n7088o4019p1336q9496j31786j60048j25379m0641K0580K0758
14587a031747k002k6053n6836o1673j5623M1989O8539P6681J05404J52438K07690
14576e41193K67504L05562K79820J81011Q1627N8699Q9106Q6026J5679o0692r1642
14565F71507q6887p0179l7468L0218J07104J47237J39420J09915R0352P7200O2824
14554A241243N4809M5076L5854L7201M5473N4043O3296O5148L4693l2336j06615
$$ y = [1457014, 1372826, 1019266, 524481, 93721, -145328, -197098, -114204, 44009, 196433, 285360, 332947, 377555, 417319, 452920, 483081, 473572, 392721, 235810, 6766, -271278, -528231, -680701, -690241, -574014, -393788, -209955, -65868, -13205, -65928, -169282, -264129, -333292, -390380, -454399, -525735, -615231, -747017, -907065, -1032444, -1073085, -1052505, -1031747, -1033749, -1059802, -1116638, -1178311, -1193934, -1151945, -1083406, -1006725, -901321, -748883, -541193, -273689, 31873, 311693, 492704, 574331, 633030, 722136, 808162, 823841, 763149, 671507, 584620, 514441, 476973, 507191, 614295, 761532, 900952, 1010867, 1101219, 1178419, 1241243, 1296052, 1341128, 1376982, 1414183, 1459656, 1513699, 1576995, 1642143, 1676836, 1644500, 1537885]
14543A537885j59726j82093j81853j52938r0255k3605J1292k07m0681m9115l506
14532F65198L2450K2141o772k7068k1524M137K1636K9264K8594O214j7945q668
14520G27657J5434M3119R3501J76074K73570L16239K51855J36109M0589k3741
14510B050406n5668l5560J6691J8305n8088j31469j33846r2667o6616q4229j09286
14499A317973r0456j9376R1921K06223K63551K46026K02270J80328J54549P4091
14489B627100j5454m4556j6375K2858N3646P8403P3312K0062o6324j64787k53125
14478B314760l06541k90253j77848o798J50831K41735K23716R5329p7865j94306
14468A972760j79515o7175M6462R4390P1621L5536J8399j1919q1152j59867j95988
$$ y = [1537885, 1378159, 1196066, 1014213, 861275, 771020, 747415, 758707, 758500, 717819, 668704, 665198, 697648, 719789, 713017, 685949, 664425, 668562, 690198, 719462, 748056, 754270, 736325, 727657, 743091, 786210, 879711, 1055785, 1329355, 1645594, 1897449, 2033558, 2074147, 2050406, 1994738, 1959178, 1975869, 1994174, 1936086, 1804617, 1670771, 1578104, 1511488, 1427259, 1317973, 1227517, 1208141, 1300062, 1506285, 1769836, 2015862, 2218132, 2398460, 2553009, 2627100, 2611646, 2567090, 2550715, 2573573, 2627219, 2705622, 2778934, 2798996, 2732672, 2567885, 2314760, 2008219, 1717966, 1540118, 1533320, 1684151, 1925886, 2149602, 2244931, 2167066, 1972760, 1793245, 1726070, 1772532, 1866922, 1938543, 1974079, 1992478, 1980559, 1899407, 1739540, 1543552]
14457A543552j66072r4772k2424L8352R6400J44552J58186J29660R1330N1251
14447A970015j4596r1164j50732j62424q4694M5074J25288J03632L5735O026J0774
14436A792934K3141L7788N4113R8136J71613J98279J35968K9361o8987j52133
14426B320213k44603l33597l66914l05275j35964Q3014K47501L00146K53580J49921
14416A968022L3373l2316j6082L4691Q6851J38589J72979J83722J94290K00404
14406B964523J57004N5735m3942q0822m2015M8227J52644K44937L08971L04087
14396D069349J96353K7929j18073j81917j74586j59075j59200j57003j36439r4239
14386C113099l2029M0986J14414J82437K14396K05268K08254K42482K68296K56854
$$ y = [1543552, 1377480, 1282708, 1260284, 1298636, 1395036, 1539588, 1697774, 1827434, 1918764, 1970015, 1955419, 1864255, 1713523, 1551099, 1466405, 1511479, 1636767, 1740399, 1776134, 1782160, 1792934, 1816075, 1853863, 1907976, 2006112, 2177725, 2376004, 2511972, 2541333, 2472346, 2320213, 2075610, 1742013, 1375099, 1069824, 933860, 1016874, 1264375, 1564521, 1818101, 1968022, 2001395, 1969079, 1952997, 1987688, 2074539, 2213128, 2386107, 2569829, 2764119, 2964523, 3121527, 3177262, 3133320, 3052498, 3010483, 3058710, 3211354, 3456291, 3765262, 4069349, 4265702, 4293631, 4175558, 3993641, 3819055, 3659980, 3500780, 3343777, 3207338, 3113099, 3081070, 3122056, 3236470, 3418907, 3633303, 3838571, 4046825, 4289307, 4557603, 4814457]
14376D814457K28552J98552J50512P7663M333l5955m2441m5674p1123j17249j32286
14365E029341p5087K2822J04406J62490K19417L01582M22665N59184O67504P35049
14355H149373P93192Q59721R13383R23043Q38771O38688M00106K10057R4440O5099
14345A3885873J06897J56871J56967J33302J55120K38017L57700M81735N51008
14336A6223490N46077N02044M52549M44166N14485O15257O86008P30898Q17369
14327B1532343J016077J324114J645467J903799K122252K377550K715768L130359
14319C7767729L603991M193093N013215O129014P526915R264725J1526493J4545908
14311I9571083J8535046K3654536K9957046L7298117M4927810N0567438M9158545
$$ y = [4814457, 5043009, 5241561, 5392073, 5469736, 5474069, 5438114, 5395673, 5349999, 5278876, 5161627, 5029341, 4954254, 4977076, 5081482, 5243972, 5463389, 5764971, 6187636, 6746820, 7414324, 8149373, 8942565, 9802286, 10715669, 11638712, 12477483, 13116171, 13516277, 13726334, 13820774, 13885873, 13992770, 14149641, 14306608, 14439910, 14595030, 14833047, 15190747, 15672482, 16223490, 16769567, 17271611, 17724160, 18168326, 18682811, 19298068, 19984076, 20714974, 21532343, 22548420, 23872534, 25518001, 27421800, 29544052, 31921602, 34637370, 37767729, 41371720, 45564813, 50578028, 56707042, 64233957, 73498682, 85025175, 99571083, 118106129, 141760665, 171717711, 209015828, 253943638, 304511076, 353669621]
14304C53669621L3950696M517489k6257288m4298778m8293143m4422652l7878626
14297A90987319l1214523k5364125k0521838j6614851j3496850j1020364r049713
14290F3705055p492428o287637n389874m680978m026586l403311k861162k406953
14282B7156126k045366j783889j605850j480562j371624j233238j067448r43505
14274A5624644q89834q68230q41787p79110o60110n23954m56798m62042m69559
14265I673220m39314l77573k94074j71078J1180K15892L66743M01494L08596J00175
14255I795261j82028m16361n09432m85939m21111l69174l39511l31654l39432
14246F400619l66076m11720m57432m86125m95934m75691m20110l40786k47747
$$ y = [353669621, 387620317, 392137806, 365880518, 321581740, 273288597, 228865945, 190987319, 159772796, 134408671, 113886833, 97271982, 83775132, 72754768, 63705055, 56212627, 49924990, 44535116, 39854138, 35827552, 32424241, 29563079, 27156126, 25110760, 23326871, 21721021, 20240459, 18868835, 17635597, 16568149, 15624644, 14734810, 13866580, 13024793, 12245683, 11585573, 11061619, 10604821, 10142779, 9673220, 9233906, 8856333, 8562259, 8391181, 8402361, 8618253, 8984996, 9386490, 9695086, 9795261, 9613233, 9196872, 8687440, 8201501, 7780390, 7411216, 7071705, 6740051, 6400619, 6034543, 5622823, 5165391, 4679266, 4183332, 3707641, 3287531, 2946745, 2698998]
14237B698998j43697l8157K0198L687m2743o9693o5768o4895j05115j62380j85711
14226A844724j55981q9250m1618m2289n9826n8908k7951R54k8374q4775p2375
14215A184331N1816K10940K64141J85771P8835K5421K3103K4453J0515k390p819
14204B049117j1322p943m510o584m065r1m979k185K8110M3441k4197j39236j85472
14191A730084j37916o7802k5361j9501m5621o6874n8745n9914j09659j71526j78079
14180G89086j03781K6823J51949K26266K44869K14662J44608M6428m4618q5365
14170A610927r2026j11648j37599j38687j20643p9373p688L1141l4909j47696
14160G71799j89469j38373p0440j1369Q5191K03976K72704K69269K01371Q2603
$$ y = [2698998, 2555301, 2517144, 2537342, 2541029, 2498286, 2428593, 2362825, 2297930, 2192815, 2030435, 1844724, 1688743, 1599493, 1557875, 1515586, 1455760, 1396852, 1368901, 1369855, 1341481, 1256706, 1184331, 1236147, 1447087, 1711228, 1896999, 1975834, 2001255, 2024358, 2048811, 2059326, 2056936, 2049117, 2037795, 2029852, 2025342, 2018758, 2014693, 2014602, 2009623, 2007438, 2035548, 2078989, 2054792, 1915556, 1730084, 1592168, 1524366, 1499005, 1479504, 1433883, 1367009, 1308264, 1248350, 1138691, 967165, 789086, 685305, 712128, 864077, 1090343, 1335212, 1549874, 1694482, 1740910, 1696292, 1610927, 1518901, 1407253, 1269654, 1130967, 1010324, 930951, 923263, 954404, 919495, 771799, 582330, 443957, 373517, 362148, 447339, 651315, 924019, 1193288, 1394659, 1477262]
14150A477262m6171j33752j26268j7249J08351J61433J57091J35026Q0168m747
14140A791144p0523p3637l0725l1824j27105k58362l30948l22053k77819k09243
14130E8905r5440L6300J48116K39018K97073K84385K14785J44758R5863N2028
14120A475791J3099j5467n2758r1683j19613j62159k22572k51361j97246o8516
14110C07515O9795J38087R0548n0076j89954k38073j75311m8323P6916J49237
14100A30361J40384P1699Q662j1696p417p723P68J7647J009p0838j65414k08762
14088a01320j46029j88J29758J56689J01986M3353L9070J03371J93292K23041
14078G43023J46593J4942o9146l8666Q5379J92227J83542P3032m2696p9531k1851
$$ y = [1477262, 1431091, 1297339, 1171071, 1153822, 1262173, 1423606, 1580697, 1715723, 1795891, 1791144, 1720621, 1646984, 1616259, 1584435, 1457330, 1198968, 868020, 545967, 268148, 58905, -36535, -235, 147881, 386899, 683972, 968357, 1183142, 1327900, 1423763, 1475791, 1488890, 1473423, 1420665, 1328982, 1209369, 1047210, 824638, 573277, 376031, 307515, 377310, 515397, 605945, 555869, 365915, 127842, -47469, -95792, -18876, 130361, 270745, 342444, 351106, 339410, 331993, 324270, 325038, 342685, 343694, 272856, 107442, -101320, -247349, -247537, -117779, 38910, 140896, 184249, 223319, 326690, 519982, 743023, 889616, 904558, 835412, 796746, 882125, 1074352, 1257894, 1330926, 1288230, 1208699, 1186848]
14067A186848R0360J75700J67053Q1724j2242p6826j18441j19455r4958j22448
14057A157315k17647k98865k90073j91301p5116j5316j8979l6634k9793r456n362
14046c1227m7964j15425j38517j02338m0048O114j3774q1583j06175m6870M4980
14035f72827J06630J28439J29853J36334J42045J16438O5414K3178K6256Q0702
14025B82462J50453J96375J85310J01688j8993j01758j23261j20539j24090j27156
14015C00491j21956j24948j38735j47641j50472j82425k42191k59362j80927k9512
14005a277678J17826J75891J25503L5293l5862j06896j80720k11871j90504j49961
13995a698979r2442Q592J46593K81197L58641L59154L22810L06491L20917L31911
$$ y = [1186848, 1277208, 1452908, 1619961, 1701685, 1689443, 1612617, 1494176, 1374721, 1279763, 1157315, 939668, 640803, 350730, 159429, 84313, 68997, 50018, 13384, -16409, -25865, -31227, -79191, -194616, -333133, -435471, -475519, -469405, -483179, -564762, -670937, -717807, -672827, -566197, -437758, -307905, -171571, -29526, 86912, 152326, 175504, 201760, 282462, 432915, 629290, 814600, 916288, 897295, 795537, 672276, 551737, 427647, 300491, 178535, 53587, -85148, -232789, -383261, -565686, -807877, -1067239, -1248166, -1277678, -1159852, -983961, -858458, -823165, -859027, -965923, -1146643, -1358514, -1549018, -1698979, -1791421, -1782829, -1636236, -1355039, -996398, -637244, -314434, -7943, 312974, 644885]
13985F44885L11416K64043J95232Q5968n1815j50097j55613r7114m1270l1712
13975I73923n2759p3239r7317j15011j01601p1670o6623q3159o0250L8426J77259
13964D67979K72569K76519K06898J01093j1046j29866k30005k34236j34771k0827
13954E64307N0074P1432L9607k2967p6114r8334q5373o9528j10308j89809j88536
13943a15549m3903J14556J29754K4591n2139r217Q0524J05766O1028o534o5420
13932B23457q7159n7522J0126O8807N9716k3174j11847j17507k7259P1515J07734
13921A16887Q6055L2688l7059r7953j22408j05957p5624n0974j2677O0376J42927
13910f3719J94610K10767J91825J30245L6628n2638r7878j00120j12072j66781
$$ y = [644885, 956301, 1220344, 1415576, 1501544, 1449729, 1299632, 1144019, 1046905, 1005635, 973923, 921164, 847925, 750608, 635597, 533996, 462326, 395703, 312544, 252294, 290720, 467979, 740548, 1017067, 1223965, 1325058, 1314012, 1184146, 954141, 719905, 585134, 564307, 614381, 685813, 725420, 702453, 626339, 528005, 442632, 373104, 262796, 72987, -115549, -159452, -44896, 84858, 109449, 57310, 48093, 128617, 234383, 295411, 288877, 223457, 136298, 78776, 88902, 157709, 217425, 194251, 82404, -35103, -62362, 9153, 116887, 202942, 235630, 198571, 100618, -21790, -127747, -203371, -254345, -267022, -206646, -63719, 130891, 341658, 533483, 663728, 700356, 647718, 549840, 449720, 337648, 170867]
13900A70867k37403k85319k88675k29773j15019p620L5318N7628J36861K27965
13890e35170K17964J08460j0680p6514p0679j8788J7630K439k6664j5558K2311
13879c85249L8859L9815N2395N6530K4704l3272q5257r7984o8987m5649p7703
13868e81798j59508k33682k39604j71904r5094n8178o1149q8439j19070j14354
13858a922780n8686J8918R7220J71335K16943J89303P9882m8330r9361o1016Q437
13847a408135J06196K32632L19270L05302K26404J64690J58643J85800J80912
13838D71714J21272O3378M3609K8553J087j5436l2418p3725j21719j27771r7420
13827B61124o7969m6723n2656j02130j62219j63384o4675Q5305J85001J93432
$$ y = [170867, -66536, -351855, -640530, -870303, -985322, -992942, -957624, -899996, -763135, -535170, -317206, -208746, -219426, -295940, -366619, -385407, -367777, -365338, -392002, -407560, -385249, -346390, -306575, -254180, -197650, -172946, -206218, -291475, -389459, -458446, -504095, -581798, -741306, -974988, -1214592, -1386496, -1481590, -1539768, -1600917, -1689356, -1808426, -1922780, -1981466, -1962548, -1865328, -1693993, -1477050, -1287747, -1207865, -1256195, -1355556, -1416572, -1408135, -1301939, -1069307, -750037, -444735, -218331, -53641, 105002, 290802, 471714, 592986, 656364, 699973, 728526, 729613, 714177, 681759, 608034, 486315, 358544, 261124, 193155, 146432, 93776, -8354, -170573, -333957, -398632, -313327, -128326, 65106]
13817F5106J43774P9573K2536k8278n3043l7986l0007m1796O082J39441K69670
13806E35072K98664K21390J05695J4090m3573j13695k20528k98108k89448k31946
13796b2387j68690j10674m6125L0972Q9178J13899J42885J84418J85993J24142
13786E23611L6218j2129K413L8350N5900M2906J2561j7309m3244o9416r6183j11216
13774C62462j01616p4385n9793o6949o4761m9808l6246k0488q967l1470j04354
13763b56375j89920k12422j46276m0803O4139J65866K55383L15051L74570M82418
13753H11631N95188N97847M25804J36928j06541j92959j51325p5836k2192P794
13743B026339K1587M329k5915o220N1700P4397L8683m2982j54285k29909k40161
$$ y = [65106, 208880, 288453, 310989, 282711, 229668, 191682, 161675, 119879, 125961, 265402, 535072, 833736, 1055126, 1160821, 1174911, 1131338, 1017643, 797115, 499007, 209559, -22387, -191077, -301751, -347876, -316904, -227726, -113827, 29058, 213476, 399469, 523611, 559829, 547700, 550113, 588463, 644363, 687269, 699830, 682521, 639277, 569861, 473678, 362462, 260846, 186461, 126668, 59719, -5042, -54850, -91096, -111584, -120551, -152021, -256375, -446295, -658717, -804993, -845796, -781657, -615791, -360408, -45357, 329213, 811631, 1406819, 2004666, 2430470, 2567398, 2460857, 2267898, 2116573, 2040737, 2018545, 2026339, 2047926, 2052255, 2026340, 2020120, 2071820, 2146217, 2184900, 2141918, 1987633, 1757724, 1517563]
13732A517563k49164k90204l20956k97805k22230j17054j7382Q956m6206j16222
13722a50704j71282k15564k35808j96466p8891Q2835K17135K71929K40740J53418
13712h2658N6568N719K5164P3530P7572j067j09764j74733j68251r1649J2680
13701c76889R7112J66385K21116K45090K49922K36380K08062J85044J56806R7155
13691A486183P032n6149n7484o8350j26257j61104j21566l8462K3685K9539L729
13680I20796j1965j7311k2020l1441o3479j12872j68815k22281k23425j39535
13670i2348j2118Q6194J09929R8196J40520K45261L31665L46071K86856J70835
13660A711061L8493p6878j77886k56168k90075k97828k88116k32637j60661j40902
$$ y = [1517563, 1268399, 978195, 657239, 359434, 137204, 20150, 2768, 11724, -34482, -150704, -321986, -537550, -773358, -969824, -1048715, -965880, -748745, -476816, -236076, -82658, -26090, -20371, 4793, 78323, 155895, 154828, 45064, -129669, -297920, -389569, -376889, -279777, -113392, 107724, 352814, 602736, 839116, 1047178, 1232222, 1389028, 1486183, 1493215, 1437066, 1379582, 1311232, 1184975, 1023871, 902305, 863843, 887528, 917067, 920796, 908831, 891520, 869500, 838059, 774580, 661708, 492893, 270612, 47187, -92348, -104466, -18272, 91657, 189853, 330373, 575634, 907299, 1253370, 1540226, 1711061, 1749554, 1672676, 1494790, 1238622, 948547, 650719, 362603, 129966, -30695, -171597]
13650a71597j42956r6436J2187J26096J68371J51180J29872R8965O1752O1738
13640C99172Q8940Q8243M9454K7560M8165O1089K0867n6463j16851j35190j59146
13629C15840k17900k83179l12784k57247j21779J4316Q1912J10888J72601K49063
13619b48269K53700J50017j481j21471j83576j87235j44790q0412k083N6587N0631
13608d58382q15l3624j7775K0878M8050P1951J24170K06470L01593L54327K80657
13597H97500R4290o8383j10503p4304p0955j22663j54267j25752p4951k7634j910
13586A60468m1035j07721j41492j40271q9227J2086R4609J03329P2820J8180p7074
13575a35328j48134j44681r6819m9242l5617o8224j07234q7102K868R1996R2013
$$ y = [-171597, -314553, -410989, -398802, -272706, -104335, 46845, 176717, 275682, 337434, 399172, 488112, 576355, 625809, 653369, 701534, 762623, 783490, 727027, 610176, 474986, 315840, 97940, -185239, -498023, -755270, -877049, -862733, -780821, -669933, -497332, -248269, 5431, 155448, 153967, 32496, -151080, -338315, -483105, -563517, -565600, -509013, -458382, -459197, -492821, -510596, -489718, -441668, -369717, -245547, -39077, 262516, 616843, 897500, 991790, 923407, 812904, 738600, 667645, 544982, 390715, 264963, 190012, 162378, 160468, 119433, 11712, -129780, -270051, -359278, -347192, -252583, -149254, -76434, -58254, -135328, -283462, -428143, -524962, -574204, -609821, -678045, -785279, -872381, -869513, -777517, -685504]
13564f85504Q208o2988p3428l1091M9132J24279J46360J21811J03591J21050J36963
13553d1617J07140Q4710J39222K36675L00574L14554K95314K20215P1853q6535
13543A642105j68106j47535p6937k5852k1842n5636q5775r7763j18226j41242
13533G03191j20663n0314R190J7222j8673n9057m9717M0593J61325K21128K00416
13522A054641J52872J20038Q0696n047j16234k03398k49416k61410k22001j13707
13512B37034K8980J61997K42635K42019J93085J42684Q3901j1617j26331k14530
13502I79857k48778k18038j58000j19467r4824p1518o8243r5291j32219j33826
13492c60347p8070m617k293q3471j42345q5434M1693J31934J69480J56093P3584
$$ y = [-685504, -677296, -740284, -813712, -844803, -795671, -671392, -525032, -403221, -299630, -178580, -41617, 65523, 150233, 289455, 526130, 826704, 1141258, 1436572, 1656787, 1728640, 1642105, 1473999, 1326464, 1249527, 1223675, 1201833, 1146197, 1060422, 962659, 844433, 703191, 582528, 532214, 541404, 558626, 539953, 480896, 431179, 471772, 633097, 854225, 1054641, 1207513, 1327551, 1408247, 1403200, 1286966, 1083568, 834152, 572742, 350741, 237034, 266014, 428011, 670646, 912665, 1105750, 1248434, 1332335, 1320718, 1194387, 979857, 731079, 513041, 355041, 235574, 140750, 69232, 989, -94302, -226521, -360347, -438417, -443034, -445327, -528798, -671143, -756577, -714884, -582950, -413470, -257377, -183793]
13481a83793j4857k6811K4567Q0675J13825J17589Q4575M2092L4363L5374K0380
13470C27979K017k5299o7398j09478j29412j03976l4321K2806j030o9684r4998
13459b82794p0358l1584r111j8228k9232P276Q7936J48710J49168J21238J01901
13448A74922Q6261O1763N3718Q6675J42874J93341K15433J69369L3686j25492
13438A092550k25071k28037j52407m2778N4475P8610J7846o7585r8752o1697r811
13427C57343L1601Q2582J46442J84361J70216J56653K02343K66338K72202K13824
13417B083905J25497R309j52074l28838m34709m22024l15849j60544k3225L1661
13407D13109J9266Q67J3193N2346R5522J18755Q7454o152j31595k31661k53302
$$ y = [-183793, -198650, -225461, -200894, -120219, -6394, 111195, 195770, 237862, 272225, 307599, 327979, 329996, 304697, 237299, 127821, -1591, -105567, -139888, -117082, -118112, -187796, -282794, -353152, -384736, -393847, -412075, -441307, -434031, -346095, -197385, -48217, 73021, 174922, 261183, 322946, 376664, 463339, 606213, 799554, 1014987, 1184356, 1218042, 1092550, 867479, 639442, 487035, 444257, 498732, 577342, 595188, 527603, 428851, 367154, 357343, 388944, 471526, 617968, 802329, 972545, 1129198, 1331541, 1597879, 1870081, 2083905, 2209402, 2218711, 2066637, 1737799, 1303090, 881066, 565217, 404673, 381448, 413109, 432375, 433242, 446435, 498781, 594303, 713058, 800512, 794360, 662765, 431104, 177802]
13396A77802j84966p5770j257O656k0196j8084J5407K8750L9697Q5518J17125
13385A70682Q9037K7021j9139r487N0826R9534P3338o327m0774j745M4923O4651
13373E42540O8185P9228J05730J06945K8986j04965j86327j48132l4462P3757
13363E31485J19063R0730K7777k2940m1659l6256k2639k3976o6049j39854j80382
13352B35300j36836o6302l2279l1712m7065l5631M8334J68641K25377J75408P3982
13341E77217J3416J8362K5773O580j7585n0045j01129j56789k06138k36758k19731
13330c46827j51358n9725J4129M3631M2453L1628J6102M222J0977L7562N3882
13319c03324M7755N4163P2057M9181o597m8760r1372j31182j02743J384J10481
$$ y = [177802, -7164, -82934, -84191, -77535, -97731, -115815, -100408, -71658, -31961, 53557, 170682, 259719, 286740, 267601, 258114, 308940, 408474, 481812, 475485, 434711, 432966, 477889, 542540, 610725, 689953, 795683, 902628, 931614, 826649, 640322, 492190, 457728, 531485, 650548, 741278, 769055, 746115, 704456, 668200, 645561, 621585, 555536, 415682, 235300, 98464, 32162, -117, -31829, -78894, -114525, -66191, 102450, 327827, 503235, 577217, 590633, 608995, 634768, 641348, 623763, 573718, 472589, 315800, 109662, -127096, -346827, -498185, -557910, -543781, -500150, -457697, -426069, -409967, -405745, -394768, -357206, -303324, -255569, -201406, -129349, -80168, -86765, -135525, -226897, -358079, -460822, -459438, -348957]
13308c48957J54305J11677J6455n0641m3411j3538j4834m0429o5665o0232Q06
13297c54464Q2689R9923J8237r4773j42264q6600K2163J17238J62543J27647L2874
13286a4787l8871m2442q812L4121P6773J03525J09563R4319L1339r1204k23750
13275B9774l05695l12456k43545j24684k693Q9936J36069J42111J58604K19200
13265b13379K90588L35372L41789K80700J32244n9048k06770k79202l22094l57924
13255e7724l41717k50703j38666n6389P536O2287Q7211Q4426Q9727J14981J57848
13244b41183K19186K65390K56017J75151N9175J562M0262J07256J15432N3274
13234A051522j4695m4420n6247p6563q3607m5554O465J339p5912j66855k01257
$$ y = [-348957, -194652, -82975, -66520, -117161, -160572, -174110, -188944, -229373, -295038, -355270, -354464, -271775, -171852, -153615, -248388, -390652, -477252, -455089, -337851, -175308, -47661, -14787, -53658, -96100, -104912, -70791, 5982, 109507, 219070, 313389, 344728, 253524, 29774, -275921, -588377, -831922, -956606, -959299, -869363, -733294, -591183, -432579, -213379, 77209, 412581, 754370, 1035070, 1167314, 1108266, 901496, 622294, 300200, -57724, -399441, -650144, -788810, -845199, -837663, -775376, -688165, -603739, -514012, -399031, -241183, -21997, 243393, 499410, 674561, 733736, 735298, 775560, 882816, 998248, 1051522, 1036827, 992407, 936160, 859597, 775990, 730436, 736901, 738240, 662328, 495473, 294216]
13223B94216j62514r8442n1154k495Q1828J83725K18955J54098Q0453N6703M5847
13212H01220O2490J23670J77366J97199J98829J65909P4313k0000m1376J514J5167
13201A756301n4703j64205k41728k33866j44920q1041j15947j65441j16584j660
13191D36206P4228O1521k7127j35339j89159j62510r4951j4232Q3579J60031J81503
13180C73750J85163J94904J71238P6380o3831j80753k22959j66388m3636M1081
13170C64949K6370l5198p0690m3886J9397K0883q0998k20982l28505l55650k73142
13159i77452j37562l6010k353j8521m4822l3114M8528J63016K23433K16349J76066
13148d22442J13064L0243k1881J168O0423J32476K13949K63676K58726K30677
$$ y = [294216, 131702, 33260, -17894, -20389, 61439, 245164, 464119, 618217, 698670, 755373, 801220, 863710, 987380, 1164746, 1361945, 1560774, 1726683, 1800996, 1780996, 1739620, 1741134, 1756301, 1701598, 1537393, 1295665, 1061799, 916879, 835838, 719891, 554450, 437866, 436206, 510434, 571955, 544828, 409489, 220330, 57820, -37131, -51363, 32216, 192247, 373750, 558913, 753817, 925055, 1001435, 937604, 756851, 533892, 367504, 323868, 364949, 391319, 356121, 285431, 241545, 260942, 281825, 200827, -20155, -348660, -704310, -977452, -1115014, -1151024, -1153377, -1171898, -1216720, -1249834, -1201306, -1038290, -814857, -598508, -422442, -309378, -279135, -301016, -299848, -239425, -106949, 107000, 370676, 629402, 860079]
13138H60079K18132K05446J79181J41738P9432p875r0193j28265j04705k9739
13128A323231N3947Q1317M3595N390q37J6835M0221K9242j2651k0535m302l3715
13116A521738p5624o1094j5624m772o4076j52735k07910k14980j75671q9405L2253
13105D92100J48095K04305J53953K9738n9521q5677r5829q9881l8553J8406K8370
13094G05506J2193j8724n6646n0289r855k2763j23381k38501k58619j35047O2306
13083a33820J89265J84600J23984P9649N0944K1399r059j3664J0757L4598M1170
13072E79823L1400M899m4383q7731r3356o3019N006J09167J86804J91259J56797
13061I76666R7277k3871j61727k08493j38576j7502O4048N9628J288p0581j44004
$$ y = [860079, 1078211, 1283657, 1462838, 1604576, 1684008, 1676133, 1585940, 1457675, 1352970, 1323231, 1377178, 1458495, 1502090, 1507480, 1506643, 1523478, 1563699, 1592941, 1580290, 1559755, 1555453, 1521738, 1446114, 1385020, 1369396, 1364624, 1300548, 1147813, 939903, 724923, 549252, 459847, 492100, 640195, 844500, 998453, 1028191, 968670, 882993, 787164, 697283, 658730, 677136, 705506, 717699, 698975, 642329, 592040, 582185, 559422, 436041, 197540, -61079, -196126, -133820, 55445, 240045, 364029, 443678, 494622, 516021, 506962, 493298, 504055, 538653, 579823, 611223, 616122, 571739, 484008, 390652, 327633, 332639, 441806, 628610, 819869, 976666, 1073943, 1050072, 888345, 679852, 541276, 523774, 587822, 647450, 648738, 578157, 434153]
13050D34153j85729j96470k11711k05580j31033l571R5432J06267N9423K3786
13040b15033L4555P8363J08013P4294k8609j38966j68093j02525l5279l7790o0318
13029d91388k896J59172L10698L30537K28686J00693J6208M830O1758J23806J16817
13018I58921M3945j6727j5000J3073J6037Q738O20k3760m3742l7755K922N3360
13006I60632O1931J9814q0910k29159l27228k92177j73265p1872j8048J9905N8126
12995g2251J05472J64177J77788R0577o4573k10529l10226l24691k25402o9589
12985g39247M6003P8895Q4206J07295J04532N2823P715J0693N2936J20168J87488
12974A13507K25006K29347K03628J29914Q566j26208k33489k79475k40061j29932
$$ y = [434153, 248424, 51954, -159757, -365337, -496370, -499941, -404509, -298242, -238819, -215033, -180478, -102115, 5898, 80192, 51583, -87383, -255476, -358001, -393280, -431070, -491388, -494284, -335112, -24414, 306123, 534809, 635502, 651710, 656540, 718298, 842104, 958921, 1002866, 986139, 971139, 984212, 1000249, 1008987, 1009607, 985847, 942105, 904350, 907272, 960632, 1022563, 1042377, 961467, 732308, 405080, 112903, -60362, -132234, -150282, -130377, -72251, 33221, 197398, 375186, 465763, 401190, 190661, -119565, -444256, -669658, -739247, -693244, -614349, -530143, -422848, -318316, -265493, -257778, -247085, -194149, -73981, 113507, 338513, 567860, 771488, 901402, 909968, 783760, 550271, 270796, 30735, -99197]
12964i9197l0500M880o400l7398n8560k1945Q3733J89027K27200K07856J82401
12953F41097J40574L6955j07228k09302k31772k23410k20384k07206j63472q3945
12943f28093K7044J55581K56461K46167R8904o8053j10622k8697N4081M9870j1952
12932D0691m6864k0740L8692Q6869P1732j1731j03365j47270j32068q3649k9124
12921c36827L3931J20799J99978K22337J96075J63436J57529J65473J30694L8209
12911A091634m9709r1930j07667j13813j05926q1961n0773l4723m7225n6961j4549
12900C36397N2568P4510O8590Q3670J10361Q9217q227j17076j83194k07767j73290
12889A25759q5256m059L0589K1383j1499n0860o8145k7939O2832J40472J34008
$$ y = [-99197, -129697, -124817, -131217, -168615, -227175, -249120, -165387, 23640, 250840, 458696, 641097, 781671, 818626, 711398, 502096, 270324, 46914, -173470, -380676, -544148, -628093, -601049, -445468, -189007, 57160, 156064, 88011, -22611, -51308, 2773, 52643, 40691, -6173, -26913, 11779, 98648, 170380, 158649, 55284, -91986, -224054, -307703, -336827, -302896, -182097, 17881, 240218, 436293, 599729, 757258, 922731, 1053425, 1091634, 1041925, 949995, 842328, 728515, 622589, 540628, 489855, 455132, 407907, 350946, 336397, 388965, 463475, 532065, 615735, 726096, 815313, 807086, 690010, 506816, 299049, 125759, 40503, 36444, 67033, 88416, 76917, 26057, -42088, -70027, -7195, 133277, 267285]
12878B67285N1422l0911p0162q6577j09157j39279j58793j39955q9849l2665M4988
12867d93653J33512J74498J44181R9147R8170J22432J20378J13964J33362J03727
12857G49718k3177j81226k91965l32227l04688k04128l6661J39763K36414K33414
12847a4763J83814J22866O1539J9435J4267K3028Q234j8089j1920L0974O1365
12836D80750N9894O0902J07694J85072K39484K41982J77018O2930m5670j29565
12826A440491j86446k17478k43628k84943l23953k92021j60322j6764M4059J8515
12816b22490l1626m6876j6936L8577Q4022J19542J77044K48493L19782M06786
12806A076318N07315N97626O59991O40585M63262J70636q3395k23850k94963l37890
$$ y = [267285, 318707, 287796, 217634, 131057, 21900, -117379, -276172, -416127, -505976, -538641, -493653, -360141, -185643, -41462, 57685, 155855, 278287, 398665, 512629, 645991, 749718, 726541, 545315, 253350, -78877, -383565, -587693, -624354, -484591, -248177, -14763, 169051, 291917, 353456, 372891, 387158, 410186, 418420, 400331, 388411, 419385, 480750, 540644, 601546, 709240, 894312, 1133796, 1375778, 1552796, 1615726, 1570056, 1440491, 1254045, 1036567, 792939, 507996, 184043, -107978, -268300, -285064, -241005, -222490, -254116, -300992, -317928, -279351, -195329, -75787, 101257, 349750, 669532, 1076318, 1583633, 2181259, 2841250, 3481835, 3945097, 4115733, 4032338, 3808488, 3513525, 3175635]
12796C175635l58452l75687l93078l91838l81809l83544l86637l67422k87037
12787a49869j22776M6288J27771J18781O0657j3953p7271j03038r4065o0200j6490
12776b84165j3098n7621q9816p3704k4489K3651M1209L2291R846p415O534M3387
12764c93390P4021R9242J52199K35172K71194K13071J24079P0104L7510J2436
12754H95638K3969N6192N0127J760n4634r5933r6509n9176l6685p1943j43682
12743D69124k00555j97278j04407L1089J13495J16859Q2364N6006N3665L9815
12733D60177J915N639R8936K21521K68436K17325J31328N7284j4062q3888j12088
12722A252523p2168J2763R3533J44887J73070J78010J44543P5644q756o1926n5120
$$ y = [3175635, 2817183, 2441496, 2048418, 1656580, 1274771, 891227, 504590, 137168, -149869, -272645, -226357, -98586, 20195, 80852, 66899, -10372, -113410, -207475, -267675, -284165, -297263, -354884, -444700, -518404, -542893, -519242, -478033, -445742, -435896, -443311, -436777, -393390, -319369, -220127, -67928, 167244, 438438, 651509, 775588, 845692, 883202, 895638, 919607, 975799, 1025926, 1027686, 973052, 877119, 780610, 721434, 684749, 612806, 469124, 268569, 71291, -33116, -2027, 111468, 228327, 310691, 366697, 420362, 460177, 462092, 467731, 566667, 788188, 1056624, 1273949, 1405277, 1462561, 1448499, 1364611, 1252523, 1180355, 1193118, 1286651, 1431538, 1604608, 1782618, 1927161, 2002805, 1994049, 1932123, 1877003]
12711A877003k1103n968m7583j29689j62991j01376r109L8576L0267k9899j23528
12700A314600j98478k32103k42728k13648j27489k7990L7731Q3415J34049J65278
12690F92637J47982R3145L9176l920l8555l7352k39K5336j9666j33059k44143
12679E21342k88859k25143n6046J36395K34534J94001Q3663q912p1580j20221
12669C99174j36671j03905o1520n5923p7684o8984Q098J28665K22675K42005J92654
12658F88584J01139J0257o2675j12688j04696n4290l3687n3208o1805m1529j3887
12647B61515K1993P3229R6131L8106o4097j24831j27481j10170r8805q6950o4664
12636a86024o2442j07473j74257k08553j75667r1981j4885J326l5741p2080p5528
$$ y = [1877003, 1855900, 1849932, 1802349, 1672660, 1509669, 1408293, 1399184, 1437760, 1468027, 1438128, 1314600, 1116122, 884019, 641291, 427643, 300154, 272164, 309895, 393310, 527359, 692637, 840619, 933764, 972940, 969020, 930465, 893113, 892874, 918210, 898544, 765485, 521342, 232483, 7340, -48706, 87689, 322223, 516224, 599887, 590975, 519395, 399174, 262503, 158598, 97078, 41155, -36529, -105513, -97415, 31250, 253925, 495930, 688584, 789723, 799980, 737305, 624617, 519921, 465631, 431944, 378736, 316931, 275402, 261515, 283508, 356737, 452868, 490974, 426877, 302046, 174565, 64395, -34410, -121360, -186024, -248466, -355939, -530196, -738749, -914416, -1006397, -1021282, -1019956, -1055697, -1127777, -1203305]
12625a203305n5210k1387L8095J29485K26841K99203L21367K75479J95261J44048
12615C49877J21228Q8100M0919k8200r8930j22343r2501m1379k007K7662N7579
12604C00005P3544P7361R9941J49034J53259O3795o1024j35678j39910j17843
12594D62484q5647j5875P2901J24476J39949J38304J03221L1410l8489p4715j02273
12583G55746j50868j94715j81602q9326J3060K6558k7998o4535p4795p7895p8282
12572a44652q7780q4918l1621K9626M6218K6936j8785r1446j41818j21227n0115
12561f69582K3509O4131O5696M4714K1277M681N174M7649J15465J81084K55300
12550A59098L21522L28263K51848J20788j1540q5399q3487q0882j48933k52776
$$ y = [-1203305, -1258515, -1279902, -1241807, -1112322, -885481, -586278, -264911, 10568, 205829, 349877, 471105, 559205, 600124, 571924, 472994, 350651, 258150, 216771, 214764, 242426, 300005, 373549, 450910, 550851, 699885, 853144, 916939, 855915, 720237, 580327, 462484, 376837, 360962, 433863, 558339, 698288, 836592, 939813, 971223, 932734, 858019, 755746, 604878, 410163, 228561, 139235, 152295, 178853, 150855, 86320, 11525, -66370, -144652, -232432, -317350, -348971, -319345, -273127, -246191, -264976, -356422, -498240, -619467, -669582, -646073, -581942, -516246, -471532, -450255, -445574, -440400, -392751, -277286, -96202, 159098, 480620, 808883, 1060731, 1181519, 1169979, 1084580, 1001093, 920211, 771278, 518502]
12540E18502k89600k16263j05206k7921R137K9126M7256N1273K5184l074K5043
12529F3457R9735J41083J06726O3588R7952J79032K12416J77541J19506N4047
12519A315083j8325r4016j70975k21085k44143k61360k42596j64916n8198M0563
12509a19968J07826J18498R2792P1927N8732P2153J18478J30116N8714n9265j54866
12498D95137j94030k09609k36107k64684k63066k03969r8993J0643Q6623J15193
12488g62862J17308J02755M0375o0403j07991m7378N3960J07139J18605J31208
12478c07284J54259J58579J29623J05772R5923O3642J1098k6885k7945L0058J29473
12467E16313K07579K32409K38331K52346K44194J84582Q8825K1272K4497M8866
$$ y = [518502, 228902, 12639, -92567, -120488, -111351, -82225, -34969, 16304, 41488, 38414, 63457, 163192, 304275, 411001, 474589, 572541, 751573, 963989, 1141530, 1261036, 1315083, 1296758, 1202742, 1031767, 810682, 566539, 305179, 62583, -102333, -160531, -119968, -12142, 106356, 199148, 271075, 329807, 401960, 520438, 650554, 709268, 650003, 495137, 301107, 91498, -144609, -409293, -672359, -876328, -975321, -964678, -878055, -762862, -645554, -542799, -502424, -562827, -670818, -718196, -664236, -557097, -438492, -307284, -153025, 5554, 135177, 240949, 336872, 400514, 411612, 384727, 356782, 386840, 516313, 723892, 956301, 1194632, 1446978, 1691172, 1875754, 1964579, 1985851, 2010348, 2059214]
12457B059214M3653L9204N1711K1161p5616k04518l18799l31838k27624j23936
12447I32612j03349j13252q8696m8976k3569J328L4793M7109J9500k2388l6080
12436E99032j4814J7430M5116N4039N3768M8524L2871K4152K0565p516q9458k06816
12424E76893k98600l29890k72974j15700P9225K24517K65810J88819L1269j34700
12414B14669k49613k73331k09670j10570j8224Q4256J98595K58533K39468J79569
12404C13682Q6720n2014j75233j94799j29995o3877l6411m9109p5859q0591n6052
12393e13538k7493k1275m943N7474J28058J76428J92699J55620R3290L6642j7786
12382B55176p8955j57125k20063k01422j01565P537P0294J08383J55777J77577
$$ y = [2059214, 2102867, 2142071, 2193782, 2214943, 2139327, 1934809, 1616010, 1284172, 1056548, 932612, 829263, 716011, 627315, 578339, 554770, 556098, 590891, 638000, 657500, 635112, 599032, 584218, 601648, 646764, 700803, 754571, 803095, 835966, 860118, 880683, 873167, 783709, 576893, 278293, -51597, -324571, -440271, -361046, -136529, 129281, 318100, 349369, 214669, -34944, -308275, -517945, -628515, -646739, -562483, -363888, -105355, 134113, 313682, 400402, 348388, 173155, -21644, -151639, -215516, -251927, -301036, -376895, -457486, -513538, -541031, -562306, -567249, -509775, -381717, -205289, -12590, 143030, 236320, 272962, 255176, 176221, 19096, -200967, -402389, -503954, -496417, -426123, -317740, -161963, 15614]
12372A5614J28887L8957l6805q3120r5076o6404l0358o9N6389J20672J35422Q8316
12360B72425P881o4825r0750q4536o7265m131J18138K38161L08995L07649K12067
12349A153809O1704o1072j11666j11555r9544r4097q9020o6034m7947p8832j40905
12338C14841j85584k28167k90684l14252k44540j20555j9047L7143Q8869J52727
12328h09249J87803J45853M7743l1481l1119M8005J18758R3437j0758j07874j38044
12317d86926j20588j09293j15485r3196q53J18490J64437J15479M6492K4437L2902
12306d24104J9900J0292N6764J26313J28843K4314j18760j92848j96470j83390
12296g49146j63237j20458q1372q8449j18526j30580j10823o8292j0965O3633
$$ y = [15614, 144501, 183458, 146653, 63533, -31543, -97947, -128305, -128374, -71985, 48687, 184109, 272425, 280306, 215481, 124731, 40195, -27070, -31201, 86937, 325098, 634093, 941742, 1153809, 1215513, 1154441, 1042775, 931220, 831676, 737579, 648559, 582525, 534578, 455746, 314841, 129257, -98910, -389594, -703846, -948386, -1068941, -1087988, -1050845, -961976, -809249, -621446, -475593, -427850, -459331, -490450, -442445, -323687, -230250, -241008, -348882, -486926, -607514, -716807, -832292, -925488, -926341, -807851, -643414, -527935, -481443, -457006, -424104, -404204, -393912, -337148, -210835, -81992, -57678, -176438, -369286, -565756, -749146, -912383, -1032841, -1114213, -1202662, -1321188, -1451768, -1562591, -1630883, -1641848, -1578215]
12286a578215J48540K39205L05045K91724J85587N2273l3089q4182j00499l8944
12276f12555O9724J64883K10934J92781J28920O4224J4881j6636k0181k5211o5908
12265A05856r2111k7572R4803J83380K26600K67812L05178K78867J61388J56j33201
12254A371156k11424k42434k16846j49933j15426j53985k10556k13305j67891
12245c10644j19767p1563J66Q0590J08349O3569n162m1015o113J09626K40712
12234D8748K94447K28243N3317j42253k24268j39113K6876J46524J69372J37126
12224E99019R5643L9437n2169j53619j97837j37572k574J15171J41634Q4852R098
12213E41083k8655k7868j8366j2992r941M602L9838P8117J01166Q9192N5202L3850
$$ y = [-1578215, -1429675, -1190470, -885425, -593701, -408114, -355841, -388930, -473112, -573611, -612555, -542831, -377948, -167014, 25767, 154687, 218911, 233792, 217156, 196975, 171764, 105856, 13745, -13827, 80976, 264356, 490956, 758768, 1063946, 1342813, 1504201, 1504357, 1371156, 1159732, 917298, 700452, 550519, 435093, 281108, 70552, -142753, -310644, -430411, -501974, -501808, -421218, -312869, -249300, -254462, -295477, -301590, -191964, 48748, 343195, 571438, 624755, 482502, 258234, 119121, 145997, 292521, 461893, 599019, 694662, 734099, 681930, 528311, 330474, 192902, 190328, 305499, 447133, 531985, 541083, 512428, 484560, 466194, 453202, 443261, 447863, 487701, 565818, 666984, 756176, 811378, 845228]
12201H45228P393l7922l9210L3523R4661R2219N3128J4103J9195Q1931J45783
12190A310032J48062R0975M2909L3721K4628J6541L4279N1812N1674K7294m4597
12179A787330j47675k29470k59808k28243j48637n2375L0088P9197J07953J56548
12169A094908K44030L03903K38156N1040j74162l72760m94147n07105m15439k61375
12159b92951j33269o7111l0235J3822Q5155J59539J87288J53681J05507R5508
12149B76934J14132J22718Q3920l6500k13310l56970l86716k87241j16972N1510
12139g48495J59961J78905J49859J33155J24968P3971k3556j25122j93087j87616
12129d57057j02919n793L9067L5253M3269Q3566J13287J18935J29820J53358J51211
$$ y = [845228, 852621, 814699, 775489, 809012, 903673, 995892, 1049020, 1063123, 1082318, 1164249, 1310032, 1458094, 1549069, 1591978, 1625699, 1650327, 1666868, 1701147, 1752959, 1804633, 1831927, 1787330, 1639655, 1410185, 1150377, 922134, 773497, 721122, 751210, 830407, 938360, 1094908, 1338938, 1642841, 1880997, 1932037, 1757875, 1385115, 890968, 383863, -31576, -292951, -426220, -493331, -523566, -509744, -424589, -265050, -77762, 75919, 181426, 276934, 391066, 513784, 597704, 561204, 347894, -9076, -395792, -683033, -800005, -748495, -588534, -409629, -259770, -126615, -1647, 72324, 48768, -76354, -269441, -457057, -559976, -565769, -526702, -491449, -448180, -364614, -251327, -132392, -2572, 150786, 301997]
12118C01997J01069L2066j2145k2014q615K3258O9039R1911N3490k8008r8124
12107E03924j14979o0204O3887J93136K08914O7213j22607k36814k41779j56125
12097A04566j7025J27969K22257K20968J49624Q0072M3532J1577n4933j52146
12087G36461k20227k15214j52346n4333O7823J81406K27647K01982J44741P6889
12077I94829N988p2826j47835j67445j22925p2668l1574K7046O8242L9676l1480
12066D89028p8633j01834j19785j19087j20468j52444j73829j29704j8622J03036
12056d22342J80336K17135K25141J78367P6427l1093j19118j85883k02757j57417
12046b41204q6279l6005k1190k0484N56O2412J15677R5886K9960J473M1185R6322
$$ y = [301997, 403066, 435132, 422987, 400973, 392358, 415616, 484655, 576566, 630056, 602048, 503924, 388945, 328741, 392628, 585764, 794678, 861891, 739284, 502470, 260691, 104566, 87541, 215510, 437767, 658735, 808359, 888431, 931963, 943540, 888607, 736461, 516234, 301020, 148674, 94341, 162164, 343570, 571217, 773199, 917940, 994829, 1000817, 927991, 780156, 612711, 489786, 417118, 385544, 412590, 480832, 520508, 489028, 410395, 308561, 188776, 69689, -50779, -203223, -377052, -506756, -525378, -422342, -242006, -24871, 200270, 378637, 455064, 423971, 304853, 118970, -83787, -241204, -327483, -363488, -384678, -405162, -404606, -342194, -226517, -130631, -100671, -99198, -58013, 38309]
12034C8309J27406J50439J55076R4126j4853q8313r0169p5257p3633l7762L1134
12023B16503P5052P3034N2472O4220J03574J10536O2735k8073r7652r0614n1683
12012D90104m6823r1991j55543j93963j95037j73235j59386j73280j87580j87859
12002a074593j68321r0365L6956J63172K58900L07114K90491K25242J44338L7866
11992A30800j00365k10822k32680j73713q5753m6191q9615j66546k16080j96920
11982a387885j10302O831J12468J78568K05716J87705J15075L9295K8924O7616
11972e55989R4846R5633Q4781O3082M0937M2332O8670J13871J56611J62144J04745
11961D71663l186r9370j33195j16417r9006j24631j86778k03918j57239j05211
$$ y = [38309, 165715, 316154, 471230, 565356, 550503, 462190, 372021, 296764, 223131, 185369, 216503, 291555, 364589, 417061, 481281, 584855, 695391, 758126, 730053, 632401, 541787, 490104, 443281, 351290, 195747, 1784, -193253, -366488, -525874, -699154, -886734, -1074593, -1242914, -1333279, -1296323, -1133151, -874251, -567137, -276646, -51404, 92934, 130800, 30435, -180387, -413067, -586780, -672533, -718724, -808339, -974885, -1190965, -1387885, -1498187, -1491356, -1378888, -1200320, -994604, -806899, -691824, -652529, -623605, -555989, -461143, -365510, -280729, -217647, -176710, -134378, -65708, 48163, 204774, 366918, 471663, 468477, 369107, 235912, 119495, 20489, -104142, -290920, -494838, -652077, -757288]
11951g57288n9317k6796K124N1606R6560J06031R1174O6676L7730K8977N1656
11940c10867J01531J70670K32755K34621J56765P0732M8277P5182J11610J33036
11930A024312J21846P9140L9243M9940Q3096O6059l703q7214j57998j83137j33558
11919H98026m7970j0095k9184o5526q0583m5873J138k5166j39635k76823l68711
11908a90402l79753l13827j79541M023J84275L02007L29364K56079J34237O1726
11898B08188P0847J03068J03286O6640K0738J5696M9659P3176O3511K5069k1546
11887G78332n3819o5300o4360o3669o7126p1418o1602l0423J902J6164N074k5463
11875B98292n2396o8131o5503J848J19795J68917P6696r0532k08824k35416k22964
$$ y = [-757288, -816605, -843401, -841277, -789671, -693111, -587080, -495906, -429230, -391500, -362523, -310867, -209336, -38666, 194089, 428710, 585475, 656207, 704484, 779666, 891276, 1024312, 1146158, 1225298, 1264541, 1314481, 1397577, 1463636, 1459933, 1372719, 1214721, 1031584, 898026, 850056, 839961, 810777, 745251, 664668, 618795, 619933, 594767, 455132, 178309, -190402, -570155, -883982, -1063523, -1059500, -875225, -573218, -243854, 12225, 146462, 208188, 279035, 382103, 485389, 552029, 572767, 588463, 638122, 711298, 774809, 799878, 778332, 724513, 659213, 594853, 531184, 464058, 392640, 331038, 300615, 302517, 318681, 323755, 298292, 245896, 177765, 112262, 114110, 233905, 402822, 479518, 388986, 180162, -55254, -278218]
11864b78218k28572k41587k19040j52087o9376J1487Q5022J26497J31328J07124
11854g27422K5643j00892j94409k16912j92407j18659J8997J76250K80976L18276
11844g30559L01100K44599J78177J04699M1649K2673K8029M1103N9008M0091l7951
11833B92618j38848k15267k28018j54796n9580m3027r9544j41646j15761l1404
11823i35273O4712J39705J90062K08932J93555J54645J00580K6006p1783j67142
11813i6001k13597j97640j70248j44223r5112l9578R26K9849N7747R6116J33537
11802f38224J50156J40963J06634N0599j9351o6056q9267j42806k20750k50999
11792i79101j89400n9417P6293J67061J75656J20434P4323J02773K08618L05239
$$ y = [-278218, -506790, -748377, -967417, -1119504, -1188880, -1177393, -1092371, -965874, -834546, -727422, -701779, -802671, -997080, -1213992, -1406399, -1525058, -1506061, -1329811, -1048835, -730559, -429459, -184860, -6683, 98016, 139665, 162338, 190367, 231470, 290478, 330569, 292618, 153770, -61497, -289515, -444311, -503891, -546918, -646462, -788108, -903869, -935273, -870561, -730856, -540794, -331862, -138307, 16338, 116918, 142924, 71141, -96001, -309598, -507238, -677486, -821709, -916821, -956399, -955473, -925624, -867877, -771761, -638224, -488068, -347105, -240471, -189872, -209223, -275279, -364546, -507352, -728102, -979101, -1168501, -1227918, -1151625, -984564, -808908, -688474, -614151, -511378, -302760, 2479]
11782B479L04847K14997J25756J11315J57016J72573J11834N875r8570j55397
11772I52725j57596j43601j27714j08367q4714o3867p1966q5164n4729j5253k3697
11761A6057n3617o3820p7848j18894j42928j04801j1614J10934K39466L39779
11751A32714L71213L32365K31250O7704j01342j86066j81607j57004j44333j30055
11741B34839r6510l6811J9743L6394L0767N0432J01820J55563K04514K36255K15680
11730A152686J09190o3960k17798k97969k69145j27715K2780Q0698M6067l1362
11720D03472q2943o8859k243O1630N3498l5736j29288j65579j42814r6630p9864
11709b85356j06748j39738j44301j20522q5692o3934n5596l9540j6712O921N8515
$$ y = [2479, 307326, 522323, 648079, 759394, 916410, 1088983, 1200817, 1206692, 1108122, 952725, 795129, 651528, 523814, 415447, 330733, 266866, 194900, 109736, 55007, 39754, 16057, -37560, -101380, -179228, -298122, -441050, -545851, -557465, -446531, -207065, 132714, 503927, 836292, 1067542, 1135246, 1033904, 847838, 666231, 509227, 364894, 234839, 138329, 101518, 121261, 157655, 188422, 238854, 340674, 496237, 700751, 937006, 1152686, 1261876, 1197916, 980118, 682149, 413004, 285289, 308069, 388767, 434834, 403472, 320529, 251670, 249427, 311057, 364555, 328819, 199531, 33952, -108862, -205492, -285356, -392104, -531842, -676143, -796665, -882357, -946291, -1001887, -1041427, -1058139, -1051218, -992703]
11698i92703J53069K50925K86350K34956J20693k6434j50861j73523j20561r2259
11688e10348q9671n8946L712N6626O8667L2153k1757p0591j38641j99151j79237
11677a107184o2354R0344K20893L05918L62210L98128L63361K41609J00412R111
11667I22448j3814K5290Q4113J10905R7499L1797j19904k93831l78857l77928
11657H7718l32248k35790j02947J7862J10622J58846J50900J16081R7859J15895
11647A84798J16519L6786p4984j16159p5660L266O2633N9730J2785l8306n9937
11636A11471k8291L3508M9158m894n4024m7714k2609l5755r9447j60415j65311
11625d24323j08562j9443N9385J05980J16670Q7526L5003j0689m3761o7067p0936
$$ y = [-992703, -839634, -588709, -302359, -67403, 53290, 26856, -124005, -297528, -418089, -510348, -600019, -658965, -655253, -598627, -529960, -497807, -519564, -590155, -728796, -927947, -1107184, -1169538, -1079194, -858301, -552383, -190173, 207955, 571316, 812925, 913337, 922448, 908634, 933924, 1018037, 1128942, 1226441, 1258238, 1138334, 844503, 465646, 87718, -244530, -480320, -583267, -565405, -454783, -295937, -145037, -28956, 68903, 184798, 301317, 338103, 263119, 146960, 71300, 74566, 137199, 196929, 209714, 171408, 111471, 83180, 116688, 165846, 160952, 106928, 59214, 36605, 850, -98597, -259012, -424323, -532885, -552328, -492943, -386963, -270293, -182767, -147764, -158453, -202214, -269281, -340217]
11614c40217p0955p6709m4087N7386J74264K42752K36735J69695O9437k8384p1761
11603C18156n5891m4450r4604j78571j92961p2285J13874K46037K88361K46758
11593E74424J28412m1060j78176j79529o5778L2448L1771k4811o2051p2593o6015
11582G7042n8667r5119j74438k27858j90901p2879N4234J26826J29610Q8563K0483
11571c23104p3446j44731j46172q2098K3872J54396K47256K12881P8154m4797
11561i7789q5590p4834p7985q5982o1654N814J07523K14651K78066K84897K72073
11550F79190K33283R4279j40646l26776l62334k74938j37664l918R7584J55571
11540A3631J51949Q1474j8222j17457k09374k64554k48073j90747j38349q1825
$$ y = [-340217, -411172, -487881, -531968, -474582, -300318, -57566, 179169, 348864, 418301, 389917, 318156, 262265, 217815, 123211, -55360, -248321, -320606, -206732, 39305, 327666, 574424, 702836, 661776, 483600, 304071, 238293, 270741, 302512, 277701, 215650, 143057, 77042, 18375, -76744, -251182, -479040, -669941, -742820, -688586, -561760, -432150, -343587, -323104, -396550, -541281, -687453, -769551, -745679, -591283, -344027, -131146, -52992, -97789, -183379, -258213, -336198, -422180, -483834, -478020, -370497, -155846, 122220, 407117, 679190, 912473, 1006752, 866106, 539330, 176996, -97942, -235606, -239524, -141940, 13631, 165580, 247054, 228832, 111375, -97999, -362553, -610626, -801373, -939722, -1021547]
11530a021547j9990K5013M5012N1458O0889P7688R0365R9399J37169J87281J82163
11519h5100J16557L2516l8855p9914j04120j44584j74186j24220o829P3431L4479
11508e00825q8932j67312j25546k3588M0462L8461P444j1901Q992N2399O0866
11497g09480L1047O825k117K899K6352M2775K2076l6217p5427l4406N4178J34759
11485e36736J74153J40163M2450o2482j09961p4767J189M9939M6926R394l1588
11474c51320n4271l9923J1004O1847N6122K10l3467l3245m7962r1098j03982o7046
11462f93131l2310k1949p723K4231N3630N0831r976p4924m1456P0995J54313J73742
11450c53727J49622J09060Q5269N3783j684m0069l9904o197M4571P5516P4628
$$ y = [-1021547, -1041537, -1016524, -971512, -920054, -859165, -781477, -691112, -591713, -454544, -267263, -85100, 31457, 63973, 25118, -54796, -158916, -303500, -477686, -601906, -608735, -535304, -500825, -589757, -757069, -882615, -906203, -865741, -827280, -819836, -831737, -822745, -770346, -709480, -678433, -671608, -673725, -670826, -644474, -601699, -579623, -615840, -691267, -725673, -671495, -536736, -362583, -222420, -179970, -242452, -352413, -427180, -425991, -376052, -329126, -319732, -351320, -405591, -445514, -434510, -372663, -316541, -316331, -349798, -383043, -431005, -522103, -626085, -693131, -725441, -747390, -755113, -730882, -677252, -626421, -636397, -711321, -752777, -681782, -527469, -353727, -204105, -95045, -9776, 44007, 42323, 2254, -37650, -43847, 724, 76240, 150868]
11439A50868O6417L6239m6266j31871j39785o0973K6449L6506k8864q8997q1618
11428b61895j8757L1440K4292k7005p5962p8962k8602N4211J20923J12696M9281
11417i8340J5471L7547O4501N8473J8350o2962j60616j98020j62299r6840J338
11406e83397J37700K60720L19265L02408K18268Q3456l9549q3286n9908j4974
11396E40703L6968P9918Q2942M7598J194k4497j8502m982j0048m7547j19752j80456
11384C83539j89564j68793j29652l3675J18038K21354J90856P1114l7352j01510
11374C24355j42746j56757j31845r8699r6035j34115j85183j67270m2945J17128
11364g14112K32781K83825K94252K84530K41614J54526N4142j5437l9363n4577
$$ y = [150868, 217285, 253524, 207258, 75387, -64398, -125371, -98922, -62416, -91280, -180277, -261895, -280652, -249212, -224920, -251925, -327887, -406849, -435451, -381240, -260317, -147621, -98340, -82869, -45322, 19179, 77652, 96002, 33040, -127576, -325596, -487895, -584735, -583397, -445697, -184977, 134288, 436696, 654964, 738420, 698871, 615585, 555677, 540703, 577671, 657589, 740531, 788129, 789323, 764826, 746324, 741342, 731294, 683747, 563995, 383539, 193975, 25182, -104470, -138145, -20107, 201247, 392103, 463217, 425865, 324355, 181609, 24852, -106993, -205692, -301727, -435842, -621025, -788295, -831240, -714112, -481331, -197506, 96746, 381276, 622890, 777416, 831558, 816121, 776758, 722181]
11354G22181j05181j75972k03672j56606o7195P757L0775J2252j3276j5844N618
11343D0837J8057J3549J1794J7350K8162O9809J48659J94193J77926J60519J64593
11332A045448J45071P7629j5645q4145j12580j43436j87143k15169j98486j25352
11322A86192l1097L0172N9937J07247J53536J18544J2188p4588j00052j01117
11312C60962j25591j58558j66211j39448q4937k3699L5871P9213J04589J60464
11302D2655K55577L11981K56855R3660p8858j37856p1270J8164M4146N277p6740
11291F63591j85257k67481k85183k51750j81298r7983k0818N0231J06875J28036
11281c41037J43304J85313K00161J09770n2359j47279r6318M0473J31714J14851
$$ y = [722181, 617000, 441028, 237356, 80750, 13555, 21312, 52087, 64339, 51063, 35219, 40837, 58894, 72443, 84237, 101587, 129749, 199558, 348217, 542410, 720336, 880855, 1045448, 1190519, 1268148, 1252503, 1168358, 1055778, 912342, 725199, 510030, 311544, 186192, 155095, 185267, 245204, 352451, 505987, 624531, 636719, 562131, 462079, 360962, 235371, 76813, -89398, -228846, -313783, -337482, -301611, -222398, -117809, 42655, 298232, 610213, 867068, 960728, 881870, 744014, 672744, 690908, 735054, 740331, 663591, 478334, 210853, -74330, -326080, -507378, -605361, -626179, -575948, -469073, -341037, -197733, -12420, 187741, 297511, 245152, 97873, 1555, 42028, 173742, 288593]
11271B88593N2859L0707M9396P6691J33651K21733K72259K41611J54259L1629
11261A553388j00583j87844k08624j69307j02956o5224o7114n7228o944M5389
$$ y = [288593, 341452, 372159, 421555, 498246, 631897, 853630, 1125889, 1367500, 1521759, 1553388, 1452805, 1264961, 1056337, 887030, 784074, 718850, 651736, 594508, 587564, 632953]
$$ [...]
##END NTUPLES=NMR SPECTRUM
##END=
