##TITLE=31P ikalashn
105-2024-BAU
11.12.2024
##JCAMPDX= 6.0         $$ Bruker NMR JCAMP-DX V2.0
##DATA TYPE= NMR SPECTRUM
##DATA CLASS= NTUPLES
##ORIGIN= UXNMR, Bruker Analytische Messtechnik GmbH
##OWNER= root
$$ TOPSPIN		Version 1.3
$$ 2024-12-11 10:16:01.500 +0400  Irina@DPX200
$$ Compression mode = diff/dup
##.OBSERVE FREQUENCY= 81.01967998063
##.OBSERVE NUCLEUS= ^31P
##.ACQUISITION MODE= SIMULTANEOUS
##.ACQUISITION SCHEME= undefined
##.AVERAGES= 128
##.DIGITISER RES= 17
##SPECTROMETER/DATA SYSTEM= spect
##.PULSE SEQUENCE= zgpg
##.SOLVENT NAME= DMSO
##.SHIFT REFERENCE= INTERNAL, DMSO, 1, 298.5841
##AUDIT TRAIL= $$ (NUMBER, WHEN, WHO, WHERE, WHAT)
$$ ##TITLE= Audit trail, TOPSPIN		Version 1.3
$$ ##JCAMPDX= 5.01
$$ ##ORIGIN= Bruker BioSpin GmbH
$$ ##OWNER= Irina
$$ $$ F:/spectra/data/iren/nmr/P31dec/1/pdata/1/auditp.txt
$$ ##AUDIT TRAIL=  $$ (NUMBER, WHEN, WHO, WHERE, VERSION, WHAT)
(   1,<2024-12-11 10:15:44.109 +0400>,<Irina>,<DPX200>,<TOPSPIN 1.3>,
      <created by zg
	started at 2024-12-11 10:12:25.984 +0400,
	POWCHK disabled, PULCHK disabled
       configuration hash MD5:
       BE 6D 3F 07 2A EA 11 49 91 17 2B D3 AF B3 58 0D
       data hash MD5: 32K
       C4 E3 A4 EC 93 F6 B0 10 67 AA 28 B9 C6 43 B9 E0>)
(   2,<2024-12-11 10:15:44.265 +0400>,<Irina>,<DPX200>,<TOPSPIN 1.3>,
      <Start of raw data processing
       efp BC_mod = 2 LB = 15 FT_mod = 6 PKNL = 1 PHC0 = 166.6493 PHC1 = 125.7226 SI = 32K 
       data hash MD5: 32K
       89 5C B6 C7 5A 6D C6 D5 3D 85 BC BE E7 1E 7F F3>)
(   3,<2024-12-11 10:15:46.609 +0400>,<Irina>,<DPX200>,<TOPSPIN 1.3>,
      <apk 
       data hash MD5: 32K
       7B A7 2E 74 70 0D 23 84 F5 C6 69 0A 13 E4 FE CD>)
(   4,<2024-12-11 10:15:49.140 +0400>,<Irina>,<DPX200>,<TOPSPIN 1.3>,
      <abs n ABSG = 5 
       data hash MD5: 32K
       A9 07 37 BC 19 6C 91 59 7B 62 A7 7D 78 28 23 D8>)
$$ ##END=
$$ 
$$ $$ hash MD5
$$ $$ 9F B7 2C B5 67 39 11 57 4F F2 72 B2 1D 89 B9 EA
##$RELAX= 
##$RELAX= 
##$RELAX= 
##$RELAX= 
##$RELAX= 
##$RELAX= 
##$RELAX= 
##$RELAX= 
##$RELAX= 
##$RELAX= 
##$RELAX= 
$$ Bruker specific parameters
$$ --------------------------
##$DU= <F:/spectra>
##$EXPNO= 1
##$NAME= <P31dec>
##$PROCNO= 1
##$TYPE= <nmr>
##$USER= <iren>
##$AMP= (0..31)
100 100 100 100 100 100 100 100 100 100 100 100 100 100 100 100 100 100 
100 100 100 100 100 100 100 100 100 100 100 100 100 100 
##$ANAVPT= -1
##$AQSEQ= 0
##$AQ_mod= 1
##$AUNM= <au_zg>
##$AUTOPOS= <>
##$BF1= 81.014009
##$BF2= 200.13
##$BF3= 200.13
##$BF4= 200.13
##$BF5= 200.13
##$BF6= 200.13
##$BF7= 200.13
##$BF8= 200.13
##$BYTORDA= 1
##$CFDGTYP= 0
##$CFRGTYP= 5
##$CHEMSTR= <none>
##$CNST= (0..63)
1 1 145 1 1 1 1 1 1 1 1 1 1 1 1 1 1 1 1 1 1 1 1 1 1 1 1 1 1 1 1 1 1 1 
1 1 1 1 1 1 1 1 1 1 1 1 1 1 1 1 1 1 1 1 1 1 1 1 1 1 1 1 1 1 
##$CPDPRG= <waltz16>
##$CPDPRG1= <>
##$CPDPRG2= <waltz16>
##$CPDPRG3= <>
##$CPDPRG4= <mlev>
##$CPDPRG5= <mlev>
##$CPDPRG6= <mlev>
##$CPDPRG7= <mlev>
##$CPDPRG8= <mlev>
##$CPDPRGB= <>
##$CPDPRGT= <>
##$D= (0..63)
$$ [...]
##$SW_h= 37037.037037037
##$TD= 32768
##$TD0= 1
##$TE= 300
##$TE2= 300
##$TE3= 300
##$TEG= 300
##$TL= (0..7)
0 120 53 12 22 120 120 120 
##$TP= (0..7)
150 150 150 150 150 150 150 150 
##$TP07= 0
##$TPNAME0= <>
##$TPNAME1= <>
##$TPNAME2= <>
##$TPNAME3= <>
##$TPNAME4= <>
##$TPNAME5= <>
##$TPNAME6= <>
##$TPNAME7= <>
##$TPOAL= (0..7)
0.5 0.5 0.5 0.5 0.5 0.5 0.5 0.5 
##$TPOFFS= (0..7)
0 0 0 0 0 0 0 0 
##$TUNHIN= 0
##$TUNHOUT= 0
##$TUNXOUT= 0
##$USERA1= <user>
##$USERA2= <user>
##$USERA3= <user>
##$USERA4= <user>
##$USERA5= <user>
##$V9= 5
##$VALIST= <valist>
##$VCLIST= <CCCCCCCCCCCCCCC>
##$VD= 0
##$VDLIST= <DDDDDDDDDDDDDDD>
##$VPLIST= <PPPPPPPPPPPPPPP>
##$VTLIST= <TTTTTTTTTTTTTTT>
##$WBST= 1024
##$WBSW= 4
##$XGAIN= (0..3)
0 0 0 0 
##$XL= 0
##$YL= 0
##$YMAX_a= 17520
##$YMIN_a= -3523
##$ZGOPTNS= <>
##$ZL1= 120
##$ZL2= 120
##$ZL3= 120
##$ZL4= 120
##$ABSF1= 298.5841
##$ABSF2= -158.5842
##$ABSG= 5
##$ABSL= 5
##$ALPHA= 0
##$AQORDER= 0
##$ASSFAC= 0
##$ASSFACI= 0
##$ASSFACX= 0
##$ASSWID= 0
##$AUNMP= <proc_1d>
##$AXLEFT= 0
##$AXRIGHT= 0
##$AXTYPE= 0
##$AXUNIT= <>
##$AZFE= 0.1
##$AZFW= 0.5
##$BCFW= 0
##$BC_mod= 2
##$BYTORDP= 0
##$COROFFS= 0
##$CY= 12.5935478210449
##$DATMOD= 1
##$DC= 0
##$DFILT= <>
##$DTYPP= 0
##$F1P= 47.1127640792319
##$F2P= -24.0371245302204
##$FCOR= 0.5
##$FTSIZE= 32768
##$FT_mod= 6
##$GAMMA= 0
##$GB= 0
##$INTBC= 1
##$INTSCL= 7.269226e-011
##$ISEN= 30
##$LB= 15
##$LEV0= 0
##$LPBIN= 0
##$MAXI= 12.09355
##$MC2= 0
##$MEAN= 0
##$ME_mod= 0
##$MI= 0.7550151
##$NCOEF= 0
##$NC_proc= -14
##$NLEV= 6
##$NOISF1= 298.5841
##$NOISF2= 270.0111
##$NSP= 0
##$NTH_PI= 0
##$NZP= 0
##$OFFSET= 298.5841
##$PC= 1.4
##$PHC0= 166.2636
##$PHC1= 223.8461
##$PH_mod= 1
##$PKNL= yes
##$PPARMOD= 0
##$PPDIAG= 0
##$PPIPTYP= 0
##$PPMPNUM= 100
##$PPRESOL= 1
##$PSCAL= 0
##$PSIGN= 0
##$REVERSE= no
##$SF= 81.014009
##$SI= 32768
##$SIGF1= 270.0111
##$SIGF2= -158.5842
##$SINO= 77.54984
##$SIOLD= 32768
##$SREGLST= <31P.CDCl3>
##$SSB= 0
##$STSI= 32768
##$STSR= 0
##$SW_p= 37037.037037037
##$SYMM= 0
##$S_DEV= 0
##$TDeff= 32768
##$TDoff= 0
##$TI= <>
##$TILT= no
##$TM1= 0
##$TM2= 0
##$TOPLEV= 0
##$USERP1= <user>
##$USERP2= <user>
##$USERP3= <user>
##$USERP4= <user>
##$USERP5= <user>
##$WDW= 1
##$XDIM= 32768
##$YMAX_p= 447105744
##$YMIN_p= -63480098
$$ End of Bruker specific parameters
$$ ---------------------------------
##NTUPLES= NMR SPECTRUM
##VAR_NAME=  FREQUENCY,     SPECTRUM/REAL,   SPECTRUM/IMAG
##SYMBOL=    X,             R,               I
##VAR_TYPE=  INDEPENDENT,   DEPENDENT,       DEPENDENT
##VAR_FORM=  AFFN,          ASDF,            ASDF
##VAR_DIM=   32768,         32768,           32768
##UNITS=     HZ,            ARBITRARY UNITS, ARBITRARY UNITS
##FACTOR=    1.13031516577767, 1,            1
##FIRST=     37037.037037037, -7250483,      -6004643
##LAST=      0,             -22448529,       94092099
##MIN=       0,             -63480098,       0
##MAX=       37037.037037037, 447105744,     0
$$ Real data points
##PAGE= N=1
##DATA TABLE= (X++(R..R)), XYDATA
$$ [...]
18629 -9555571 -8432778 -6970148 -4969962 -2326631 943042 4689780 8639023 12418743
18621 12418743 15619913 17907420 19150165 19478064 19216028 18745866 18370123 18222616 18259904
18612 18259904 18333053 18283116 18005468 17467969 16681899 15639670 14268431 12442821 10043556
18603 10043556 7017714 3414207 -615363 -4862316 -9150671 -13417740 -17714837 -22131842
18595 -22131842 -26715258 -31417797 -36070734 -40385958 -44010629 -46622260 -48023134 -48202761
18587 -48202761 -47346818 -45772928 -43805572 -41660849 -39419155 -37087840 -34679506 -32240083
18579 -32240083 -29835196 -27550877 -25523637 -23945849 -23003249 -22779602 -23202765 -24064659 -25089070
18570 -25089070 -26015645 -26685548 -27096955 -27391865 -27789228 -28520669 -29787466 -31706353 -34231752
18561 -34231752 -37103738 -39888327 -42116851 -43444817 -43733476 -43034541 -41532265 -39488897
18553 -39488897 -37192689 -34896860 -32770352 -30900900 -29349102 -28191835 -27502342 -27282447
18545 -27282447 -27411069 -27661495 -27780797 -27577798 -26966678 -25947381 -24555475 -22842517 -20907189
18536 -20907189 -18929312 -17150476 -15798884 -15003201 -14743397 -14857790 -15097508 -15207051 -15005947
18527 -15005947 -14449161 -13648229 -12841986 -12321381 -12331983 -12989176 -14236830 -15860443 -17546714
18518 -17546714 -18977018 -19932736 -20373454 -20450290 -20440268 -20631992 -21228463 -22308761 -23830410
18509 -23830410 -25642835 -27516502 -29192437 -30430810 -31047008 -30941990 -30124192 -28708677
18501 -28708677 -26881503 -24837077 -22725376 -20646584 -18692699 -16986665 -15661285 -14789016
18493 -14789016 -14340586 -14210974 -14266021 -14358560 -14328222 -14030315 -13402569 -12524951 -11617612 -10969080
18483 -10969080 -10840761 -11400906 -12707136 -14714836 -17272150 -20098257 -22791095 -24900809
18475 -24900809 -26052915 -26069831 -25030626 -23231849 -21071781 -18921949 -17027644 -15447632
18467 -15447632 -14055791 -12631155 -11008037 -9198949 -7407249 -5919741 -4957353 -4584621
18459 -4584621 -4717568 -5191965 -5823441 -6422102 -6786323 -6727130 -6141281 -5090886 -3813954
18450 -3813954 -2642728 -1896002 -1820065 -2582122 -4268736 -6862122 -10213407 -14048813 -18030059
18441 -18030059 -21853109 -25323541 -28348661 -30861261 -32755049 -33890421 -34162508 -33586425
18433 -33586425 -32340195 -30710989 -28960894 -27215203 -25462648 -23646342 -21741942 -19755357
18425 -19755357 -17675218 -15465597 -13135256 -10824132 -8798391 -7315737 -6465960 -6130352
18417 -6130352 -6076465 -6082594 -6003793 -5775885 -5389149 -4848545 -4132892 -3177269 -1899498 -264290
18407 -264290 1652001 3641663 5415821 6709626 7390329 7506016 7249390 6876922 6640744
18398 6640744 6738274 7259515 8151825 9236622 10266985 10994253 11239703 10966679 10309420
18389 10309420 9519982 8862795 8526825 8587934 9007757 9656872 10365182 10991628 11483534
18380 11483534 11891490 12327503 12891253 13609243 14418415 15202320 15861529 16372941 16797061
18371 16797061 17228592 17714252 18181766 18441275 18278259 17558344 16252044 14396088 12065415
18362 12065415 9379586 6513487 3670832 1010068 -1431201 -3741369 -6045734 -8390974
18354 -8390974 -10701800 -12826764 -14603173 -15889808 -16575477 -16582374 -15875481 -14485970 -12540955
18345 -12540955 -10271007 -7957030 -5815238 -3892317 -2057270 -100778 2131559 4663319
18337 4663319 7405371 10229280 13021056 15672680 18040069 19927547 21121717 21453341
18329 21453341 20857079 19403992 17287908 14767870 12097975 9479598 7042591 4841115
18321 4841115 2862527 1063252 -574020 -1998627 -3101177 -3777710 -4023088 -4002275 -4035665
18312 -4035665 -4482315 -5587092 -7382627 -9691726 -12223079 -14712802 -17032681 -19201148
18304 -19201148 -21304215 -23396315 -25453212 -27401294 -29179757 -30756266 -32071838 -32987439
18296 -32987439 -33315416 -32928456 -31854306 -30275234 -28439947 -26557765 -24733823 -22963512
18288 -22963512 -21173179 -19283278 -17269934 -15194632 -13179007 -11347255 -9793878 -8600595
18280 -8600595 -7858911 -7636135 -7889869 -8423933 -8961463 -9281748 -9290841 -8982453 -8374417 -7509416
18270 -7509416 -6505446 -5566100 -4897164 -4584085 -4535288 -4530546 -4323585 -3730949 -2675577 -1182443
18260 -1182443 662069 2759859 5028311 7400796 9825291 12266777 14682812 16964157
18252 16964157 18897546 20216309 20717194 20337928 19126601 17148143 14434789 11041355
18244 11041355 7149737 3101839 -690341 -3891450 -6337325 -8020088 -9006758 -9387943
18236 -9387943 -9294735 -8926997 -8526719 -8299383 -8332502 -8546141 -8689745 -8403553 -7347084 -5346571
18226 -5346571 -2481234 944991 4523613 7874403 10737759 13017385 14745626 15950060
18218 15950060 16509194 16149549 14616390 11880009 8215909 4117982 123860 -3347967
18210 -3347967 -6088643 -8089472 -9443701 -10218651 -10377799 -9803286 -8396735 -6178088 -3316683
18201 -3316683 -83981 3235781 6415509 9296306 11759874 13711508 15100801 15970719
18193 15970719 16492693 16939462 17595324 18658770 20191645 22126067 24304364 26525767
18185 26525767 28593184 30351953 31699297 32563188 32886648 32652177 31925534 30855783 29607478
18176 29607478 28275559 26851582 25259888 23428795 21349205 19091134 16782599 14580316
18168 14580316 12640329 11068751 9861055 8879438 7899229 6700069 5150600 3248284
18160 3248284 1106856 -1080614 -3062728 -4529959 -5137386 -4589447 -2767797 168867
18152 168867 3785466 7489631 10715454 13091662 14537152 15252015 15597883 15919899 16414624
18143 16414624 17113304 17942123 18764873 19380210 19537202 19023918 17794300 16034022 14092748
18134 14092748 12317771 10918507 9959117 9443372 9385251 9812136 10722154 12036599 13575821
18125 13575821 15074567 16238493 16824548 16714334 15949189 14709727 13251143 11827154
18117 11827154 10625434 9716043 9021217 8342746 7476978 6375751 5232982 4403658 4195806
18108 4195806 4679139 5634570 6668571 7415370 7692900 7514098 6979794 6168330 5102114
18099 5102114 3784337 2259607 653019 -846260 -2057462 -2896115 -3424077 -3835993 -4392251
18090 -4392251 -5316940 -6684762 -8355324 -10024424 -11384315 -12279318 -12741751 -12909242 -12928580
18081 -12928580 -12934943 -13083268 -13536171 -14378538 -15541924 -16821058 -17960880 -18730756 -18943119
18072 -18943119 -18445905 -17139633 -15025831 -12239897 -9030835 -5705191 -2575396 62603
18064 62603 1919325 2698649 2136853 113906 -3237737 -7545935 -12351376 -17279262 -22109161
18055 -22109161 -26727229 -31024641 -34831981 -37944288 -40208473 -41595206 -42202201 -42191476
18047 -42191476 -41699843 -40771198 -39346097 -37311883 -34580760 -31144395 -27072402 -22471398
18039 -22471398 -17447488 -12101825 -6569986 -1081179 4027021 8376731 11658591 13709680
18031 13709680 14537745 14316838 13368259 12107087 10938731 10131611 9726929 9544961 9305764
18022 9305764 8805379 8029581 7134063 6341029 5846863 5771895 6131969 6828748 7679195 8495851
18012 8495851 9188706 9814281 10518693 11406760 12428610 13366021 13930851 13901145 13207892
18003 13207892 11952602 10377016 8794292 7487026 6597424 6055276 5584046 4786447 3279397
17994 3279397 844184 -2464106 -6323076 -10282226 -13951584 -17125967 -19799874 -22115734
17986 -22115734 -24300909 -26599571 -29188782 -32096339 -35157160 -38039822 -40340333 -41693013
17978 -41693013 -41849101 -40720756 -38407559 -35197003 -31514561 -27824162 -24518958 -21848910
17970 -21848910 -19894857 -18568623 -17643386 -16840232 -15942725 -14855054 -13569207 -12106342
17962 -12106342 -10509329 -8873861 -7342534 -6034165 -4964123 -4029306 -3080511 -2030190
17954 -2030190 -904603 201272 1208558 2085844 2807420 3309976 3517259 3417517 3114158
17945 3114158 2790489 2610446 2641430 2866091 3270746 3936740 5055059 6837178 9381853
17936 9381853 12603554 16268727 20084068 23767773 27093480 29911220 32131738 33680695
17928 33680695 34462011 34363255 33299725 31264571 28352983 24757776 20751028 16651645
17920 16651645 12781545 9438292 6898377 5420448 5212333 6359863 8748667 12040171
17912 12040171 15751172 19404321 22650120 25291566 27236507 28456864 28993765 28969591
17904 28969591 28551043 27870425 26964731 25769924 24160977 22013944 19271600 15993092
17896 15993092 12370839 8706756 5345944 2582864 574329 -711858 -1496141 -2122397
17888 -2122397 -2943619 -4205894 -5973646 -8118073 -10381185 -12498788 -14313726 -15797480
17880 -15797480 -16970150 -17811825 -18265142 -18323287 -18112501 -17887728 -17925455 -18374311 -19161489
17871 -19161489 -20013490 -20573319 -20541187 -19759993 -18221292 -16032764 -13396213 -10594115 -7944944
17862 -7944944 -5722224 -4089873 -3105183 -2778449 -3126141 -4171538 -5899589 -8204942 -10879015
17853 -10879015 -13659821 -16317201 -18717113 -20829003 -22680154 -24292591 -25641426 -26647500
17845 -26647500 -27198418 -27198575 -26645198 -25683739 -24566805 -23513676 -22588490 -21716709 -20813859
17836 -20813859 -19884799 -19000500 -18199648 -17435202 -16623030 -15733609 -14835705 -14065405 -13557934
17827 -13557934 -13391988 -13573501 -14059442 -14804316 -15796228 -17052710 -18575285 -20289112 -22013721
17818 -22013721 -23507340 -24566342 -25096427 -25101212 -24619136 -23667678 -22226314 -20270151 -17842918
17809 -17842918 -15117267 -12384499 -9971041 -8139151 -7023674 -6600712 -6665330 -6845752 -6710632
17800 -6710632 -5959068 -4593097 -2968834 -1698461 -1443987 -2680256 -5530800 -9758005
17792 -9758005 -14897212 -20437699 -25948628 -31112951 -35699761 -39530744 -42472087 -44441819
17784 -44441819 -45407809 -45368425 -44339398 -42381340 -39653784 -36423508 -32982959 -29528716
17776 -29528716 -26092879 -22566246 -18781309 -14602404 -9981681 -4972979 267895 5486031
17768 5486031 10365447 14611418 18030489 20564279 22274517 23298344 23800137 23939392
17760 23939392 23844308 23576148 23114023 22400031 21414023 20204289 18857408 17453870 16049066
17751 16049066 14678597 13370877 12161366 11099416 10230141 9558041 9028319 8551092 8047189
17742 8047189 7467023 6768398 5895768 4807978 3536647 2212230 1039249 249546 46023
17733 46023 536569 1679960 3274563 5004178 6536038 7631697 8194047 8211142 7661935
17724 7661935 6487568 4648545 2187999 -775956 -4112040 -7713375 -11472067 -15229848
17716 -15229848 -18768527 -21859542 -24332627 -26108922 -27185520 -27607730 -27462473 -26887981
17708 -26887981 -26084459 -25318049 -24896811 -25097868 -26070715 -27778623 -30015553 -32484834 -34898820
17699 -34898820 -37051794 -38834642 -40207554 -41177350 -41799073 -42178607 -42448109 -42715633 -43014916
17690 -43014916 -43279395 -43354225 -43050424 -42220369 -40818707 -38933656 -36791364 -34722105 -33068608
17681 -33068608 -32058387 -31723541 -31936765 -32525288 -33351801 -34306287 -35257853 -36037977 -36461659
17672 -36461659 -36354140 -35581622 -34099654 -31998275 -29506481 -26948290 -24673456 -22981700
17664 -22981700 -22047441 -21864237 -22240163 -22854818 -23353860 -23436259 -22892949 -21596708 -19494283
17655 -19494283 -16635034 -13192251 -9420541 -5578192 -1882491 1500219 4465666 6978848
17647 6978848 9051534 10689816 11840499 12378805 12153661 11050184 9013973 6039035
17639 6039035 2174151 -2422125 -7413750 -12273396 -16361789 -19077265 -20003609 -18989955
17631 -18989955 -16143295 -11760006 -6246644 -68959 6278312 12316022 17640581 21961953
17623 21961953 25107117 27020516 27780274 27607887 26849756 25936761 25326839 25419138 26452435
17614 26452435 28442074 31193559 34375312 37611454 40562586 42969110 44653840 45511567
17606 45511567 45515943 44742289 43375323 41673414 39889616 38192018 36637811 35203876 33824789
17597 33824789 32403334 30806360 28877594 26478187 23539773 20107626 16354229 12544308
17589 12544308 8945052 5718536 2863457 234269 -2387381 -5189187 -8208108 -11256665
17581 -11256665 -13970050 -15966584 -17021416 -17141180 -16497113 -15270133 -13522296 -11195851
17573 -11195851 -8246952 -4802208 -1197054 2141140 4873159 6866335 8188035 8998654
17565 8998654 9430630 9534353 9301678 8723462 7847506 6819843 5876129 5262746 5126792
17556 5126792 5447201 6052494 6712183 7242359 7566598 7713767 7777706 7874297 8100489 8480700
17546 8480700 8916652 9184900 9010513 8201367 6773103 4975128 3186783 1740371 771219
17537 771219 184243 -245493 -722786 -1346831 -2128823 -3055688 -4118618 -5292624 -6527725
17528 -6527725 -7786509 -9080744 -10453833 -11921564 -13425114 -14843984 -16073525 -17107696
17520 -17107696 -18050074 -19039214 -20142381 -21279546 -22213883 -22611393 -22139193 -20565131 -17832158
17511 -17832158 -14090483 -9683876 -5090072 -811770 2757129 5418620 7159672 8076904
17503 8076904 8300174 7938585 7058181 5703361 3937386 1851876 -461267 -2928184 -5473047
17494 -5473047 -7991618 -10359013 -12464322 -14239425 -15664869 -16744903 -17455385 -17701475
17486 -17701475 -17328449 -16187786 -14219342 -11500847 -8234570 -4682874 -1095002 2340583
17478 2340583 5501536 8299070 10650957 12507379 13908574 14999790 15974567 16989496
17470 16989496 18098382 19223158 20166226 20662952 20452365 19328618 17157616 13885865
17462 13885865 9573147 4430600 -1186681 -6840512 -12073859 -16444892 -19568961 -21210979
17454 -21210979 -21380632 -20338851 -18493505 -16244773 -13862184 -11452315 -9019601 -6552938
17446 -6552938 -4067338 -1605666 756301 2901948 4693716 6021299 6839857 7167345
17438 7167345 7064190 6639146 6071022 5597158 5455342 5814051 6726903 8120270 9812025
17429 9812025 11564615 13163850 14487478 15523866 16332409 16971102 17436492 17663549 17595146
17420 17595146 17267753 16841236 16544670 16566961 16958763 17612665 18333566 18947661 19390447
17411 19390447 19730353 20101707 20577629 21069049 21313977 20952126 19641335 17175093 13570980
17402 13570980 9100192 4230026 -505048 -4627314 -7778311 -9741603 -10460811 -10043228
17394 -10043228 -8727157 -6813029 -4574191 -2176973 348622 3062298 6014202 9160238
17386 9160238 12352093 15398886 18140540 20484439 22401400 23893763 24952958 25541052
17378 25541052 25626658 25249628 24540165 23661826 22736548 21814454 20883226 19889092 18765943
17369 18765943 17467391 15986481 14358438 12643047 10890774 9125451 7368437 5673478
17361 5673478 4116119 2731655 1463022 184259 -1209928 -2734116 -4316691 -5840030
17353 -5840030 -7162232 -8128285 -8599613 -8494010 -7812821 -6646119 -5143355 -3445528 -1626354
17344 -1626354 304806 2365110 4576676 6945070 9415605 11854049 14093658 16000326
17336 16000326 17478361 18429411 18754916 18438935 17638487 16684321 15966935 15768379 16144855
17327 16144855 16937022 17894608 18827969 19690140 20544934 21465934 22457491 23433247 24212588
17318 24212588 24513042 23983698 22316799 19388403 15328171 10472518 5253490 101659
17310 101659 -4614391 -8624175 -11763259 -13958383 -15223969 -15671185 -15483569 -14854728 -13939638
17301 -13939638 -12836011 -11563228 -10041511 -8126074 -5711448 -2836547 288644 3348727
17293 3348727 6034880 8139727 9595558 10458088 10861486 10972794 10963353 10985684 11127944
17284 11127944 11360995 11535589 11446478 10919321 9874558 8349687 6483346 4482174 2592794
17275 2592794 1082963 212377 172493 1017681 2639726 4799108 7181111 9457644 11362830
17266 11362830 12770539 13726323 14407757 15052289 15908478 17211607 19142848 21755154 24898435
17257 24898435 28198999 31124752 33119330 33767106 32947130 30902844 28164766 25365214
17249 25365214 23059733 21631093 21266727 21959165 23500017 25487091 27387232 28666342
17241 28666342 28951898 28170556 26585065 24668495 22861839 21379049 20188366 19132328
17233 19132328 18049347 16819990 15358953 13600519 11514810 9159375 6712699 4426631
17225 4426631 2505105 990663 -254802 -1456678 -2794865 -4333480 -6042038 -7849803
17217 -7849803 -9667752 -11373478 -12805866 -13799619 -14237949 -14091554 -13443234 -12504086 -11588911
17208 -11588911 -11022875 -11029718 -11677818 -12890218 -14482145 -16208363 -17807670 -19028158 -19640818
17199 -19640818 -19463493 -18390927 -16407595 -13584605 -10084213 -6176102 -2240047 1278910
17191 1278910 3974646 5598807 6107137 5591051 4160241 1885232 -1168058 -4871638
17183 -4871638 -9002982 -13261586 -17306670 -20791165 -23399123 -24896442 -25183273 -24334976
17175 -24334976 -22610053 -20384606 -18010657 -15677134 -13371124 -10957431 -8308066 -5400320
17167 -5400320 -2336916 716922 3631995 6365611 8918724 11242022 13184799 14549265
17159 14549265 15219128 15257897 14899074 14441919 14124865 14047027 14173790 14408658 14668552 14907802
17149 14907802 15088073 15133377 14914805 14292621 13205069 11737990 10102614 8527092 7148093
17140 7148093 5980477 4962218 4012936 3064392 2072548 1029155 -41516 -1122598 -2256124
17131 -2256124 -3542166 -5059545 -6766414 -8473673 -9923056 -10908608 -11356166 -11329491 -10981284
17122 -10981284 -10477459 -9929011 -9363460 -8739237 -7983615 -7033429 -5860760 -4483358 -2976348
17113 -2976348 -1480411 -175447 786832 1351977 1597559 1725919 2000423 2625954 3643462
17104 3643462 4915990 6191441 7176441 7605416 7320008 6329256 4796888 2961095 1055543
17095 1055543 -725867 -2249080 -3476816 -4489627 -5432543 -6398140 -7339368 -8085690 -8436291
17086 -8436291 -8247053 -7459064 -6082994 -4188719 -1917237 528709 2958208 5292995
17078 5292995 7606530 10070784 12863557 16088989 19721918 23581352 27346568 30617355
17070 30617355 33007803 34250111 34261258 33139041 31113461 28496176 25626728 22801344
17062 22801344 20209332 17917784 15905776 14108010 12438918 10803159 9106657 7273831
17054 7273831 5267436 3097907 814266 -1516684 -3826224 -6036316 -8034939 -9671972
17046 -9671972 -10803586 -11362612 -11394751 -11027607 -10415402 -9728652 -9189121 -9078496 -9665162
17037 -9665162 -11075267 -13201421 -15727945 -18254525 -20422282 -21975813 -22776902 -22817750 -22247750
17028 -22247750 -21380689 -20633774 -20380363 -20772992 -21653891 -22624233 -23218626 -23072802 -22024353
17019 -22024353 -20139453 -17665339 -14933727 -12274579 -9973077 -8248724 -7226952 -6905117
17011 -6905117 -7141794 -7692811 -8286935 -8706068 -8831007 -8648578 -8246367 -7795919 -7497052
17002 -7497052 -7489418 -7788558 -8292955 -8851062 -9338814 -9692278 -9868802 -9774575 -9235874 -8050802
16992 -8050802 -6085656 -3352003 -25739 3589688 7126065 10206903 12490883 13724595
16984 13724595 13810380 12842646 11065757 8769752 6186639 3448224 627884 -2174379
16976 -2174379 -4789942 -7037554 -8829310 -10219662 -11352946 -12364632 -13316336 -14193979
16968 -14193979 -14947555 -15539962 -15981380 -16333504 -16676820 -17055745 -17436558 -17701859 -17681566
16959 -17681566 -17210171 -16187210 -14609376 -12566948 -10226252 -7810705 -5565873 -3702098
16951 -3702098 -2346644 -1532396 -1201565 -1197345 -1260639 -1071591 -344882 1068565 3141608
16942 3141608 5715356 8582896 11542583 14396197 16937787 18994605 20517005 21633570
16934 21633570 22591700 23603728 24701607 25697419 26283121 26219551 25497673 24364313 23197001
16925 23197001 22309712 21802568 21531784 21205660 20545359 19420661 17896011 16176608 14492251
16916 14492251 12982011 11637236 10324202 8868595 7169807 5303289 3542283 2246199
16908 2246199 1662977 1778889 2316832 2867462 3052905 2633006 1525808 -236834 -2573730
16899 -2573730 -5395008 -8603647 -12078476 -15667372 -19195676 -22477868 -25330399 -27589897
16891 -27589897 -29128897 -29860443 -29738949 -28763940 -26984686 -24515368 -21564880 -18447080
16883 -18447080 -15527540 -13116442 -11376686 -10310071 -9823952 -9825865 -10276489 -11162904 -12421111
16874 -12421111 -13885392 -15321132 -16521585 -17391927 -17966186 -18367610 -18750900 -19250419 -19942256
16865 -19942256 -20825854 -21838590 -22903951 -23971135 -24998259 -25896318 -26502487 -26622558 -26115725
16856 -26115725 -24957000 -23236386 -21117395 -18800102 -16487622 -14324288 -12325049 -10371258
16848 -10371258 -8299807 -6009878 -3495670 -803641 2014936 4910527 7814332 10625561
16840 10625561 13234303 15575007 17667416 19608729 21526967 23523129 25614485 27696066
16832 27696066 29551311 30919563 31584508 31433720 30469718 28792188 26576432 24054496
16824 24054496 21496997 19185475 17356866 16134248 15497537 15321500 15453596 15789587 16310899
16815 16310899 17060341 18081866 19385144 20954014 22763146 24772129 26902150 29021601
16807 29021601 30958527 32528365 33555820 33894245 33456780 32254008 30415082 28169473
16799 28169473 25787085 23511227 21532730 20007354 19057370 18713805 18838385 19108190 19108071
16790 19108071 18497541 17158836 15237468 13053451 10946601 9160079 7814671 6941644
16782 6941644 6527736 6558149 7048904 8060390 9692794 12053838 15196645 19062350 23462627
16773 23462627 28103664 32642650 36768758 40281639 43126620 45364191 47087336 48331630
16765 48331630 49036130 49085657 48408363 47070989 45318361 43523974 42061770 41162621 40836927
16756 40836927 40901002 41077524 41111172 40850596 40268770 39432475 38466278 37537193 36839280 36551794
16746 36551794 36785550 37558096 38809555 40429659 42270101 44147721 45856289 47193795
16738 47193795 47995347 48151491 47606702 46364199 44512689 42228550 39706013 37065933
16730 37065933 34338293 31527850 28685587 25921498 23361928 21099674 19174320 17579888
16722 17579888 16281234 15232857 14393822 13721685 13144636 12543264 11767378 10672056 9154084
16713 9154084 7198337 4922869 2570786 424011 -1315972 -2608814 -3577490 -4430872
16705 -4430872 -5332108 -6275302 -7052380 -7341174 -6859728 -5491849 -3317358 -552666 2528313
16696 2528313 5639760 8515208 10951528 12840392 14160077 14946511 15271834 15229457 14913587
16687 14913587 14395622 13706538 12831635 11725857 10352307 8718383 6870180 4846986
16679 4846986 2646817 243293 -2359762 -5082609 -7764125 -10192540 -12148917 -13446768
16671 -13446768 -13964368 -13667197 -12615087 -10956676 -8919357 -6788219 -4858438 -3366224
16663 -3366224 -2425366 -1993123 -1874753 -1766138 -1328127 -289189 1435091 3660792 5970017
16654 5970017 7863832 8933560 8957716 7926998 6033441 3616126 1055631 -1330813
16646 -1330813 -3324173 -4758376 -5462852 -5274917 -4119209 -2068737 668575 3813321
16638 3813321 7079676 10222137 13065510 15518951 17574237 19288410 20741137 21965342
16630 21965342 22896178 23401574 23383090 22858910 21969686 20928129 19960490 19259535 18947167
16621 18947167 19058710 19574545 20490405 21862092 23768288 26215234 29066164 32051909
16613 32051909 34852414 37203802 38982053 40220978 41048629 41569920 41758549 41430750 40332508
16604 40332508 38283640 35269523 31420998 26927102 21972314 16742451 11468559 6450330
16596 6450330 2026540 -1496538 -3917987 -5176352 -5338696 -4570388 -3103092 -1201558
16588 -1201558 858710 2794747 4331743 5260957 5507966 5153691 4394265 3467586 2577509
16579 2577509 1844560 1312851 1006478 983288 1343974 2191290 3555628 5331198 7277365
16570 7277365 9091669 10514837 11428728 11912139 12218670 12668785 13502522 14782429 16405982
16561 16405982 18180359 19868912 21205599 21936755 21892705 21028771 19404469 17129838 14316067
16552 14316067 11052096 7423684 3568949 -271459 -3755758 -6515215 -8287098 -9038289
16544 -9038289 -8980364 -8449783 -7753963 -7101743 -6621895 -6383714 -6374969 -6485609 -6553367 -6449378
16534 -6449378 -6136085 -5667981 -5154299 -4706098 -4388200 -4204928 -4123190 -4098209 -4087049 -4071948
16524 -4071948 -4080186 -4155107 -4297492 -4448083 -4522791 -4442047 -4124600 -3491199 -2518269 -1296805
16514 -1296805 -24672 1061107 1751525 1913539 1534451 754768 -139183 -778602 -817519
16505 -817519 -46365 1527486 3675954 6035053 8223713 9919650 10880534 10964385 10173593
16496 10173593 8674418 6745005 4675260 2681847 874966 -724006 -2127160 -3323389
16488 -3323389 -4284469 -5048299 -5793090 -6798136 -8283900 -10239550 -12368219 -14188399 -15218513
16479 -15218513 -15143516 -13905090 -11689701 -8814244 -5564967 -2085487 1622899 5609897
16471 5609897 9876394 14337675 18855453 23288573 27523158 31498430 35250299 38924688
16463 38924688 42688915 46565443 50305375 53400005 55251825 55449063 53995955 51333743
16455 51333743 48136464 45022394 42334708 40082008 38042839 35937137 33547003 30757230
16447 30757230 27563568 24086199 20567935 17313160 14580907 12510011 11120362 10353980
16439 10353980 10103077 10217653 10529350 10911021 11332408 11864161 12634623 13776253 15376975
16430 15376975 17432140 19820916 22341129 24775699 26927646 28623203 29739464 30262202
16422 30262202 30303635 30036258 29599249 29061864 28445608 27746408 26932221 25941657 24709253
16413 24709253 23204626 21444229 19454050 17213996 14639475 11619987 8084678 4056074
16405 4056074 -325243 -4810365 -9088649 -12863835 -15938379 -18263005 -19897955 -20886838
16397 -20886838 -21135825 -20400375 -18385499 -14893578 -9966884 -3987530 2316363 7996635
16389 7996635 12126337 14082540 13761344 11607511 8406894 4942348 1709835 -1175966
16381 -1175966 -3883016 -6656851 -9647409 -12860304 -16191877 -19447650 -22330844 -24488003
16373 -24488003 -25659378 -25835467 -25263190 -24285453 -23171149 -22065329 -21023866 -20040550 -19052305
16364 -19052305 -17956635 -16654219 -15101671 -13344305 -11501420 -9710547 -8068385 -6597019
16356 -6597019 -5243589 -3917427 -2554202 -1174825 85064 980038 1201258 469044 -1358331
16347 -1358331 -4219784 -7861003 -11889903 -15844293 -19278137 -21869414 -23505655 -24295706
16339 -24295706 -24505443 -24463129 -24477800 -24776072 -25454440 -26474771 -27721310 -29076766 -30459372
16330 -30459372 -31809580 -33050117 -34050600 -34630430 -34614118 -33910314 -32569334 -30796692 -28924060
16321 -28924060 -27349507 -26455513 -26503610 -27528889 -29294823 -31335799 -33052593 -33831020 -33175078
16312 -33175078 -30828482 -26862159 -21710791 -16093987 -10780581 -6311688 -2873557 -370103
16304 -370103 1424678 2760446 3871391 4951801 6102210 7267288 8238890 8755600 8633803
16295 8633803 7840365 6481441 4751248 2888430 1139602 -291599 -1302508 -1920716
16287 -1920716 -2281261 -2571206 -2980579 -3669463 -4738422 -6207600 -8022547 -10081637 -12256715
16278 -12256715 -14394063 -16314133 -17832615 -18803628 -19164665 -18962845 -18351783 -17548454 -16756776
16269 -16756776 -16104389 -15634669 -15336816 -15174484 -15104887 -15093307 -15122225 -15198776 -15356004 -15633684
16259 -15633684 -16042052 -16528334 -16961624 -17143894 -16844800 -15847465 -14001125 -11287246 -7883697
16250 -7883697 -4172435 -646275 2250967 4261070 5367052 5767408 5788402 5760258 5907864
16241 5907864 6317321 6989407 7915693 9102892 10538371 12150769 13816909 15422311 16937329
16232 16937329 18448154 20110325 22059343 24338805 26868600 29449008 31802046 33640776
16224 33640776 34734614 34945870 34245040 32720476 30567975 28035155 25341713 22633412
16216 22633412 19995607 17497037 15210765 13181624 11370464 9636028 7773548 5585658
16208 5585658 2962280 -55701 -3272032 -6410281 -9224125 -11568982 -13399474 -14721057
16200 -14721057 -15553953 -15928334 -15874674 -15393789 -14454460 -13053631 -11287792 -9350057 -7442868
16191 -7442868 -5684812 -4081448 -2559984 -1030613 554199 2160215 3675532 4966999
16183 4966999 5945772 6586045 6903518 6942565 6779030 6499435 6148783 5699444 5088726 4295147
16173 4295147 3368994 2381859 1349978 206835 -1149762 -2767884 -4570435 -6360687
16165 -6360687 -7914562 -9093733 -9884048 -10332105 -10449477 -10165679 -9342697 -7823417 -5498171
16156 -5498171 -2366489 1450733 5755538 10318395 14884407 19168238 22888015 25838822
16148 25838822 27952484 29305836 30095189 30602753 31146754 32003230 33322016 35083694 37123783
16139 37123783 39205879 41106059 42677788 43879654 44766928 45453262 46051542 46625952 47184902
16130 47184902 47700263 48117134 48349249 48285521 47823103 46910054 45562144 43840226 41810338
16121 41810338 39511127 36942551 34091414 30993555 27787887 24701125 21966540 19753892
16113 19753892 18156269 17195799 16811319 16856152 17140548 17494002 17799808 17997547 18076888
16104 18076888 18065456 18004864 17924398 17822292 17656503 17346503 16792433 15925704 14781967 13533970
16094 13533970 12440128 11761546 11717835 12464808 14041492 16302251 18904435 21380850 23255933
16085 23255933 24160499 23936420 22714398 20905330 19063350 17674599 16997564 17050721 17736455
16076 17736455 18997229 20899428 23603169 27234965 31730247 36750912 41752498 46164869
16068 46164869 49569439 51785791 52866710 53046820 52668918 52087664 51567642 51214094 50962462
16059 50962462 50628536 50007520 48987910 47617062 46077912 44609133 43429742 42686220
16051 42686220 42413709 42527850 42862892 43223406 43409026 43229614 42554012 41378361 39848372
16042 39848372 38204021 36686283 35468259 34633176 34178143 34031059 34095014 34314384 34710423
16033 34710423 35342404 36220935 37252963 38272428 39129160 39760129 40194262 40495609 40687913
16024 40687913 40715386 40471462 39877613 38951924 37817769 36658274 35653276 34930415 34557168
16015 34557168 34578551 35063763 36117290 37847628 40325479 43561283 47490321 51933977
16007 51933977 56551581 60853735 64321126 66574847 67498212 67257751 66232472 64892428
15999 64892428 63669812 62848888 62499873 62486740 62554114 62458651 62082586 61465508 60734795 59989421
15989 59989421 59229689 58380192 57372453 56224747 55078496 54169748 53735617 53895924 54575402
15980 54575402 55512269 56344573 56719181 56375798 55199182 53247529 50749707 48053130 45519774
15971 45519774 43399783 41742944 40415581 39231620 38106504 37109387 36371683 35936230
15963 35936230 35691015 35465094 35211502 35107955 35482727 36630842 38655772 41426954 44659260
15954 44659260 48047425 51357345 54426732 57123429 59331090 60964010 61971892 62327722
15946 62327722 62027419 61111106 59674857 57843829 55722010 53366833 50820438 48169809
15938 48169809 45570356 43201516 41190095 39564107 38262320 37175628 36191556 35232982
15930 35232982 34285351 33399843 32665896 32156185 31856680 31625002 31234069 30496056 29376806
15921 29376806 28008460 26596509 25301555 24176669 23180530 22242743 21348863 20594120 20152660
15912 20152660 20177714 20714967 21687899 22941555 24295817 25580586 26659371 27454076 27969495
15903 27969495 28301049 28603784 29024012 29635447 30420940 31294265 32132640 32810144 33234572
15894 33234572 33380281 33299541 33096477 32867334 32633235 32298853 31669596 30540294 28815137
15885 28815137 26575867 24051598 21531113 19284780 17514330 16313752 15632034 15248553
15877 15248553 14800036 13900986 12323752 10113581 7543539 4953482 2604674 635335
15869 635335 -896425 -1949097 -2471668 -2428271 -1838081 -776642 686318 2574844 5036096
15860 5036096 8254097 12287116 16951077 21847350 26510132 30563019 33802895 36200825
15852 36200825 37856893 38957436 39751253 40514599 41479493 42752662 44274796 45842966
15844 45842966 47186384 48062686 48334562 48000359 47166447 45966302 44468964 42639144 40371652
15835 40371652 37560380 34148858 30159267 25722454 21083127 16541705 12373465 8805278
15827 8805278 6054705 4357607 3932244 4900790 7222592 10675606 14889973 19413730
15819 19413730 23786824 27609738 30593883 32588938 33603061 33818154 33570306 33274238
15811 33274238 33306807 33893483 35051056 36606942 38263860 39673471 40514879 40582157 39859346
15802 39859346 38542798 36990666 35620961 34804602 34780148 35577542 36963442 38484528 39640734
15793 39640734 40088747 39737148 38685588 37072267 34943002 32220159 28774829 24552030
15785 24552030 19674962 14462717 9348165 4743316 921717 -2026507 -4148949 -5527716
15777 -5527716 -6194174 -6134559 -5386856 -4136442 -2704931 -1414314 -419001 364811 1175327
15768 1175327 2231971 3605279 5213797 6919857 8627877 10313023 11985969 13650610
15760 13650610 15292431 16887925 18414622 19862311 21246283 22601888 23955505 25305252
15752 25305252 26629237 27896671 29066818 30091607 30927352 31543972 31927615 32077945 32010268
15743 32010268 31774305 31466075 31203083 31081701 31146674 31375797 31689306 32003678 32309915
15734 32309915 32713163 33387880 34467321 35939237 37612416 39168960 40275611 40698309
15726 40698309 40357666 39309234 37689170 35667836 33420703 31113732 28902918 26931933
15718 26931933 25311754 24105587 23354336 23125016 23520861 24623032 26403118 28682721
15710 28682721 31183400 33627194 35809705 37618514 39023657 40062554 40822718 41422848
15702 41422848 41987559 42619592 43399568 44425871 45853343 47875561 50638041 54131529
15694 54131529 58141981 62292559 66141499 69276761 71387259 72322540 72131481 71040677
15686 71040677 69361759 67380046 65293340 63221529 61254771 59487419 58000020 56799643
15678 56799643 55771624 54700216 53369643 51677762 49667545 47461267 45173196 42870558
15670 42870558 40586860 38349803 36190750 34140883 32239609 30551685 29166610 28175535
15662 28175535 27635582 27522747 27696896 27931988 28027208 27933769 27798751 27888079 28451932 29630386
15652 29630386 31438956 33799884 36566354 39530763 42451286 45114347 47405953 49347010
15644 49347010 51065524 52714543 54373075 55980641 57356666 58307489 58738878 58678541 58202862
15635 58202862 57350364 56099648 54415866 52315856 49899693 47326582 44760452 42330540
15627 42330540 40117848 38146894 36382759 34761207 33257309 31947552 31004476 30614959
15619 30614959 30888365 31827283 33365923 35423958 37927493 40791120 43884170 46999984
15611 46999984 49847926 52107077 53548246 54145600 54084555 53667313 53196919 52900389 52894668
15602 52894668 53175698 53615845 53974318 53948290 53282017 51891656 49918343 47663260 45449390
15593 45449390 43501799 41906672 40645724 39663649 38925455 38443300 38275367 38514117 39281200
15584 39281200 40717196 42934629 45937986 49565408 53510514 57427529 61049703 64238689
15576 64238689 66954543 69202948 71003019 72368386 73280154 73665071 73424183 72527949 71117006
15567 71117006 69514492 68123985 67281717 67150786 67698929 68744882 70031232 71297663
15559 71297663 72342041 73046758 73359292 73249020 72671636 71563856 69878139 67634539 64941301
15550 64941301 61966286 58898835 55943650 53329898 51285565 49966037 49394301 49478635
15542 49478635 50088359 51109485 52455558 54065241 55898511 57912545 60010977 61999582
15534 61999582 63596081 64508892 64556268 63770247 62420337 60926657 59700959 58990438 58786547
15525 58786547 58826122 58682898 57929379 56310735 53841976 50785502 47544644 44533572 42069802
15516 42069802 40320163 39304159 38924968 39002373 39323727 39726803 40166402 40706172 41449786
15507 41449786 42475013 43813335 45470355 47449526 49748332 52333837 55124913 57994515
15499 57994515 60789762 63358911 65567100 67299091 68470025 69043472 69028949 68457076 67353712
15490 67353712 65711091 63464192 60527093 56904290 52783752 48508934 44450489 40890249
15482 40890249 37988019 35813379 34383676 33658522 33495892 33643837 33829436 33896644 33878847
15473 33878847 33958026 34361846 35270798 36764441 38798271 41204642 43725643 46068953 47956679
15464 47956679 49164082 49576686 49260002 48484387 47665564 47244130 47559836 48766268 50810043
15455 50810043 53475840 56473251 59532095 62480934 65281540 67990615 70663343 73268951
15447 73268951 75673015 77682021 79119225 79889925 79987539 79439666 78264571 76498888 74264356
15438 74264356 71781862 69292432 66947016 64760560 62654596 60524057 58264207 55769187
15430 55769187 52963410 49890775 46801039 44133589 42362792 41788717 42413300 43972085
15422 43972085 46069820 48313303 50387983 52104230 53430191 54471363 55381456 56259684
15414 56259684 57088058 57712054 57862322 57239581 55657874 53175534 50129873 47051563 44501851
15405 44501851 42909474 42481884 43215931 44963269 47487171 50498747 53703636 56863625
15397 56863625 59838206 62583363 65115220 67454799 69573185 71365003 72672354 73351335
15389 73351335 73341760 72703596 71613614 70328626 69121781 68216462 67747486 67757238 68221577
15380 68221577 69095169 70351313 71988210 73997373 76321221 78837249 81380394 83777251
15372 83777251 85867978 87524573 88676919 89331875 89557692 89425679 88945251 88048090 86634200
15363 86634200 84631611 82016036 78786303 74939653 70492852 65547470 60348806 55285364
15355 55285364 50815997 47356181 45175097 44343904 44737730 46067509 47937769 49945395
15347 49945395 51796843 53378023 54727636 55930270 57004615 57863094 58363439 58406912 58004585
15338 58004585 57258114 56274403 55092210 53690371 52078759 50394644 48908902 47918696
15330 47918696 47605462 47966619 48855544 50070422 51408319 52655563 53559653 53851217 53337287
15321 53337287 52009373 50079529 47919249 45954020 44569408 44041284 44486747 45851507
15313 45851507 47957471 50594211 53588835 56813599 60164948 63557218 66923973 70210318
15305 70210318 73365171 76340357 79087058 81540752 83600703 85125169 85958451 85984146
15297 85984146 85182963 83673681 81727704 79749505 78206421 77510160 77898249 79376641
15289 79376641 81747545 84701415 87924500 91174780 94309436 97274658 100075402 102741422
15281 102741422 105301704 107769418 110135600 112371023 114429469 116250080 117769765 118944120
15273 118944120 119754734 120194087 120247593 119898845 119161392 118101416 116814713 115378496 113828494
15264 113828494 112169717 110392736 108488331 106476768 104443293 102538102 100921555 99694430
15256 99694430 98868735 98390190 98178219 98149053 98219684 98312406 98372772 98387089 98364638 98286617
15246 98286617 98088982 97721359 97231308 96799441 96702595 97227910 98580840 100827594 103888215
15237 103888215 107574101 111650445 115892957 120114853 124167187 127926350 131275771 134097141
15229 134097141 136289697 137801766 138633193 138805608 138344176 137298949 135784059 133991311
15221 133991311 132161391 130533128 129295136 128552111 128316614 128530647 129104537 129954427 131022227
15212 131022227 132268260 133648383 135110225 136628611 138245495 140052786 142107118 144338306
15204 144338306 146524813 148356633 149544335 149908278 149409983 148132018 146221353 143818830
15196 143818830 141024845 137923194 134613115 131195449 127729697 124218105 120633590 116963098
15188 116963098 113245762 109598229 106208957 103299347 101084494 99758990 99492093 100395289
15180 100395289 102458307 105506409 109219935 113186800 116956746 120117590 122390849 123690355
15172 123690355 124113894 123888491 123290988 122561883 121841722 121149392 120397302 119435370 118124763
15163 118124763 116416089 114373843 112125365 109785980 107424970 105080902 102785374 100570199
15155 100570199 98480713 96614422 95151733 94325571 94320042 95150614 96611694 98348353 100013944
15146 100013944 101397924 102451826 103244169 103895007 104501311 105065583 105467290 105508632 105025867
15137 105025867 104015733 102698882 101460950 100696648 100663268 101432271 102933799 105033751
15129 105033751 107602436 110557383 113861013 117466561 121244532 124953477 128294704 131013321
15121 131013321 132962921 134090440 134379590 133832358 132516172 130615914 128419412 126242615
15113 126242615 124349537 122895161 121899990 121271851 120866155 120543368 120195069 119745922 119154735
15104 119154735 118420653 117573574 116638132 115605377 114455980 113222750 112028863 111065680
15096 111065680 110538506 110620320 111412509 112892572 114863706 116962954 118779370 120051835
15088 120051835 120802966 121278413 121734565 122246578 122662163 122703662 122141659 120944522 119327013
15079 119327013 117674872 116396485 115788216 115976578 116952982 118664115 121079454 124168718
15071 124168718 127802628 131672609 135317157 138252258 140124126 140801598 140383884 139152223
15063 139152223 137497830 135831816 134480637 133605746 133201340 133168661 133400728 133825985 134412610
15054 134412610 135153094 136048578 137108551 138357168 139825095 141525979 143435047 145484380
15046 145484380 147575060 149596537 151440162 152997172 154153732 154814463 154954721 154654430
15038 154654430 154079210 153423408 152845813 152423797 152150608 151977936 151865652 151801086 151796433 151896494
15028 151896494 152198150 152844165 153966369 155612357 157716435 160133368 162707526 165337667
15020 165337667 168001353 170733622 173594107 176649959 179972093 183637826 187726999 192283009
15012 192283009 197236698 202343398 207190264 211285571 214192959 215652075 215634969 214327054
15004 214327054 212066964 209282737 206424508 203875390 201854137 200360102 199200893 198093928
14996 198093928 196789316 195154481 193184164 190933266 188416576 185558017 182243195 178438277
14988 178438277 174276102 170041779 166075896 162664590 159973694 158050933 156890418 156513511
14980 156513511 156994557 158404241 160722248 163786551 167299092 170877592 174143649 176823076
14972 176823076 178812783 180184025 181135197 181923858 182791247 183892930 185269388 186882004
14964 186882004 188682192 190638370 192697277 194743518 196616758 198171746 199333223 200114641
14956 200114641 200594989 200874905 201041947 201155133 201238817 201281668 201257308 201170427 201081195 201058321
14946 201058321 201092510 201060256 200779351 200109483 199024895 197624094 196085586 194597687 193297979
14937 193297979 192251726 191461983 190879152 190413239 189977823 189543020 189141475 188824268 188613157
14928 188613157 188483694 188378918 188232567 187983328 187579005 186982173 186182734 185210759 184141081
14919 184141081 183083988 182153786 181418436 180870901 180468754 180216959 180200186 180514492 181163735
14910 181163735 182024150 182899606 183606432 184029531 184139444 183990900 183723664 183560317 183771914
14901 183771914 184596318 186132895 188267555 190687126 193002248 194916639 196330783 197317026
14893 197317026 198003331 198457093 198640577 198456145 197845659 196871272 195728718 194712930 194167342
14884 194167342 194410417 195648038 197920153 201106073 204965226 209191367 213475125 217559511
14876 217559511 221267128 224493220 227169900 229224620 230578422 231199952 231165231 230663246
14868 230663246 229946650 229275988 228889785 228986597 229700402 231081849 233102502 235671617 238644688
14859 238644688 241826692 244991186 247922241 250462080 252532857 254107942 255155925 255612849
14851 255612849 255403924 254501777 252995503 251113300 249149717 247332451 245728259 244257155
14843 244257155 242792402 241260109 239670525 238087228 236589360 235255452 234150073 233299477
14835 233299477 232671582 232175365 231678246 231037546 230145814 228981943 227646769 226359722 225403120
14826 225403120 225022792 225329615 226263066 227646233 229304821 231172860 233300280 235750212
14818 235750212 238479010 241310777 244023548 246462983 248586756 250414297 251942073 253104271
14810 253104271 253806807 254003584 253755788 253226034 252608629 252043282 251558961 251066890 250407495
14801 250407495 249439949 248127462 246566849 244953657 243500709 242335756 241436248 240659272
14793 240659272 239840142 238869821 237714333 236410561 235056740 233783320 232711159 231920387
14785 231920387 231431861 231204462 231170442 231287994 231539504 231862433 232096419 232023518 231491031
14776 231491031 230539323 229439993 228595185 228356184 228888970 230163769 232038714 234351042
14768 234351042 236953235 239695877 242413384 244969352 247341363 249647856 252069143 254746578
14760 254746578 257758843 261152693 264948514 269111456 273537218 278076149 282574441 286899583
14752 286899583 290931772 294530417 297513184 299688461 300940804 301308365 300981606 300220762
14744 300220762 299254375 298209501 297084740 295772935 294134920 292085422 289639115 286906181
14736 286906181 284057428 281279259 278738518 276571054 274885718 273753947 273163151 272961819
14728 272961819 272862356 272533086 271739300 270460104 268919830 267508645 266633063 266593966 267556918
14719 267556918 269585579 272661876 276655977 281284108 286116072 290644229 294381371 296962126
14711 296962126 298231701 298289202 297448686 296117195 294647402 293251245 292011864 290950696
14703 290950696 290089506 289475542 289156838 289126266 289287676 289481247 289547557 289379990 288941177
14694 288941177 288252545 287373052 286376033 285325151 284255024 283170109 282066434 280968101
14686 280968101 279960258 279187552 278796946 278846325 279242019 279764516 280174116 280315266 280148853
14677 280148853 279723672 279145160 278568076 278191433 278223062 278814573 280011630 281759291 283949409
14668 283949409 286461884 289169850 291928870 294590659 297040582 299215150 301082196 302618361
14660 302618361 303809546 304658085 305178386 305387186 305300813 304940551 304336962 303527427 302555554
14651 302555554 301483236 300404073 299436219 298701720 298320220 298406746 299035219 300184507 301730553
14642 301730553 303505260 305382953 307339809 309450533 311827643 314544008 317578096 320793978
14634 320793978 323949164 326732038 328834309 330027909 330199729 329348240 327575962 325075301
14626 325075301 322092130 318882624 315678970 312660426 309936623 307558776 305558091 303988950
14618 303988950 302941232 302503063 302706119 303512593 304863391 306748109 309240746 312471024
14610 312471024 316544971 321464004 327086808 333138662 339248379 345003434 350022005 354022904
14602 354022904 356864739 358546881 359189625 359014684 358323803 357450384 356680535 356192350 356065008
14593 356065008 356330567 356988091 357958368 359044055 359962782 360454749 360405365 359905798 359213465
14584 359213465 358644610 358460618 358785886 359576099 360644143 361720257 362513016 362765842 362315413
14575 362315413 361141029 359371349 357216571 354855865 352371207 349781127 347131991 344563282
14567 344563282 342300431 340587386 339606306 339421856 339947770 340938877 342052580 342990351 343637930
14558 343637930 344100646 344606182 345342001 346343908 347516529 348753612 350037364 351430960
14550 351430960 352993687 354705456 356447218 358034632 359290429 360128578 360602204 360873212
14542 360873212 361111382 361387386 361634804 361709585 361499956 360999078 360295354 359509874 358738751
14533 358738751 358034959 357430282 356978063 356784372 356989899 357694643 358870848 360330057 361767777
14524 361767777 362850301 363305714 363017817 362116016 361002130 360252371 360417127 361814655 364417030
14515 364417030 367887769 371751169 375587046 379138765 382300243 385030145 387268582 388903485
14507 388903485 389794952 389834895 388999993 387376010 385164470 382675791 380292985 378401037
14499 378401037 377303284 377157923 377961782 379587367 381858452 384634198 387851103 391483499
14491 391483499 395448762 399536396 403424571 406781044 409384919 411201784 412378893 413153364
14483 413153364 413703788 414035597 413995966 413414506 412250342 410630733 408776008 406887314 405066682
14474 405066682 403285820 401392956 399161264 396386810 393011120 389212615 385407538 382125145
14466 382125145 379793198 378557015 378258675 378580621 379223374 379985532 380733136 381345373 381707848
14457 381707848 381737841 381389157 380638597 379502908 378089367 376620349 375395444 374716341 374809485
14448 374809485 375770884 377566720 380094831 383247662 386916709 390953849 395155704 399301885
14440 399301885 403203378 406698993 409602221 411668429 412636724 412326983 410731170 408053389
14432 408053389 404683540 401109993 397797698 395079866 393112729 391906110 391391171 391476479
14424 391476479 392071667 393081622 394390710 395869125 397416997 399017939 400755479 402780517
14416 402780517 405255359 408291173 411879869 415843640 419839079 423420375 426134188 427614397
14408 427614397 427651974 426236265 423577053 420091277 416311576 412714479 409557020 406828643
14400 406828643 404331755 401816777 399090313 396061193 392741158 389236084 385751468 382606066
14392 382606066 380208833 378957523 379090640 380598394 383275182 386871977 391217864 396234792
14384 396234792 401876811 408054077 414578926 421158917 427443386 433094837 437848723 441555596
14376 441555596 444206126 445913308 446839361 447105744 446746768 445742187 444108307 441973830
14368 441973830 439571389 437147471 434858513 432718998 430623070 428419826 425998330 423339537
14360 423339537 420521085 417692007 415048050 412831321 411338689 410884968 411699982 413818045
14352 413818045 417034447 420940324 424999737 428648405 431417205 433050486 433538501 433019568
14344 433019568 431623099 429383189 426287684 422416919 418059886 413708126 409912699 407086957
14336 407086957 405363943 404568806 404306541 404118681 403644423 402738224 401504419 400224722 399217649
14327 399217649 398719384 398845343 399616365 400989324 402851122 404992970 407117731 408902490
14319 408902490 410076785 410464873 409993375 408702093 406762588 404470537 402188174 400243787
14311 400243787 398828848 397953779 397496382 397313961 397344682 397627903 398229588 399140870 400249948
14302 400249948 401421723 402617232 403942211 405567785 407585499 409927861 412410548 414829119
14294 414829119 417024891 418904342 420432093 421605746 422432414 422934495 423171147 423239133 423254633
14285 423254633 423344869 423650964 424316359 425445755 427052362 429038698 431236137 433470082
14277 433470082 435595341 437484266 439004804 440036841 440520432 440478711 439989346 439137652 437986333
14268 437986333 436570354 434917443 433081790 431161148 429283012 427577617 426160292 425123611
14260 425123611 424522381 424344154 424486958 424769499 424969334 424873005 424325394 423252273 421638393
14251 421638393 419496451 416883111 413958556 411027813 408507831 406801006 406122981 406407244
14243 406407244 407370455 408674376 410048020 411307683 412319918 412986220 413265766 413177983 412752256
14234 412752256 411975782 410797407 409180891 407164205 404888611 402583041 400511467 398896999
14226 398896999 397842835 397295251 397086176 397031636 397016800 397012619 397025187 397039811 397023182 396966245
14216 396966245 396895725 396839140 396797093 396750731 396679278 396568194 396418186 396263716 396185399 396301843
14206 396301843 396751970 397674139 399170217 401265965 403906491 406988687 410377903 413888722
14198 413888722 417283877 420331686 422883626 424909428 426472026 427660906 428513807 428970131
14190 428970131 428888256 428117187 426578752 424306781 421421045 418078841 414465947 410818002
14182 410818002 407406425 404469716 402138186 400394089 399072201 397897957 396564043 394833122
14174 394833122 392627010 390042040 387260743 384420934 381551866 378604575 375497042 372116940
14166 372116940 368323298 363998781 359128680 353855602 348487264 343450949 339208324 336167946
14158 336167946 334616388 334660474 336186945 338877748 342298581 346011169 349644082 352914584
14150 352914584 355633942 357711571 359144602 359986753 360322708 360265668 359949581 359491849 358952515
14141 358952515 358322543 357542037 356536820 355264200 353754144 352130164 350598480 349397548
14133 349397548 348720738 348651175 349140586 350040203 351170439 352393175 353649520 354955164 356371819
14124 356371819 357977383 359846383 362031707 364528548 367230133 369923861 372361314 374368838
14116 374368838 375918056 377100019 378026819 378739695 379184026 379258143 378897314 378132610 377092311
14107 377092311 375969046 374986106 374361830 374265208 374784550 375924403 377608124 379660843 381785604
14098 381785604 383577285 384607937 384564697 383368036 381190011 378345374 375121702 371674677
14090 371674677 368060583 364348806 360692890 357303086 354368285 352003818 350250971 349104191
14082 349104191 348536934 348516828 349012061 349984820 351368634 353048087 354865473 356650050 358242194
14073 358242194 359500179 360309370 360610515 360422584 359826592 358916350 357749049 356319654 354562213
14064 354562213 352376877 349688913 346520830 343017098 339391553 335854815 332581408 329694582
14056 329694582 327240596 325188281 323479685 322082365 320987531 320176350 319614158 319276826
14048 319276826 319156892 319223812 319388761 319536473 319603887 319628030 319726249 320034060 320648592 321617998
14038 321617998 322971291 324725272 326830329 329111665 331289964 333092542 334386621 335250837
14030 335250837 335945684 336801201 338079593 339886698 342173550 344796993 347580198 350353720
14022 350353720 352985805 355397130 357545318 359378708 360789263 361612916 361685246 360900123
14014 360900123 359232215 356738811 353559794 349903710 346010855 342117292 338447736 335228185
14006 335228185 332687894 331038539 330436715 330939626 332467240 334782551 337504164 340174671
13998 340174671 342381777 343868428 344561504 344525051 343906053 342913886 341809259 340852906 340210975
13989 340210975 339894051 339804701 339858644 340065137 340493663 341153954 341885213 342348874 342145474
13980 342145474 340972554 338708883 335393535 331160178 326187451 320676586 314842511 308908787
13972 308908787 303108243 297692241 292930168 289073883 286297725 284649853 284036611 284243821
13964 284243821 284990095 285996767 287043491 287983862 288732847 289259109 289595770 289847884 290155764
13955 290155764 290608834 291178383 291742150 292176706 292424622 292489916 292399727 292193415 291952130
13946 291952130 291828585 292036388 292790061 294215657 296270692 298713749 301146992 303126716
13938 303126716 304303970 304528870 303860637 302489521 300644216 298550067 296425938 294461565
13930 294461565 292751247 291227785 289674460 287834736 285532656 282705046 279355978 275525876
13922 275525876 271321588 266953758 262707078 258852113 255574515 252966882 251065860 249884538
13914 249884538 249391477 249449368 249804277 250181383 250418594 250523119 250617596 250839051 251270329
13905 251270329 251934634 252825611 253921735 255166763 256454086 257656162 258676793 259471321
13897 259471321 260029689 260359494 260483150 260439335 260287090 260110806 260014501 260104850 260479218 261214959
13887 261214959 262329647 263720196 265144292 266276151 266798797 266492679 265302718 263359254
13879 263359254 260941942 258408020 256107822 254304703 253128126 252579951 252582661 253045607 253924080
13870 253924080 255239355 257039525 259312393 261896477 264461719 266603562 268002437 268537575
13862 268537575 268283554 267413346 266095556 264460411 262634120 260783491 259129915 257935372
13854 257935372 257461522 257886999 259207953 261199673 263488822 265694524 267547660 268935876
13846 268935876 269882038 270487884 270868009 271084465 271098988 270777972 269960063 268543636 266540464
13837 266540464 264068630 261287254 258311830 255167697 251808420 248173411 244238763 240043223
13829 240043223 235691618 231325180 227062259 222953594 218992732 215180552 211608606 208503714
13821 208503714 206180777 204914367 204822476 205845721 207799808 210426735 213427726 216513809
13813 216513809 219478711 222238760 224793490 227142348 229239546 231023752 232484146 233697947
13805 233697947 234807450 235951995 237196864 238496652 239708873 240652570 241186922 241276116
13797 241276116 241011092 240571465 240142706 239828069 239584949 239212230 238424655 236998096 234880213
13788 234880213 232178654 229070021 225736526 222368513 219199484 216523252 214649231 213795306
13780 213795306 213980413 214991124 216447711 217934040 219129486 219899175 220317860 220608176
13772 220608176 221014571 221690463 222665325 223885316 225265370 226696602 228017297 229015036
13764 229015036 229505076 229445556 228996902 228463027 228135691 228134487 228342336 228474543 228234997 227465393
13754 227465393 226209541 224676694 223144427 221858874 220978816 220578501 220675562 221236446 222161775
13745 222161775 223295094 224474459 225598088 226655714 227704418 228812065 230006214 231248517
13737 231248517 232433580 233401422 233956813 233903714 233104137 231536986 229307009 226589781 223546814
13728 223546814 220248542 216639619 212583214 207981382 202894933 197571019 192368312 187648220
13720 187648220 183689592 180636475 178477415 177068412 176203166 175699133 175452401 175445691 175729609
13711 175729609 176395090 177539897 179234058 181497907 184300279 187555188 191084776 194573169
13703 194573169 197588084 199694424 200592078 200200292 198661398 196272753 193381523 190302546
13695 190302546 187304979 184646912 182581731 181291528 180803008 180978670 181591942 182412685
13687 182412685 183249839 183961178 184460651 184730102 184820156 184832072 184890211 185110961 185567609 186272437
13677 186272437 187199223 188317601 189585048 190900654 192095992 193015137 193619480 193993983
13669 193993983 194232444 194319932 194132154 193540340 192514893 191149107 189598970 187985053 186329636
13660 186329636 184585271 182723264 180781974 178825016 176866613 174854219 172724973 170473282
13652 170473282 168173153 165955715 163978720 162413766 161431650 161151490 161572886 162559249
13644 162559249 163908485 165471799 167241381 169343305 171931180 175048455 178549127 182121664
13636 182121664 185401819 188108575 190120062 191465368 192277625 192744673 193052481 193322594
13628 193322594 193582078 193795913 193921474 193913547 193680796 193076883 191984232 190432963 188630588
13619 188630588 186860796 185342579 184153687 183234905 182434314 181556558 180404893 178815772
13611 178815772 176692542 174047854 171041875 167971808 165193898 163022796 161655387 161121277
13603 161121277 161264668 161789983 162370738 162753840 162792784 162416828 161585936 160263252 158424577
13594 158424577 156116415 153520871 150943960 148707310 147027933 145973874 145499084 145514383
13586 145514383 145960759 146844999 148194422 149960473 151980577 154046282 155988253 157686677
13578 157686677 159036667 159945769 160377278 160393559 160153875 159857063 159653213 159576663 159562850
13569 159562850 159547627 159550977 159662189 159958904 160445585 161051100 161670343 162215334 162646008 162965565
13559 162965565 163182423 163270481 163176173 162874112 162408910 161868902 161310916 160709712 159978798
13550 159978798 159036573 157860825 156493611 154995788 153399966 151716221 149975883 148248272
13542 148248272 146605772 145083592 143686579 142436866 141411880 140743388 140593040 141113710
13534 141113710 142385407 144357137 146857542 149671346 152612491 155557630 158455006 161309134
13526 161309134 164134838 166916644 169607999 172150126 174478810 176525081 178232565 179586392
13518 179586392 180617721 181361482 181786667 181748510 181018450 179402862 176870759 173586264 169844245
13509 169844245 166003524 162465944 159644340 157863063 157237203 157629651 158715050 160091868
13501 160091868 161375309 162244044 162449434 161813477 160248674 157816215 154779612 151569598
13493 151569598 148636188 146274014 144528707 143208894 141964273 140401581 138220590 135325294
13485 135325294 131853033 128093803 124344282 120806331 117603675 114863551 112737711 111319110
13477 111319110 110548332 110219184 110077158 109912126 109577187 108959392 107969254 106568968 104798615
13468 104798615 102768017 100629786 98556971 96725962 95301653 94428616 94228556 94803451
13460 94803451 96238990 98587251 101824012 105817170 110338804 115113952 119885900 124480859
13452 124480859 128840310 132989734 136957226 140700678 144093151 146966607 149178632 150663103
13444 150663103 151439423 151576374 151144172 150211563 148893736 147383557 145911707 144671874
13436 144671874 143793718 143372342 143479727 144116858 145148114 146287516 147174580 147509748 147165402
13427 147165402 146211893 144866354 143399186 142029598 140851430 139821574 138802975 137631340
13419 137631340 136188535 134479683 132687340 131149423 130245342 130251534 131249531 133119125 135597282
13410 135597282 138366395 141132374 143664144 145798409 147439034 148574174 149300886 149814506
13402 149814506 150339140 151038416 151968652 153099262 154376946 155776799 157297142 158920777
13394 158920777 160598331 162268087 163882544 165408278 166790546 167915018 168615292 168734315
13386 168734315 168194780 167032722 165394977 163519384 161681478 160089924 158782071 157610053
13378 157610053 156341034 154789838 152882850 150636644 148111293 145385926 142548165 139670720
13370 139670720 136779115 133846650 130836422 127759861 124705854 121824670 119275629 117156982
13362 117156982 115453256 114043874 112776145 111541093 110283775 108951234 107453058 105692901
13354 105692901 103640733 101373759 99066012 96960109 95337651 94474818 94591294 95816316
13346 95816316 98165628 101526360 105680845 110368588 115332510 120320319 125070026 129324326
13338 129324326 132887077 135676324 137705593 139003342 139561968 139357210 138387924 136702240
13330 136702240 134426117 131780379 129045088 126487139 124302657 122585006 121309981 120353095
13322 120353095 119545827 118739678 117844467 116839677 115766990 114699155 113687662 112710937
13314 112710937 111657327 110377207 108790783 106969730 105126093 103533522 102446385 102038502
13306 102038502 102352036 103275245 104579118 105997144 107305092 108379537 109224680 109947388
13298 109947388 110680475 111496683 112366803 113192573 113909491 114601662 115523789 116969417 119065647
13289 119065647 121657357 124362848 126743417 128480105 129487744 129933969 130156525 130511883
13281 130511883 131231436 132364547 133820082 135444367 137083389 138629693 140056284 141407825
13273 141407825 142731601 143989589 145029303 145652178 145728863 145269568 144407311 143317604 142128190
13264 142128190 140876296 139536454 138086317 136559546 135059599 133731170 132693626 131964631
13256 131964631 131430332 130894758 130175613 129183097 127944489 126566648 125150664 123716239
13248 123716239 122202985 120540722 118704432 116698462 114512024 112115354 109492465 106658616
13240 106658616 103649887 100506647 97259541 93926645 90537715 87171837 83969694 81105514
13232 81105514 78742013 77004328 75995986 75839221 76680661 78625130 81633646 85458085
13224 85458085 89656164 93688529 97064442 99467483 100796253 101121852 100631104 99601617
13216 99601617 98372240 97263040 96478142 96062828 95929482 95912997 95831353 95550982 95043194
13207 95043194 94407961 93853225 93632126 93954326 94901357 96386011 98187367 100044400 101737969
13198 101737969 103104702 104005704 104330667 104069979 103374229 102499725 101666548 100962574 100366628
13189 100366628 99836205 99371489 99027509 98894224 99056000 99534304 100240098 100968948 101456882
13180 101456882 101499712 101087114 100440973 99895150 99694835 99862573 100207186 100434831 100269992
13171 100269992 99534200 98192161 96376972 94368416 92502021 91040219 90075119 89510474
13163 89510474 89119103 88648737 87939710 86995122 85962375 85054883 84469878 84320882 84582931
13154 84582931 85072037 85492443 85548257 85061392 84033051 82645968 81242386 80269085 80152509
13145 80152509 81130207 83131483 85793563 88623610 91213364 93369902 95092124 96449289
13137 96449289 97495249 98288923 98953349 99665123 100566500 101690380 102959333 104231085 105336960
13128 105336960 106101367 106372897 106081815 105282851 104143653 102898828 101803158 101076245 100824121
13119 100824121 100974572 101290522 101473194 101282503 100579099 99276123 97292278 94581129 91199965
13110 91199965 87332599 83239772 79180234 75349471 71850080 68700324 65889640 63447283
13102 63447283 61455058 59987888 59040033 58495501 58156726 57806373 57260828 56402076 55211499
13093 55211499 53807600 52446880 51463520 51172381 51771364 53267440 55452489 57943678
13085 57943678 60265873 61946979 62625685 62157561 60659388 58445519 55886366 53274367
13077 53274367 50772451 48465220 46465912 44984837 44285094 44550955 45776277 47753599
13069 47753599 50155969 52641378 54911785 56716039 57840411 58129951 57538209 56156134
13061 56156134 54174047 51797443 49188736 46467042 43728534 41049342 38482675 36080701
13053 36080701 33934537 32183759 30966023 30343086 30267365 30610261 31220384 31975999 32822109
13044 32822109 33794831 35024275 36688134 38907746 41646469 44694180 47750543 50541268
13036 50541268 52894161 54748238 56117677 57050265 57611691 57896179 58024205 58100556 58163090
13027 58163090 58164348 57996291 57550010 56783172 55752854 54592000 53440875 52374819 51390305
13018 51390305 50471532 49675005 49151617 49091475 49633842 50794443 52444430 54345025 56216850
13009 56216850 57816226 58992289 59697894 59946917 59767051 59217649 58456842 57756832 57424688
13000 57424688 57699442 58700255 60430063 62805065 65690281 68928121 72340816 75709739
12992 75709739 78776220 81295478 83112786 84197536 84606477 84420359 83727439 82662140
12984 82662140 81418912 80177356 78985940 77712286 76110363 73955622 71159933 67818385
12976 67818385 64193417 60652877 57568349 55195801 53596724 52656703 52191090 52058843
12968 52058843 52212299 52670265 53445579 54469303 55558404 56459279 56944232 56901985 56385228
12959 56385228 55602821 54853408 54420746 54475590 55027906 55947262 57027316 58044057 58786281
12950 58786281 59081216 58822176 57970659 56537866 54596896 52334432 50064312 48137382
12942 48137382 46800905 46120531 46004508 46288682 46827426 47546433 48441145 49547285 50919713
12933 50919713 52624880 54720198 57199095 59932247 62674068 65152703 67177527 68699863
12925 68699863 69817925 70728128 71627812 72627942 73749938 74990143 76357321 77830168
12917 77830168 79281506 80463784 81093401 80961804 79981306 78168745 75630240 72564352
12909 72564352 69245994 65970734 62990329 60478356 58529186 57167502 56354267 55996164
12901 55996164 55960513 56077399 56124890 55833182 54942258 53293118 50896435 47940123 44731804
12892 44731804 41595975 38765599 36326258 34250928 32495825 31081458 30103179 29669445
12884 29669445 29811503 30425732 31292060 32162202 32856663 33306763 33541360 33661173 33809825
12875 33809825 34112238 34587631 35109209 35464728 35469892 35030143 34109365 32667734 30657766
12866 30657766 28093167 25117684 21996118 19026889 16452497 14442539 13152084 12789485
12858 12789485 13614098 15837397 19490134 24358070 30028930 36008969 41846819 47221245
12850 47221245 51968754 56053473 59505093 62360097 64635688 66339669 67496649 68179091
12842 68179091 68543006 68838291 69339651 70210983 71407333 72695321 73762460 74328213 74210920
12833 74210920 73366586 71918665 70156401 68468401 67220985 66637727 66746491 67429095 68538760
12824 68538760 69985563 71723975 73690640 75779122 77861495 79814157 81533309 82940137
12816 82940137 83964332 84521156 84524546 83945043 82861756 81446499 79874916 78224259 76428875
12807 76428875 74331411 71817379 68966019 66111856 63743662 62288161 61919949 62506535
12799 62506535 63693865 65064671 66289436 67210409 67834592 68255399 68550490 68709272 68632182
12790 68632182 68191939 67290214 65871932 63930686 61530615 58815829 55980517 53212596
12782 53212596 50647587 48366142 46432576 44936328 44005185 43787770 44417246 45967541
12774 45967541 48404487 51533214 54972953 58209116 60725166 62152200 62357571 61435008
12766 61435008 59634680 57304262 54857406 52727455 51279368 50708560 50985728 51881527
12758 51881527 53052933 54151580 54923860 55275075 55275057 55116005 55055552 55351507 56170944 57493851
12748 57493851 59082649 60561905 61563301 61845031 61331147 60082568 58247743 56025836
12740 56025836 53639033 51296531 49155767 47314899 45845856 44820791 44292797 44251829
12732 44251829 44597847 45152170 45700062 46030703 45946292 45259923 43823933 41588084 38641301
12723 38641301 35204820 31590697 28149533 25205214 22974562 21505406 20678445 20282916
12715 20282916 20132697 20169739 20504504 21360582 22938923 25289951 28289664 31710389 35287981
12706 35287981 38736165 41753688 44068331 45491804 45939910 45416385 43990342 41792188
12698 41792188 39027797 35977324 32947458 30198522 27901670 26152339 25014902 24555758
12690 24555758 24842807 25915377 27741645 30177413 32941759 35645870 37893577 39396300
12682 39396300 40020404 39763653 38718897 37050447 34969378 32707355 30506707 28629339
12674 28629339 27350706 26894369 27318797 28440411 29871212 31169788 32020954 32337731 32248596
12665 32248596 32017295 31952469 32325404 33302419 34919802 37123362 39837763 42993727 46488049
12656 46488049 50137557 53700586 56945136 59683947 61770588 63114938 63717361 63658822
12648 63658822 63036634 61919526 60378918 58556843 56682789 55008871 53722571 52912831
12640 52912831 52599936 52780975 53448599 54579452 56110396 57916618 59799865 61503849
12632 61503849 62773301 63439042 63472953 62975163 62120757 61110282 60122605 59251424 58448276
12623 58448276 57529159 56265176 54495266 52179631 49385430 46248866 42941000 39645415
12615 39645415 36547675 33820581 31589514 29890492 28658346 27766673 27100396 26618557
12607 26618557 26375052 26494806 27129454 28420216 30465515 33270567 36697412 40474604
12599 40474604 44280509 47838420 50961520 53548204 55561488 57007096 57908804 58283918
12591 58283918 58116650 57332594 55808178 53442269 50257958 46465945 42442588 38623227
12583 38623227 35364393 32856059 31119836 30048687 29430882 28971423 28364070 27408084 26094997
12574 26094997 24603055 23207677 22168582 21648021 21679780 22185513 23021912 24030745 25062228
12565 25062228 25966100 26582708 26769397 26452990 25656037 24456359 22907130 20997585 18705046
12556 18705046 16101421 13420203 11019551 9261777 8392991 8495507 9515240 11311457
12548 11311457 13688295 16415913 19265145 22054783 24688737 27162397 29534240 31875408
12540 31875408 34219362 36535514 38738452 40721722 42397013 43726636 44744018 45561357
12532 45561357 46357599 47333325 48640403 50318865 52269235 54277811 56095318 57527518
12524 57527518 58475768 58906435 58792582 58091701 56774242 54862801 52448292 49684612 46772441
12515 46772441 43936349 41404099 39389860 38057066 37449160 37434842 37729772 37992538 37943319
12506 37943319 37468211 36680961 35895499 35491443 35740467 36696246 38186795 39878064 41368782
12497 41368782 42300089 42473297 41944576 41035660 40226901 39980474 40588135 42106451 44383300
12488 44383300 47136763 50028273 52694441 54763539 55908215 55938186 54883995 53013952
12480 53013952 50742643 48443545 46270895 44125684 41793195 39132999 36180252 33120835
12472 33120835 30196650 27619535 25544271 24088611 23341396 23331225 23993292 25172235 26652117
12463 26652117 28197304 29605392 30757698 31629818 32250951 32653904 32866398 32945492 33008921
12454 33008921 33224005 33759055 34725638 36137323 37905415 39873559 41867488 43737174
12446 43737174 45387237 46784823 47924836 48780981 49312260 49523701 49485956 49268569 48871301
12437 48871301 48247515 47400304 46452735 45625311 45149355 45194233 45838763 47065800 48769964
12428 48769964 50786091 52933505 55055387 57035201 58785934 60227910 61289429 61939061
12420 61939061 62205542 62152369 61840879 61323232 60647904 59848319 58937585 57945941 56980889
12411 56980889 56249466 56014350 56510940 57864901 60030578 62772183 65718680 68485245
12403 68485245 70796916 72548835 73789599 74654328 75286194 75782278 76172241 76414616 76409652
12394 76409652 76043742 75252954 74056661 72532419 70765923 68832192 66810912 64789698
12386 64789698 62837516 60979874 59207838 57519855 55959860 54606704 53519393 52704258
12378 52704258 52141158 51815099 51702814 51751151 51888232 52037217 52102066 51954216 51463768 50575001
12368 50575001 49370788 48058976 46875825 45990419 45499628 45496122 46112844 47499470 49765854
12359 49765854 52926471 56853333 61258110 65730338 69821529 73136893 75403872 76507196
12351 76507196 76496561 75572728 74045824 72256673 70463503 68725594 66857172 64523979
12343 64523979 61458236 57650129 53384990 49127535 45350656 42400429 40442711 39487784
12335 39487784 39439900 40115483 41239899 42484947 43572093 44382930 44990098 45586922 46376287
12326 46376287 47485294 48923308 50578633 52257864 53765975 54996297 55981614 56871820
12318 56871820 57843109 58990051 60276068 61585344 62833014 64028426 65231881 66461994
12310 66461994 67655178 68699877 69485377 69924116 69969721 69652999 69108081 68542006 68141561
12301 68141561 67972906 67950137 67898254 67656724 67140567 66325818 65200982 63741310 61914320
12292 61914320 59690621 57048672 53987888 50562090 46911962 43252641 39803653 36705805
12284 36705805 33988408 31607623 29510707 27666081 26048052 24610179 23282689 21999024
12276 21999024 20731064 19512703 18441815 17657546 17294857 17425976 18019124 18950219 20059385
12267 20059385 21203426 22278109 23216451 23965371 24460568 24650965 24575278 24408622 24414264
12258 24414264 24829298 25760602 27153182 28855921 30745442 32806431 35086674 37558905
12250 37558905 40026572 42182103 43774683 44739159 45193776 45348730 45416872 45550162 45784393
12241 45784393 46029734 46154919 46110859 45970703 45836604 45701631 45403093 44708941 43460534
12232 43460534 41675110 39560367 37439070 35622274 34294698 33459153 32958322 32567587
12224 32567587 32110149 31517642 30795505 29936399 28880927 27582496 26119996 24741557 23788347
12215 23788347 23558563 24211699 25761638 28123729 31152900 34657887 38414092 42183926
12207 42183926 45738949 48878476 51436832 53272868 54255082 54277302 53319526 51511635 49139552
12198 49139552 46582145 44217570 42341780 41122401 40590657 40661594 41181608 41998984 43015211
12189 43015211 44168907 45367491 46436434 47135013 47233060 46613692 45353632 43728774 42129026
12180 42129026 40928791 40380364 40562005 41373054 42560695 43777541 44677869 45036972 44837093
12171 44837093 44260790 43582743 43011937 42573437 42099955 41324676 40010022 38059393 35579580
12162 35579580 32865836 30312403 28293179 27057396 26666500 26994209 27788884 28751572 29584315
12153 29584315 30015050 29825846 28892422 27230895 25028147 22605427 20298778 18325244
12145 18325244 16732608 15463341 14467314 13764876 13426946 13517255 14048095 14970758 16209757
12136 16209757 17731165 19592925 21918035 24797513 28205577 32002303 36007821 40059415
12128 40059415 43991424 47570413 50472280 52350238 52953108 52206064 50207715 47170526
12120 47170526 43361294 39074233 34623397 30327275 26487829 23378305 21222170 20133114
12112 20133114 20037643 20652910 21564345 22366322 22781441 22703425 22176438 21351593 20431061 19591918
12102 19591918 18913672 18351994 17767350 16984346 15860770 14343233 12471757 10325581 7965766
12093 7965766 5439146 2841413 371771 -1685917 -3059685 -3602174 -3334329 -2383756 -874294
12084 -874294 1138490 3648525 6632589 9984711 13480970 16801258 19620473 21722506
12076 21722506 23050050 23657398 23630226 23053237 22027511 20676270 19108489 17377227 15481509
12067 15481509 13417375 11240263 9088407 7148196 5591094 4527781 4006763 4051990
12059 4051990 4699946 5995405 7945986 10472575 13396747 16486228 19537085 22431280
12051 22431280 25123489 27579572 29734860 31506035 32824023 33648694 33968712 33809478
12043 33809478 33254682 32460791 31643651 31044476 30886595 31319949 32372468 33952189 35905355
12034 35905355 38074563 40313086 42482048 44464162 46162993 47456539 48156595 48049775
12026 48049775 47009969 45085965 42487036 39491030 36369060 33371699 30723825 28575462
12018 28575462 26949745 25767854 24945361 24459519 24320483 24500077 24912089 25455862 26061172
12009 26061172 26685562 27269363 27694978 27798454 27428708 26489065 24918919 22659272 19663013
12000 19663013 15946142 11636024 6985409 2340658 -1932580 -5536899 -8297993 -10174401
11992 -10174401 -11257770 -11781382 -12094994 -12562621 -13409199 -14605837 -15874640 -16816002 -17084191
11983 -17084191 -16518756 -15177346 -13271066 -11046162 -8677092 -6221946 -3641437 -846300
11975 -846300 2255243 5715408 9511422 13533049 17605576 21529309 25108055 28161981
11967 28161981 30533582 32095468 32763282 32505738 31346532 29365449 26698428 23523745
11959 23523745 20034147 16411559 12817173 9401352 6323353 3748318 1800847 500873
11951 500873 -269941 -739585 -1160406 -1717650 -2491891 -3479558 -4624112 -5838962 -7048018
11942 -7048018 -8242462 -9499390 -10925545 -12567993 -14365899 -16165099 -17764981 -18967658
11934 -18967658 -19613560 -19598261 -18879040 -17480334 -15498232 -13098776 -10499088 -7923263 -5546159
11925 -5546159 -3458241 -1670475 -140052 1211115 2487738 3799646 5210631 6689982
11917 6689982 8117830 9334604 10183063 10529881 10289690 9457281 8127809 6485991 4765710
11908 4765710 3199804 1970722 1150292 637841 157893 -633518 -1981824 -3922459 -6291775
11899 -6291775 -8819619 -11219906 -13242884 -14702796 -15489238 -15561346 -14945998 -13755379 -12192232
11890 -12192232 -10500389 -8877487 -7420546 -6139566 -5003765 -3984600 -3098950 -2452128
11882 -2452128 -2246281 -2716030 -4002354 -6035571 -8508064 -10965963 -12973392 -14258956
11874 -14258956 -14774462 -14651085 -14089376 -13249308 -12194023 -10889404 -9228183 -7065471 -4275467
11865 -4275467 -827813 3147801 7353293 11382277 14809694 17268361 18510657 18466158
11857 18466158 17270666 15234117 12765535 10301170 8242804 6878903 6291920 6309750
11849 6309750 6561078 6625284 6195614 5170176 3636438 1776058 -239767 -2296365 -4307247
11840 -4307247 -6157666 -7680271 -8680945 -8983798 -8457676 -7035141 -4768326 -1905410
11832 -1905410 1109222 3770773 5718058 6868079 7390672 7551015 7545780 7443069 7222256
11823 7222256 6837822 6262306 5507710 4619878 3636576 2537829 1248472 -284518 -2008432
11814 -2008432 -3773473 -5422540 -6849107 -7981504 -8762524 -9160960 -9176032 -8819575 -8113942
11805 -8113942 -7124344 -5989061 -4899332 -4026856 -3447737 -3117422 -2913102 -2715463 -2480015
11796 -2480015 -2254419 -2128782 -2148608 -2248482 -2251995 -1939434 -1151873 116714 1692836 3275989
11786 3275989 4530129 5179100 5098319 4370837 3252016 2040596 939625 11205 -742762
11777 -742762 -1245423 -1270161 -491482 1361367 4336916 8187738 12451570 16644690 20438954
11768 20438954 23713875 26493893 28865949 30931109 32769634 34403101 35778492 36793609
11760 36793609 37342037 37344619 36767465 35649564 34136968 32486452 31018912 30044094 29784138
11751 29784138 30313931 31542550 33248331 35144254 36937956 38372083 39252767 39473417
11743 39473417 39029010 38010346 36571959 34882755 33081925 31260235 29473546 27774162
11735 27774162 26228962 24904893 23828301 22941633 22095324 21100890 19808474 18139029
11727 18139029 16063123 13587610 10791021 7870451 5135514 2937405 1565405 1150168
11719 1150168 1617858 2715125 4085469 5380259 6384993 7091303 7643969 8194872 8785264
11710 8785264 9341508 9761645 10010874 10157457 10329236 10626533 11055188 11521761 11888658
11701 11888658 12059009 12048379 11996510 12099549 12497183 13183970 14005643 14750398 15270027 15537156
11691 15537156 15610481 15567577 15475474 15409756 15477775 15797024 16422566 17274078 18133267 18730923
11681 18730923 18857934 18416868 17409363 15916911 14094444 12141514 10242767 8525262
11673 8525262 7068158 5937298 5189928 4834531 4786569 4867041 4849494 4529038 3798898 2731469
11663 2731469 1609287 824796 682874 1260758 2415271 3880350 5374300 6687768 7716149
11654 7716149 8400900 8632015 8222025 6990216 4882708 2026992 -1313153 -4835792 -8277548
11645 -8277548 -11429329 -14114866 -16180234 -17499890 -17969968 -17494537 -16006491 -13529560
11637 -13529560 -10231420 -6411927 -2420978 1434733 4925528 7870252 10113846 11560512
11629 11560512 12228459 12254117 11828643 11129171 10303871 9481016 8732467 8009939 7158086
11620 7158086 6039807 4673215 3262759 2111312 1488858 1530580 2184993 3216365 4280402
11611 4280402 5060563 5388348 5274504 4859568 4347771 3958813 3882882 4229728 4995971 6068793
11601 6068793 7254712 8328543 9106233 9509306 9570878 9381717 9025089 8546421 7973476
11592 7973476 7364328 6825177 6459367 6287227 6219576 6121112 5920672 5686720 5612855 5923245
11582 5923245 6761434 8134194 9929467 11964209 14026435 15914721 17467473 18569988
11574 18569988 19169544 19322774 19221500 19124681 19225029 19562264 20048268 20566424 21057973
11565 21057973 21531557 21997412 22394815 22587048 22424392 21810907 20730196 19246908 17513217
11556 17513217 15759943 14229034 13062642 12227906 11535943 10739609 9650545 8225315
11548 8225315 6592766 5011751 3783644 3171859 3352742 4377822 6134180 8329241
11540 8329241 10535753 12297148 13244708 13170158 12051430 10064031 7568676 5036252 2919828
11531 2919828 1534904 997481 1228722 2008350 3050780 4080831 4891470 5374884 5531086
11522 5531086 5460150 5335654 5361849 5723754 6536951 7810393 9434229 11193810 12822743
11513 12822743 14102148 14957572 15486340 15909760 16492504 17461251 18944324 20948811 23359972
11504 23359972 25939559 28355195 30292247 31603816 32368278 32789371 33019428 33051829 32763309
11495 32763309 32057834 30980358 29704308 28420512 27238224 26168230 25169476 24213950
11487 24213950 23338468 22649017 22260316 22210035 22424873 22780450 23205744 23735695 24468564
11478 24468564 25469770 26703371 28043552 29344968 30499343 31434309 32084617 32387882
11470 32387882 32312152 31882101 31174567 30290124 29325676 28349775 27369544 26297300 24943377
11461 24943377 23068502 20508169 17310243 13772239 10331225 7395975 5247925 4043983
11453 4043983 3857214 4680772 6388160 8710304 11272448 13668127 15533645 16609460
11445 16609460 16779125 16078664 14678785 12847058 10900542 9161284 7919825 7402865
11437 7402865 7745970 8980945 11042426 13782558 16972257 20290730 23346407 25758352
11429 25758352 27258134 27740183 27231665 25822736 23627668 20804337 17590786 14298262
11421 14298262 11241537 8651095 6638223 5233985 4458551 4370971 5074400 6669979 9179054
11412 9179054 12486285 16348440 20459535 24518485 28255539 31426927 33817960 35265019
11404 35265019 35667486 34971087 33152539 30252467 26442420 22047223 17481896 13146763
11396 13146763 9339184 6208665 3770008 1968420 747999 75741 -72452 274002
11388 274002 1083031 2325283 3963089 5926585 8098177 10324144 12458966 14422588
11380 14422588 16231343 17988808 19861978 22044649 24671877 27706568 30896306 33844540
11372 33844540 36132677 37425344 37545566 36515186 34545060 31977365 29200668 26558318
11364 26558318 24281477 22483619 21202881 20426597 20071958 19975658 19950394 19889199 19833889
11355 19833889 19950665 20438086 21433507 22953575 24868847 26917493 28767866 30116162
11347 30116162 30779277 30736057 30098494 29044404 27754736 26372834 24991549 23663049 22406673
11338 22406673 21206528 20017376 18781161 17431166 15874347 13977900 11599937 8670936
11330 8670936 5267718 1602905 -2064854 -5506009 -8519840 -10902765 -12462533 -13089917
11322 -13089917 -12825971 -11860008 -10450519 -8818456 -7081313 -5253618 -3277455 -1056438
11314 -1056438 1491956 4372026 7473333 10584797 13454709 15872170 17728869 19037251
11306 19037251 19911815 20515691 20970947 21275634 21300020 20879121 19934272 18536150 16873741
11297 16873741 15162233 13558268 12138041 10937179 9995181 9355535 9030192 8973877 9103068
11288 9103068 9349410 9703649 10220019 10982620 12056887 13460520 15166048 17102287 19127841
11279 19127841 21015414 22505639 23413044 23697901 23449101 22804076 21866665 20660551 19127763
11270 19127763 17172681 14733563 11834733 8582811 5117447 1556552 -2022599 -5546216
11262 -5546216 -8880166 -11798483 -14011956 -15242778 -15317545 -14242712 -12223279 -9599626
11254 -9599626 -6716134 -3796834 -923121 1874200 4507037 6808449 8601443 9793146
11246 9793146 10434647 10710659 10856147 11049274 11360405 11796215 12377388 13139731 14045144
11237 14045144 14920760 15520509 15659446 15308279 14599936 13770028 13063076 12640645 12540680
11228 12540680 12700071 13003435 13330868 13594164 13747640 13778792 13705000 13587470 13537387 13675393
11218 13675393 14055045 14619793 15233028 15749207 16076327 16203838 16201908 16213867 16438427 17075146
11208 17075146 18238951 19892882 21846796 23829975 25595965 26994447 27965132 28462238
11200 28462238 28373670 27512485 25709464 22952233 19466037 15670920 12041269 8949969
11192 8949969 6575582 4899542 3765894 2973689 2378292 1944236 1700675 1646440 1711822
11183 1711822 1812692 1922057 2079094 2346728 2774214 3378154 4128437 4951463 5765092
11174 5765092 6520976 7215479 7862830 8458510 8955655 9255137 9213012 8677169 7544155
11165 7544155 5805208 3560627 1000720 -1638868 -4127302 -6271130 -7929840 -9037721
11157 -9037721 -9640542 -9909737 -10084784 -10363028 -10828387 -11477443 -12295726 -13291309 -14462277
11148 -14462277 -15758298 -17087443 -18356012 -19498788 -20478379 -21271992 -21869826 -22275155 -22485040
11139 -22485040 -22471341 -22198632 -21660931 -20883562 -19885410 -18646178 -17103364 -15171974 -12777808
11130 -12777808 -9886587 -6508016 -2690094 1459294 5732684 9835022 13493435 16600259
11122 16600259 19257364 21670034 23982360 26183822 28127111 29604061 30415241 30408503 29495494
11113 29495494 27665326 24998719 21655909 17820462 13638059 9208627 4635153 76698
11105 76698 -4244582 -8084305 -11216124 -13430956 -14517469 -14274760 -12577998 -9480188 -5297698
11096 -5297698 -602063 3921362 7690818 10396542 12025632 12755925 12813472 12385501 11617036
11087 11617036 10649691 9647593 8798801 8305837 8348267 8991211 10086983 11271974 12088979
11078 12088979 12157825 11311388 9662864 7577687 5536115 3947695 3027408 2783236 3082336
11069 3082336 3746891 4645487 5742065 7066389 8617296 10272679 11783362 12857471
11061 12857471 13267271 12898075 11721642 9752760 7042647 3697951 -107226 -4133216
11053 -4133216 -8081231 -11603315 -14333554 -15956266 -16290674 -15337988 -13256736 -10298744
11045 -10298744 -6770376 -3036116 482389 3361597 5281734 6124875 6007956 5242199
11037 5242199 4245227 3436163 3142561 3541072 4641407 6311917 8329619 10424040 12300703
11028 12300703 13668042 14295428 14082329 13081817 11454393 9398249 7126242 4895783
11020 4895783 3018681 1792480 1382078 1732742 2579424 3556686 4344076 4765180 4806292
11011 4806292 4570849 4209856 3869364 3667254 3683541 3951028 4453511 5149058 6004176 6988466
11001 6988466 8020514 8928812 9482841 9479527 8829988 7595187 5947725 4082801 2137831
10992 2137831 169605 -1815861 -3821367 -5834430 -7823947 -9739174 -11493213 -12945357
10984 -12945357 -13924596 -14307048 -14097237 -13453561 -12644839 -11955578 -11571492 -11501160 -11584250 -11584807
10974 -11584807 -11311510 -10686421 -9720214 -8429405 -6786786 -4765086 -2430439 27264
10966 27264 2382005 4496408 6361881 8041548 9604532 11111613 12625371 14194533
10958 14194533 15815239 17415258 18880974 20098909 20976737 21434536 21389896 20772257 19559817
10949 19559817 17788418 15517856 12809427 9757004 6540648 3440966 785874 -1152761
10941 -1152761 -2268551 -2686557 -2746249 -2886809 -3464568 -4589124 -6082298 -7588015 -8751395
10932 -8751395 -9357129 -9374555 -8921600 -8196468 -7426969 -6841899 -6628531 -6861873 -7440310 -8083180
10922 -8083180 -8421007 -8147154 -7152257 -5574935 -3745031 -2042041 -741273 67083 453118
10913 453118 560329 528143 446564 321531 62938 -468551 -1373378 -2643921 -4157110 -5732971
10903 -5732971 -7219118 -8535125 -9644066 -10484827 -10930765 -10814361 -10002992 -8474573 -6343963
10894 -6343963 -3821325 -1130560 1551827 4101930 6421273 8421582 10034709 11230043
10886 11230043 12019226 12439919 12525356 12287749 11743115 10961949 10099111 9375331 9010705
10877 9010705 9134137 9731174 10685322 11876562 13242869 14772454 16470024 18323049 20253047
10868 20253047 22062937 23437525 24034568 23623879 22179544 19866097 16943089 13663701
10860 13663701 10237304 6874620 3854294 1514933 147587 -133894 554020 1923802
10852 1923802 3649249 5493111 7364144 9288400 11327912 13496137 15709570 17793768
10844 17793768 19545916 20837874 21703880 22342917 23024460 23958204 25204370 26666197 28144942
10835 28144942 29404740 30229226 30484171 30166494 29387158 28285568 26953221 25438711 23813160
10826 23813160 22212939 20807228 19711922 18922498 18327366 17789920 17216518 16539310 15642419
10817 15642419 14342618 12484518 10072948 7316793 4547712 2076060 66313 -1513301
10809 -1513301 -2854375 -4216210 -5822560 -7777870 -10029638 -12402712 -14694306 -16765491
10801 -16765491 -18575374 -20170955 -21667276 -23217669 -24964453 -26985429 -29259551 -31667546
10793 -31667546 -34034891 -36199286 -38054915 -39534287 -40550421 -40972261 -40664811 -39542745
10785 -39542745 -37587845 -34849983 -31460147 -27640613 -23690577 -19939727 -16676406 -14087772
10777 -14087772 -12253567 -11184587 -10860490 -11244445 -12280351 -13875551 -15871736 -18030099
10769 -18030099 -20068262 -21750336 -22970476 -23759126 -24212873 -24416441 -24402448 -24137555 -23520309
10760 -23520309 -22402753 -20647764 -18206617 -15168431 -11735237 -8133023 -4518065 -930084
10752 -930084 2692357 6448969 10398247 14490985 18534111 22206619 25157180 27163626
10744 27163626 28255188 28705781 28911554 29236692 29894358 30895404 32078134 33202785 34059501
10735 34059501 34532456 34592350 34237296 33445084 32192889 30527058 28610418 26711108 25146244
10726 25146244 24187774 23946868 24296959 24896069 25316170 25226445 24539445 23442198 22301955
10717 22301955 21516914 21398380 22106301 23618698 25739696 28160291 30552102 32650533
10709 32650533 34294426 35417481 36013966 36112049 35775698 35124819 34336957 33610113 33118322
10700 33118322 33007679 33421766 34484601 36201874 38340913 40401392 41733758 41752119 40128470
10691 40128470 36890339 32409464 27295053 22210160 17664650 13885767 10840855 8373505
10683 8373505 6337387 4651646 3281254 2181716 1253788 351854 -648066 -1778182 -2973580
10674 -2973580 -4129545 -5159703 -6010346 -6640990 -7006951 -7062629 -6784157 -6208046 -5469911
10665 -5469911 -4810551 -4527367 -4878429 -5979512 -7754382 -9969892 -12324383 -14533008 -16385759
10656 -16385759 -17783073 -18739270 -19330458 -19607362 -19542430 -19049098 -18042276 -16492130 -14451065
10647 -14451065 -12050836 -9465208 -6851116 -4309185 -1886743 400434 2551857 4560268
10639 4560268 6375078 7872702 8863239 9150060 8626479 7351940 5554088 3558642 1685992
10630 1685992 151991 -989017 -1818864 -2447662 -2903675 -3118720 -3003075 -2515715 -1680904
10621 -1680904 -577501 677338 1956780 3164395 4270847 5326906 6433249 7680038
10613 7680038 9109476 10737018 12601905 14777199 17304161 20099555 22918322 25392020
10605 25392020 27099430 27652740 26820149 24645066 21466821 17819765 14278543 11314589
10597 11314589 9191830 7922080 7299211 7009043 6780462 6510031 6288147 6321041 6816574
10588 6816574 7902400 9604318 11874432 14632850 17793305 21264530 24922839 28563956
10580 28563956 31881374 34523624 36216045 36867283 36593646 35658519 34366463 32963198
10572 32963198 31594170 30338323 29266812 28453442 27909848 27499078 26929450 25869590 24104081
10563 24104081 21619149 18592012 15323249 12142521 9305651 6916979 4919546 3177050
10555 3177050 1616255 321688 -518181 -771504 -473216 213942 1131090 2206039 3417204
10546 3417204 4706764 5946136 6977152 7689540 8089966 8320006 8602243 9152033 10117234
10537 10117234 11570234 13538777 16048481 19137933 22816313 26982502 31366965 35550494
10529 35550494 39067126 41543494 42793980 42814720 41701832 39576069 36555410 32751388
10521 32751388 28269551 23228758 17800065 12229609 6815487 1846081 -2467171 -6029468
10513 -6029468 -8863439 -11078518 -12809872 -14136728 -15034229 -15413974 -15235752 -14607946 -13797176
10504 -13797176 -13133067 -12876709 -13144191 -13905332 -15005069 -16178387 -17090167 -17424009 -16984865
10495 -16984865 -15749830 -13830653 -11375031 -8480783 -5178826 -1474192 2609358 7018419
10487 7018419 11676545 16472326 21233896 25729829 29709766 32957075 35334443 36826313
10479 36826313 37565453 37813650 37894583 38105690 38632459 39494450 40555331 41588494 42357265
10470 42357265 42678325 42450454 41647254 40295746 38456584 36200204 33581717 30640330
10462 30640330 27442596 24142847 20996098 18289935 16242715 14949771 14392707 14444383
10454 14444383 14840624 15187348 15052112 14094061 12164131 9345254 5929473 2345083 -942899
10445 -942899 -3536850 -5191187 -5844375 -5579827 -4548122 -2918114 -891092 1262242 3212993
10436 3212993 4654254 5401574 5448224 4944832 4119103 3186882 2313424 1633839 1268335
10427 1268335 1273592 1569662 1944743 2170072 2133442 1880698 1553979 1296898 1183965 1193215
10417 1193215 1231049 1198624 1054839 834484 621841 503679 522032 646146 774051 757713
10407 757713 447546 -250151 -1332022 -2703884 -4230392 -5785407 -7256486 -8502937 -9324612
10398 -9324612 -9501006 -8892103 -7525534 -5601903 -3407832 -1183722 968247 3069266
10390 3069266 5164075 7228450 9142193 10710091 11702580 11907667 11175626 9439962 6724202
10381 6724202 3145436 -1089783 -5700122 -10357558 -14741401 -18613638 -21874311 -24556718
10373 -24556718 -26764772 -28590345 -30055012 -31105130 -31651427 -31606828 -30892593 -29442101 -27241066
10364 -27241066 -24385488 -21102758 -17710130 -14534320 -11837411 -9777222 -8401019 -7660926
10356 -7660926 -7441886 -7599277 -8008861 -8610539 -9406391 -10408903 -11584664 -12828209 -13966995
10347 -13966995 -14800229 -15167266 -14998563 -14303405 -13120427 -11498560 -9534545 -7428917 -5499210
10338 -5499210 -4121513 -3624653 -4187164 -5782811 -8194589 -11078963 -14053705 -16802174
10330 -16802174 -19173458 -21223890 -23158242 -25191109 -27407929 -29704464 -31821358 -33430180
10322 -33430180 -34218538 -33957343 -32561377 -30138695 -26998636 -23593124 -20398642 -17782471
10314 -17782471 -15907560 -14709427 -13948723 -13316338 -12543669 -11462647 -9991861 -8088038
10306 -8088038 -5726740 -2931645 182410 3401722 6457832 9089955 11086584 12305449
10298 12305449 12683580 12237798 11063206 9334884 7288830 5163824 3137165 1303726
10290 1303726 -298287 -1653166 -2754763 -3615475 -4285929 -4872112 -5533560 -6449273 -7758602
10281 -7758602 -9510354 -11642271 -13983925 -16286015 -18294551 -19856581 -20994301 -21887007
10273 -21887007 -22772690 -23840402 -25166225 -26698910 -28283588 -29717086 -30823532 -31513376
10265 -31513376 -31790229 -31719506 -31401534 -30962220 -30543104 -30278838 -30260670 -30487550 -30834645 -31093926
10255 -31093926 -31091376 -30799224 -30351473 -29948001 -29718163 -29647787 -29621206 -29521609 -29288053 -28904361
10245 -28904361 -28380357 -27765167 -27167545 -26751436 -26697745 -27133033 -28051533 -29292166 -30607351
10236 -30607351 -31777838 -32690219 -33337288 -33757702 -33968053 -33935847 -33581229 -32771970 -31334325
10227 -31334325 -29125201 -26138606 -22559726 -18718385 -14975353 -11610440 -8760068 -6417121
10219 -6417121 -4481014 -2831252 -1395451 -182291 745280 1336792 1591664 1526297 1117192
10210 1117192 302097 -945426 -2542696 -4301742 -5998885 -7440092 -8485840 -9059388
10202 -9059388 -9169117 -8929544 -8542707 -8237268 -8202506 -8553656 -9333651 -10524684 -12039470
10193 -12039470 -13693567 -15194933 -16184456 -16330271 -15441094 -13530934 -10783109 -7445539
10185 -7445539 -3756957 45395 3691729 6888339 9367707 10943570 11552035 11268599
10177 11268599 10285827 8857343 7247280 5714338 4509832 3848017 3844468 4473279 5597796
10168 5597796 7059763 8751807 10627453 12668552 14846372 17091356 19281403 21265146
10160 21265146 22915472 24168711 25013061 25450587 25490777 25195367 24724171 24315407 24198791
10151 24198791 24508500 25260766 26395045 27819634 29418671 31035853 32465422 33455179
10143 33455179 33726374 33039218 31300791 28637787 25361874 21845909 18392655 15168902
10135 15168902 12219557 9517497 7006737 4638543 2414097 422095 -1163639 -2142049
10127 -2142049 -2364089 -1779382 -432595 1558748 4011743 6680703 9287469 11585930
10119 11585930 13430748 14817009 15880489 16857808 18006369 19508757 21410422 23622820
10111 23622820 25979752 28293546 30361018 31936218 32745720 32584167 31434741 29525492
10103 29525492 27286600 25243482 23897458 23619585 24571156 26673385 29640427 33064689
10095 33064689 36519826 39634698 42113894 43729360 44323288 43829969 42300030 39911662
$$ [...]
##END NTUPLES=NMR SPECTRUM
##END=
