##TITLE=1H ikalashn
BAU 93-2024
25.10.2024
##JCAMPDX= 6.0         $$ Bruker NMR JCAMP-DX V2.0
##DATA TYPE= NMR FID
##DATA CLASS= NTUPLES
##ORIGIN= UXNMR, Bruker Analytische Messtechnik GmbH
##OWNER= root
$$ TOPSPIN		Version 1.3
$$ 2024-10-25 11:01:23.656 +0400  Irina@DPX200
$$ Compression mode = diff/dup
##.OBSERVE FREQUENCY= 200.131300845
##.OBSERVE NUCLEUS= ^1H
##.DELAY= (6, 6)
##.ACQUISITION MODE= SIMULTANEOUS
##.ACQUISITION SCHEME= undefined
##.AVERAGES= 32
##.DIGITISER RES= 18
##SPECTROMETER/DATA SYSTEM= spect
##.PULSE SEQUENCE= zg
##.SOLVENT NAME= CDCl3
##.SHIFT REFERENCE= INTERNAL, CDCl3, 1, 17.49637
##AUDIT TRAIL= $$ (NUMBER, WHEN, WHO, WHERE, WHAT)
$$ ##TITLE= Audit trail, TOPSPIN		Version 1.3
$$ ##JCAMPDX= 5.01
$$ ##ORIGIN= Bruker BioSpin GmbH
$$ ##OWNER= Irina
$$ $$ F:/spectra/data/iren/nmr/1H/4/audita.txt
$$ ##AUDIT TRAIL=  $$ (NUMBER, WHEN, WHO, WHERE, VERSION, WHAT)
(   1,<2024-10-25 11:00:57.750 +0400>,<Irina>,<DPX200>,<TOPSPIN 1.3>,
      <created by zg
	started at 2024-10-25 10:58:50.109 +0400,
	POWCHK disabled, PULCHK disabled
       configuration hash MD5:
       BE 6D 3F 07 2A EA 11 49 91 17 2B D3 AF B3 58 0D
       data hash MD5: 16K
       40 73 FF A6 BF 32 3A DE CD AB 4C CD F3 A4 F4 7C>)
$$ ##END=
$$ 
$$ $$ hash MD5
$$ $$ 2D E1 53 D8 9D D6 17 0C 15 53 48 64 A5 4C 82 5A
##$RELAX= 
##$RELAX= 
##$RELAX= 
##$RELAX= 
##$RELAX= 
##$RELAX= 
##$RELAX= 
##$RELAX= 
##$RELAX= 
$$ Bruker specific parameters
$$ --------------------------
##$DU= <F:/spectra>
##$EXPNO= 4
##$NAME= <1H>
##$PROCNO= 1
##$TYPE= <nmr>
##$USER= <iren>
##$AMP= (0..31)
100 100 100 100 100 100 100 100 100 100 100 100 100 100 100 100 100 100 
100 100 100 100 100 100 100 100 100 100 100 100 100 100 
##$ANAVPT= -1
##$AQSEQ= 0
##$AQ_mod= 1
##$AUNM= <au_zg>
##$AUTOPOS= <>
##$BF1= 200.13
##$BF2= 200.13
##$BF3= 200.13
##$BF4= 200.13
##$BF5= 200.13
##$BF6= 200.13
##$BF7= 200.13
##$BF8= 200.13
##$BYTORDA= 1
##$CFDGTYP= 0
##$CFRGTYP= 5
##$CHEMSTR= <none>
##$CNST= (0..63)
1 1 145 1 1 1 1 1 1 1 1 1 1 1 1 1 1 1 1 1 1 1 1 1 1 1 1 1 1 1 1 1 1 1 
1 1 1 1 1 1 1 1 1 1 1 1 1 1 1 1 1 1 1 1 1 1 1 1 1 1 1 1 1 1 
##$CPDPRG= <>
##$CPDPRG1= <>
##$CPDPRG2= <>
##$CPDPRG3= <>
##$CPDPRG4= <mlev>
##$CPDPRG5= <mlev>
##$CPDPRG6= <mlev>
##$CPDPRG7= <mlev>
##$CPDPRG8= <mlev>
##$CPDPRGB= <>
##$CPDPRGT= <>
##$D= (0..63)
0 2 0 0 0 0 0 0 0 0.06 0 0.03 0 0 0 0 0.0002 0 0 0 0 0 0 0 0 0 0 0 0 0 
0 0 0 0 0 0 0 0 0 0 0 0 0 0 0 0 0 0 0 0 0 0 0 0 0 0 0 0 0 0 0 0 0 0 
##$DATE= 1729839657
##$DBL= (0..7)
120 120 120 120 120 120 120 120 
##$DBP= (0..7)
150 150 150 150 150 150 150 150 
##$DBP07= 0
##$DBPNAM0= <>
##$DBPNAM1= <>
##$DBPNAM2= <>
##$DBPNAM3= <>
##$DBPNAM4= <>
##$DBPNAM5= <>
##$DBPNAM6= <>
##$DBPNAM7= <>
##$DBPOAL= (0..7)
0.5 0.5 0.5 0.5 0.5 0.5 0.5 0.5 
##$DBPOFFS= (0..7)
0 0 0 0 0 0 0 0 
##$DE= 6
##$DECBNUC= <off>
##$DECIM= 32
##$DECNUC= <off>
##$DECSTAT= 4
##$DIGMOD= 1
##$DIGTYP= 9
##$DL= (0..7)
0 120 120 120 120 120 120 120 
##$DP= (0..7)
150 150 150 150 150 150 150 150 
##$DP07= 0
##$DPNAME0= <>
$$ [...]
##$SW= 21.9926040160658
##$SWIBOX= (0..15)
0 0 2 0 0 0 0 0 0 0 0 0 0 0 0 0 
##$SW_h= 4401.40845070422
##$TD= 16384
##$TD0= 1
##$TE= 300
##$TE2= 300
##$TE3= 300
##$TEG= 300
##$TL= (0..7)
0 120 120 120 120 120 120 120 
##$TP= (0..7)
150 150 150 150 150 150 150 150 
##$TP07= 0
##$TPNAME0= <>
##$TPNAME1= <>
##$TPNAME2= <>
##$TPNAME3= <>
##$TPNAME4= <>
##$TPNAME5= <>
##$TPNAME6= <>
##$TPNAME7= <>
##$TPOAL= (0..7)
0.5 0.5 0.5 0.5 0.5 0.5 0.5 0.5 
##$TPOFFS= (0..7)
0 0 0 0 0 0 0 0 
##$TUNHIN= 0
##$TUNHOUT= 0
##$TUNXOUT= 0
##$USERA1= <user>
##$USERA2= <user>
##$USERA3= <user>
##$USERA4= <user>
##$USERA5= <user>
##$V9= 5
##$VALIST= <valist>
##$VCLIST= <CCCCCCCCCCCCCCC>
##$VD= 0
##$VDLIST= <DDDDDDDDDDDDDDD>
##$VPLIST= <PPPPPPPPPPPPPPP>
##$VTLIST= <TTTTTTTTTTTTTTT>
##$WBST= 1024
##$WBSW= 25
##$XGAIN= (0..3)
0 0 0 0 
##$XL= 0
##$YL= 0
##$YMAX_a= 425325
##$YMIN_a= -295206
##$ZGOPTNS= <>
##$ZL1= 120
##$ZL2= 120
##$ZL3= 120
##$ZL4= 120
##$ABSF1= 10
##$ABSF2= 0
##$ABSG= 5
##$ABSL= 3
##$ALPHA= 0
##$AQORDER= 0
##$ASSFAC= 0
##$ASSFACI= 0
##$ASSFACX= 0
##$ASSWID= 0
##$AUNMP= <proc_1d>
##$AXLEFT= 0
##$AXRIGHT= 0
##$AXTYPE= 0
##$AXUNIT= <>
##$AZFE= 0.1
##$AZFW= 0.1
##$BCFW= 1
##$BC_mod= 2
##$BYTORDP= 1
##$COROFFS= 0
##$CY= 7568.61572265625
##$DATMOD= 1
##$DC= 2
##$DFILT= <>
##$DTYPP= 0
##$F1P= 17.9538593292236
##$F2P= -4.03888763876832
##$FCOR= 0.5
##$FTSIZE= 32768
##$FT_mod= 4
##$GAMMA= 1
##$GB= 1
##$INTBC= 1
##$INTSCL= 1
##$ISEN= 128
##$LB= 0.02
##$LEV0= 0
##$LPBIN= 0
##$MAXI= 945.577
##$MC2= 0
##$MEAN= 0
##$ME_mod= 0
##$MI= -402.1523
##$NCOEF= 0
##$NC_proc= 0
##$NLEV= 6
##$NOISF1= 8.587773
##$NOISF2= 6.764455
##$NSP= 1
##$NTH_PI= 0
##$NZP= 0
##$OFFSET= 17.49637
##$PC= 1
##$PHC0= 321.3682
##$PHC1= 1.603909
##$PH_mod= 0
##$PKNL= yes
##$PPARMOD= 0
##$PPDIAG= 0
##$PPIPTYP= 0
##$PPMPNUM= 100
##$PPRESOL= 1
##$PSCAL= 0
##$PSIGN= 0
##$REVERSE= no
##$SF= 200.13
##$SI= 32768
##$SIGF1= 18.5376
##$SIGF2= -6.396296
##$SINO= 400
##$SIOLD= 32768
##$SREGLST= <1H.CDCl3>
##$SSB= 3
##$STSI= 0
##$STSR= 0
##$SW_p= 4401.40845070422
##$SYMM= 0
##$S_DEV= 0
##$TDeff= 0
##$TDoff= 0
##$TI= <>
##$TILT= no
##$TM1= 0
##$TM2= 0
##$TOPLEV= 0
##$USERP1= <user>
##$USERP2= <user>
##$USERP3= <user>
##$USERP4= <user>
##$USERP5= <user>
##$WDW= 1
##$XDIM= 8192
##$YMAX_p= 0
##$YMIN_p= 0
$$ End of Bruker specific parameters
$$ ---------------------------------
##NTUPLES= NMR FID
##VAR_NAME=  TIME,          FID/REAL,        FID/IMAG
##SYMBOL=    X,             R,               I
##VAR_TYPE=  INDEPENDENT,   DEPENDENT,       DEPENDENT
##VAR_FORM=  AFFN,          ASDF,            ASDF
##VAR_DIM=   8192,          8192,            8192
##UNITS=     SECONDS,       ARBITRARY UNITS, ARBITRARY UNITS
##FACTOR=    0.0002272,     1,               1
##FIRST=     0,             0,               0
##LAST=      1.8609952,     55,              216
##MIN=       0,             -295206,         -295206
##MAX=       1.8609952,     425325,          425325
$$ Real data points
##PAGE= N=1
##DATA TABLE= (X++(R..R)), XYDATA
$$ [...]
1910A320o30j363J354M24j681K06J222j157p72J501m32j321O88J197j335k13J769
$$ 1320 690 -673 681 1105 -576 -370 852 -305 -1077 424 -8 -1329 -641 556 -779 -992 777
1927G77o91j232J346Q41j526K02J759j134m19J043p2j632Q16J220j606l30J554
$$ 777 86 -1146 200 1041 -485 -283 1476 342 -77 966 894 -738 78 1298 -308 -638 916
1944I16q21j265J353J58j077n4J429j101p20J674l50j124O14J329j408k8J327
$$ 916 95 -1170 183 341 -736 -790 639 -462 -1182 492 142 -982 -368 961 -447 -475 852
1961H52l67j202J231Q11j939M20J478j125r52J477N4j812P19R80j350n67J708
$$ 852 485 -717 514 1325 -614 -194 1284 159 -793 684 738 -1074 -355 625 -725 -1292 416
1978D16m33j236J289N95j590M02J536q79p67J463n2j141P91J209j521n94J540
$$ 416 -17 -1253 36 631 -959 -557 979 100 -667 796 744 -397 394 1603 82 -512 1028
1995A028n89j253J030K95j365N33R77p82q12J021Q1j119M47J278j582K81J401
$$ 1028 439 -814 216 511 -854 -321 656 -126 -938 83 164 -955 -508 770 -812 -531 870
2012H70n99j052R91Q49j359R8J332r89p82J427K10j697O51J038j712j7J290n79
$$ 870 271 -781 210 1059 -300 -202 1130 141 -641 786 996 -701 -50 988 -724 -741 549 -30
2030c0j041Q34P27j302j07J408q41o84J504J40j218O68J022r32n68J500m15j245
$$ -30 -1071 -237 490 -812 -919 489 -352 -1036 468 608 -610 58 1080 148 -420 1080 665 -580
2048e80Q61P54j243l7Q75n54j206J627j90j208N28Q05j128k54J284j67j056J096
$$ -580 281 1035 -208 -245 630 76 -1130 497 307 -901 -373 432 -696 -950 334 167 -889 207
2066B07N58j143K1J379p87p12J051K96j121N79N03j017l49J056l15j029N06R04
$$ 207 765 -378 -357 1022 235 -477 574 870 -251 328 831 -186 -535 521 206 -823 -317 587
2084E87j328m0J401p80q96R48L25j101O55O91o10m32J293r9j161J061J69q46j57
$$ 587 -741 -781 620 -160 -1056 -108 217 -884 -229 462 -148 -580 713 614 -547 514 683 -163 -320
2103c20J116l48j006J261l5j513L29J010r37n44R55p4r00P67O67r94J76J019n54
$$ -320 796 448 -558 703 668 -845 -516 494 -443 -987 -32 -106 -1006 -239 428 -566 -390 629 75
2122G5q17J227K94j368M61J065q62m39J357l33j131O55M08q42l77J105m83p50
$$ 75 -742 485 779 -589 -128 937 75 -364 993 660 -471 184 592 -250 -627 478 -5 -755
2140g55P01N85j258L69P90r04j33J198j01j105P23Q96j347R9J085k45p88O38N31
$$ -755 -54 531 -727 -358 432 -472 -605 593 492 -613 110 1006 -341 -242 843 598 -190 448 979
2159I79j348L97P48r15n18P44R9j026N72O02j077j53J291m24q85R79L57j039J70
$$ 979 -369 28 776 -139 -657 87 186 -840 -268 334 -743 -896 395 -29 -914 65 422 -617 -447
2178d47J054l14p41R13L02r11M98N59r13k28Q56l77j052P94N24j213N73N74p80
$$ -447 607 293 -448 465 767 -144 354 913 0 -228 628 251 -801 -7 517 -696 -123 451 -329
2197c29n88R24N9p66N95O60r01k48J097l11n10N77L62p51Q7Q44p93l90P39J02
$$ -329 -917 7 66 -700 -105 555 -346 -594 503 192 -318 259 621 -130 -43 801 8 -382 357 459
2217D59j222O87N53r26j32P96k93p69P77N61r74p1Q32k95n09Q71L38r77K94R97
$$ 459 -763 -76 477 -449 -581 215 -78 -847 -70 491 -483 -554 278 -17 -526 345 683 -294 0 997
2237I97r45n35J100q9q53M96L38r32K50O93m31r21R06ko83K64P96p05m42R20l5
$$ 997 52 -483 617 528 -325 171 509 -423 -173 520 89 -832 74 72 -611 -347 449 -256 -698 222 187
2258A87r28Q89M20o79J7Q55o56n33Q83L0p86K44O96q70j92O82Rr87L61O39j051
$$ 187 -741 148 568 -111 -94 761 105 -428 455 485 -301 -57 639 -231 -423 259 268 -719 -358 281 -770
2279g70K93J059o89n75Q53K46q44J67R14p83j49R67j95o43K83O75j072o2R41n10
$$ -770 -477 582 -107 -682 171 417 -427 -260 654 -129 -278 689 494 -149 134 809 -263 -325 616 106
2299A06q68J002J33j067K58J019q82k29N75Q7j253Q75O86o31J25Q69m46p96J027
$$ 106 -762 240 373 -694 -436 583 -299 -528 47 134 -1119 -244 442 -189 -64 805 359 -437 590
2318E90j02p28K02P10m51o46Q26k90o14L09N40n60l28N52lp13O62K95r20L30P66
$$ 590 488 -240 -38 672 221 -425 401 111 -503 -194 346 -214 -542 10 7 -706 -44 251 -669 -339 427
2339D27n30k68J043l39o33N32N77p52k84R47m04q42R75j83n97l5O77m76m85Q49
$$ 427 -103 -371 672 333 -300 232 809 57 -227 720 316 -526 449 266 -331 -366 311 -165 -650 199
2359A99k68o21M35O11p66L6P99k59o01M15O29q74K35P17m10l81N23L1q67M67L42
$$ 199 -69 -690 -255 356 -410 -374 425 166 -435 -20 609 -265 -30 687 277 -104 419 450 -417 50 392
2380C92m95k49O59k33r08P97K03r03N89M98n57m9L80K98p08K39P17q56j78J028
$$ 392 -103 -352 307 74 -834 -37 166 -737 -148 350 -207 -256 124 422 -286 -47 670 -186 -364 664
2400F64l73m25K92L99q43J93O94p77k92J047j78r69K12O60o20k91P61l88k88O24
$$ 664 291 -134 158 557 -286 -93 601 -176 -468 579 401 -568 -356 304 -316 -607 154 -234 -522 102
2420A02K52p99N03M54l80m41P30J09o92M54L07n03j73N05l33m59L05L71p22J65
$$ 102 354 -445 58 512 132 -309 421 530 -162 292 599 96 -77 428 95 -364 -59 312 -410 -245
2440b45O60m77m94L23O08r99O05M23o28r1P11k25m17N29P4l82j61R04o48k77P16
$$ -245 415 -62 -556 -233 375 -624 -19 404 -224 -315 396 171 -246 283 357 -25 -186 718 70 -207 509
2461E09j91p30L02K55m04P1M20j75p67N42M34o13k72P57j63n00R00J39j076L95
$$ 509 318 -412 -110 145 -259 -188 232 57 -710 -168 266 -347 -619 138 -25 -525 375 514 -562 -167
2481a67J074j079J19O24n80l95O71J96p98M9N28j05p52P75J4q38L69P04q37J26
$$ -167 907 -172 -53 571 -9 -404 267 463 -335 -286 242 137 -615 160 174 -664 -295 409 -428 -302
2501c02L81J78p17N04M45o81R4N37k02p07Q47j8n37K74L16n28j50M01M9o34O07
$$ -302 79 257 -460 44 489 -192 -98 439 237 -470 377 359 -178 96 412 -116 -266 135 184 -450 157
2522A57J1n83k7N12k21o08Q41L63p27m6O25j41l71L09J96n27M23K23m45q8M60
$$ 157 168 -415 -442 70 -151 -759 82 445 -282 -328 297 156 -215 94 290 -237 186 409 -36 -124 336
2543C36k10m90M61L42q54L91M40o08l35N52L1n66L86L64l85j51O29j11m33K99
$$ 336 126 -364 97 439 -415 -24 416 -192 -527 25 56 -510 -124 240 -145 -296 333 222 -211 88
2563H8L35m71j26M92k45n80Q61k06n93M12M24n99k23O66l33l98M67j06k11M80
$$ 88 423 -48 -174 318 73 -507 354 148 -445 -33 391 -208 -431 235 -98 -496 -29 -135 -346 134
2583A34K50m34k16N23J25o79L53N26o07mO47m42k26M40j34m82J61M10n05j59L58
$$ 134 384 -50 -266 257 382 -297 56 582 -25 -29 618 176 -50 390 256 -226 -65 345 -160 -319 39
2604C9K37o74L74K18n80K40M49n8p08P68J56o24j46O48m49k57N56Q0l76L39j7
$$ 39 276 -398 -24 194 -386 -146 303 245 -463 305 461 -163 -309 339 -110 -367 189 269 -107 232 215
2625B15p8k77N03k72o64N09K29n92L01M81o79l66J065k18o77L21O07l63rJ90K94
$$ 215 137 -140 363 91 -573 -64 165 -427 -126 355 -324 -690 375 157 -520 -199 408 45 36 226 520
2646E20p62P36k52m11N9L96j98k78M12j13j52O5K70o09J0L93R1n01M82J5n25P7
$$ 520 -242 494 242 -169 -110 286 88 -190 222 109 -43 22 292 -317 -307 86 177 -324 158 173 -352 -275
2668b75M85l41J98N0L12p56M98K09l12k38K93J49m63L75N3m92k17N59n12K84L22
$$ -275 210 -131 67 117 429 -327 171 380 68 -170 123 272 -191 184 237 -255 -472 87 -425 -141 181
2689A81l2l93K07L29n61p2K84J13m57N28K69o87K04M96l17p2R0J71m87K35K96
$$ 181 149 -244 -37 292 -269 -341 -57 56 -401 127 396 -291 -87 409 92 20 110 281 -206 29 325
2710C25n23n5J75p3P4N1J27l94P1L93k11l94P14j7k80n8K61j22l12O99j65k99
$$ 325 -198 -253 -78 -151 -77 -26 101 -293 -222 171 -40 -434 280 263 -17 -75 186 64 -248 451 286 -13
2732a3n0M90p30l5P43m43m18M14K30j77m13N18Q7l69J95Q6l59n5R27p17J15M41
$$ -13 -63 427 -303 -338 405 -38 -456 -42 188 11 -402 116 203 -166 29 115 -244 -299 628 -89 26 467
2754D67m13l33L68K54m79l1N30l48l44K51J80l91K78J2k81j19M63j27j09K44M65
$$ 467 54 -279 89 343 -136 -167 363 15 -329 -78 102 -289 -11 1 -280 -399 64 -63 -172 72 537
2775E37o46K0N60k79j95M57j10p98L24L17J9m40N27k74k29M1L23l19j21N76k80
$$ 537 -109 -89 471 192 -3 454 344 -454 -130 187 206 -234 293 19 -210 -169 154 -165 -286 290 10
2796A0l46M46j50j76J12L72m47l67Q92k83j36K87K1m88K42L18j76k76K02L39m11
$$ 10 -336 110 -40 -216 -104 268 -179 -546 346 63 -73 214 235 -253 -11 307 131 -145 57 396 -15
2817a5j27L45j59j96M85m47k72K92L76o68J14M33l14m5K47N7l48M4M36j49j57
$$ -15 -142 203 44 -152 333 -114 -386 -94 282 -386 -272 161 -153 -198 49 106 -242 -198 238 89 -68
2838f8N38r7o20M37J58l81O9J91k40j04J76l4j98K1K46l11K0L64J80o42L70K85
$$ -68 470 373 -247 190 348 -33 36 227 -13 -117 59 25 -173 -152 94 -217 -197 167 347 -295 75 360
2860C60k95k06M48k5m41M49J79o28L12J13j94o7J86k10r9j45M89l33l33L64J09
$$ 360 65 -141 307 282 -159 290 469 -159 153 266 72 5 191 -19 -118 -263 226 -107 -440 -76 33
2881C3n15L16L29l76m8N40m00J01M9K0p4L2M62j14p44K02M69m65J41K85l45k31
$$ 33 -482 -166 163 -213 -261 279 -121 -20 29 49 -25 7 469 355 -389 -187 282 -183 -42 243 -102 -333
2903c33N62m61n0K76L40n16q9M41l0n36P01k82n1J7M80l93%J75qm87J88N3k73
$$ -333 229 -232 -282 -6 334 -182 -271 170 140 -396 305 23 -28 -11 469 76 76 251 243 -244 -56 -3 -276
2926b76L55M2m33J82K06N8l80L86j26l75J60K39l0o6N1K30k78k80L72J75m74M51
$$ -276 79 121 -312 -130 76 134 -246 140 14 -361 -201 38 8 -58 -7 223 -55 -335 37 212 -262 189
2948A89J17l68J71L1l70J01L63n9o21L14J96k94j4M74l47j93L91k02K4J19J85
$$ 189 306 -62 109 140 -230 -129 234 175 -446 -132 64 -230 -244 230 -117 -310 81 -121 -97 22 207
2969B07j59l39P84n76k00M81j24j81K6M13n47J51O7j69j20J22K16j96L2L42k11
$$ 207 48 -291 493 -83 -283 198 74 -107 -81 332 -215 -64 3 -166 -286 -164 52 -144 -112 230 19
2990A9k86K19K42m18J93M9pn9J58K6k25J04K37o3j1J93k55m49M14M2l64J39Q3
$$ 19 -267 -48 194 -224 -31 18 11 -48 110 136 -89 15 252 189 178 371 116 -333 81 123 -241 -102 -19
3013a9o4l3J19J60n30J48M47j39l13L19Nm05K94K16l46L9K63j96j01M6J22r7J27
$$ -19 -83 -116 3 163 -367 -219 228 89 -224 95 100 -305 -11 205 -141 -102 161 -35 -136 -90 32 -65 62
3036F2J35n25N5L66O6j52j23J15k9j97M64l84j37K95L8k49K1L99l84K10M47o05
$$ 62 197 -328 -273 93 159 7 -116 -1 -30 -227 237 -147 -284 11 49 -200 -179 220 -164 46 493 -112
3058a12J36L70j88k18j74L50m38O2K57O2l95L51J34l80R6J55j39N0P5j18O6k03
$$ -112 24 394 206 -12 -186 164 -274 -212 45 107 -288 63 197 -183 -87 68 -71 -21 54 -64 2 -201
3080b01M38k15J41k24K71m10o8L48k59K16j44J49j17q4K61j88q4N2J26l12M26
$$ -201 237 22 163 -61 210 -200 -268 80 -179 37 -107 42 -75 -159 102 -86 -170 -118 8 -304 122
3101A22k67J26p5L13m67o8L79J78l62M41l01j27P1J59k28j56L57K02l74m6J84
$$ 122 -145 -19 -94 219 -248 -316 63 241 -121 320 19 -108 -37 122 -106 -262 95 297 -77 -123 61
3122F1k28k94N49j56J61k39L42k64o6L19j34n06O20J40k46j30L07j59l93K46J26
$$ 61 -167 -461 88 -68 93 -146 196 -68 -134 185 51 -455 165 305 59 -71 236 77 -316 -70 56
3143E6n9O6K23m59j81K92N5j99JL24k90J19K77j63l09L32L9k30J96j08J31k51
$$ 56 -3 63 286 -173 -354 -62 -7 -206 -205 119 -171 -52 225 62 -247 85 124 -106 90 -18 113 -138
3165a38L05m7k43j11K47r4m5M19l65m67P74j74j25l3L86l27k24K68j2j59K79K18
$$ -138 167 120 -123 -234 13 -81 -126 293 -72 -539 235 61 -64 -97 289 -38 -262 6 -6 -165 114 332
3187C32n04P6J95l4j29J92K6l98J36O4N3j56K44j84j39J30K62l00j48N98k02k94
$$ 332 -172 -96 99 65 -64 128 154 -244 -108 -44 9 -147 97 -87 -226 -96 166 -134 -282 316 114 -180
3209a80L3K66m6m2J55r7j84L83j05l08K11L02m65O3L24k00n18M14J05l83K91l4
$$ -180 -147 119 73 31 186 89 -95 288 183 -125 86 388 -77 -14 310 110 -408 6 111 -272 19 -15
3231a5r1k9O3j5j68P6K23k86K5L43j72L1J4p9q1K5M27l07j7K27J52l55M2K15o59
$$ -15 -106 -135 -72 -87 -255 -179 44 -242 -217 126 -46 -15 -1 -80 -161 -136 291 -16 -33 194 346 -9 33 248 -411
3256d11M03J02k79l6K44K8m38L31M5L0k00J00J35l49K06L23l14O4N4K3j51L37
$$ -411 -8 94 -185 -221 23 51 -387 -56 -11 19 -181 -81 54 -295 -89 234 -80 -16 38 61 -90 247
3278B47R5m86K10J97m19j51M96l02K5J99j77j27K30Q4P2l71J67J27q0l2N69n89
$$ 247 342 -144 66 263 -156 -307 189 -113 -88 111 -66 -193 37 121 193 -178 -11 116 36 4 573 -16
3300a6KL55k35m16M78J97m67O5M50k48m31K94J56m67N20J60m96r5K39o7j52K27
$$ -16 -14 341 106 -310 168 365 -102 -37 413 165 -266 28 184 -283 237 397 -99 -194 45 -22 -174 53
3322E3N0j09k20K53Q9l64J94L75m49K87Q7m71P2N5O0j90L5K46k90J58K41Lm24
$$ 53 103 -6 -226 27 116 -248 -54 321 -128 159 246 -225 -153 -98 -38 -228 -193 53 -237 -79 162 165 -259
3345b59L48N9l93M76n8r6k73K55J32K0R1j65M6l37L20j99j59K03Mj20j12N30m48
$$ -259 89 148 -245 231 173 77 -196 59 191 211 302 137 183 -154 166 -33 -192 11 15 -105 -217 313 -135
3368a35n1K72K13n38K20K01k19j23K87N9m52O01j08j65l56N94m20K07J7J61m39
$$ -135 -186 86 299 -239 -19 182 -37 -160 127 186 -266 335 227 62 -294 300 -120 87 104 265 -174
3389a74J72K06k29l15L04j4J65k73L79k85j04J98j10r0K65J18l75L34K39m23L2
$$ -174 -2 204 -25 -340 -36 -50 115 -158 221 -64 -168 30 -80 -170 95 213 -162 172 411 -12 20
3410B0R0R0k49j01K54k54O9J88L6k96Q0J51j90l17O71m80P7L61j90j45M0L08k04
$$ 20 110 200 -49 -150 104 -150 -81 107 143 -153 -73 78 -112 -429 242 -238 -161 200 10 -135 -95 213 9
3433Ij57L24k01j01J55Nk22J24K42Q3m88M94k71k61M45j41j61J40j27K4p0M2L61
$$ 9 -148 176 -25 -126 29 34 -188 -64 178 261 -227 267 -4 -265 180 39 -122 18 -109 -85 -155 -113 248
3456B48m12M4L38k61l54M29r7MJ19K17n40L12j36K06l86K93J83k56k1J67l46J9
$$ 248 -164 -120 218 -43 -397 32 -65 -61 58 275 -265 47 -89 117 -269 24 207 -49 -70 97 -249 -230
3478b30L28n5m47L79P4k18j43N20l86J0J97J69j41k29N59k94J42l14R0k72l2M26
$$ -230 98 43 -404 -25 49 -169 -312 208 -178 -168 29 198 57 -172 387 93 235 -79 11 -261 -293 133
3500A33j06l96M38J7m80N32J9j85O3k7l4k29K63L9k78J93J25j7l1J42lk30L36
$$ 133 27 -369 69 86 -394 138 157 -28 35 8 -26 -255 8 47 -231 -38 87 70 39 181 178 -52 284
3523B84K7o16J29O33l82l64K39J75l93L78j49k72K23L17k68r7p1O3L4j11L42p4
$$ 284 311 -305 -176 457 75 -289 -50 125 -268 110 -39 -311 -88 229 -39 -136 -207 -144 -110 -221 121 47
3545D7j93N28j32n39M96j33n6N3j4P7n34K42M19n19K67K59j25m70K21K44j93Q1
$$ 47 -146 382 250 -289 207 74 18 71 57 134 -400 -158 261 -258 9 268 143 -327 -106 138 -55 26
3567B6n5n6m8J62J16k01q8L10n65K34L32j00j22J02k08Q8j17K40l34J38K52j66
$$ 26 -29 -85 -133 29 145 -56 -144 166 -399 -165 167 67 -55 47 -161 -73 -190 50 -284 -146 106 -60
3589f0j00L63J02m66O9M21l44oL99m85R8n7J68j19n1L06N8n08K60J12j88j33K00
$$ -60 -160 203 305 -161 -92 329 -15 -21 378 -107 -9 -66 102 -17 -68 238 296 -212 48 160 -28 -161 39
3612C9j75k0J75m3j39N3M03j67j50J84j1l15J67Jl7N1P2j5k15K10J41n22L29O1
$$ 39 -136 -156 19 -24 -163 -110 293 126 -24 160 149 -166 1 2 -35 16 88 73 -142 68 209 -313 16 77
3636G7k20M9L2K52l42p6L70m59Q5K19L4k81K87J10j03k80L54M5j84N89k35l41
$$ 77 -143 -94 -62 190 -152 -228 142 -317 -232 -13 21 -260 27 137 34 -246 108 153 -31 558 323 -18
3658a8J33K92m93n5K61k76L7J17J6j80N9K43m11R2Q5K97m34K49J48j58n2K10j02
$$ -18 115 407 -86 -141 120 -156 -119 -2 14 -166 -107 136 -275 -183 -98 199 -235 14 162 4 -48 162 60
3681F0%P4P0j30q8R0j83J81J96M4k57k71K31l9k85O48j53l26J91R4m49K20K92
$$ 60 60 134 204 74 -14 76 -107 74 270 314 57 -214 17 -22 -307 341 188 -138 53 147 -302 -82 210
3704B10q0k63j8L85m47L07O9k91p9O72m61j66J31L18n25J76Q6j83j66L06O7l16
$$ 210 130 -133 -151 234 -213 94 163 -128 -207 465 4 -162 -31 287 -238 -62 24 -159 -325 -19 48 -268
3726b68J41L43n27K4N49L1l59J34Q7k87J34J41k49p6N16l42k0j19L81n24K65Q3
$$ -268 -127 216 -311 -287 262 293 -66 68 155 -132 2 143 -106 -182 334 -8 -28 -147 234 -290 -25 58
3748E8p3j98K75J07m11K5L12l9m13L12L1k28K15N8q5L5L6Rj2P8j00K56k21R9k16
$$ 58 -15 -213 62 169 -242 -217 95 56 -357 -45 -14 -242 -27 31 -54 -19 17 26 14 92 -8 248 27 126 -90
3773i0k7N8J05j38P8M47n05j30K62r6k86M47j88%R8J62k02r7k3K71ok91M24j22
$$ -90 -117 -59 46 -92 -14 433 -72 -202 60 -36 -322 125 -63 -63 35 197 -5 -102 -125 146 140 -151 273 151
3797A51j89L20j94m26L18L61l13j79L00k46m5K88j42m45N26L3J45m60M46r2j38
$$ 151 -38 282 88 -338 -20 341 28 -151 149 -97 -142 146 4 -441 85 118 263 -197 249 157 19
3818A9M7J58j80k02J63K04l57J00J59l59J66L3R5k22J36%p0L2K06M2l38J97L6
$$ 19 66 224 44 -158 5 209 -148 -48 111 -248 -82 -49 46 -176 -40 -40 -110 -78 128 170 -168 29 65
3841F5j13J95M5k23N1M54o10M5L75r8l07L29J09m29q9J76Jk19M96j87l62L97K11
$$ 65 -48 147 192 -31 20 474 -136 -91 284 186 -121 208 317 -112 -201 -25 -24 -243 253 66 -296 101 312
3864C12p32K73m8J14q7R7M09n27K55J27k08k8J53l9j15K3R0J1l64M90n5m64M51
$$ 312 -420 -147 -195 -81 -168 -71 338 -189 66 193 -15 -43 110 71 -44 -21 69 80 -284 206 151 -313 138
3887A38j09r2j73K25n3K4m7K05j11j71L99k38j18J86K08k33j21L75j90k26M10
$$ 138 29 -63 -236 -11 -64 -40 -87 118 7 -164 235 -3 -121 65 273 40 -81 294 104 -122 288
3908B88J6n08J04J56r5K2Q5j22q6L79k45K2J03J67l90j37M98p0l71J17M32l69
$$ 288 304 -204 -100 56 -39 -17 68 -54 -140 239 -6 16 119 286 -104 -241 257 187 -184 -67 365 -4
3930dj01K57l59K76nJ82j02j45l9q0p3J92k68J56J81L07l31k13J16j13k6O6L97
$$ -4 -105 152 -207 69 64 246 144 -1 -40 -120 -193 -1 -269 -113 68 375 44 -169 -53 -166 -192 -126 271
3953B71l70J8J82q1j8P5J5j10J59l5k42L22Q2l80L21l05K4j38K26O5j99n1L14
$$ 271 -99 -81 101 20 2 77 92 -18 141 106 -136 186 268 -112 209 -96 -72 -210 16 81 -118 -169 145
3976A45j71K0K81l35k19L79J46k81%K77k12k66K69l9M9k82N51o9m80J48Rj27M5
$$ 145 -26 -6 275 -60 -279 100 246 -35 -35 242 30 -236 33 -6 43 -239 312 243 -237 -89 -80 -207 -162
3999a62L54l04mL59k93m0O3M49m75l33O07j01m38O98j47k38j62J98k6m19O49O6
$$ -162 192 -112 -116 243 -50 -90 -27 422 -53 -386 221 120 -318 380 233 -5 -167 31 5 -414 235 301
4021C01k78o0J47j65l03M38o8j4J37Nl58P3M54k54m4L23k42q0mP8j04j61M69k41
$$ 301 23 -37 110 -55 -358 80 12 -2 135 140 -218 -145 309 55 11 334 92 12 8 86 -18 -179 290 49
4045D9l04J15K54k59l74O06k37j47L55j0l49N4L54j45k57N78j07l80L91Q9m04
$$ 49 -255 -140 114 -145 -519 87 -150 -297 58 48 -301 -247 107 -38 -295 283 176 -204 187 276 -128
4066a28J43L07r1l45L7J05j51J35K12l89j66N48j7n01J68L74m05j56N65m76j25
$$ -128 15 322 231 -114 -77 28 -123 12 224 -165 -331 217 200 -301 -133 241 -164 -320 245 -231 -356
4087c56N18k9k53K35Jp2R5J06J3l76L31j02k49j11K72j81j24L34l3k88J94N30
$$ -356 162 133 -120 115 116 44 139 245 258 -118 213 111 -138 -249 23 -158 -282 52 19 -269 -75 455
4109D55o20j29L80n1k56J06K63k88J37L27m36L7M2J96m89N74M3l00K45m5J51m21
$$ 455 -165 -294 86 35 -221 -115 148 -140 -3 324 -112 -75 -33 163 -326 248 291 -9 236 191 342 -79
4131g9M3L69n93J93l2mj34M18k91j63L20K25k36j52M35l18K52J6j55j17OL88k68
$$ -79 -36 333 -260 -67 -99 -103 -237 181 -110 -273 47 272 36 -116 319 1 253 269 114 -3 3 391 123
4154A23m46L98r9k01K12K61j77m12M67j35l85L76J73k72K5M98l24m5J80k04j04
$$ 123 -323 75 -24 -225 -13 248 71 -341 126 -9 -394 -18 155 -117 -92 406 82 37 217 13 -91
4175i1m0M63o0m88L15J07k52nJ50r7j34J81J99n12K40K42k67j35M96k21m61N14
$$ -91 -131 332 272 -216 99 206 -46 -51 99 2 -132 49 248 -264 -24 218 -49 -184 312 91 -370 144
4197A44j53l59J36L36k47J13J54l25J86J35J94l01Q2R1m86L21P2m0l17J23J97
$$ 144 -9 -368 -232 104 -143 -30 124 -201 -15 120 314 13 95 186 -300 21 93 53 -264 -141 56
4218E6q6l8j33j06L29J05k0j31r9K51r1j50J32K96k44j22L38j59j09J62l27l92
$$ 56 -30 -68 -201 -307 22 127 107 -24 -123 128 37 -113 19 315 71 -51 287 128 19 181 -146 -538
4240e38L45J12k23K43L01l94N2j37K01r0J14J27m28K78J6Q2l77J25K11l55J20
$$ -538 -193 -81 -304 -61 240 -154 -102 -239 -38 -128 -14 113 -315 -37 -21 61 -316 -191 20 -335 -215
4261b15L64j66j22L48Lk93J51K87p16K30K47r8k13M14p6j01J18k01r3o4N00p9
$$ -215 149 -17 -139 209 212 -81 70 357 -359 -129 118 20 -193 221 145 44 162 -39 -132 -196 304 225
4283B25n63J86L19k57K49l5qm08L22l8N1m6M01l96q8K94q6k88K04n3j23J18J57
$$ 225 -338 -152 167 -90 159 124 116 -292 30 -8 43 -3 398 2 -86 208 122 -166 38 -15 -138 -20 137
4306A37k04o8K24j07KlL38o20K87N6N6k19O2J22m5k45M28n9l52K24j21j0k23L09
$$ 137 -67 -135 89 -18 -16 -19 319 -301 -14 42 98 -121 -59 63 18 -227 201 142 -210 14 -107 -117 -340 -31
4330c1q5N2L58j7m73J20L37n85K43M07k82k45J92J30k96K06j1j57RK55j38k1O0
$$ -31 -116 -64 294 277 -196 -76 261 -324 -81 326 44 -201 -9 121 -175 31 20 -137 -128 127 -11 -32 28
4353B8j25p5o6K34l8j80M0L70k96j6L21l8m58L72j34p1l6K06J94q6L26j49o16
$$ 28 -97 -172 -238 -4 -42 -222 -182 188 -108 -124 197 159 -299 73 -61 -132 -168 38 232 146 472 323 -293
4376b93L48Jn5k43M93j35L7l1J58k62j45K37j37k09J94J86k50j12M87k85p5L37
$$ -293 55 56 1 -242 251 116 153 122 280 18 -127 110 -27 -236 -42 144 -106 -218 269 -16 -91 246
4398B46k27o2O8m6p6J57K28k04l38K54pl87K66J74l20M9K66j35k97K81K98m01
$$ 246 19 -43 25 -21 -97 60 288 84 -254 0 -7 -394 -128 46 -274 -225 41 -94 -391 -110 188 -213
4420b13K06Q6p7j28K77K53o65M16j93P0o7Q5Ok23J14j76J59J93k60J86J97m09
$$ -213 -7 79 2 -126 151 404 -261 155 -38 32 -35 50 56 -167 -53 -229 -70 123 -137 49 246 -163
4442a63L05p8p9K79l23K4J34p3k43L39j60J71k09J88j60K11j88R0k78M41j9k76
$$ -163 142 64 -15 264 -59 -35 99 26 -217 122 -38 133 -76 112 -48 163 -25 65 -213 228 209 -67
4464f7r0L39j6k69Q2M4m6P6Q9k51jJ61q7J0P0J05o7j80J28k1l3J45M5k44j25J73
$$ -67 -157 182 166 -103 -21 23 -23 53 142 -109 -110 51 -36 -26 44 149 82 -98 30 9 -24 121 166 -78 -203 -30
4490c0M5p3J2R7k18K46k15p4K17J54p4k65K22o3l0j38J80L96p94O76l72K06k36
$$ -30 15 -58 -46 51 -167 79 -136 -210 7 161 87 -178 44 -19 -49 -187 -7 389 -405 271 -101 105 -131
4513a31O1r2P1L61k1j30J96k8m46K57j98O2P1n3n7J59j29K19k03J82q5k39KJ48
$$ -131 -70 -162 -91 270 249 119 315 287 -159 98 -100 -38 33 -20 -77 82 -47 172 -31 151 66 -173 -171 -23
4537b3J48l69K54n3j02J97j21K64k83K64j91o3N4K38j99k31K14p5j15M9K20J06
$$ -23 125 -244 10 -43 -145 52 -69 195 -88 176 -15 -78 -24 214 15 -216 -2 -77 -192 -143 77 183
4559A83k25k3n8J92R1n6k3J6O1j04k53L52m10J56m1K08r1k7R4J47l02q8K12j79
$$ 183 -42 -65 -123 69 160 104 81 97 158 54 -199 153 -257 -101 -142 66 -25 -52 42 189 -113 -201 11 -168
4583a68K07K21k41j73K11J13l16K18r8j74K00J49L9l78K6K82q6l15M64k43L5m2
$$ -168 39 260 19 -154 57 170 -146 72 -26 -200 0 149 188 -190 -164 118 32 -283 181 -62 -27 -69
4605f9L33l02K8K17l30m7M09j39l42L91q0J67j44l1j80k08K18N28p16L05J95k39
$$ -69 264 -38 -10 207 -123 -170 239 100 -242 149 69 236 92 61 -119 -327 -109 419 -297 8 203 -36
4627c6J64k07M06p33L41lO7j79K00m4mj79M42J5l41K17l73J57J63K4k00R8N3J11
$$ -36 128 -79 327 -406 -65 -68 -1 -180 20 -24 -28 -207 235 250 -91 126 -247 -90 73 97 -103 -5 48 159
4651A59j78M8K01k38J97k96p2J67N0J53l00J64M7l3O3ok58m1Mo7P62o71L12k01
$$ 159 -19 29 230 -8 189 -107 -179 -12 38 191 -109 55 102 69 132 126 -132 -173 -169 -236 526 -145 167 -34
4675c4LK84k12m4L75k07l21m8J58J16k95L15J2j01pJ50k95K20O4j99P3o8J40q8
$$ -34 -31 253 41 -3 372 165 -156 -204 -46 70 -225 90 102 1 -6 144 -151 69 133 -66 7 -61 79 -9
4699in2p1l6N9L93j86j47J23j52P7m01L50K24l62K94j21j9J30j80m3P3M2nj90
$$ -9 -61 -132 -168 -109 284 98 -49 74 -78 -1 -402 -52 172 -190 104 -17 -36 94 -86 -129 -56 -14 -19 -209
4723b09N1J54j85M6M55k35m0K34l36K25j96J79p0R6j93k9k28K81k9j79L0L73j34
$$ -209 -158 -4 -189 -143 312 77 37 271 -65 160 -36 143 73 169 -24 -53 -281 0 -29 -208 -178 195 61
4746F1k30J36P9j10lK90j61j57o6L90k13p7N9j69M5M06l09J4k31K20k26R8L25
$$ 61 -169 -33 46 -64 -67 223 62 -95 -161 229 16 -61 -2 -171 -126 280 -29 -15 -246 -26 -252 -154 171
4769A71k76M1K91o7m08M60j02q0M8j50R7M9m7P1k17L70j17q6M8k1k13J18J81k1
$$ 171 -105 -64 227 160 -248 212 110 30 78 -72 25 74 27 98 -119 251 134 48 96 75 -138 -20 161 140
4793A40qk77J17J27M3j58M1j33K66l57K82l50N08n5m28K85J47k56o5J56L1l69
$$ 140 132 -145 -28 99 142 -16 25 -108 158 -199 83 -267 241 186 -242 43 190 -66 -131 25 56 -313
4815c13K26K95l83j33L04Q8o7K0j90J41J85j55K7O6j52J50j94o7M26l24J41N6
$$ -313 -87 208 -175 -308 -4 84 17 37 -153 -12 173 18 45 111 -41 109 -85 -152 274 -50 91 147
4837A47kp3M6R5k04J12J2k22r5K47j20J07n7J28k81J21K45j89m2p5J53j60m3K35
$$ 147 145 72 118 213 9 121 133 -89 -184 63 -57 50 -7 121 -160 -39 206 17 -25 -100 53 -107 -150 85
4861H5j72K11n8j04oK90k96M1K7L3j08P2o6Q3j1n3p8J93l58K23n8J41k02J11N3
$$ 85 -87 124 66 -38 -44 246 -50 -9 18 51 -57 15 -51 32 21 -32 -110 83 -275 -52 -110 31 -171 -60 -7
4886gK49j48OJ7m2O5j38o1J53J10k30K52j58q1J51m8j84k43P2L31N1k5J12k95
$$ -7 242 94 100 117 75 140 2 -59 94 204 -26 226 68 -13 138 90 -94 -337 -265 66 117 92 204 -91
4910i1J19J91k39m5L0K52k79J0M38k94j93j12J21j4j41J36J63k12J74j49K27K22
$$ -91 28 219 -20 -65 -35 217 -62 -52 386 92 -101 -213 -92 -106 -247 -111 52 -160 14 -135 92 314
4932C14j92m9j3n1j95L49j96n7N3J39Pl2m2J86l86L26k56J80K6l38M32k08j70
$$ 314 122 73 60 9 -186 163 -33 -90 -37 102 109 77 35 221 -165 161 -95 85 111 -227 205 -3 -173
4955a73Pk3P1M43k95O2j58J71jm47L69%k03K24Pj74M23m11K07j28K7j87K07J46
$$ -173 -166 -189 -118 325 30 92 -66 105 104 -343 26 26 -177 47 54 -120 303 -108 99 -29 -2 -189 18 164
4979A64j30J5j25l7K2N5j15J54j17K79j93J95k58L68l43K56l35L08R8k21o4nL36
$$ 164 34 49 -76 -113 -91 -36 -151 3 -114 165 -28 167 -91 277 -66 190 -145 163 261 40 -24 -29 307
5002C07j93r2q8r0j16J68j45K05r2J52k49K19k73J61K29J78l57P0J1O3k90K31
$$ 307 114 22 -66 -156 -272 -104 -249 -44 -136 16 -233 -14 -287 -126 103 281 -76 -6 5 68 -222 9
5024IJ99k96N1K97n14K13Q3K0Rk27j34L50J04M2m29K48K7j59K03k87J32M2j05
$$ 9 208 -88 -37 260 -254 -41 42 62 71 -156 -290 60 164 206 -223 25 52 -107 96 -191 -59 -17 -122
5047a22j89M49k24J63j82J01R0j34r0J20J26k44P4P6K25M7R4o71N65l32M9K3Q8
$$ -122 -311 138 -86 77 -105 -4 86 -48 -138 -18 108 -136 -62 14 239 286 380 -291 274 -58 -9 14 102
5070A02p8j02J27m29O12j66r3K86p3k51N6M8R5N4j87L2J28q6K1k44jMQ7L5J08
$$ 102 24 -78 49 -380 232 66 -27 259 186 -65 -9 39 134 188 1 33 161 75 96 -148 -149 -145 -58 -23 85
5095H5K1R3k51q2R1NJ74k23J3n7K60k18q4J40P5k91L24j01K2j19K20r8Q1l04L00
$$ 85 106 199 -52 -134 -43 -38 136 -87 -74 -131 129 -89 -173 -33 42 -249 75 -26 -4 -123 97 -1 80 -224 76
5120G6L1j55m7j34J55L2O0JJ08j19R8k06K05P0l69L03O4k13K13k57j46K54k88
$$ 76 107 -48 -95 -229 -74 -42 18 19 127 8 106 -100 105 175 -194 109 173 -40 173 -84 -230 24 -264
5143b64K12j2OR3k35J61R3j64j0K74j42j88J65J79j25N2q7Qk56K66j30k33M81
$$ -264 -52 -64 -58 35 -200 -39 54 -110 -120 154 12 -176 -11 168 43 95 8 16 -240 26 -104 -337 144
5166A44m4k8j4o0q2J08k14J20J19k27L25k3k06K9J34k06O7n8O7j76J18J1M3q6
$$ 144 100 72 58 -2 -84 24 -190 -70 49 -178 147 124 -82 -53 81 -125 -58 -116 -49 -225 -107 -96 -53 -139
5190a39K28J44j39k61M28j54k55J51K1j14J10K38k94lk40J58J49P9j33L3j95J28
$$ -139 89 233 94 -167 261 107 -148 3 24 -90 20 258 -36 -39 -279 -121 28 107 -26 7 -188 -60
5212f0L56p1k28L3j55L11j66n6M5n6R4j66KL04rM1k99Q6J46m30M18q6K27k11K44
$$ -60 296 225 -3 30 -125 186 20 -36 9 -47 47 -119 -117 187 178 219 -80 6 152 -278 140 54 281 70 314
5237C14j12k77j4K30j56j41L14K08l28m9P6j42K59m71L11J31k77J65jM5k91K20
$$ 314 202 -75 -89 141 -15 -156 158 366 38 -11 65 -77 182 -289 22 153 -124 41 40 85 -206 14
5259A4j30J76J51l1n4j44J88j67JQ4l1M2j63q7J68R3M2l00K79j21j39OJ34K67
$$ 14 -116 60 211 180 126 -18 170 3 4 88 57 99 -64 -151 17 110 152 -148 131 10 -129 -123 11 278
5283B78k29Mk30J13J82k18P5J90k05K58q1n5K5Oqj17P6l8m5Q6q0L7J56j96N5J22
$$ 278 49 53 -177 -64 118 -100 -25 165 -40 218 137 82 107 113 105 -12 64 26 -19 67 -13 24 180 -16 39 161
5309A61j94J72k38K17j13m4J26J77j87J56j01k4r6j01P6K2L5P4r9m20J98N6K80
$$ 161 -33 139 -99 118 5 -39 87 264 77 233 132 108 12 -89 -13 9 44 118 19 -401 -203 -147 133
5332A33l64K26O2j87j1ML96m20M38k90l85L54J74J2p2n9r2l3M2lL18j47j03J10
$$ 133 -231 -5 57 -130 -141 -137 259 -161 277 -13 -398 -44 130 142 70 11 -81 -114 -72 -75 243 96 -7 103
5356A03R4m2q2j58l1R3J10J28k70n8J54k50J49q1R4J34k50j08M31j57m3J80k70
$$ 103 197 155 73 -85 -116 -23 87 215 -55 -113 41 -209 -60 -141 -47 87 -163 -271 160 3 -40 140 -130
5379a30R9J77j79J72l80N08j40j90m3N1m2M9j94K87j85J33K56k84J39j04N8q0
$$ -130 -31 146 -33 139 -241 267 127 -63 -106 -55 -97 -48 -242 45 -140 -7 249 -35 104 0 58 -22
5401b2N2L7k46j47L64j17J11Q3j11o1j52L2J41O4O5n6k8M4J12k34K2L5n9K73j35
$$ -22 30 67 -179 -326 38 -79 32 115 4 -57 -209 -177 -36 28 93 37 9 53 165 -69 -47 -12 -71 202 67
5426F7j3m21L13j20J18J05K1j38j80K91j61K58j38J11j99j47L07L7q8r0N3j39
$$ 67 54 -367 -54 -174 -56 49 70 -68 -248 43 -118 140 2 113 -86 -233 74 111 23 -67 -14 -153
5448a53O1j3N3NJ02K07m79K16j20J28L4O0j7l31K94j08m5K12o5N1j95J41n4J08
$$ -153 -92 -105 -52 -47 55 262 -217 -1 -121 7 41 101 84 -247 47 -61 -106 106 41 92 -103 38 -16 92
5472I2ql67L28k3J0r0J08q9M4L4j8m5RJ60j36K58j55k59M44l10J45j87J27j99
$$ 92 84 -283 45 22 32 -58 50 -39 5 39 21 -24 -15 145 9 267 112 -147 297 -13 132 -55 72 -127
5496a27J90m0o6j42K26j34N9j01L10k25J21j18J33k88K67K23k38K20k94K39k26
$$ -127 63 23 -43 -185 41 -93 -34 -135 175 -50 71 -47 86 -202 65 288 50 270 -24 215 -11
5517a1r7K21j33j09J46l0j52r5J47J04m9KK18j22K1j1N1Nl0K55k90K56l94P3O1
$$ -11 -108 113 -20 -129 17 -13 -165 -260 -113 -9 -58 -56 162 40 61 50 101 106 76 331 41 297 -97 -24 37
5542C7J11L5J82l85K04j48J4m8O8R7l80L2K26O0q1j65K83O1k36J47M9l49O1R0
$$ 37 148 183 365 -20 184 36 50 2 70 167 -213 -181 45 105 24 -141 142 203 -33 114 163 -186 -125 -35
5566c5J65l04J92j42k9L21k57J2J2J12J45k73j63K97o5K3K03l55L4L2K4K0j85
$$ -35 130 -174 18 -124 -153 168 -89 -77 -65 47 192 -81 -244 53 -12 11 214 -141 -107 -75 -51 -31 -216
5589b16J54n0O5p3L28k04j67J23J04m8j80J02J90n3k15J90l3Q3J42k99J88k25
$$ -216 -62 -112 -47 -120 208 4 -163 -40 64 16 -164 -62 128 75 -140 50 17 100 242 -57 131 -94
5611i4N8jl2jj61J96N6J3j07J05J42J48l84o8K14l0q7J22k79J64NP8J70m72J44
$$ -94 -36 -37 -69 -70 -231 -35 21 34 -73 32 174 322 -62 -130 84 54 -33 89 -190 -26 -21 57 227 -245 -101
5636a01K42p1k34J08k20L68n2J50k48M5j3J46L7k75K26l17L01n0N9j40M1K89m80
$$ -101 141 70 -164 -56 -276 92 40 190 -58 -13 -26 120 157 -118 108 -209 92 42 101 -39 2 291 -189
5659a89K5J69Lj44J87j65J63j3R5j11K6K82k23p3Nr8k5j16QM0K91m9j39R5Q6j48
$$ -189 -164 5 8 -136 51 -114 49 36 131 20 46 328 105 32 37 -61 -86 -202 -194 -154 137 88 -51 44 130 -18
5685a8j81J75J25j58j18N4q0L50k41J75q2l2ok68K36o4j45L26k38J83J04j73J23
$$ -18 -199 -24 101 -57 -175 -121 -201 149 -92 83 1 -31 -37 -305 -69 -133 -278 48 -190 -7 97 -76 47
5708D7j16J56k01J20P8m7Q6r8j6j05R7J23l55K18J8k9m2l0N6J86qk60K86j29q9
$$ 47 -69 87 -114 6 84 37 123 25 9 -96 1 124 -231 -13 5 -24 -66 -96 -40 146 138 -122 164 35 -54
5733e4r7K39K10k39J7R7J0k98K87k61k9K48q8m8J58j5j98k1RK78k61L5q5j35J89
$$ -54 -151 88 298 59 76 173 183 -115 172 -89 -118 130 42 -6 152 137 -61 -82 -73 205 -56 -21 -106 -241 -52
5758e2o7M14k73J22n5j58K2J44Kk37K35K8j35m4Q7m8j94K78M4j18j36q0K41K62
$$ -52 -119 295 22 144 89 -69 -47 97 99 -138 97 125 -10 -54 33 -15 -209 69 113 -5 -141 -221 20 282
5782B82m72M30k63M6J64j0j02j94k06K22K36J3k50M18j82m50L0K34M1j89L04j36
$$ 282 -190 240 -23 23 187 177 75 -119 -325 -103 133 146 -104 314 132 -318 -288 -54 -13 -202 102 -34
5804c4j74K7L05j60o6K30J15k92J25q8KK8J30L5j64j53L56k55K32j42l7p3K9K65
$$ -34 -208 -181 124 -36 -102 128 243 -49 76 -12 -10 18 148 183 19 -134 222 -33 199 57 20 -53 -24 241
5828B41j25k60L84k86rj65L18k85j0L06J46Mm89M63k90Q1J80j15m20L26L76l59
$$ 241 116 -144 240 -46 -55 -220 98 -187 -197 109 255 259 -230 233 -57 24 204 89 -331 -5 371 12
5850A2Kk1J50j08J34p6j63O1j4M3J26R3k98j65O6J33k7rK62l35J01J41k2R1k96
$$ 12 14 -7 143 35 169 93 -70 -9 -23 20 146 239 -59 -224 -158 -25 -52 -61 201 -134 -33 108 86 177 -119
5875a19J86j75J37k92L15k54J87j86J83J9j32K04j91k5J43O1j08Oo1O7J51J21
$$ -119 67 -108 29 -263 52 -202 -15 -201 -18 1 -131 73 -118 -143 0 61 -47 -41 -102 -35 116 237
5897B37l90J20N3J26J42m85K7L20j57J67k16P9k37J64k3n2r9Q1J18K05k64p5J55
$$ 237 -153 -33 20 146 288 -197 -170 150 -7 160 -56 23 -214 -50 -73 -125 -224 -143 -25 180 -84 -159 -4
5920dP1O2j08k06K74J66l35l4J99L4j55R2O4j78p2L62k54k20K53J64n90N04k14
$$ -4 67 129 21 -185 89 255 -80 -114 85 119 -36 56 120 -58 -130 232 -22 -242 11 175 -415 89 -125
5943a25R8j57L96j25J63k78K55r2l18J64R0j31kM1R6J76j72j02J7rO8L8j71j3
$$ -125 -27 -184 212 87 250 -28 227 135 -183 -19 71 -60 -62 -21 75 251 79 -23 -6 -15 53 91 -80 -93
5967i3m7jR3K14j43L07n62K56J17k32K13k6j06j14J96j9jk22K43k59R0j21K65
$$ -93 -140 -141 -48 166 23 330 -232 24 141 -91 122 96 -10 -124 72 53 52 -170 73 -186 -96 -217 48
5990D8q2Q0J98l27J0j19K43k88M22l27N2j63j00K47K9J04l7j5n2J56j10R1l3J39
$$ 48 -34 46 244 -83 -73 -192 51 -237 185 -142 -90 -253 -353 -106 -77 27 -10 -25 -77 79 -31 60 27 166
6014A66k00J37j59l5J20k06M76k83q2K16%l81L18j71J39o1L6Q3k04K54%l94J32
$$ 166 -34 103 -56 -91 29 -177 299 16 -66 150 150 -231 87 -84 55 -6 30 113 -91 163 163 -231 -99
6037i9R2k90K97Q2L2k99K99j17k47O03k31j20k36J82J39l49L92l3j53j81L27q6
$$ -99 -7 -297 0 82 114 -185 114 -3 -250 353 122 2 -234 -52 87 -262 130 97 -56 -237 90 4
6059Dm7O8Q0m06L31m8J04K2l14J69J63k14j8K9K80k38K41j35q9L10l78q3p5K55
$$ 4 -43 25 105 -301 30 -18 86 108 -206 -37 126 -88 -106 -77 203 -35 206 71 -18 292 -86 -169 -244 11
6083A1m8J93m50J77l1K03k87J78n6J52o4J03j61JL8j20R9R4kq6J26O2j66L9K25
$$ 11 -37 156 -294 -117 -148 55 -232 -54 -110 42 -22 81 -80 -79 -41 -161 -62 32 30 -56 70 132 -34 5 230
6108B30l07m2m8K99K7k21J3j70J11R5m2p1l3K65KJ32k83j9q3K67k49R6J0j27K55
$$ 230 -77 -119 -167 132 159 -62 -49 -219 -108 -13 -55 -126 -159 106 108 240 -43 -62 -145 122 -127 -31 -21 -148 107
6133A07k62OK16o3m3k9m7K03k96J75J33j76n5n0J57J7KM7k11J58Mj60J15j2N1
$$ 107 -155 -149 67 4 -39 -68 -115 88 -208 -33 100 -76 -131 -181 -24 -7 -5 42 -169 -11 -7 -167 -52 -64 -13
6158a3j68O3K49j36K2Q6j66K0J64j49j29J62n8M2Q9j01Q5j04j5o6K62j75J05j51
$$ -13 -181 -118 131 -5 17 103 -63 -43 121 -28 -157 5 -53 -11 78 -23 62 -42 -57 -123 139 -36 69 -82
6182h2Q1P1l57L26k40J08j3R0j32L42j04j14K7K9p5j2km5O9O2l47M60l23L10j87
$$ -82 -1 70 -287 39 -201 -93 -106 -16 -148 194 90 -24 3 32 -43 -55 -57 -102 -33 29 -318 142 -181 129 -58
6207e8J63K0k70j3J33j01J33J27o7K46m84K82j36o2m3J25Q3j21K51k18j5j35K64
$$ -58 105 125 -145 -158 -25 -126 7 134 67 313 -171 111 -25 -87 -130 -5 78 -43 208 -10 -25 -160 104
6230A04j83L4m2j21mK58J35j90o3j9J48j82K12p3k21L39Qj82L6l3K5K7r1K24j37
$$ 104 -79 -45 -87 -208 -212 46 181 -9 -72 -91 57 -125 87 14 -207 132 140 -42 -6 -39 -14 13 -78 146 9
6255Ij44j30J68Q6J16l0m4K04p0k48j03L13LR1R9m63LJ51K85p0k37K7J25l12J26
$$ 9 -135 -265 -97 -11 105 75 31 235 165 -83 -186 127 130 221 320 -143 -140 11 296 226 -11 16 141 -171 -45
6280d5J29j45k07K02Q4k42J71J97p9k10J71O4O1j98L4k5n6J26N9j16K6O3k27K32
$$ -45 84 -61 -268 -66 18 -224 -53 144 65 -145 26 90 151 -47 -13 -38 -94 32 91 -25 1 64 -163 69
6304F9j96J95j43L16k20J02j10K0m8m5k6PK48k6k52R6n5L07n6j42J46k61n9n2
$$ 69 -127 68 -75 241 21 123 13 33 -15 -60 -86 -79 169 143 -109 -13 -68 239 183 41 187 -74 -133 -185
6328a85K09k49J57N2J8J3J1J78r8p6J86l24nL48l82mQ4r1K19l16J56Ql1K87j26
$$ -185 24 -225 -68 -16 2 15 26 204 106 30 216 -108 -113 235 -147 -151 -67 -158 61 -255 -99 -91 -122 165 39
6353C9k44M55j49k89L87J1l07O1j0l23K21K88q0K5j44J4j8p2P4J2J80j99J56k16
$$ 39 -205 250 101 -188 199 210 -97 -36 -46 -369 -148 140 60 85 -59 -45 -63 -135 -61 -49 131 -68 88 -128
6377a28J98j5l07K31R3k31J64R3k35J3N6N8j20Q5L7L1K2r4K20k48k30M06l10k3
$$ -128 70 55 -252 -21 72 -159 5 98 -137 -124 -68 -10 -130 -45 -8 23 45 -49 171 -77 -307 99 -211 -234
6401b34K28p0rL7p6J65q7J29J60j27j37J24j47Rk7J35j91M2J16k72J41m7pL3Q9
$$ -234 -6 -76 -85 -48 -124 41 -46 83 243 116 -21 103 -44 -35 -62 73 -118 -76 40 -232 -91 -138 -145 -112 -23
6426b3R4j81k6M2L52n09K93j2j12J14p3J53m0J24J48k80M9m96K78J28j26P4k5
$$ -23 71 -110 -136 -94 258 -251 42 30 -82 32 -41 112 72 196 344 64 113 -383 -105 23 -103 -29 -54
6449e4J61k0k63L16K1q5k55K46o4j94L63n5l19J71q3O5L5k62L95j82j3J16O2n6
$$ -54 107 87 -176 140 161 76 -179 67 3 -191 172 117 -202 -31 -114 -49 -14 -276 119 -63 -76 40 102 46
6473D6m0L9J38l77j13K91J65k42p0J49Mk00J41J71k7l8j64J99q2l78K33J12J52
$$ 46 6 45 183 -194 -307 -16 149 -93 -163 -14 -10 -210 -69 102 75 37 -127 72 -10 -388 -155 -43 109
6496A09o2l68O65l75Q3j00K4j4j82J83j14m1L8J0L35o6l4k11q0J74M10l80r1J17
$$ 109 47 -321 344 -31 52 -48 -24 -38 -220 -37 -151 -192 -154 -144 191 125 91 -120 -200 -26 384 4 -87 30
6520C0j66j41M21k79J82p3J66J23k80J46k94K70l06L34m0k32K15k48L06m8o6j53
$$ 30 -136 -277 144 -135 47 -26 140 263 -17 129 -165 105 -201 133 93 -139 76 -172 134 86 20 -133
6542a33K07m20M67n3N4k49L30k80j14K3r8L65L9pj74k65O73k31k08K90j30p9M3
$$ -133 74 -346 121 68 122 -127 203 -77 -191 -168 -266 99 138 131 -43 -308 365 134 -74 216 86 7 50
6565E0J68j51r7j9J00J63l70M8N9M1J03m7J25j15P7j04j44J96j11J72J1k56P0
$$ 50 218 67 -30 -49 51 214 -156 -108 -49 -8 95 48 173 58 135 31 -113 83 -28 144 155 -101 -31
6588c1Q0j16M8L5J33k41N0l0j52P8L19J11m00K12j64O3M4j98k5K62l05K20j21
$$ -31 49 -67 -19 16 149 -92 -42 -72 -224 -146 173 284 -116 96 -68 -5 39 -159 -184 78 -227 -7 -128
6611a28K64p9q1p4K66q8j28K50k03J6n1k2K11m6p1K2r6L8K2o5j26M66m17K04o0
$$ -128 136 57 -24 -98 168 80 -48 202 -1 15 -36 -58 153 107 36 58 -38 0 22 -43 -169 297 -120 84 24
6636B4K4j09j52J37J32k86m3M39J3j91k3J20q0M6l2mJ19qj68M1k5k7j64J5R9j1
$$ 24 48 -61 -213 -76 56 -230 -273 166 179 -12 -35 85 5 51 19 15 134 126 -42 -1 -26 -53 -217 -202 -103 -114
6662a14J79Qj3k82L32Pj95Q2J51k29jp8K88l59K82p7l4Q4p2J74p7J5j61J8K12
$$ -114 65 73 60 -222 110 117 -78 4 155 -74 -75 -153 135 -224 58 -19 -53 31 -41 133 56 71 -90 -72 140
6687A40o6Oj04J62pL9k15l4r6J89L0J22m59L24n8o8K8K9J83j92J42j36Ok42L12
$$ 140 74 80 -24 138 131 170 -45 -79 -175 14 44 166 -293 31 -27 -95 -67 -38 145 -47 95 -41 -35 -277 35
6712C5j78L28q2l4m2j89K46L4j05j05m3R7J50j6q7O2j19O0o8k1O6K09l56J94J87
$$ 35 -143 185 103 69 27 -162 84 118 13 -92 -135 -38 112 96 9 71 -48 12 -56 -77 -11 198 -158 36 223
6737B23j08j62k4N1OK5j02j27K66q0R9l0k96J43l4Q2K19j50K30l20J22j17J00
$$ 223 115 -47 -71 -20 -14 11 -91 -218 48 -32 67 37 -259 -116 -150 -68 151 1 231 -89 33 -84 16
6760A6j44K81k16J10k2J54l22P6P3j08J37Rq4n6m9K09j68J17j75M50p6k21K33
$$ 16 -128 153 -63 47 25 179 -143 -67 6 -102 35 44 -40 -96 -145 64 -104 13 -162 288 212 -9 224
6783B24k73J40r9J38k71J67P4q2k43J90k2J37N6r0j49L87m9j18m9q2L9j33j01
$$ 224 -49 91 -8 130 -141 26 100 18 -225 -35 -57 80 136 46 -103 284 235 117 68 -14 25 -108 -209
6806b09J24q5L44q1j14P6k0J23j70R4j98K18k91K84j04j01J66k54K57lMn6K28
$$ -209 -85 -170 174 93 -21 55 35 158 -12 82 -116 102 -189 95 -9 -110 56 -198 59 56 60 4 232
6829B32l78M21j96r5qp8R0Q1k3N6k56K11j98M6j4J17J72l11K00L2l7q1k4J73o7
$$ 232 -146 275 79 -16 -24 -102 -12 69 46 102 -154 57 -141 -95 -109 8 180 -131 69 101 64 -17 -41 132 65
6854F5n6J03k2j99K10j78p7K22M0j46M04m39j11K25n3j34j07L86m16J29J08j62
$$ 65 9 112 90 -109 101 -77 -154 68 108 -38 366 -73 -184 41 -12 -146 -253 133 -283 -154 -46 -208
6876b08K97k32l9P8P6J49J30j94q3j31p8Q4L17j0o9J15l46J88o6oqJ34k7m9Q6
$$ -208 89 -143 -182 -104 -28 121 251 57 -26 -157 -235 -151 166 156 87 202 -144 44 -22 -28 -36 98 71 22 108
6901A08N0k29j16L43k15j1P1j44p8J48J1o2L41j43k4j15J68k94l1J77j15L76j93
$$ 108 158 -71 -187 156 -59 -70 1 -143 -221 -73 -62 -124 217 74 50 -65 103 -191 -222 -45 -160 216 23
6924B3N4O4k02p5n6OK32J24j50P3k72KJ70Q4R4j04J49k32o3J77j05K1j08L93m99
$$ 23 77 141 -61 -136 -192 -186 46 170 20 93 -179 -177 -7 77 171 67 216 -16 -79 98 -7 14 -94 299 -200
6949b00O7K06NP2j51M3R5k76J54n8n4K12l63L36l00L72m81M15j17MJ19j20N6j09
$$ -200 -133 73 78 150 -1 42 137 -139 15 -43 -97 115 -248 88 -212 160 -321 94 -23 -19 100 -20 36 -73
6973g3Q9j39j39J97k44L07m4j46K70l4j38K3o6J04j9R9o4m0K63k86O5r5P0L4k2
$$ -73 16 -123 -262 -65 -309 -2 -46 -192 78 44 -94 -71 -137 -33 -52 47 -17 -57 206 -80 -15 -110 -40 -6 -28
6998b8P1j7J67j88j68J82L65l84L49l67J14k63M25kj02j76j87P0j56K88J29j75
$$ -28 43 26 193 5 -163 19 384 0 349 -18 96 -167 258 256 154 -22 -209 -139 -295 -7 122 -53
7020e3Q2J00k72K04J61j80j45K75k1Q2k70JL04j15j39n7P0j23j39L2lK99qq4o4
$$ -53 29 129 -143 61 222 42 -103 172 151 233 -37 -36 268 153 14 -43 27 -96 -235 -203 -206 93 85 1 -63
7045f3J06l95K96K43j83M7K7k44K51J28k8j75j42k2J38N7p9N5m1m3O0j29P2j13
$$ -63 43 -352 -56 187 4 51 78 -166 85 213 185 10 -132 -154 -16 41 -38 17 -24 -67 -7 -136 -64 -177
7069a77J1L47k20Q9m3l5n9QK73j63J44j70JK77p03L40J03J56p7r1J01J8l37k1
$$ -177 -166 181 -39 50 7 -28 -87 -79 194 31 175 5 6 283 -420 -80 23 179 102 11 112 130 -207 -228
7093b28J44J07j71M0K25p6j71K01lp8jQ4j16K14j93j46J12M8j18J55J16k02j67
$$ -228 -84 23 -148 -108 117 41 -130 71 68 -10 -11 73 -43 171 -22 -168 -56 -8 -126 29 145 -57 -224
7116b24K25R8j8nj75K17j85J34j39N4o6O3n0K32l13L0L42l13M8l1k65K50L46j22
$$ -224 1 99 81 76 -99 118 -67 67 -72 -18 -84 -21 -71 161 -152 -122 220 -93 -45 -76 -341 -91 255 133
7140A33j50n8K42j07j10O3p1P2J48k25j92L25K9m45K59J30k08L53l90j18K46p3
$$ 133 -17 -75 167 60 -50 13 -58 14 162 -63 -255 70 99 -346 -87 43 -165 188 -202 -320 -74 -147
7162a47J90q0J98m39L57l6m9K30l56N2L8k52L44j44j66N44j41k49P8M9R9l69L34
$$ -147 43 -37 161 -278 79 43 -6 224 -132 -80 -42 -294 50 -94 -260 284 143 -106 -28 21 120 -249 85
7185H5j63J94l10Q9o7J96j08q1m0J22J18j26N4R6K1j26Q6k35J10N2p4L52k68J2
$$ 85 -78 116 -194 -105 -172 24 -84 -165 -205 -83 35 -91 -37 59 80 -46 40 -195 -85 -33 -107 245 -23 -11
7209a1J17o3K43m76K68m2N6q0l74L27K21j84j31K75k02P0L56l46O2J2n6M5K22
$$ -11 106 43 286 -190 78 36 92 12 -362 -35 186 2 -129 146 -56 14 370 24 86 98 42 87 309
7232C09m31K97m0k72J18K6j38L97m48N60l29j41j57L9K27p4j37M34l98L1L34j21
$$ 309 -122 175 135 -137 -19 7 -131 266 -182 378 49 -92 -249 -210 17 -57 -194 240 -158 -127 207 86
7254H6J28q0k52j69N55j52m2Lj09K46p6m7rj69J06J51J97m33K29J20k2k16K3K4
$$ 86 214 134 -118 -287 268 116 74 77 -32 214 138 91 82 -87 19 170 367 -66 163 283 261 45 68 92
7278I2rK29j29j96n6K87l20K32k27l6L4K35J88o74L52j39J16J99l17K53l8k90
$$ 92 83 312 183 -13 -69 218 -102 130 -97 -133 -99 136 324 -350 2 -137 -21 178 -139 114 76 -214
7300b14J93j19N0j06K59r7K02N5k71k5J6o7O6L3K3J2j21K73k73Q6j02K59k58J36
$$ -214 -21 -140 -90 -196 63 -34 168 223 -48 -73 -57 -124 -58 -25 -2 10 -111 162 -111 -25 -127 132 -126 10
7324A0o2r5J37J15j94J1k04L75j0q0J25n4L7J10m4n7k16J10M5j48K90k11l2J3
$$ 10 -52 -147 -10 105 -89 -78 -282 93 83 3 128 74 111 221 177 120 -96 14 59 -89 201 -10 -42 -29
7348b9K06J11l10L17k98k14L53j22J15k30K66k12P9j80m0K45j18R3j59J70j84
$$ -29 177 288 -22 295 -3 -217 136 14 129 -101 165 -47 32 -148 -188 57 -61 32 -127 43 -141
7369a41K47k31K90k53L3j38K25k4Rp1J3N0k10L21j12m5O5q2k5O8j47J24j20K52
$$ -141 106 -125 165 -88 -55 -193 32 8 17 -54 -41 9 -201 120 8 -37 28 -54 -79 -11 -158 -34 -154 98
7393I8l79L42o5j64J53R9j93m7J36J61j68Nm6J33N1j74P3n1N5j54N0j0k35L09
$$ 98 -281 61 -4 -168 -15 84 -109 -156 -20 141 -27 -22 -68 65 116 -58 15 -36 19 -135 -85 -95 -330 -21
7417b1J39r8j3L6k84K06j00Q6K54j97Q6l88P9K52o0K29m65K57r2K29J35l23J54
$$ -21 118 20 7 43 -241 -35 -135 -49 205 8 94 -294 -215 37 -23 206 -259 -2 -94 135 270 -53 101
7440A01K9j47N5k6j46k4J05K21k43l1J91k04K82k92M6J22k2J71R9j52k52K63k68
$$ 101 130 -17 38 12 -134 -158 -53 168 -75 -106 85 -119 163 -129 -83 39 17 188 287 135 -117 146 -122
7463a22J26k9P5j32L9J38p0J55k08M3j19J51m7j37K17j26m6K32J7k53K36j76K61
$$ -122 4 -25 50 -82 -43 95 25 180 -28 15 -104 47 0 -137 80 -46 -92 140 157 -96 140 -36 225
7486B25l03K98j32K2j21N0J1k33R9R7k74M35j98J05j56J05r9Q5Q9r9k27J73J80
$$ 225 -78 220 88 110 -11 39 50 -183 -84 13 -261 174 -24 81 -75 30 -69 16 105 6 -221 -48 132
7509A32k96L24k24n0L9J05j66J40lL4Q7kj71J61j34J21J00j96O7oOj16m7J74m81
$$ 132 -164 160 -64 -114 -75 30 -136 4 1 35 122 120 -51 110 -24 97 197 1 68 62 68 -48 -95 79 -402
7534d02L42J30J83l14K53j84j34N4p1J61j33J61j15Q2q9J90k35j11K92M6l21L62
$$ -402 -60 70 253 -61 192 8 -126 -72 -143 18 -115 46 -69 13 -76 114 -121 -232 60 106 -215 147
7556A47j61k7o5J66K6j81j53K21J05r4J22l8R4M0j26k15K47j00j38K74k21q9J67
$$ 147 -14 -41 -106 60 86 -95 -248 -27 78 -16 106 68 162 202 76 -139 108 8 -130 144 -77 -166 1
7579AQ7m06N41j72J8j02K93k86j6j27J40M8o5l1J16K02m7j53l1J21n2j29k4N9
$$ 1 88 -318 223 51 69 -33 260 -26 -42 -169 -29 19 -46 -77 39 241 194 41 10 131 79 -50 -74 -15
7603a5OL6k32j74K14J27l0J41L8k21J99k2R0o7m4p2oJ42n3k45j3J55M4j7MM1K58
$$ -15 -9 27 -205 -379 -165 -38 -68 73 111 -110 89 67 157 90 46 -26 -32 110 57 -188 -201 -46 -2 -19 -15 26 284
7630B84j03m17J75O5P9l81L23j74L70j73k24L82p3L7j5k34K97k49J66j68j82K57
$$ 284 181 -236 -61 4 83 -298 25 -149 221 48 -176 206 133 170 155 -79 218 -31 135 -33 -215 42
7652D2K1Q1jj11n6l0r2Q7J44k46L9K36k2k81K15n2j5J97k62J15m7O8J3j35O9k4
$$ 42 63 144 143 32 -24 -54 -146 -59 85 -161 -122 114 92 -189 26 -26 -41 156 -106 9 -38 30 43 -92 -23 -47
7678d7J7Pj92J60k74R1K67j78K45m4J07m40K9K73J0oPj52K34n7r5J01j81K86j55
$$ -47 -30 -23 -215 -55 -329 -238 29 -149 96 52 159 -281 -252 21 31 25 32 -120 114 57 -38 63 -118 168 13
7703A3k71M0M13k68J07j14j2L09j4M4n18L26l8J43o6j04J04j12J62k76L25k41
$$ 13 -258 -218 195 -73 34 -80 -92 217 203 247 -271 55 17 160 94 -10 94 -18 144 -132 193 -48
7725d8K10k55L11k77K11j85j57L44l42K45j23J17m70L05K47l1j18j17J54M5L6
$$ -48 162 -93 218 -59 152 -33 -190 154 -188 57 -66 51 -419 -114 133 102 -16 -133 21 66 102
7746A02j00j79Q5K03k65m7J56l2J23j87N9J26p7K28l95M26k48L5j79J48Nk4j37
$$ 102 2 -177 -92 111 -154 -201 -45 -77 46 -141 -82 44 -33 195 -200 226 -22 13 -166 -18 -13 -37 -174
7769a74K80J32k24LJ24k68j34M52j10j01J38K4j37j29K38p2O3r9j75J52J08k71
$$ -174 106 238 14 17 141 -127 -261 191 81 -20 118 142 5 -124 114 42 105 6 -169 -17 91 -180
7791a80L88j93o1N7j32J84N4j40j54K99j41n2L81k36pJ48l87J60K04k63K07j11
$$ -180 208 15 -46 11 -121 63 117 -23 -177 122 -19 -71 310 74 67 215 -172 -12 192 -71 136 25
7813B5J03k06nJ17k3m1q3K14o4Oj91j39K24K1Q5J1m3J99j29N4J23o0k83J17k50
$$ 25 128 -78 -83 34 11 -30 -113 101 37 43 -148 -287 -63 -42 43 54 11 210 81 135 258 198 -85 32 -218
7838b18K83K5j27Q3J21l65J37J19j73j69K63J29l3o0j8j11O2K82k30K12k73J12
$$ -218 65 90 -37 46 167 -198 -61 58 -115 -284 -21 108 75 15 -3 -114 -52 230 0 212 -61 51
7860E1j69K94j45L3j55M1k80K91Q0J60j59l5m5j54K93J09k21J23J7l88M30k37
$$ 51 -118 176 31 64 -91 -50 -330 -39 41 201 42 7 -38 -192 101 210 -11 112 129 -259 171 -66
7882f6M15m28R7Q4j22r2J98j99p8L26q4p5m2R8j02M0P3K6j06J08k97M45l29p4
$$ -66 349 -79 18 102 -20 -112 86 -113 -191 135 51 -24 -66 32 -70 -30 43 69 -37 71 -226 219 -110 -184
7906a84K02n5rJ25j54K79j68j71J42K5j03j8QP1j8N7L8p8J1J2q2j58J86J83l39
$$ -184 18 -37 -46 79 -75 204 36 -135 7 32 -71 -89 -81 -10 -28 29 67 -11 0 12 -70 -228 -42 141 -198
7931a98J41J16j25K67k16n7O4j32K00lk34J20l6L5J79k24K08j98o7R9L6j07P8
$$ -198 -57 59 -66 201 -15 -72 -8 -140 60 57 -177 -57 -93 -58 121 -103 105 -93 -160 -61 -25 -132 -54
7954e4J27J72n92N79k00L93m57K79j67r0j4j82L28j62o7lK28j72O9J02j19l4K1
$$ -54 73 245 -347 232 32 425 -32 247 80 -10 -24 -206 122 -40 -107 -110 118 -54 15 117 -2 -36 -15
7977a5j1K18j14R9J3j24Q3r2J97l48n9J97Q9k20K01n4j32j29K45J24l47J24K80
$$ -15 -26 192 78 177 190 66 149 57 254 -94 -153 44 133 -87 114 60 -72 -201 44 168 -179 -55 225
8000B25k11j12m6j32K59Oj63K15p8J11j14J8oJ78l45K21o7L8O7j25J32o4L2K4
$$ 225 14 -98 -144 -276 -17 -11 -174 41 -37 74 -40 -22 -28 150 -195 26 -41 -3 64 -61 71 7 39 63
8024F3k52K18P3j40J82j35q4J01M8n2j62L94j67k8j94K07r1K3J10j19j54J85j04
$$ 63 -189 29 102 -38 144 9 -75 26 74 22 -140 254 87 59 -135 72 -19 4 114 -5 -159 26 -78
8047g8Q2J83k16j14J30K1J82k29K16k07q0M9O3O9j30J99j59r8J83j84L8J18M4
$$ -78 4 187 -29 -143 -13 8 190 -39 177 -30 -110 -61 2 71 -59 140 -19 -117 66 -118 -80 38 82
8070H2j84J00O4qj29J07k51M75k01k71J9K01J02R8j60p1Oj00qj25K70q9J57l8
$$ 82 -102 -2 62 54 -75 32 -219 256 55 -216 -197 4 106 204 44 -27 -21 -121 -129 -254 16 -73 84 46
8094D6J52l46N7K34l00J96k92j18O6M83Pl80M15l56n2J66j59M12j85p3Q5k82K38
$$ 46 198 -148 -91 143 -157 39 -253 -371 -305 178 185 -195 220 -136 -188 -22 -181 231 46 -27 58 -224 14
8117A4M8k71J89p4R1j31L44J98o21K28O4k04q2R5J80l3j95P2n3K54j85l8N1R6
$$ 14 62 -209 -20 -94 -3 -134 210 408 -213 15 79 -125 -207 -112 68 35 -160 -88 -141 113 -72 -110 -59 37
8141C7Ol6k2m6K42k93K33k25J61j24J14m3m8K85k63L7Rj03k60M18pO0j45L2k3
$$ 37 43 7 -15 -61 181 -112 121 -104 57 -67 47 4 -44 241 -22 15 24 -79 -339 79 72 132 -13 19 -4
8166dm1m5j4L0J89k90O6PM6n0L76k78M2j48J43K5l57L43j56K10P8k07Q0N9m9
$$ -4 -45 -90 -104 -74 115 -175 -109 -102 -56 -106 270 -8 34 -114 29 54 -303 40 -116 94 172 -35 45 104 55
8191E5
$$ Imaginary data points
##PAGE= N=2
##DATA TABLE= (X++(I..I)), XYDATA
0@%%%%%%%%%%%%%%%%Jl3O4o4O4o4O5r7J28j28J60j92K21k53K88l21L54m17M80
$$ 0 0 0 0 0 0 0 0 0 0 0 0 0 0 0 0 0 1 -32 32 -32 32 -32 33 -64 64 -64 96 -96 125 -128 160 -161 193 -224 256
35B56n44O09o74P40q31R30j030J149j274J406j550J713j891K083k294K527k784
$$ 256 -288 321 -353 387 -444 486 -544 605 -669 737 -813 900 -991 1092 -1202 1325 -1459
52a459L067l382L738m142M591n104N704o406P241q259R532j1171J3383j6541K1428
$$ -1459 1608 -1774 1964 -2178 2413 -2691 3013 -3393 3848 -4411 5121 -6050 7333 -9208 12220
67A2220l0136N0314j74745q7368L29063O6607L1980J11960P6493r1337j0607k1513
$$ 12220 -17916 32398 -142347 -229715 99348 165955 197935 309895 386388 295051 284444 262931
79B62931j50569j17846K5034q7230j39279J8184N4512o9956K0323J25095K3060
$$ 262931 112362 -5484 19550 -67680 -206959 -188775 -134263 -204219 -183896 -58801 -35741
90c5741p833J25621P0372m8533K9310P0138o8319o8069K3234n6388j17128M015
$$ -35741 -43574 82047 152419 103886 133196 203334 135015 66946 90180 33792 -83336 -79321
102g9321Q654r1088q861R2891m793k6294R3609O0730l6837L9167P0707m5809l1756
$$ -79321 -70667 -161755 -170616 -77725 -82518 -108812 -15203 45527 8690 47857 118564 72755 40999
115D0999N7165k9355r1102K0947K4965q4122k3073O4345k6561n1030O2450L5356
$$ 40999 98164 68809 -22293 -1346 23619 -60503 -83576 -19231 -45792 -96822 -34372 984
127I84n1658K8881P3630k9537k1316O7374j223o0864L2712L2640o7178j5531N7048
$$ 984 -50674 -21793 51837 22300 984 68358 67135 6271 38983 71623 4445 -11086 45962
140D5962l5487o0332M3900J7059o7222P800N2888m0271k8199O0347J868n1044
$$ 45962 10475 -49857 -5957 11102 -56120 -48320 4568 -35703 -63902 -3555 -1687 -52731
152e2731M1992M9757m4893l560O5230j6246m4888M4155J8222n9189O422M5522
$$ -52731 -10739 39018 -5875 -9435 55795 39549 -5339 38816 57038 -2151 4271 49793
164D9793m3939l6138M7247m121n4942K6428L5225m8141q281N5369j9622m4253
$$ 49793 5854 -30284 16963 12842 -42100 -15672 19553 -28588 -36869 18500 -1122 -45375
176d5375M3768K4952m9926O550M8023l0223k6674M7343O93m6335K8002L6206m5264
$$ -45375 -1607 23345 -26581 -20031 27992 -2231 -28905 18438 19131 -27204 798 37004 -8260
189h260j1105N0147j7279m2834L6839J9550m9982M971M3642l1837k9683M5308
$$ -8260 -19365 30782 13503 -29331 7508 27058 -22924 -17953 25689 -6148 -35831 9477
201I477M261m4804K3259L4669l9052j0118M7325j4673l8212L7864K2191m5967
$$ 9477 13738 -31066 -7807 26862 -12190 -22308 25017 10344 -27868 9996 32187 -13780
213a3780M624M3797k6046k6650M1983M228m2130K1285L1047m1417j3861M1995
$$ -13780 -9156 34641 8595 -18055 23928 28156 -13974 7311 38358 -3059 -16920 25075
225B5075j6407m1835K8696J6440m6233J87L8510k5440k4793M2291Q603l5309K3515
$$ 25075 8668 -33167 -4471 11969 -34264 -34077 4433 -21007 -45800 -3509 5094 -30215 -6700
238f700L5528k9407o798M4692r375l3797L0362J6408m4340j629L3698k7577l0124
$$ -6700 28828 -579 -7377 37315 27940 -5857 24505 40913 -3427 -5056 28642 1065 -29059
251b9059L1560K892l9287J5121K7911l1522q031M2034p048l0768L1387K1420l5614
$$ -29059 2501 5393 -33894 -18773 9138 -22384 -30415 11619 4571 -26197 5190 26610 -9004
264i004K418L6377k0868k3876L3636M156l7690J3725K7091l1066j1820L6149r114
$$ -9004 -6586 29791 8923 -14953 18683 22839 -14851 -1126 25965 -5101 -16921 19228 10114
277A0114l1800K5992J6742l7559L95L4056k1136k5427L1117N196l4919J3460K6845
$$ 10114 -21686 4306 21048 -16511 -16116 17940 -3196 -28623 2494 7690 -27229 -13769 13076
290A3076k7252q059L7557n771k8350K8215K0008l2619J782L3821j8603k3788K8051
$$ 13076 -14176 -22235 15322 9551 -18799 9416 29424 -3195 -1413 32408 13805 -9983 18068
303A8068K897l6591R102K2948k9881j2781L0841q076k8466K3729J7651l0442L606
$$ 18068 20965 -15626 -6524 16424 -13457 -26238 4603 -3473 -31939 -8210 9441 -21001 -17395
316a7395L4661j5078j9400L0706P990l0544J1747K4206k4938j0724K9616p797
$$ -17395 17266 2188 -17212 13494 21484 -9060 2687 26893 1955 -8769 20847 13050
328A3050k8971K0465J5242l1548q77K9805j6600k2160K5910N687l0677R775K3468
$$ 13050 -15921 4544 19786 -11762 -12639 17166 566 -21594 4316 10003 -20674 -10899 12569
341A2569k3965j0604K9560m926k5730K1365J7454k6699K251L1105j3216j9136
$$ 12569 -11396 -22000 7560 2634 -23096 -1731 15723 -10976 -8725 22380 9164 -9972
353i972K7065P144k9071Q227K2253k3859j3415K5599q030k8447J6996J3781k9182
$$ -9972 17093 24237 -4834 3393 25646 1787 -11628 13971 5941 -22506 -5510 8271 -20911
366b0911j210K8629j3263j9281K6663R454k5515J0809K5082j9019r404K8321m015
$$ -20911 -22121 6508 -6755 -26036 627 10081 -15434 -4625 20457 1438 -7966 20355 16340
379A6340k4967J7258J3998k7313k620K5145j4783k1012K2305N881k7835P135K1961
$$ 16340 -8627 8631 22629 -4684 -7304 17841 3058 -17954 4351 10232 -17603 -10468 11493
392A1493j9332j1550K5513k926k3027J6993J5679k4106q04K6558j0899j8043K2745
$$ 11493 -7839 -19389 6124 3198 -19829 -2836 12843 -11263 -12067 14491 3592 -14451 8294
405H294Q675k4110O979K1731j7611j1227K3880l243k4042J3566J3036k4972m069
$$ 8294 16969 -7141 -162 21569 3958 -7269 16611 13368 -10674 2892 15928 -9044 -13113
418a3113K2537j2581j9739K0075P284k4357O520K1951j5259r507K5178J14k0421
$$ -13113 9424 -3157 -22896 -2821 4463 -19894 -13374 8577 -6682 -16189 8989 9103 -11318
431a1318J6148J5663k1441k148K3975j0734j8922J8918O216k5283L285J9254j7691
$$ -11318 4830 20493 -948 -3096 20879 10145 -8777 10141 16357 -8926 -5641 13613 -4078
444d078j2533K1219j672k2064J3000J4239k0531k011K3127q301j6664K0194Q688
$$ -4078 -16611 4608 2936 -19128 -6128 8111 -12420 -14431 8696 395 -16269 3925 12613
457A2613k1314N561K1043j4249j0914K1462q46k0714J1816J2916k0937m742K0495
$$ 12613 -8701 -3140 17903 3654 -7260 14202 13356 -7358 4458 17374 -3563 -8305 12190
470A2190r930j8691J6614O270k2522L687J8983j4100j0222K0281J215j8124J2421
$$ 12190 2260 -16431 183 6453 -16069 -12382 6601 -7499 -17721 2560 3775 -14349 -1928
483a928J5078j7530j574K1525p333j6020J6842P585k1173K997J8032j4571j2106
$$ -1928 13150 -4380 -5954 15571 8238 -7782 9060 16645 -4528 -1531 16501 1930 -10176
496a0176J8033m29k0407R301J2566j8088m377J9673p223j6215J6305Q145j9646
$$ -10176 7857 7428 -12979 -3678 8888 -9200 -13577 6096 -1127 -17342 -1037 7108 -12538
509a2538M108J9127j1460j0265K0007J877j7780J0638J3680j6542l568J8504p339
$$ -12538 -8430 10697 -763 -11028 8979 10856 -6924 3714 17394 852 -2716 15788 8449
522H449j7154J4376O049k1072J539J6030j3119j1896J6992R96j7757R109J3890
$$ 8449 -8705 5671 11720 -9352 -7813 8217 -4902 -16798 194 1190 -16567 -7458 6432
535F432j5042k611J9606m647j3230J5300Q527j7870K733J7138j1282j1430J6114
$$ 6432 -8610 -11221 8385 3738 -9492 5808 14335 -3535 -802 16336 5054 -6376 9738
548I738L56j8209O915J1502j6102n233J7157o261j4940J3197P473j7130K191J7099
$$ 9738 10094 -8115 -1200 10302 -5800 -11033 6124 -137 -15077 -1880 5593 -11537 -9346 7753
562G753j0071r968J7347K649j6106Q090J3400j3249m178J7446m873j4360J2925
$$ 7753 -2318 -12286 5061 7710 -8396 -306 13094 -155 -4333 13113 8240 -6120 6805
575F805P293j7929P35J5273j1470j1352J4389P09j7509O644J2042j4283m603J6874
$$ 6805 14098 -3831 -3096 12177 707 -10645 3744 4453 -13056 -6412 5630 -8653 -13256 3618
589C618m084j3435J3419Q513j4956K015J7063q832r984J5783K397j6002O735J1527
$$ 3618 -466 -13901 -482 8031 -6925 -4910 12153 3321 -6663 9120 11517 -4485 2250 13777
603A3777j3790n828J4536n151j4607J0745O840j6408M25J4775r173j0000J4989
$$ 13777 -13 -5841 8695 3544 -11063 -318 6522 -9886 -9461 5314 -3859 -13859 1130
616A130K950j4851O650J2982j1735m073J6155k923j2743J1612P765j5104Q05J4521
$$ 1130 4080 -10771 -4121 8861 -2874 -6947 9208 6285 -6458 5154 12919 -2185 -1380 13141
630A3141q955j0743J3320J915j5904M293J1110j3175n937J4457l776j3528J0152
$$ 13141 4186 -6557 6763 8678 -7226 -2933 8177 -4998 -10935 3522 -254 -13782 -3630
643c630P743j4106J086J5106p014r112J4939M032j3604O022J2358j1038n446J4113
$$ -3630 4113 -9993 -8907 6199 -815 -9927 5012 9044 -4560 1462 13820 2782 -2664 11449
657A1449l299j3790Q765O429j5541j197J2887q495j0432J2310K807j4121N126
$$ 11449 8150 -5640 3125 9554 -5987 -7184 5703 -2792 -13224 -914 1893 -12228 -7102
670g102J2624j0282m710J5502j189j1723R597Q551j3182J05J3742p460j0031J2101
$$ -7102 5522 -4760 -9470 6032 4843 -6880 2717 11268 -1914 -1809 11933 4473 -5558 6543
684F543K569j4981L744J0994j0982n884J3429k448j2442Q114P591j3060q87J3216
$$ 6543 9112 -5869 -2125 8869 -2113 -7997 5432 2984 -9458 -1344 6247 -6813 -7700 5516
698E516o673q974J1526L190j2851M263J1771r405m789J3506n96j1656R029P637
$$ 5516 -1157 -10131 1395 4585 -8266 -4003 7768 -1637 -6426 7080 6484 -5172 3857 11494
712A1494j2009j048J2474p118j0576J0525K170j4323K650J0222j0563o040J2509
$$ 11494 -515 -1563 10911 3793 -6783 3742 5912 -8411 -5761 4461 -6102 -12142 367
725C67j087j1471Q634Q402j0447O33J3737m950q072J1743L929j2705L358J0412
$$ 367 -720 -12191 -3557 4845 -5602 -4969 8768 3818 -4254 7489 11418 -1287 2071 12483
739A2483r951o871J1359k259j3061O314O917j2283j663J1908n262q443J0695M059
$$ 12483 2532 -4339 7020 4761 -8300 -1986 4931 -7352 -9015 2893 -2369 -10812 -117 3942
753C942j1946M090J1649q318n720J2748k95j1048O764P409j1105j164J1518n292
$$ 3942 -8004 -3914 7735 -583 -6303 6445 6150 -4898 1866 9275 -1830 -2994 8524 3232
767C232r588J0160L254j2343K246J0253q558o295J0713o47j1372O063O915j0346
$$ 3232 -6356 3804 7058 -5285 -3039 7214 -1344 -7639 3074 2427 -8945 -2882 4033 -6313
781f313j602J1486m186q376J0306M491j0626L251J1228p270n456J0982K24j0962
$$ -6313 -7915 3571 -615 -8991 1315 5806 -4820 -1569 9659 2389 -3067 7915 8139 -2823
795b823N871O371j1047k348R810n304r575Q443L351j1785K333R983p277n007J0654
$$ -2823 3048 9419 -1628 -3976 5834 530 -9045 -602 2749 -9036 -6703 3280 -3997 -9004 1650
810A650J131r822O779Q172r112j282J1310l885q498Q884L368j1095J365R325q143
$$ 1650 2781 -7041 -262 7910 -1202 -2484 8826 4941 -3557 5327 8695 -2400 -1035 8290 147
825A47o521R235p8j0543M782P014r482j904J0215l321q138Q634M290r850K405
$$ 147 -6374 2861 2783 -7760 -2978 4036 -5446 -7350 2865 -456 -8594 40 4330 -5520 -3115
840c115R869o393n372J0319R85j0019N407O745r011k048R285l524q414P036L442
$$ -3115 6754 361 -5011 5308 6293 -3726 1681 8426 -585 -2633 6652 3128 -5286 1750 5192
855E192j0300N90Q873o595n951R249L04r593N054P239p884j928J0524k459p364
$$ 5192 -5108 -4518 4355 -2240 -8191 1058 1362 -8231 -3177 4062 -3822 -5750 4774 2315 -5049
870e049Q202M562r470J668R070o371n948Q715O35j0363M008O061r093k496Q614
$$ -5049 3153 7715 -1755 -87 8983 2612 -3336 5379 6014 -4349 -341 5720 -3373 -5869 2745
885B745k983q253O959M185r347J674Q920n683m629R552J297q667M617P309p480
$$ 2745 -238 -8491 -1532 2653 -6694 -5020 3900 -1783 -6412 3140 4437 -4230 387 7696 216
900B16k323Q986k318p858O230L782r430M6Q301o259n744P708O09r354L896O803
$$ 216 -2107 6879 4561 -3297 2933 6715 -2715 -2669 5632 -627 -6371 1337 1946 -7408 -3512 3291
916C291p548k263R034j659p287P105M400q309J544Q714n101n189Q239J269q627
$$ 3291 -4257 -6520 2514 855 -6432 673 5073 -3236 -1692 7022 1921 -3268 4971 6240 -2387
931b387L206O210p370l081Q276k783q072N794L286q441L01P654m642n427Q195
$$ -2387 819 7029 -341 -3422 4854 2071 -6001 -207 3079 -5362 -5061 2593 -2049 -7476 719
946G19J323q019M149P153o622k441R055j450p109O456M055q074J30P696n268n904
$$ 719 2042 -5977 -1828 5325 -1297 -3738 5317 3867 -3242 3214 7269 -805 -675 7021 1753 -4151
962d151P444M7q702L168N967p211k935Q366k052p188N971M466p578O63Q290l868
$$ -4151 3293 3340 -5362 -2194 3773 -3438 -6373 1993 -59 -7247 -1276 3190 -4388 -3725 4565 697
978F97n085Q036J485p417K842O560o469k983P804k168o990M806L798q173l79P223
$$ 697 -4388 3648 5133 -2284 558 7118 649 -2334 5470 3302 -3688 1118 4916 -3257 -3636 3587
994C587m580n567O817J338q011L122O429n620k734Q230r63o530N619M374o783
$$ 3587 -993 -6560 257 1595 -6416 -3294 3135 -2485 -5219 3011 2048 -4482 1137 5511 -1272
1009a272n6P583l769n246O763J245p683J981N740o485l258O779j066p353M686
$$ -1272 -1328 6255 2486 -2760 4003 5248 -2435 -454 5286 -1199 -4457 2322 1256 -6097 -1411
1024a411L707p042N1P148l479m986P332J723o714L000O371n552k591P789j332
$$ -1411 2296 -4746 -4695 2453 -1026 -6012 1320 3043 -3671 -671 5700 148 -2443 5346 4014
1039D014o471M519L737p248n20O491l827n713O131J114p355K015N914n556l123
$$ 4014 -2457 2062 5799 -1449 -1969 4522 695 -5018 1113 2227 -5128 -3113 2801 -2755 -5878
1054e878P383o33o361M701M495o018l5P248k980n019O531J694o797J991N712n624
$$ -5878 1505 872 -5489 -788 3707 -2311 -2346 4902 1922 -3097 3434 5128 -1669 322 6034 410
1070D10l177O496q37p201L755L887o873p69O800l584m957N764K025o475K047O510
$$ 410 -2767 3729 2892 -4309 -554 3333 -3540 -4309 2491 -1093 -6050 -286 1739 -4736 -2689 3821
1086C821m968k476P074k47n956M281M292o120n04O136l041n183N321J524p236
$$ 3821 -1147 -3623 3451 3204 -2752 1529 5821 -299 -803 5333 2292 -2891 2430 3954 -3282
1101c282J429N411n122l467O363o44o399L755M352n955j94O664k475m347N910
$$ -3282 -1853 3558 -1564 -5031 1332 688 -5711 -1956 2396 -3559 -3753 2911 436 -3911 1999
1116A999J899o241K264N494m477l010O127n14o198L447L567o256j000N798l145
$$ 1999 3898 -2343 -79 5415 938 -2072 4055 3541 -2657 790 4357 -1899 -2899 2899 -246
1131b46m728N004J635o445J634N611m373k599O262L7n593L953M167n307o53O334
$$ -246 -4974 30 1665 -4780 -3146 2465 -1908 -4507 1755 1792 -3801 152 4319 -988 -1641 4693
1147D693k008m914N005J692o110P37N240m336l397N156k02o111K948M009n496
$$ 4693 2685 -2229 2776 4468 -1642 -905 4335 -1 -3398 1758 1556 -4555 -1607 2402 -3094
1162c094j062N966k065m601M901K382n667J559N704l686l079O120P0n399L016
$$ -3094 -4156 1810 -255 -4856 45 2427 -3240 -1681 4023 337 -2742 3378 3448 -1951 1065
1177A065L917n132j383N524k388m913M063J883o013O56M884l970l097N531K85
$$ 1065 4982 -150 -1533 3991 1603 -3310 753 2636 -3377 -2721 2163 -1807 -4904 627 912
1192I12n601L016M793m890j238O338j645m147M419K316n389J023N000l901l236
$$ 912 -4689 -1673 3120 -1770 -3008 3330 1685 -2462 1957 4273 -1116 -93 4907 1006 -2230
1207b230N124j72n519K073L564m968j674N425j864m442M229K252n073O34N227
$$ -2230 2894 2722 -2797 -724 2840 -2128 -3802 1623 -241 -4683 -454 1798 -3275 -2641 2586
1222B586l354k333N131P10n122K647M122m475j258N383j653m595L885J687n056
$$ 2586 -768 -3101 2030 2740 -2382 265 4387 -88 -1346 4037 2384 -2211 1674 3361 -1695
1237a695o4M922l629l277M545J89n423K653L862m807r17N471j280m231M157K717
$$ -1695 -1759 3163 -466 -3743 802 991 -4432 -1779 2083 -2724 -3641 1830 550 -3681 476 3193
1253C193m861O78N084l115k590M902O1n062K046L650m882j656M965j486m836L463
$$ 3193 -1668 -990 4094 979 -1611 3291 3352 -1710 336 3986 -896 -2552 2413 927 -3909 -446
1269d46K168m920M49M496k691k976M605R08m895K311M439l979j298N136j194m018
$$ -446 1722 -3198 -2749 1747 -944 -3920 685 1593 -3302 -991 3448 -531 -1829 3307 2113 -1905
1285a905L547K121m626o3M588l049l279M279L43n258J957L565m002j751M707j175
$$ -1905 1642 3763 -863 -926 3662 613 -2666 1613 1956 -3302 -1345 2220 -1782 -3533 1174 -1
1301al910L333K339m005M76M644k246l016M346R85m647K298L367l833j654M484
$$ -1 -3911 -578 1761 -2244 -1768 2876 630 -2386 1960 2945 -1702 596 3963 130 -1524 2960
1317B960p44m813K951K009m335k94M213k543l556M161J039m433J616L736l169
$$ 2960 2216 -2597 354 2363 -1972 -2266 1947 -596 -4152 9 1048 -3385 -1769 1967 -1202
1332a202j460M638n34l723L327K559m387K40M240k232l211L418J180m875J400
$$ -1202 -2662 1976 1442 -2281 1046 3605 -782 -542 3698 1466 -1745 1673 2853 -2022 -622
1347f22L376l832j702M339j063l945K655K228l783Q8L949j992k716L958Q66l999
$$ -622 2754 -1078 -2780 1559 496 -3449 -794 1434 -2349 -2261 1688 -304 -3020 938 1804 -2195
1363b195J720L893l120j656M202q39l632K940J858m178j49L818k455l136L777
$$ -2195 -475 3418 298 -1358 2844 2005 -1627 1313 3171 -1007 -1156 2662 207 -2929 848
1378H48O29m625J439L355l453j620M291l32l453K955K316l656qM524j970k669
$$ 848 1477 -3148 -1709 1646 -1807 -3427 864 532 -2921 34 2350 -1306 -1314 3210 1240 -1429
1394a429L538J026m296J194L337l498j860L971n33m267K387K013l689m78L836
$$ -1429 2109 3135 -1161 33 3370 -128 -1988 1983 1450 -2817 -430 1583 -2106 -2584 1252
1409A252j787k691L416J043l786J433L463k691j300L886m53l076K313K499l776
$$ 1252 -535 -3226 190 1233 -2553 -1120 2343 -348 -1648 2238 1785 -1291 1022 3521 -255
1424b55m59L731k081k799L131N13l783R09K960k923j789L667m37l586K402K251
$$ -255 -714 3017 936 -1863 1268 1781 -2002 -1093 1867 -1056 -2845 822 385 -3201 -799 1452
1440A452l243j67L749j381k766L453J244l549R75L593k653j848L575k61l987K311
$$ 1452 -1791 -1958 1791 410 -2356 1097 2341 -1208 -233 3360 707 -1141 2434 2173 -1814 497
1456D97K071l682q14L479j656k770K723J049l662J016K959j976j664L574Rk886
$$ 497 2568 -1114 -1928 1551 -105 -2875 -152 897 -2765 -1749 1210 -766 -2430 1144 1153 -1733
1472a733J850K308l001l74L842j258l073K744J107l596O85K845k615k182L575
$$ -1733 117 2425 -576 -950 2892 1634 -1439 1305 2412 -1184 -499 2346 -269 -2451 1124
1487A124o33l205J967K089l046n58L501j207k889K991J551l301J027L016k206
$$ 1124 491 -2714 -747 1342 -1704 -2262 1239 32 -2857 134 1685 -1616 -589 2427 221
1502B21j557L487N0l307J672K077k970q32L284j205l094K367J026l173N19K921
$$ 221 -1336 2151 2201 -1106 566 2643 -327 -1159 2125 920 -2174 193 1219 -1954 -1435 1486
1518A486k318j750L193k95k700J651K604k660n37L324q83k515K395J374l188N06
$$ 1486 -832 -2582 611 316 -2384 -733 1871 -789 -1326 1998 1115 -1400 995 2369 -819 -313
1534c13L040k137j901K767R4l089R32K609l309p26K855r77k553K380J396k986
$$ -313 2727 590 -1311 1456 1550 -1539 -607 2002 -1307 -2033 822 -155 -2708 -328 1068 -1918
1550a918L75L312j877j756L484Ok797J216K629k688p17K980q97k710K290J017
$$ -1918 -1543 1769 -108 -1864 1620 1626 -1171 45 2674 -14 -731 2249 1352 -1358 932 1949
1566A949l053J27K894k150k195K900L02k891J047K211k256p83L058o45k286K383
$$ 1949 -1104 -977 1917 -233 -2428 472 774 -2117 -1070 1141 -1115 -1898 1160 515 -1771 612
1582F12J377k525j5K828j846j139K474M01k905P16K256k591j064K375m64k751
$$ 612 1989 -536 -551 2277 431 -708 1766 2167 -738 -22 2234 -357 -1421 954 490 -2261
1598b261J582J804k671l31K873j343j886K559M59k389J223K305k300m97K779m83
$$ -2261 -679 1125 -1546 -1877 996 -347 -2233 326 785 -1604 -381 1924 -376 -873 1906 1423
1614A423k354J648J332k381J5K277j711j830K100L87k853Q96J947j911j096K510
$$ 1423 -931 717 2049 -332 -317 1960 249 -1581 519 906 -1947 -1051 896 -1015 -2111 399
1630C99k42k169K094J330k421L66K288j135j758K314R87k942J141K016k071j259
$$ 399 157 -2012 82 1412 -1009 -643 1645 510 -1248 1066 2053 -889 252 2268 197 -1062
1646a062K492o06k275J730Q70k331l47K524j240j953K223P40k539R36K171j974
$$ -1062 1430 824 -1451 279 1149 -1182 -1529 995 -245 -2198 25 765 -1774 -838 1333 -641
1662f41o42K471k22k294J737J668k286l04K430j361j549J984O08k628K58K327
$$ -641 -1283 1188 966 -1328 409 2077 -209 -513 1917 556 -993 991 1599 -1029 -771 1556
1678A556k252r20K240l60k319J604J108k110m3K494j116j678K166R39k233Q03
$$ 1556 -696 -1616 624 264 -2055 -451 657 -1453 -1496 998 -118 -1796 370 1309 -924 -121
1694a21J930j364j163K279k55k068R56J635k642O2J945j135j930K160N41k412
$$ -121 1809 445 -718 1561 1306 -762 194 1829 -813 -751 1194 59 -1871 289 830 -1582
1710a582M64J960j620j104K568j7k055J124J555j851JK316r14j857K004P93k427
$$ -1582 -1118 842 -778 -1882 686 669 -1386 -262 1293 -558 -557 1759 845 -1012 992 1785 -642
1727f42K19K218j685j156J927l26k124Q57J434k206k6K160r45j487J865O59k089
$$ -642 -423 1795 110 -1046 881 555 -1569 -712 722 -1484 -1510 650 -295 -1782 83 742 -1347
1744a347P47J946j356o01J858N6k026J236J264k041l95K221j061j783J856N32
$$ -1347 -600 1346 -10 -611 1247 1303 -723 513 1777 -264 -659 1562 501 -1282 574 1106
1760A106k184M35J581j484r46J647j38j893J343J257j715j25K183p52j322J865
$$ 1106 -1078 -643 938 -546 -1492 155 17 -1876 -533 724 -991 -1116 1067 315 -1007 858
1776H58O82k203N02J774j274j080J994j85j806O93J421j954o43K038p95j962J674
$$ 858 1540 -663 -161 1613 339 -741 1253 1068 -738 -45 1376 -578 -1221 817 22 -1940 -266
1793b66P40j768K96J841j100j280K311J89j848J068J455j625n09J973m17j939
$$ -266 474 -1294 -998 843 -257 -1537 774 963 -885 183 1638 13 -496 1477 1060 -879
1809h79J570Q29k271K78J580j216j343K115j35k235Q95J707j788o28K040o07j299
$$ -879 691 1520 -751 -473 1107 -109 -1452 663 528 -1707 -812 895 -893 -1521 519 -88 -1387
1826a387J597J186k236L99J888j219p56J663L06j835O63J182j726n02J653p03
$$ -1387 210 1396 -840 -441 1447 228 -528 1135 1441 -394 269 1451 -275 -777 876 173
1842A73j457J107Q54j911J61J705q71j349J623L74j446P42J433j313q17K285n49
$$ 173 -1284 -177 677 -1234 -1073 632 -239 -1588 35 409 -1037 -295 1138 -175 -992 1293 744
1859G44j602J670P01j613J7J460j103j388J758K55j981N80J054j287p37K077o19
$$ 744 -858 812 1513 -100 -83 1377 274 -1114 644 899 -1082 -502 552 -735 -1472 605 -14
1876a4j495J548O23j660K37J833j207p30J513M59j668M91J795j640p01J888n86
$$ -14 -1509 39 662 -998 -761 1072 -135 -865 648 1107 -561 -70 1725 85 -616 1272 686
1893F86j769J323P48j651o6J439r85j049J364M57j919R46J289j315n32J652l2
$$ 686 -1083 240 988 -663 -729 710 -275 -1324 40 497 -1422 -476 813 -502 -1034 618 586
1910E86j495J046R75j308k1J559r44j149J737J07j873O93J304j539p73J600k11
$$ 586 -909 137 1112 -196 -217 1342 398 -751 986 1093 -780 -87 1217 -322 -1095 505 294
1927B94j866J104J069j686m0J687p13j136J560N25j600M55J882j675l00J507k07
$$ 294 -1572 -468 601 -1085 -1125 562 -151 -1287 273 798 -802 -347 1535 -140 -440 1067 860
1944H60j352J001Q41j644m3J336p52j392J207M66j646N98J083j194m43J456r0
$$ 860 -492 509 1350 -294 -337 999 247 -1145 62 528 -1118 -520 563 -631 -1074 382 292
1961B92j622J201R37j135q8J227n38j004J438L71j477L91J448r92j052J323J52
$$ 292 -1330 -129 808 -327 -415 812 274 -730 708 1079 -398 -7 1441 449 -603 720 872
1978H72j725M90J028j462j01J539o95j357J517K11j488R25J235r49q76J677j36
$$ 872 -853 -363 665 -797 -898 641 -54 -1411 106 317 -1171 -246 989 40 -836 841 705
1995G05j322Q65R49j119m28J507p08r17P92M95j451K38J182j216p97J474k17j415
$$ 705 -617 248 1197 78 -350 1157 449 -468 324 819 -632 -394 788 -428 -1225 249 32 -1383
2013a383O93J221j176M0J089k49r64J147N90j473Q7J414p59o04J143r6j248O17
$$ -1383 -690 531 -645 -605 484 235 -729 418 1008 -465 -378 1036 277 -327 816 720 -528 89
2031H9Q48j391NJ084p88r93J106J98j188K62J383q87p86J474J46j330O83J004
$$ 89 937 -454 -449 635 -153 -1146 -40 158 -1030 -768 615 -272 -1058 416 562 -768 -85 919
2049I19j144r7J149k92j089J081O35j520K63Q98r72n92R83K70j712P49R55j108
$$ 919 -225 -322 827 535 -554 527 1162 -358 -95 803 -169 -761 222 492 -1220 -471 484 -624
2067f24m07J592o17j054R05O46j150P24P85o80p23J222J04j476Q27J022j084n83
$$ -624 -1031 561 -56 -1110 -205 441 -709 15 800 120 -603 619 723 -753 74 1096 12 -571
2085e71J386m75j351J142L27j189r7J271q15r81J659k04r93N35J049r72k92J398
$$ -571 815 340 -1011 131 458 -731 -828 443 -372 -1353 306 102 -891 -356 693 -279 -571 827
2103H27n38q65J102L26j102q8J383p60p02J039k19q76L52Q68j183j12J129n18
$$ 827 289 -576 526 852 -250 -338 1045 285 -417 622 403 -473 -121 747 -436 -548 581 63
2121F3j098O28Q93j168J20J224p07l63Q02K60j107M54J113j125l86J148l49o58
$$ 63 -1035 -407 486 -682 -562 662 -45 -408 394 654 -453 1 1114 -11 -397 751 402 -256
2139b56K82Q34j163n7R13n59r87Q42N16j117J64R39o60p66J402J74j277J141K56
$$ -256 26 860 -303 -360 553 -6 -993 -151 365 -752 -588 351 -309 -1075 327 501 -776 365 621
2158F21p45K7J048n36q60R79J54j118M75O09p95n06J194k90j203P22N58j021L5
$$ 621 -124 -97 951 415 -445 534 688 -430 45 654 -141 -647 547 257 -946 -224 334 -687 -652
2177f52J111m80q05Q21L77p96L38P46q95j78J001j78o66O29M48o43n98J163o54
$$ -652 459 -21 -826 -5 372 -424 -86 660 -235 -413 588 410 -256 373 821 178 -420 743 89
2196H9q46Q80L54r82J35R54q37n77J141k99o52N71M59p13Q3Q04l27p56J221K63
$$ 89 -757 123 477 -505 -370 584 -253 -830 311 12 -640 -69 390 -323 -240 564 237 -519 702 965
2216I65j178K69P95o62m53O34p4j044N98Q09r42k67O34q6q84R47L02j099L34J014
$$ 965 -213 56 851 189 -264 370 296 -748 -150 659 -283 -550 84 -2 -886 61 363 -736 -402 612
2236F12q50l43Q02L80r86P08L75j116M19Q02m63p59P47N00j058m56J187p67l38
$$ 612 -238 -581 221 601 -385 323 698 -418 1 803 340 -419 328 828 -230 -686 501 -266 -604
2255f04J036j67j158R75N39j097j83J038l51p40P89M69p86J02R70o85m97P26K47
$$ -604 432 265 -893 82 621 -476 -659 379 28 -712 77 546 -240 -138 832 147 -350 376 623
2274F23q31K21P82r40k79R32o56k77J79O58j105L12N70l99o34J310l63n51K37
$$ 623 -208 13 795 -145 -424 508 -148 -425 -246 412 -693 -381 189 -210 -844 466 103 -448 -211
2293b11O68o09j55P22R0r83O56N32q49J29O42p53m86P51N9p42M69M84q00k53R90
$$ -211 457 -152 -307 415 505 -478 178 710 -139 -10 632 -121 -607 144 203 -539 -70 414 -386 -639 351
2314C51m03o55O01N42p75r4J006n65k92O87M34j210O02M68p88m32Q91np12L38
$$ 351 -52 -707 -106 436 -339 -433 573 8 -284 403 837 -373 229 697 -91 -523 368 363 -349 -11
2334a1N69j041k0R02o01q08J176L6p96J01R84o72j49R65k30q19L51R42r71jQ59
$$ -11 558 -483 -503 399 -202 -1010 166 202 -594 -493 491 -181 -330 635 405 -414 -63 879 -92 -93 766
2355G66o81m95P80K87j061K38N91p73K3P34j14j032M78Q51r92J5P36k55p06Q33
$$ 766 85 -410 370 657 -404 -166 425 -348 -325 409 295 -737 -259 592 -400 -385 351 96 -610 223
2375B23K18p92K66Q51q51R8P43l50q44N20N63o92j89Q15m70q94P71M04r47l0R84
$$ 223 441 -351 -85 766 -85 13 756 406 -438 82 645 -47 -236 579 109 -785 -14 390 -557 -587 397
2396C97o45l09O67J86o49L20P10q86j26P95q2q31P29O47j190L37O25n59n17N96
$$ 397 -248 -557 110 296 -353 -33 677 -209 -335 460 378 -453 276 923 -267 70 695 136 -381 215
2416B15l2q39L43O87o39k69N84j79n02P76K17p25L19M00k73n81J142m49n51O51
$$ 215 183 -656 -313 374 -265 -534 50 -129 -631 145 362 -363 -44 356 83 -498 644 195 -356 295
2436B95K23m92l09P93l51n99N13M42j093J24P74n69k8N97m9r50O23L80q66K39
$$ 295 518 26 -283 510 159 -440 73 515 -578 -454 320 -249 -277 320 271 -679 -56 324 -542 -303
2456c03Q41m21p23R29L37p34J02L97k48n53P09rp74M71J75l87m32P26j50m02L69
$$ -303 538 117 -606 323 660 -74 28 425 177 -376 333 324 -450 21 196 -191 -623 103 -47 -449 -80
2477h0K60q04K40M25k35m57R84L4p39K60O36n38r6O35p7q23P42p9k90m0M44l27
$$ -80 180 -624 -384 41 -194 -651 333 367 -372 -112 524 -14 -110 525 448 -375 367 288 -2 -42 402 75
2499G5n09M72n8l94L67L83l43p96J198k57n55L94K52n36jQ11m76n01R83j60m92
$$ 75 -434 38 -20 -414 -47 336 -7 -803 395 138 -417 -23 229 -307 -308 503 27 -474 509 349 -143
2520a43J20M66n68j50Q10o57l13K80Q2k93j81J052n72n38P46K24o98Q1O14m56
$$ -143 -23 443 -125 -275 535 -122 -435 -155 -73 -366 -547 505 -67 -605 141 365 -333 -252 362 -94
2540i4j88P56k77l64M69K58m81JQ25p51m55L25K99o86K48K93k64l63O36m6p74
$$ -94 -282 474 197 -167 302 560 79 80 905 154 -301 24 323 -363 -115 178 -86 -449 187 141 -633
2561f33M88P56j033J13P26m43k55L13L84p80K55M63k48l77M99o8p65M92N18p34
$$ -633 -145 611 -422 -309 417 -26 -281 32 416 -364 -109 354 106 -271 228 160 -605 -113 405 -329
2581c29R3N90n10k73L08L29n63K37N86o94K5L77O9l06J25N10p62k2N67k79l20
$$ -329 -236 354 -156 -429 -121 208 -355 -118 468 -226 -201 176 245 -61 64 574 -188 -210 357 78 -242
2602b42O21K7p86L82K98m91j09L43K50n81J86M82o34p4N75l24o20P31M55o86O6
$$ -242 379 406 -380 2 300 -191 -300 43 293 -288 -102 380 -254 -328 247 -77 -697 34 489 -197 -131
2623a31O30l09l88L06K88m13P1L77o98L8O03k32l62j06O96r30J13O76l00m13M88
$$ -131 499 190 -198 108 396 -17 54 431 -267 -229 374 142 -220 -326 370 -560 -447 229 -71 -484 4
2644DK65n70K29L47k48k06N33j18m88N83l3n05J61L63p5m43L61n3l05J99K74m65
$$ 4 269 -301 -72 275 27 -179 354 236 -252 331 298 -207 -46 317 242 -201 160 107 -198 1 275 -190
2666a90k67P22k39n85M97K53l82K5P00n49J0L07n5j86K56J93m53j96L04k22l44
$$ -190 -457 265 26 -559 -62 191 -191 -166 534 -15 -5 302 247 61 317 510 57 -139 165 -57 -401
2687d01M76K30l01k44L29j87l32L87J16l46M2N43l94l04R39l42m12M60J94m09
$$ -401 75 305 4 -240 89 -98 -430 -43 73 -273 -231 312 -82 -386 553 211 -201 259 453 44
2707D4j27M72m43j5N16j72n02M2O89p44J24J55q5l99N65Q3n50K22M03j96l87L64
$$ 44 -83 389 -54 -69 447 275 -227 -185 504 -240 -116 39 -46 -445 120 203 -347 -125 278 82 -305 59
2729E9J57p72K26P80m05q3N20l06k92K77J4j52j95L19j37k72L80j3m38Q6L52k54
$$ 59 216 -556 -330 450 45 -38 482 176 -116 161 175 23 -172 147 10 -262 118 105 -333 -247 105 -149
2751a49l24O67j85r4L2L65m57p9M07n3k49J44J02j08J22J31k27l9L80j27o10K99
$$ -149 -473 194 9 -85 -53 312 -145 -224 183 130 -119 25 127 19 141 272 45 6 386 259 -351 -52
2773e2N25p38k09O43j47k57N7N20n80k8N15j82q3R4kr2L00R2k94l47O12n52Q8
$$ -52 473 -265 -474 169 22 -235 -178 342 -238 -266 249 67 -16 78 76 -16 284 376 82 -265 347 -205 -117
2796a17K20k10k10n3M22Mm15L11K26o93M73K84k30j39L26j95l03M00J05j78p7
$$ -117 103 -107 -317 -370 52 56 -359 -48 178 -515 -42 242 12 -127 199 4 -299 101 206 28 -49
2817d9L26k52J24K03r2k70k62M50q1l42M65l45l68L91N28p07K71Q0j11k71K81
$$ -49 277 25 149 352 260 -10 -272 178 97 -245 220 -125 -493 -102 426 -281 -10 70 -41 -312 -31
2838c1J39m95L13M48m33q4M35j29k66O7M89m66p6L40j26n94O64N0n86L67J58m43
$$ -31 108 -387 -74 374 -59 -143 292 163 -103 -36 453 -13 -89 251 125 -469 195 245 -341 26 184 -259
2860b59j70M05J29k83J12J85l15R6M65j94l70L09K92m07j3K66k64k12M78K19p32
$$ -259 -429 -24 105 -178 -66 119 -196 -100 365 171 -199 110 402 -5 -18 248 -16 -228 250 469 -263
2881b63j28O71n18j52N13l80j20N48K2k80J07J76k59k82N02p7l99L07N86n52J69
$$ -263 -391 280 -238 -390 123 -257 -377 171 193 -87 20 196 -63 -345 157 80 -319 -12 574 22 191
2902A91J4n3l38L39J84o83J66M90n08o2J89n9J16J09p0j47M7J50l2k70M5M12m43
$$ 191 205 152 -186 153 337 -346 -180 310 -198 -260 -71 -130 -14 95 25 -122 -75 75 43 -227 -182 230 -213
2925b13K52M05m80K25p4J39m09M39l8k73k79M02J18l59K0L32m21K84K19m31k24
$$ -213 39 444 -36 189 115 254 -155 284 246 -27 -306 96 214 -145 -125 207 -214 70 289 -142 -366
2946c66N36J46k55l83N65L9l56M95l66j04M6J81n33J89J52N8j14K25n4m22N1L75
$$ -366 170 316 61 -322 243 282 -74 421 55 -49 -3 178 -355 -166 -14 44 -70 155 101 -321 -270 105
2968A05j23k84L65J40k44K29J48l28o4M72m04k64L72m2o1j37N62l54j5N7l28K8
$$ 105 -18 -302 63 203 -41 188 336 8 -56 416 12 -252 120 78 17 -120 442 88 73 130 -198 -170
2990a70K81k29j26J05K69k45k29K84m4j09l6L96j59m01M51n4k2J25j46O2l7q9
$$ -170 111 -118 -244 -139 130 -115 -344 -60 -104 -213 -249 147 -12 -413 38 -16 -38 87 -59 3 -34 -123
3012a23K75k46M23m7k42j50K66k35k63K83J52m52J74L60o5k60L56k68j60L70o1
$$ -123 152 -94 329 282 40 -110 156 -79 -342 -59 93 -359 -185 175 110 -150 206 -62 -222 148 87
3033H7K5Q1N0j97l11L30K80n83n0P12o65M6P3K15j86r9P2L2J35J92j27k45M06
$$ 87 112 193 243 46 -265 65 345 -238 -288 424 -241 -195 -122 93 -93 -192 -120 -88 47 239 112 -133 273
3056B73m6l01j81L71k58J40K09p7J9j16m6l24J50P9Nj95K79J91m01J21M13k68
$$ 273 227 -74 -255 116 -142 -2 207 130 149 33 -13 -337 -187 -108 -103 -298 -19 172 -229 -108 305 37
3078C7k71L22j09l27L56K07m07K75J43j64j92K86J58l67L8L74p33L08J97k70j46
$$ 37 -234 88 -21 -348 8 215 -192 83 226 62 -130 156 314 -53 -15 359 -374 -66 131 -139 -285
3099b85K87J65l22k8L16o2j17o7N6l12J89M00k73j18L31j3k06L03J35j66m18N42
$$ -285 2 167 -155 -183 133 71 -46 -113 -57 -369 -180 220 -53 -171 160 147 -59 244 379 213 -205 337
3121C37m49J9J45J34m25J12L13l42K16O3o9k96L08q2j10j03K75l19J90J30j56
$$ 337 -112 -93 52 186 -239 -127 186 -156 60 123 54 -242 66 -16 -126 -229 46 -273 -83 47 -109
3142a09J21j59J49J78k16J33K11l50J96O3o02L76J61j68l01J83K46l68Q9J68L
$$ -109 12 -147 2 180 -36 97 308 -42 154 217 -385 -9 152 -16 -317 -134 112 -256 -167 1 4
3163Dj44M06j42q3R3K1o1N7l9q4j98K58k07J92J78l03j25JK78j9k95J66K62j76
$$ 4 -140 266 124 41 134 155 94 151 112 28 -170 88 -119 73 251 -52 -177 -176 102 83 -212 -46 216 40
3187D0j64L15J1k63P1O7j6j07N45m17N1j39L40m64K48m9m1k81N92l21j92K24P
$$ 40 -124 191 202 -61 10 77 61 -46 499 82 133 -6 334 -130 118 69 28 -253 339 18 -174 50 57
3210E7k19j28M64o1k16K61j03k64J5K67P6k39L09p2k89K49J30l46j60N31j36m6
$$ 57 -162 -290 174 113 -103 158 55 -209 -194 73 149 -90 219 147 -142 107 237 -109 -269 262 126 80
3232H0N1l04J67J07q0j33R5K24j65j51K46Oj53l5J28j29j59J77J91k27K4L46l4
$$ 80 131 -173 -6 101 21 -112 -17 207 42 -109 137 143 -10 -45 83 -46 -205 -28 163 -64 -40 306 272
3255B72n19M42rl97N09j02j35k08K77m10L34M6J05l49N6J12j34j16K25O0l87M51
$$ 272 -247 195 186 -211 298 196 61 -147 130 -280 54 100 205 -144 -88 24 -110 -226 -1 59 -328 123
3277A23N7k00J11J75q9k68K51J28m65l1L08l95L31J98k20j87j10L80mj70L82k69
$$ 123 180 -20 91 266 177 -91 160 288 -177 -208 100 -295 36 234 14 -173 -283 97 93 -77 305 36
3299C6q0j0L2m7k36M88k32n9MJ17j18J39Pr2p1K35K3j00LK69l12n4K69m32J49
$$ 36 -44 -54 -22 -69 -305 183 -49 -108 -104 13 -105 34 41 -51 -122 113 136 36 39 308 -4 -58 211 -221 -72
3324g2n2J06O7P3j39r7O6P6R0j66p0L61l21K60lj08j92M46o1l56K08J73o00K75
$$ -72 -124 -18 49 122 -17 -114 -48 28 118 -48 -118 243 -78 182 179 71 -121 325 264 -92 116 289 -311 -36
3348c6J39J8k73J88J94m67J23J39r8J16O5n7j97N4M42n55L5M39l15R0J53O4k23
$$ -36 103 121 -152 36 230 -237 -114 25 -73 43 108 51 -146 -92 350 -205 -170 269 -46 44 197 261 38
3371C8k5Q0M8k44J45j41r0J06k02J98P1m2K27l57K32R8j1k26M65k39oj32K7k6
$$ 38 13 93 141 -103 42 -99 -189 -83 -285 -87 -16 -58 169 -188 44 142 131 -95 370 131 125 -7 20 -6
3395fP1J56k83k99N90l40k24M67J6k12j17J94j66N3L42q5j61J72J41m68PJ03L48
$$ -6 65 221 -62 -361 229 -111 -335 132 148 -64 -181 13 -153 -100 242 157 -4 168 309 -159 -152 -49 299
3418B99k54k58N07m40Q1K99M1m36L94l68J7oK49j83j39K71K85o94M90j35%qL04
$$ 299 45 -213 294 -146 -65 234 275 -161 233 -135 -118 -124 125 -58 -197 74 359 -335 155 20 20 12 316
3441C16m05rK50k4l92j22P17l65k39O36R9o49M43j56m4j6N1k77K0K50L2N3k98
$$ 316 -89 -98 152 128 -264 -386 331 -34 -273 363 462 -187 256 100 56 40 91 -186 -166 84 116 169 -129
3464a29Q3j62J47L33l69j0J84M8r9l19M56k1k58K32j21o6%K53k94n3L03k56K0
$$ -129 -46 -208 -61 272 -97 -107 77 125 26 -293 163 142 -116 116 -5 -71 -71 182 -112 -165 138 -118 -98
3487i8pM8J28k58J55K64l82L8J73k71J62J99j49k56M32j1k65L45p7p8j68M0j24
$$ -98 -105 -57 71 -187 -32 232 -150 -112 61 -210 -48 151 2 -254 178 167 -98 247 170 92 -76 -36 -160
3510a60k46M60j23j31k3K24j53n1K18On7O9R4j6j30J30j61k10J88J36k02J02K23
$$ -160 -406 54 -69 -200 -223 1 -152 -203 15 21 -36 33 127 111 -19 111 -50 -260 -72 64 -138 -36 187
3533A87k80j94L89j57L3K31o9j44k2J77k08j58L07j14l1jJ99j75k35N35P4m65
$$ 187 -93 -287 102 -55 -22 209 140 -4 -26 151 -57 -215 92 -22 -53 -54 145 -30 -265 270 344 -121
3555a21J30K58m96k0K90O0R6j10O0j52j17rJ06k93L95j48o1J62j2k7J8P6j2k12
$$ -121 9 267 -229 -249 41 101 197 87 147 -5 -122 -131 -25 -318 77 -71 -132 30 18 -9 9 85 73 -139
3579a39K89O8k38L04p6j12O8j61k5n4R9j34j93M65P0l39m1K27N3m76R2L64k1j84
$$ -139 150 218 -20 284 208 96 164 3 -22 -76 23 -111 -304 161 231 -108 -149 78 131 -345 -253 111 90 -94
3603i4M50j94k16K7K42Ro7l7J60k42j29J00q8j38L27m57K05P8L95l85j14K77k63
$$ -94 356 162 -54 -27 215 224 157 120 280 38 -91 9 -79 -217 110 -347 -142 -64 331 -54 -168 109 -154
3626a54m8J19K6j61J69rp7K04K77n18K60L1J74l13j3M3J60j5j82K17l40J79J5
$$ -154 -202 -83 -57 -218 -49 -58 -135 69 346 -172 88 119 293 -20 -33 10 170 155 -27 190 -150 29 44
3649D4n2k17L19J61o15O62k71q3J05J60k76J4L23J11m87%L71l09j62L46j81j93
$$ 44 -8 -225 94 255 -360 302 31 -52 53 213 -63 -49 274 385 -102 -102 269 -40 -202 144 -37 -230
3671b30K79L6j91j07M55l12j32K20o1k11K64M4j81K53j20M22n31L13j07j96N2
$$ -230 49 85 -106 -213 242 -70 -202 18 -43 -254 10 54 -127 126 6 428 -103 210 103 -93 -41
3692d1M14j18k15j02J25j03oK66k86l2K46k95o9J83J87pj23K63k43j60J38J2k59
$$ -41 373 255 40 -62 63 -40 -46 220 -66 -98 148 -147 -216 -33 154 147 24 287 44 -116 22 34 -225
3715b25L19J6l04K73K05k96j03K1L42m35J57P5n2j70J82M5L0j10K72m62k3M65
$$ -225 94 110 -194 79 284 -12 -115 -94 248 -187 -30 45 -7 -177 5 50 80 -30 242 -220 -243 222
3737B22l53o9M16k71k37O1K89k46J3K76J02k56k6J60l84K31q7O0k16K45L45k23
$$ 222 -131 -200 216 -55 -292 -231 58 -188 -175 101 203 -53 -79 81 -303 -72 -159 -99 -315 -70 275 52
3759E2j23K64q0j92j8J00M6l2L34p00L63J88j17k83L87j12m7J1J97j74l05J48
$$ 52 -71 193 113 -79 -97 3 49 17 351 -349 14 202 85 -198 189 77 30 41 238 64 -241 -93
3781i3j6J45k32N02m85Q4K28j48m5m9K30j02j64K73k41J19K98k61n2J20J99k40
$$ -93 -109 36 -196 306 -179 -95 133 -15 -60 -109 121 19 -145 128 -113 6 304 43 -9 111 310 70
3803G0J8J51k7o79M85l4J20j42K24q3m21K48J06n59P11k8k57j15Q2K83l11L25
$$ 70 88 239 212 -467 18 -16 104 -38 186 103 -318 -70 36 -523 188 160 -97 -212 -130 153 -158 167
3825A67Q1k59J10K88n18Q0L62l21j19K91k5j21rko8m06M14J56n48M04J87k07k18
$$ 167 248 -11 99 387 -131 -51 311 -10 -129 162 137 16 7 5 -63 -469 -55 101 -447 -43 144 -63 -281
3848b81N27l69k3L53k99J45J16k30M2L9K5L4K2k50K14k32J11r4q3R3J02K19l2
$$ -281 246 -123 -146 207 -92 53 169 -61 -19 20 45 79 101 -149 65 -167 -56 -150 -233 -140 -38 181 149
3871A49j34O8q0l85L65O7p3j10J69j3j63K26n4r8O2M04j91n14M68l9k36K08j09
$$ 149 15 83 3 -382 -17 50 -23 -133 36 23 -140 86 32 -66 -4 400 209 -305 163 124 -112 96 -13
3894a3Rj33M25m03Q5K05j32n6P6L86o55j90M09R1l00L61J91n80K75J23j55j67
$$ -13 -4 -137 288 -115 -30 175 43 -13 63 449 -206 -396 13 104 -196 165 356 -224 51 174 19 -148
3916a48J25J59l92K01K71j54k32j38M48q1P3oj82J78k62J30j35J89J35j02J90
$$ -148 -23 136 -256 -55 216 62 -170 -308 140 59 132 126 -56 122 -140 -10 -145 44 179 77 267
3937B67Q0l71K8J47j7l94K03K05m94J72M57j74l85J66N48m90k73J20o3J71K98
$$ 267 347 -24 4 151 134 -260 -57 148 -346 -174 283 109 -276 -110 438 -52 -325 -205 -268 -97 201
3958B01q7k43Q4L06l70n2K55q7N7P2K8m62J0M82l98P4R7N79p70Q4J13j26J5M92
$$ 201 114 -129 -45 261 -109 -161 94 7 64 136 164 -298 -288 194 -204 -130 -33 546 -224 -140 -27 -153 -138 354
3982C54m59J60R1j55k55N82l19K5q3K92L2n02K83K30l28k22M27m8m91K95J74l95
$$ 354 -105 55 146 -9 -264 318 -1 24 -59 233 265 -237 46 276 -52 -274 153 105 -386 -91 83 -312
4004c12N23r5j25k01M81l92J5K47q7M7l68N10j67l99L22J23j01j85L15j53l4J60
$$ -312 211 116 -9 -210 271 -121 -106 141 54 101 -267 243 76 -323 -1 122 21 -164 151 -2 -36 124
4026A24P6k22N8k94K93j27L7L8o3J05j45K35L6Qk50J2M13k74j07K14K22l95q2
$$ 124 200 -22 36 -258 35 -92 -55 -17 -80 25 -120 115 151 159 -91 -79 334 60 -47 167 389 -6 -88
4049h8L83l41J63J19k24k40J61K68rn00L56J66l59K5K26j61n0J79O4l23L06P7
$$ -88 295 -46 117 236 12 -228 -67 201 192 -308 48 214 -145 -120 106 -55 -105 74 138 -185 121 198
4071A98k44j17K10j04k6L67m5k01J0J16l87K73rL42p16J98P9q1J10n5K41j65P0
$$ 198 -46 -163 47 -57 -83 284 239 38 48 164 -223 50 41 383 -333 -135 -56 -137 -27 -82 159 -6 64
4094F4J12l91J99o6J33j47M87q8n29M16rj48jJ18p0l76K59Qj28J21J6L2l11L58
$$ 64 176 -215 -16 -82 51 -96 391 303 -226 190 181 33 32 150 80 -296 -37 -29 -157 -36 -20 12 -299 59
4118E9p7M4k2P4j91J24J52k08r2J78j16j0J23J12k94K23k0j42p5J10P5o6j31M54
$$ 59 -18 26 4 78 -113 11 163 -45 -137 41 -75 -85 38 150 -144 79 59 -83 -158 -48 27 -39 -170 284
4142B84k21l49O31k94R2l51N75l04k70K36J34j69J91Ok44O1M72n20q1O5M57m20
$$ 284 63 -286 345 51 143 -208 367 63 -207 29 163 -6 185 191 -53 8 480 -40 -121 -56 401 -19
4164a9J18j0M5k45K35p6l09jL40j19K52n8k54P4j95K50J23k8J24j46j85K47j37
$$ -19 99 89 134 -111 124 48 -261 -262 78 -41 211 153 -101 -27 -222 28 151 123 247 101 -84 163 26
4187B6j01r7M55m23l9K93o8j53Q2J76m32M94j5j17k42J63o2j64J74J28j41L1M15
$$ 26 -75 -172 283 -140 -179 114 46 -107 -25 151 -281 213 198 81 -161 2 -60 -224 -50 78 -63 -32 383
4210C83l68kp0L99n10J93Q0j65M6J74k67j93J41K72k32P3K22l79N7J88L8k16K66
$$ 383 15 13 -57 342 -168 25 105 -60 -14 160 -107 -300 -159 113 -119 -46 176 -203 -146 42 80 -136 130
4233A30L62l42l35L92p3j06J10K10n55J11M19k40p5Q4l3j60L95k47R1l96J79K08
$$ 130 492 150 -185 207 134 28 138 348 -207 -96 323 83 8 92 59 -101 294 47 138 -258 -79 129
4255A29l67K54J09j27O7J64k56k12L64k5j59K85j11K9n60M59Pl45L40J23j68K6
$$ 129 -238 16 125 -2 65 229 -27 -239 125 100 -59 226 115 144 -416 43 50 -295 45 168 0 26
4277B6N4k21J49K05l79m6K89L2K5k35N2k5l08M11K65l49j82N48l58K3J68r9O6
$$ 26 80 -141 8 213 -166 -212 77 109 134 -101 -49 -74 -382 29 294 -55 -237 311 -47 -24 144 45 111
4300A11j70L55k76k80K88j42R7o4K58l91J75K45l83N1O9J62o1J81l7r8k8K01j87
$$ 111 -59 296 20 -260 28 -114 -17 -81 177 -214 -39 206 -177 -126 -57 105 44 225 188 90 62 263 76
4323G6j93J99l3p5MJ09j44q3J80Q2j34lO2K4k13J23K93o11K81K48l8j52L50N4
$$ 76 -117 82 49 -26 -22 87 -57 -140 40 122 -12 -15 47 71 -142 -19 274 -337 -56 192 154 2 352 406
4347D06l08j91K94Mj50K5J31k61J10j3j65J56J4l17K45K32k76R2J57k31l3j1L40
$$ 406 98 -93 201 205 55 80 211 -50 60 47 -118 38 52 -265 -20 212 -64 28 185 -46 -79 -90 250
4370B50k80L09J7j10l89M65j33l07J26J61j70j00J67L33k66k99L72n9k34K01J3
$$ 250 -30 279 296 186 -203 262 129 -178 -52 109 -61 -161 6 339 73 -226 146 87 -147 54 67
4391F7K6J5l35R4J0J33r5j8J46J39j46j31%J70K2q7j0L7j23K12j32K56l03r7o7
$$ 67 93 108 -227 -133 -123 10 -85 -103 43 182 36 -95 -95 75 97 10 0 37 -86 126 -6 250 -53 -150 -217
4416b17K66R1m72J47K33j86N4RJ39p7nJ51L0j24J17l46K5M07j45j07rM8J31j75
$$ -217 49 140 -332 -185 48 -138 -84 -75 64 -13 -18 133 163 39 156 -190 -165 242 97 -10 -19 29 160 -15
4440a5k7j18K60M4q6Pk74J35j66J11K66pO4j70j15L87m59M07k6r0j11N4Ol51K85
$$ -15 -42 -160 100 144 58 65 -209 -74 -240 -129 137 130 194 24 -91 296 -163 244 218 128 17 71 77 -274 11
4465A1Q8L0O4k22k0K37k91N6j13K64p4p6J37L06m38j57J61R7J65j72j98K16j92
$$ 11 99 129 193 -29 -49 188 -103 -47 -160 104 30 -46 91 397 -41 -198 -37 60 225 53 -145 71 -121
4488a21N05j89k99J09K83k65J5j51JQ9K40j45j88L73p3j55lN2j23j33L5Q9L2M6
$$ -121 384 195 -104 5 288 23 38 -113 -112 -23 217 72 -116 257 184 29 26 78 -45 -178 -143 -54 -22 24
4512B4N5j76o3M06n9l98J39L35m68L07j21l9j76M73j43o6j91K56l13j62K20K11
$$ 24 79 -97 -160 246 187 -211 -72 263 -205 102 -19 -58 -234 239 96 30 -161 95 -218 -380 -160 51
4534E1P9j42R8J95j77j38K07l23K58k32J32p7K7j6k08J10n6k8L36l1o0k35J86
$$ 51 130 -12 86 281 104 -34 173 -150 108 -124 8 -69 -42 -58 -266 -156 -212 -240 96 65 5 -230 -44
4557d4P9jJ6J1Kj16K63m29n3L51J60l47J02R6J16R7l5l2k60N7k8J40q9J59p2n49
$$ -44 35 34 50 61 63 -53 210 -219 -272 79 239 -108 -6 90 206 303 268 236 -24 33 5 145 56 215 143 -406
4583d06L42j68K22j4K9j35K10J03j31k51K73J20k85J10MP0r8J38j96J2p7J40k03
$$ -406 -64 -232 -10 -24 5 -130 80 183 52 -199 74 194 -91 19 23 93 -5 133 -63 -51 -128 12 -191
4606a91O1K27j13J22j14P4r8k5K60k87L1K68j76j96K95K5k35J72J3j98R1J22M9
$$ -191 -130 97 -16 106 -8 66 -32 -57 203 -84 -53 215 39 -157 138 163 -72 100 113 -85 6 128 177
4629A77k63P3J32l71K41K68j19l1k79J47J02j50J24m8Q2RR1j84L3J23m05L10j85
$$ 177 -86 -13 119 -252 -11 257 138 107 -172 -25 77 -73 51 3 85 94 185 1 34 157 -248 62 -123
4652a23R6J7k68M00k90J21P6q2kJ88k11p5J05K5J5q1J85j28j78Q1K55j51j25M26
$$ -123 -27 -10 -278 122 -168 -47 29 -53 -55 133 -78 -153 -48 -23 -8 -89 96 -32 -210 -129 126 -25 -150 276
4676B76k32r9Q0K16l44K30k85K46j20K02r5N7j36K46k05j08L17l61J06J47j98
$$ 276 44 -55 25 241 -103 127 -158 88 -32 170 75 132 -4 242 37 -71 246 -115 -9 138 -60
4697f0Q8J39J13K8m27K28l2k56pJ23m3j2R4q7r0L53j98J45j00J81k19j30j16L90
$$ -60 28 167 280 308 -119 109 77 -179 -186 -63 -106 -118 -24 -111 -201 152 -46 99 -1 180 -39 -169 -285 105
4721A05k77R7L4K50l04K53j56L36j8k93r4k98M49k31K6l9L24k43Qo8K53k72M9
$$ 105 -172 -75 -41 209 -95 158 2 338 320 27 -67 -365 84 -147 -121 -160 164 -79 -71 -139 114 -158 -109
4744a09P0k12M36k00J62j5j97j55M56j58K71l57p2l6J72l5o5K9l9J18P4j0k1L7
$$ -109 -39 -251 185 -15 147 132 -65 -220 236 78 349 -8 -80 -116 56 21 -44 -15 -54 64 138 128 107 144
4768A44lj72p5J27n2q0L23k26j33M11k88R1j25K56j85J6J23l31O7l2J01J0J9J74
$$ 144 141 -31 -106 21 -31 -111 212 -14 -147 264 -24 67 -58 198 13 29 152 -179 -112 -144 -43 -33 -14 160
4792A60j92M4K40j13m4j84L48k57k7j48J05J10L25m59J09K05L2k74m6J75j55p1
$$ 160 -32 12 252 139 95 -89 259 2 -25 -173 -68 42 367 -92 17 222 254 -20 -66 109 -46 -117
4814a17j06K14J51L6j75L8J56k05L21k79J6J25k27J7K60N3p1l67N9J42L2J05k10
$$ -117 -223 -9 142 178 3 41 197 -8 313 34 50 175 -52 -35 225 278 207 -160 -101 41 73 178 -32
4837c2q4R1O9l16K81K91j27q0N8N3j48L1M7K8m39L24j4l8n9J92k84n1N35k63m0
$$ -32 -116 -25 44 -272 9 300 173 93 151 204 56 87 134 162 -277 47 33 -5 -64 128 -156 -207 328 65 25
4862B5J38j19l0J76J01l25O5P9j35J52j66J45Op6r7K27l57J24M2L8j32L72j86
$$ 25 163 44 14 190 291 -34 31 110 -25 127 -39 106 112 36 -61 166 -191 -67 -25 13 -119 253 67
4885F7O5k52K5m3n2L21k90L6J41o0j75J76K48l04j87L13j27P3K7o9J32J29k54
$$ 67 132 -120 -95 -138 -190 131 -159 -123 18 -42 -217 -41 207 -97 -284 29 -98 -25 2 -67 65 194 -60
4908f0J37Q8j13l3J38j68j8M8j50N1J40j68J05O2J80p8R6m72L9P5J00Pp1j12R0
$$ -60 77 165 52 19 157 -11 -29 19 -131 -80 60 -108 -3 59 239 161 257 -215 -176 -101 -1 6 -65 -177 -87
4933h7MJ9k30M67J4P2n41L16J61k46n0J32o1k28M54j74J64j71J18k41O4K99k72
$$ -87 -83 -64 -294 173 187 259 -282 34 195 -51 -101 31 -30 -258 196 22 186 15 133 -108 -44 255 -17
4956a7o8J25k14o4P0M14k33J30Nk10p5R6J52l22M4N7J52J21p7J44q7j87L20o0
$$ -17 -85 40 -174 -238 -168 246 13 143 148 -62 -137 -41 111 -211 -167 -110 42 163 86 230 143 -44 276 216
4980B16m2j93R6M5j27j03Oj17Q3k39K80J7J9J53j30J61j21J46O2n0j71q7O8M4
$$ 216 174 -19 77 122 -5 -108 -102 -219 -136 -375 -95 -78 -59 94 -36 125 4 150 212 162 -9 -96 -28 16
5004A6nj07q2K43K1r2j86J66J26j99P7n0J73j75k24J71lJ71l3nl5j08J89r5J11
$$ 16 11 -96 -178 65 86 -6 -192 -26 100 -99 -22 -72 101 -74 -298 -127 -130 41 8 3 -32 -140 49 -46 65
5029F5j30nL9N8l7m4j2J97j04J2q5k3O3j0J25J49k14m8k23L30j9M0l76L39N7j62
$$ 65 -65 -70 -31 27 -10 -54 -66 131 27 39 -46 -69 -6 -16 109 258 44 -4 -227 103 84 124 -252 87 144 -18
5055a8j26L93k33J23L9j45o6Q3K7j42P9j32K32j50j88K96MJ09j73J25k00n5J43
$$ -18 -144 249 16 139 178 33 -33 50 77 -65 14 -118 114 -36 -224 72 76 185 12 137 -63 -118 25
5078B5j98K34m3J90l49L42j63J8P0j14K70l12o6J6k39M70j41m5l6j39J50P0o3
$$ 25 -173 61 18 208 -141 201 38 56 126 12 282 -30 -96 -80 -319 151 10 -35 -71 -210 -60 10 -53
5101e3K2K13k90p7K08L9j01J59L1p0k2O8j93o3J61k38j82M78j21N4j00q1J08J66
$$ -53 -31 182 -108 -185 23 62 -39 120 151 81 59 127 -66 -129 32 -206 -388 90 -31 23 -77 -158 -50 116
5125A16k40J16j77J97j38N2L3P8L5L0J9J55j43k21J3K39m97J59K67M1j7r5j12
$$ 116 -124 -8 -185 12 -126 -74 -41 37 72 102 121 276 133 -88 -75 164 -333 -174 93 134 117 22 -90
5148i0K17j64k02J18NJ61j0P5l97P6J82rK22j82J76j82J45j43Mq3n6K4J45k05
$$ -90 127 -37 -239 -121 -116 45 35 110 -287 -211 -29 -38 184 2 178 -4 141 -2 2 -81 -137 -113 32 -173
5172a73j04J76M39j07k57J88o9j04j77K25j05Mr0M04k49N3LJ73m02J57r6oL94
$$ -173 -277 -101 338 231 -26 162 93 -11 -188 37 -68 -64 -154 250 1 54 57 230 -172 -15 -111 -117 277
5195B77o28L85K06k70j16K31k00j0R2j6J00k22L54m46K60K48k52K0rk08n6K25
$$ 277 -351 34 240 -30 -146 85 -115 -125 -33 -49 51 -171 183 -263 -3 245 -7 13 4 -204 -260 -35
5217c5P3k83K19R0j8r3k9L45k83K22n4Jk11N1K31k15J12Q9j11k66J66J61q7K4
$$ -35 38 -245 -26 64 46 -47 -76 269 -14 208 154 155 -56 -5 226 11 123 212 101 -165 1 162 75 99
5241I9Rj25K08j27k8j69K47k30P0J80k93J73r5J44j6J76l04L92k13k8Q7k9l1n8
$$ 99 108 -17 191 64 36 -133 114 -116 -46 134 -159 14 -81 63 47 223 -81 311 98 70 157 128 97 39
5265C9j62P0r7K84r7K6Q6J85j79k97o9L54p9K34l93P1q6R1Q5K1J13k13qJ7K29
$$ 39 -123 -53 -150 134 37 63 149 334 155 -142 -211 143 64 298 -95 -24 -110 -19 66 87 200 -13 -21 -4 225
5290B25k74K08l12K43j7k16kM9K37R9k89j21J89k00K44j49R6l1J11O3M5m5k23
$$ 225 -49 159 -153 90 73 -143 -145 -96 141 240 -49 -170 19 -181 63 -86 10 -21 90 153 198 153 -70
5313g0J95j38n3J32q5J20j55J44k31K89k57Pq2L2K03J51j3l10K77p1L8j83M0J81
$$ -70 125 -13 -66 66 -19 101 -54 90 -141 148 -109 -102 -184 -152 51 202 189 -121 156 85 123 -60 -20 161
5337A61k07M5M0r5n7K35R5l62n4L52k25k3O2K90m88J89R7k30J29M2K07l04O6l8
$$ 161 -46 -1 39 -56 -113 122 217 -145 -199 153 -72 -95 -33 257 -231 -42 55 -175 -46 -4 203 -101 -35 -73
5361g3J33k9j06PP2o3M9Rm4P9l46K17L5J90p8k6n2j46K83K24l40om8j95L08O0
$$ -73 60 31 -75 -68 4 -59 -10 -1 -45 34 -312 -95 -60 130 52 26 -26 -172 111 335 -5 -11 -59 -254 54 114
5387A14k90L01P8k74j43K4J77lJ37l99L19l5k93P02n40K25k14M02l01k11L41N0
$$ 114 -176 125 203 -71 -214 -190 -13 -16 121 -278 41 6 -287 415 -125 100 -114 288 -13 -224 117 167
5409A67Jk95l2J18Q1n0j13N5P8J33j51p2J59J20l21K00k35L74k38K06j33o5K11
$$ 167 168 -127 -159 -41 40 -10 -123 -68 10 143 -8 -80 79 199 -122 78 -157 217 -21 185 52 -13 198
5432A98j22M8k1r6P4J45l95L37m91J27J72Q7K43r6J00k96j39K69j96J5J32q3Q2
$$ 198 76 124 103 7 81 226 -169 168 -323 -196 -24 63 306 210 310 14 -125 144 -52 -37 95 12 94
$$ [...]
8191B16
##END NTUPLES=NMR FID
##END=
