##TITLE=1H ikalashn
96-2024-BAU
20.11.2024
##JCAMPDX= 6.0         $$ Bruker NMR JCAMP-DX V2.0
##DATA TYPE= NMR FID
##DATA CLASS= NTUPLES
##ORIGIN= UXNMR, Bruker Analytische Messtechnik GmbH
##OWNER= root
$$ TOPSPIN		Version 1.3
$$ 2024-11-20 10:39:19.656 +0400  Irina@DPX200
$$ Compression mode = diff/dup
##.OBSERVE FREQUENCY= 200.131300845
##.OBSERVE NUCLEUS= ^1H
##.DELAY= (6, 6)
##.ACQUISITION MODE= SIMULTANEOUS
##.ACQUISITION SCHEME= undefined
##.AVERAGES= 16
##.DIGITISER RES= 18
##SPECTROMETER/DATA SYSTEM= spect
##.PULSE SEQUENCE= zg
##.SOLVENT NAME= DMSO
##.SHIFT REFERENCE= INTERNAL, DMSO, 1, 17.49637
##AUDIT TRAIL= $$ (NUMBER, WHEN, WHO, WHERE, WHAT)
$$ ##TITLE= Audit trail, TOPSPIN		Version 1.3
$$ ##JCAMPDX= 5.01
$$ ##ORIGIN= Bruker BioSpin GmbH
$$ ##OWNER= Irina
$$ $$ F:/spectra/data/iren/nmr/1H/4/audita.txt
$$ ##AUDIT TRAIL=  $$ (NUMBER, WHEN, WHO, WHERE, VERSION, WHAT)
(   1,<2024-11-20 10:36:29.187 +0400>,<Irina>,<DPX200>,<TOPSPIN 1.3>,
      <created by zg
	started at 2024-11-20 10:35:20.859 +0400,
	POWCHK disabled, PULCHK disabled
       terminated by command 'halt'
       configuration hash MD5:
       BE 6D 3F 07 2A EA 11 49 91 17 2B D3 AF B3 58 0D
       data hash MD5: 16K
       F4 37 78 4E C2 7C 71 A4 46 F4 06 52 0D 4C 3E 13>)
$$ ##END=
$$ 
$$ $$ hash MD5
$$ $$ F8 2F 9E 27 3F 7C 21 9F 5C 3F 7F A4 D2 E8 30 86
##$RELAX= 
##$RELAX= 
##$RELAX= 
##$RELAX= 
##$RELAX= 
##$RELAX= 
##$RELAX= 
##$RELAX= 
##$RELAX= 
$$ Bruker specific parameters
$$ --------------------------
##$DU= <F:/spectra>
##$EXPNO= 4
##$NAME= <1H>
##$PROCNO= 1
##$TYPE= <nmr>
##$USER= <iren>
##$AMP= (0..31)
100 100 100 100 100 100 100 100 100 100 100 100 100 100 100 100 100 100 
100 100 100 100 100 100 100 100 100 100 100 100 100 100 
##$ANAVPT= -1
##$AQSEQ= 0
##$AQ_mod= 1
##$AUNM= <au_zg>
##$AUTOPOS= <>
##$BF1= 200.13
##$BF2= 200.13
##$BF3= 200.13
##$BF4= 200.13
##$BF5= 200.13
##$BF6= 200.13
##$BF7= 200.13
##$BF8= 200.13
##$BYTORDA= 1
##$CFDGTYP= 0
##$CFRGTYP= 5
##$CHEMSTR= <none>
##$CNST= (0..63)
1 1 145 1 1 1 1 1 1 1 1 1 1 1 1 1 1 1 1 1 1 1 1 1 1 1 1 1 1 1 1 1 1 1 
1 1 1 1 1 1 1 1 1 1 1 1 1 1 1 1 1 1 1 1 1 1 1 1 1 1 1 1 1 1 
##$CPDPRG= <>
##$CPDPRG1= <>
##$CPDPRG2= <>
##$CPDPRG3= <>
##$CPDPRG4= <mlev>
##$CPDPRG5= <mlev>
##$CPDPRG6= <mlev>
##$CPDPRG7= <mlev>
##$CPDPRG8= <mlev>
##$CPDPRGB= <>
##$CPDPRGT= <>
##$D= (0..63)
0 2 0 0 0 0 0 0 0 0.06 0 0.03 0 0 0 0 0.0002 0 0 0 0 0 0 0 0 0 0 0 0 0 
0 0 0 0 0 0 0 0 0 0 0 0 0 0 0 0 0 0 0 0 0 0 0 0 0 0 0 0 0 0 0 0 0 0 
##$DATE= 1732084585
##$DBL= (0..7)
120 120 120 120 120 120 120 120 
##$DBP= (0..7)
150 150 150 150 150 150 150 150 
##$DBP07= 0
##$DBPNAM0= <>
##$DBPNAM1= <>
##$DBPNAM2= <>
##$DBPNAM3= <>
##$DBPNAM4= <>
##$DBPNAM5= <>
##$DBPNAM6= <>
##$DBPNAM7= <>
##$DBPOAL= (0..7)
0.5 0.5 0.5 0.5 0.5 0.5 0.5 0.5 
##$DBPOFFS= (0..7)
0 0 0 0 0 0 0 0 
##$DE= 6
##$DECBNUC= <off>
##$DECIM= 32
##$DECNUC= <off>
##$DECSTAT= 4
##$DIGMOD= 1
##$DIGTYP= 9
##$DL= (0..7)
0 120 120 120 120 120 120 120 
##$DP= (0..7)
$$ [...]
##$SW= 21.9926040160658
##$SWIBOX= (0..15)
0 0 2 0 0 0 0 0 0 0 0 0 0 0 0 0 
##$SW_h= 4401.40845070422
##$TD= 16384
##$TD0= 1
##$TE= 300
##$TE2= 300
##$TE3= 300
##$TEG= 300
##$TL= (0..7)
0 120 120 120 120 120 120 120 
##$TP= (0..7)
150 150 150 150 150 150 150 150 
##$TP07= 0
##$TPNAME0= <>
##$TPNAME1= <>
##$TPNAME2= <>
##$TPNAME3= <>
##$TPNAME4= <>
##$TPNAME5= <>
##$TPNAME6= <>
##$TPNAME7= <>
##$TPOAL= (0..7)
0.5 0.5 0.5 0.5 0.5 0.5 0.5 0.5 
##$TPOFFS= (0..7)
0 0 0 0 0 0 0 0 
##$TUNHIN= 0
##$TUNHOUT= 0
##$TUNXOUT= 0
##$USERA1= <user>
##$USERA2= <user>
##$USERA3= <user>
##$USERA4= <user>
##$USERA5= <user>
##$V9= 5
##$VALIST= <valist>
##$VCLIST= <CCCCCCCCCCCCCCC>
##$VD= 0
##$VDLIST= <DDDDDDDDDDDDDDD>
##$VPLIST= <PPPPPPPPPPPPPPP>
##$VTLIST= <TTTTTTTTTTTTTTT>
##$WBST= 1024
##$WBSW= 25
##$XGAIN= (0..3)
0 0 0 0 
##$XL= 0
##$YL= 0
##$YMAX_a= 45680
##$YMIN_a= -65105
##$ZGOPTNS= <>
##$ZL1= 120
##$ZL2= 120
##$ZL3= 120
##$ZL4= 120
##$ABSF1= 10
##$ABSF2= 0
##$ABSG= 5
##$ABSL= 3
##$ALPHA= 0
##$AQORDER= 0
##$ASSFAC= 0
##$ASSFACI= 0
##$ASSFACX= 0
##$ASSWID= 0
##$AUNMP= <proc_1d>
##$AXLEFT= 0
##$AXRIGHT= 0
##$AXTYPE= 0
##$AXUNIT= <>
##$AZFE= 0.1
##$AZFW= 0.1
##$BCFW= 1
##$BC_mod= 2
##$BYTORDP= 1
##$COROFFS= 0
##$CY= 7568.61572265625
##$DATMOD= 1
##$DC= 2
##$DFILT= <>
##$DTYPP= 0
##$F1P= 17.9538593292236
##$F2P= -4.03888763876832
##$FCOR= 0.5
##$FTSIZE= 32768
##$FT_mod= 4
##$GAMMA= 1
##$GB= 1
##$INTBC= 1
##$INTSCL= 1
##$ISEN= 128
##$LB= -0.5
##$LEV0= 0
##$LPBIN= 0
##$MAXI= 945.577
##$MC2= 0
##$MEAN= 0
##$ME_mod= 0
##$MI= -402.1523
##$NCOEF= 0
##$NC_proc= 0
##$NLEV= 6
##$NOISF1= 8.587773
##$NOISF2= 6.764455
##$NSP= 1
##$NTH_PI= 0
##$NZP= 0
##$OFFSET= 17.49637
##$PC= 1
##$PHC0= 201.0145
##$PHC1= 11.39667
##$PH_mod= 0
##$PKNL= yes
##$PPARMOD= 0
##$PPDIAG= 0
##$PPIPTYP= 0
##$PPMPNUM= 100
##$PPRESOL= 1
##$PSCAL= 0
##$PSIGN= 0
##$REVERSE= no
##$SF= 200.13
##$SI= 32768
##$SIGF1= 18.5376
##$SIGF2= -6.396296
##$SINO= 400
##$SIOLD= 32768
##$SREGLST= <1H.CDCl3>
##$SSB= 3
##$STSI= 0
##$STSR= 0
##$SW_p= 4401.40845070422
##$SYMM= 0
##$S_DEV= 0
##$TDeff= 0
##$TDoff= 0
##$TI= <>
##$TILT= no
##$TM1= 0
##$TM2= 0
##$TOPLEV= 0
##$USERP1= <user>
##$USERP2= <user>
##$USERP3= <user>
##$USERP4= <user>
##$USERP5= <user>
##$WDW= 1
##$XDIM= 8192
##$YMAX_p= 0
##$YMIN_p= 0
$$ End of Bruker specific parameters
$$ ---------------------------------
##NTUPLES= NMR FID
##VAR_NAME=  TIME,          FID/REAL,        FID/IMAG
##SYMBOL=    X,             R,               I
##VAR_TYPE=  INDEPENDENT,   DEPENDENT,       DEPENDENT
##VAR_FORM=  AFFN,          ASDF,            ASDF
##VAR_DIM=   8192,          8192,            8192
##UNITS=     SECONDS,       ARBITRARY UNITS, ARBITRARY UNITS
##FACTOR=    0.0002272,     1,               1
##FIRST=     0,             0,               0
##LAST=      1.8609952,     27,              -8
##MIN=       0,             -65105,          -65105
##MAX=       1.8609952,     45680,           45680
$$ Real data points
##PAGE= N=1
##DATA TABLE= (X++(R..R)), XYDATA
0@%%%%%%%%%%%%%%%%%%%%%jJ7l2L2l2L2l2L3m9O4o4P3q9R6j12J28j40J56j76J92
$$ 0 0 0 0 0 0 0 0 0 0 0 0 0 0 0 0 0 0 0 0 0 0 -1 16 -16 16 -16 16 -16 17 -32 32 -32 41 -48 48 -64 64 -76 80 -96 96
41I6k08K40k68K93l22L56l93M30m73N22n74O33o98P71q51R42j050J174j318J491
$$ 96 -112 128 -140 153 -169 187 -206 224 -249 273 -301 332 -366 405 -446 496 -554 620 -698 793
61G93j700J963k300K755l407M411o218J0464l8711l3155M4901K2098J6379M98
$$ 793 -907 1056 -1244 1511 -1896 2515 -3703 6761 -31950 -65105 -20204 1894 18273 18771
75A8771Q227N957R772K767J86q861j0035j3967j4568j8734j2235o67J0317M815
$$ 18771 26998 32955 42727 45494 45680 36819 26784 12817 -1751 -20485 -32720 -33387 -23070 -18255
89a8255n561q759M385J9431K6286J8021L653o983n019J914N254q04r946j5879
$$ -18255 -23816 -32575 -28190 -8759 17527 35548 39201 32218 27199 29113 34367 33563 23617 7738
103G738j4284j0191p859o796j999M949P745L415j862j180P141J5554J5942O590
$$ 7738 -6546 -16737 -24596 -31392 -33391 -28442 -20697 -17282 -19144 -20324 -13183 2371 18313 24903
117B4903n112j0412n579L526O802l23j0390j2898p572j504J626K684L206L413
$$ 24903 19791 9379 3800 7326 14128 13805 3415 -9483 -17055 -18559 -16933 -14249 -11043 -7630
131g630L202K255J041J872N412Q191O413j185q693q932j484N864N329j535q275
$$ -7630 -4428 -2173 -1132 740 6152 14343 20756 19571 10878 1946 462 6326 11655 10120 1845
146A845r158l816K712N173K686q84k217j402M66K028K698L043L039Q99l301n762
$$ 1845 -7313 -11129 -8417 -3244 -558 -1442 -3659 -5061 -4595 -2567 131 3174 6213 7112 3811 -1951
162a951l144K456N614L236k548o505n114o8M244M955J290l723m974j497K695L909
$$ -1951 -5095 -2639 2975 6211 3663 -2842 -7956 -8024 -3780 1175 2465 -1258 -6232 -7729 -5034 -1125
178a125L179K151O60j308k150j018J122K452J759p33l606m845k998J262M622L236
$$ -1125 2054 4205 4865 3557 1407 389 1511 3963 5722 4989 1383 -3462 -6460 -5198 -576 2660
194B660j378m284l040K84L444M594L054l06k428j924N2J749J764K95j522k855
$$ 2660 1282 -3002 -6042 -5758 -2314 2280 5334 5028 2600 676 728 2477 4241 4536 3014 159
210A59l413k413J69K681K943R73j116k043r26J625L750L340M59k594l713j815
$$ 159 -3254 -5667 -5498 -2817 126 1099 -17 -2060 -2986 -1361 2389 5729 6188 3594 -119 -1934
226a934J370K635J073j393l016l181j468R63K300J707M81k92n33j57P41J837K433
$$ -1934 -564 2071 3144 1751 -1265 -4446 -5914 -4951 -2651 -944 -463 -755 -1288 -1445 -704 1133 3566
243C566J305j166l386l030m10J936K553R04j915l245j547J527L206K138j76j618
$$ 3566 4871 3705 319 -2711 -3121 -1185 1368 2272 357 -2888 -4435 -2908 298 2436 2260 642
259F42j331K36J197J137R20O12l46j433j994j558N1J807J887j75k533k625k20
$$ 642 -689 -453 744 1881 2801 3413 3067 1634 -360 -1918 -1867 -60 1827 1652 -881 -3506 -3726
276c726K770L457Q94k230k967j073J062K008J199l10j115o38R7K3k60K44R95Q88
$$ -3726 -956 2501 3395 1165 -1802 -2875 -1813 195 1394 1084 -31 -669 -572 -549 -809 -565 430 1318
294A318o53k283j868Q31L064K496j19k489k641k55K383K729K87k018j963o2J361
$$ 1318 665 -1618 -3486 -2655 409 2905 2786 297 -2344 -2599 -216 2513 2800 782 -1181 -1243 118
311A18J173J6n55j11J87p67j510r42P09K073J753m91k539j786J042L127K075q64
$$ 118 1291 1307 752 641 828 61 -1449 -2391 -1682 391 2144 1653 -886 -2672 -1630 1497 3572 2708
329B708l140k183N78K133J396n03j307p68K54N27j76o58J94J387J092o17j839
$$ 2708 -432 -2615 -2037 96 1492 989 -318 -1086 -832 -305 -481 -1139 -945 442 1534 917 -922
346i22q49J545K868J222j814l237j652J055K283J233j208k241q26J341J741M67
$$ -922 -1771 -226 2642 3864 2050 -1187 -2839 -1784 499 1732 524 -1717 -2543 -1202 539 1006
362A006p08m20N40P26m30j302n11J288J904M03j788k580j043J599K444M70k083
$$ 1006 298 -122 418 1144 714 -588 -1099 189 2093 2496 708 -1872 -2915 -1316 1128 1598 -485
379d85k310k03K066K349N58j078r47L40Q14L6q05o93K98J047L11j479j877j39
$$ -485 -2795 -2998 -932 1417 1975 897 -50 290 1104 1140 335 -358 -60 987 1298 -181 -2058 -2197
397b197J905J928j24k249k112L99K507K114P3j443j228L07J371O92q60j377l58
$$ -2197 -292 1636 1512 -737 -2849 -2450 57 2171 2244 801 -427 -120 1251 1943 1083 -294 -652
414f52N43Q7r50j128J43J685J585m18j862j194P61K243J610n26j957j299Q66J744
$$ -652 -109 -22 -972 -2100 -1957 -272 1313 895 -967 -2161 -1400 843 2453 1927 -30 -1329 -463 1281
432A281O95j110j662o70M78L87m26o71K12J262J179m8r63o68R43J932Q43j285
$$ 1281 1976 866 -796 -1466 -988 -601 -1027 -1698 -1486 -224 955 907 -56 -724 219 2151 2994 1709
450A709k218r60R74J671L85j363j663m33Q00Q79R3n50k45Q18J134K13o51l73Q36
$$ 1709 -509 -1469 -495 1176 1561 198 -1465 -1898 -1098 -219 -126 -676 -921 -103 1031 1244 593 220 1056
469A056J140Nj560k016p37R80J180oj260j182jJ440J560J85o98l80O04Q73K32
$$ 1056 2196 2201 641 -1375 -2112 -1132 48 42 -1218 -2400 -2401 -961 599 784 86 -294 310 1183 1415
488A415m84m03L34N51k79j297j324k93Q29R28j05j198p94P36J842J371k5q54n97
$$ 1415 931 528 862 1413 1134 -163 -1487 -1780 -951 -23 -128 -1326 -2120 -1384 458 1829 1804 950 353
507C53L98O49O9p15p03j20J38j51o77p67K4Q20O84l99r53l46Q32J581R65l53r39
$$ 353 751 1400 1469 754 51 -69 69 -82 -759 -1526 -1502 -682 2 -397 -1350 -1696 -864 717 1682 1329 390
528C90l98M65N83L6o80q54l22K69K38k62k81K86O53L81m16p01j15P72R94K87n81
$$ 390 -8 457 1040 1076 396 -458 -780 -511 -273 -535 -816 -530 123 504 88 -613 -728 44 1038 1325 744
549G44p57j44N17Q73q4q64q73k16K89K05j23k45J07L92J48k82l34J21M68M86L0
$$ 744 -13 -157 360 1233 1149 285 -588 -804 -515 -310 -433 -678 -571 -179 -31 -313 -647 -526 -58 428 458
570D58o18n21J93Q92O73j50p56o10K0L70J47j62k87k9J39K32J38o6R8M28L45l10
$$ 458 -160 -681 -488 404 1077 927 171 -439 -419 -49 98 -64 -351 -380 -241 -9 129 63 161 589 934 624
592F24n81l25L45N48K64l37o35l15J49K98J23l09n17j21K71L20J8O3K24K12J5
$$ 624 43 -282 63 611 875 538 -97 -412 -263 35 158 -151 -668 -789 -518 -198 -180 -117 107 319 334
613C34k44l57j83K45K87q7l69l94M5M41N79J27l14k85P2K07J89J21n9QJ18Ok66
$$ 334 90 -267 -450 -205 82 -5 -374 -768 -723 -282 297 424 110 -175 -103 104 293 414 355 363 481 487 221
636B21k44L5J24j0k49l60j65K65N76L76k6k40j67Q2K23kl13k77j04n8n7q8MN6
$$ 221 -23 12 136 126 -123 -483 -648 -383 193 569 543 303 136 218 441 439 126 -151 -255 -313 -370 -458 -454 -398
660c98J57O4j82l06R6L93M95J83k02k31R6K78J34j86l05k70j86j6R6j1N2J75K57
$$ -398 -241 -177 -359 -665 -569 -176 319 502 300 69 165 443 577 391 86 -184 -370 -386 -290 -301 -249 -74 183
683A83O5j47j63J11L54J55k23l43r8J19K40J85j12l97l39O1J68L0j35k2J51J85
$$ 183 248 101 -62 49 403 558 335 -8 -106 13 253 438 326 -71 -410 -349 -181 -151 -286 -308 -157 28
705B8N3r4JJ67J33k9k33k81j33K37L82J34j99k44J5J63J72j01k50j23L9M2N2p
$$ 28 81 -13 -12 155 288 259 26 -255 -388 -151 231 365 166 -78 -63 100 272 171 -79 -202 -163 -121 -69 -76
729g6oO4K18K6k48k59J6L12K16k5k64j68Q9K87J65j73k70k12m9J41K2r9OK11K61
$$ -76 -82 -18 200 226 -22 -281 -265 47 263 238 -26 -194 -105 182 347 174 -96 -308 -357 -216 -194 -293 -287 -76 185
754A85K4l8j14L8K20R6k07l19j20K04K90M1j34k67r4Q4J03J7j26p7J06J78J00
$$ 185 209 171 57 95 315 411 204 -115 -235 -31 259 300 166 -101 -195 -111 -8 9 -117 -194 -88 90 190
777A90o8r2J13J56j04k25l11j07K05K65Q4k33j30L2K53K09j3k57j62P2J39j7k4
$$ 190 122 30 143 299 195 -30 -341 -448 -243 22 106 -127 -257 -225 28 237 224 -33 -195 -123 16 -1 -25
800b5k1M3R8P9j32k49J8J61J81J5k25q0J28L21J19j36k29j83N2K1L5j22o8M9J87
$$ -25 -46 -3 95 174 42 -207 -189 -28 153 168 -57 -137 -9 312 431 295 66 -117 -65 -44 -9 -131 -199 -150 37
825C7O9m8j52P3J43J06j52k52m9J27J96R9r0k42j18R4J31j0j72q6R3J39J60l8
$$ 37 106 58 -94 -21 122 228 76 -176 -225 -98 98 197 107 -135 -253 -159 -28 -38 -210 -296 -203 -64 96 58
849E8j6P1J42Kj20j72j44O8J92Mj29j72Q4J58J38kj48j84R6J08N8Jl3K6P4Q2j37
$$ 58 42 113 255 257 137 -35 -179 -111 81 85 -44 -216 -132 26 164 162 14 -170 -74 34 92 93 60 86 160 242 105
876A05j76k9L7P9j00j23p7J23K15J44n6j21n8L9N9O1r3j43K7J10R7p0j12J8N9
$$ 105 -71 -100 -63 16 -84 -207 -284 -161 54 198 142 21 -37 2 61 122 29 -114 -87 23 120 50 -62 -44 15
901A5K5p2j48o3J66J79N7n2n7o2J15P3l2j63j67N0N3R4j5r9R4P5M3r3q7k8L7J37
$$ 15 40 -32 -180 -243 -77 102 159 107 50 -12 103 176 144 -19 -186 -136 -83 11 -4 -103 -9 66 109 16 -71 -99 -62 75
929G5K0p6r9N0J26R7j8j89j73P6O5J5m9j5O7Q5P1l6p1n1Q3Oj5j02j07J03J59O8
$$ 75 95 19 -80 -30 96 193 175 -14 -187 -111 -46 -31 -80 -95 -28 57 128 92 21 -30 53 59 44 -58 -165 -62 97 165
957A65p7j08o4N7N5qr8k1lQ1J06k4nm5Q2L4p4j88k1O4Q2O3n1m1mL5J46m9j24p8
$$ 165 88 -20 -84 -27 28 20 -78 -99 -102 -21 85 61 56 11 93 127 53 -135 -156 -92 -10 53 2 -39 -43 -8 138 89 -35 -113
987a13J2N9R5Or3M0J20jo8r9l7L5K4M4n0r1J06R0Q8o1n2q8J1K9K0q0j3K9Q2Q2
$$ -113 -101 -42 53 59 -34 6 126 125 57 -42 -79 -44 -20 24 -26 -117 -11 79 167 106 54 -34 -23 6 26 -54 -67 -38 44 126
1017A26n1m2o2K4O1n1j10l3Q6O4P0j3r9j9J06m6Oo9q1L9M3R0mn0J0M6L6j2j23
$$ 126 75 33 -29 -5 56 5 -105 -138 -52 12 82 69 -30 -49 57 11 17 -52 -133 -94 -51 39 35 -15 -5 41 77 65 -58
1046e8o1L6P7J5Ll2j5J26K8L9j44r0KP6K2L1r1L5N1P9o6o9j1m0N9k1om2J7Q3Q4
$$ -58 -119 -83 -6 9 12 -20 -35 91 119 158 14 -76 -74 2 24 55 -36 -1 50 129 63 -6 -17 -57 2 -19 -25 -67 -50 33 117
1077A17k0o5r6K4O0l5k5n2J9P9J7nj4j8PL5j6p3nl4J37N4l9j6l1L5Knj10j3L0
$$ 117 97 32 -64 -40 20 -15 -40 -92 -73 6 23 18 4 -14 -7 28 12 -61 -66 -100 37 91 52 36 5 40 42 37 -73 -86 -56
1108e6j8J02J4k7K7L9L1n6m7o8K7M9J9k1j9L3M3L2k7q2j9k0NK4K6m3LL0Q8k7m7
$$ -56 -74 28 42 15 42 81 112 56 9 -59 -32 17 36 15 -4 29 72 104 77 -5 -24 -44 -39 -15 11 -32 -29 1 89 62 15
1139A5k7rJ9j3l7l3K7P5M3j3l9m2L6qpm7m1J8P9L2nPk0K6LOo8l1O1lM8k0JoO5
$$ 15 -12 -21 -2 -15 -52 -85 -58 17 60 47 8 -34 2 -6 -13 -60 -101 -83 -4 28 23 30 10 36 39 45 -23 -54 7 4 52 32 33 27 92
1174I2k6m4m3m4j9N8J5K7k3M4K2K1m6l9j3kK0m8m2L3L5RO4k3q1k0PRN0j5m7N3
$$ 92 66 22 -21 -65 -84 -26 -11 16 -7 37 59 80 34 -5 -18 -20 0 -48 -90 -57 -22 -13 51 28 -53 -73 -66 -57 -7 -22 -69 -16
1206a6M9O0l1k0l1K9k6k3m7oJ8O8P3o3k7L2j9J08o8l8l3K3nL3Nl2oJ7J5Ko8l5
$$ -16 33 93 62 42 11 40 14 -9 -56 -62 -44 24 97 34 7 39 20 128 60 22 -11 12 7 40 45 13 7 24 39 41 -27 -62
1238f2KM4M4p8M0QK9K0j4n0k0k4L2N7p2m4N4O1%k1k1j1j6L9J6j4qQN2K6np1KL9
$$ -62 -60 -16 28 -50 -10 -2 27 47 33 -17 -37 -61 -29 28 -44 -88 -34 27 27 6 -15 -26 -42 -3 13 -1 -9 -1 51 77 72 1 3 42
1272D2k6k7M5o6J3M5M8k4l4J2jO0o1j4m2O4j4J3k5k6J7LM1j5l8j05M6N5L5k3K
$$ 42 16 -11 34 -32 -19 26 74 50 16 28 27 87 26 12 -30 34 20 33 8 -18 -1 2 43 28 -10 -115 -69 -14 21 -2 0
1303@jN1Pj1o6j1QKJ6pn8N6N2l2J4l6j8%R0n1L0k8KNM0ml9k5RN8m2j1k5K1j0K6
$$ 0 -1 50 57 46 -20 -31 -23 -21 -5 -12 -70 -14 38 6 20 -16 -34 -34 56 5 35 7 9 14 54 50 11 -14 -5 53 11 0 -25 -4 -14 12
1339A2J7k3l0J9K9Nk5n0l6P4M6k7l4L3L0k6kk6j2n2P5Km2J7L7K7jj6j9l7M3l2
$$ 12 29 6 -24 -5 24 29 4 -46 -82 -8 38 11 -23 10 40 14 12 -14 -26 -78 -3 -1 -43 -26 11 38 37 21 2 -35 8 -24
1371b4QP%K1MM1J6k9o4J6oK1kKJ2J0qK5k5l6J3j8L9j9l6nK8J5K3pj7n1N1K2k2
$$ -24 -16 -9 -9 12 16 57 73 44 -20 -4 -10 11 9 11 23 33 25 50 25 -11 2 -16 23 4 -32 -37 -9 6 29 22 5 -46 5 27 5
1406Ep6O5K3J0j2k2K3k6L5j2p6M4j6L7J9qpJ3J3J8rj8qk3K1M1l4K3m0ON7o4L7
$$ 5 -71 -6 17 27 15 -7 16 -10 25 13 -63 -19 -35 2 21 13 6 19 32 50 41 23 15 -8 13 54 20 43 3 9 66 2 39
1439C9n0oRNL1j2m1L1NK8l4l0N9o6k6M9k1K0jN2pj6j4j9J0Kk0L1m6J5N0oK3nj4
$$ 39 -11 -17 -8 -3 28 16 -25 6 11 39 5 -25 34 -32 -58 -9 -30 -10 -11 41 34 18 4 -15 -5 -3 -23 8 -38 -23 27 21 44 39 25
1474B5j6K9n3K3k3M7k7K1PJ4l5L4l6ll0PL6Pj9Rj0j7L2kj0k6j0K8lJ5k2l0O1l
$$ 25 9 38 -15 8 -15 32 5 26 33 47 12 46 10 7 -23 -16 20 27 8 17 7 -10 22 20 10 -16 -26 2 -1 14 -8 -38 23 20
1508B0RMr3K9J8j4J1mk8N4K2j3pj4j2K1j8KNj7J6M4j2Rl8J8mnMk0lJ1nM3j4K5
$$ 20 29 33 -60 -31 -13 -27 -16 -20 -48 6 28 15 8 -6 -18 3 -15 -13 -8 -25 -9 35 23 32 -6 12 8 3 7 -13 -16 -5 -10 33 19 44
1544D4l3RJm5k0J9L4rj5K9Pn0N2mj7k0l1M2J1oJ5%j9J9Nqk2j4K5k1L4qK3j8J7
$$ 44 11 20 21 -24 -44 -25 9 0 -15 14 21 -29 23 19 2 -18 -49 -7 4 -2 13 13 -6 13 18 10 -12 -26 -1 -22 12 4 27 9 26
1579B6j%m3K8Kj3QK3l2J5%K8l2nK9l1J9k0l5N9j7QJ5qj2k2PJ5lm6J7ML8nl1K1
$$ 26 25 25 -18 10 12 -1 7 30 -2 13 13 41 9 4 33 2 21 1 -34 25 8 16 31 23 11 -11 -4 11 8 -38 -21 -17 21 16 -15 6
1615FL8k2m3Ql3M0J4k8L1Mk4J7KL7m4j6K5m7M3l1NkL5L2j5l2K7m7J1lL6j8J9m
$$ 6 44 22 -21 -13 -46 -6 8 -20 11 15 -9 8 10 47 3 -13 12 -35 8 -23 -18 -20 15 47 32 0 27 -20 -9 -12 24 6 25 21
1649B1q%Nj1n5M2l6N2k4K1l4K4Rj8J5M3m3l3J7kkM8m5L2n2O7J3k8k2mK3rK2l4
$$ 21 13 13 18 7 -48 -6 -42 10 -14 7 -27 -3 6 -12 3 46 3 -30 -13 -15 -17 31 -14 18 -34 33 46 18 -4 -8 15 6 28 -6
1683fK5L3ol7J2K2J1p0L9m2K2lk5O7m4K2l1K0Ol0K2oj9k2jM2qj5ljlLK0j3qJ0
$$ -6 19 52 46 9 21 43 54 -16 23 -19 3 0 -25 42 -2 20 -11 9 15 -15 7 1 -18 -40 -41 1 -7 -22 -25 -26 -29 -26 -6 -19 -27 -17
1719a7J0J6Mol2L8Pnk6J4L5n2J0l0NL3jPJ3l0J2JK2j5J3j5J7j0J0l2J5m5QL5k6
$$ -17 -7 9 13 7 -25 13 20 15 -11 3 38 -14 -4 -34 -29 4 3 10 23 -7 5 6 28 13 26 11 28 18 28 -4 11 -34 -26 9 -17
1754a7j5M2l4L4kj6oj2rL6Jn4L8OJ8%j5j1PK7L3m6o0L9K1J2kj6J7NKKk0Kj2pj
$$ -17 -32 10 -24 10 8 -8 -14 -26 -35 1 2 -52 -14 -8 10 10 -5 -16 -9 18 51 5 -55 -16 5 17 15 -1 16 21 23 25 5 7 -5 -12 -13
1791a3j2Q0k4k8J5K6l7Om0J0N0l5K4n5M4K6j3l5rM1l4J4Lj7J2j4K1J6o1PJ9L9
$$ -13 -25 55 31 3 18 44 7 13 -27 -17 33 -2 22 -33 11 37 24 -11 -20 21 -13 1 4 -13 -1 -15 6 22 -39 -32 -13 26
1823B6m0oJ4j3KK4K9j5p3L2QL2Nl3K1j9J9O3n7lj1k6N6k7K4l3j9KN1k3k9J5l1
$$ 26 -14 -20 -6 -19 -17 7 36 21 -52 -20 -12 20 25 -8 13 -6 13 76 19 16 5 -21 35 8 32 -1 -20 -18 33 10 -19 -4 -35
1856c5J4L0j7j2J2l3M1J0l3J1J3j2Qk4j4mO4l2Qj0MJ2j2L5Mj3l7j0L1k5J7J1L
$$ -35 -21 9 -8 -20 -8 -41 0 10 -23 -12 1 -11 -3 -27 -41 -45 19 -13 -5 -15 -11 1 -11 24 28 15 -22 -32 -1 -26 -9 2 5
1889EqL1rl1K1K6m5j5K2LnL3l2RJ6poj9K9ln4O6m4jNL3Rl5PJ%l4J5%O2m6K8J6
$$ 5 -3 28 19 -12 9 35 -10 -25 -3 0 -5 28 -4 5 21 14 8 -11 18 15 -39 27 -17 -18 -13 20 29 -6 1 2 2 -32 -17 -17 45 -1 27 43
1927D3n6L5m4J6J3K3k7pN3j3Kk8K8l4j4J6lL2m4LK7N1j3l3J7m0J2j4Lj4K6j0k9
$$ 43 -13 22 -22 -6 7 30 3 -4 49 36 38 10 38 4 -10 6 3 35 -9 -6 21 72 59 26 43 3 15 1 4 -10 16 6 -23
1960b3%L4l8L7k5J8m9M7l2MkOJRl4N4k0K7npKk0j5N8j5Nk1QK5J4l5LJj0m2L7L6
$$ -23 -23 11 -27 10 -15 3 -46 1 -31 -27 -29 -23 -22 -13 -47 7 -13 14 9 2 4 -16 -31 27 12 17 -4 4 29 43 8 11 12 2 -40 -3 33
1997C3n7L3pML8n8L7oj5Kj2qK4pL5n8K0k2K6J0m0K0K2Nm4L0O0q7L2l0%K8m9K1
$$ 33 -24 9 2 6 44 -14 23 17 2 4 -8 -16 8 1 36 -22 -2 -24 2 12 -28 -8 14 19 -25 5 65 -22 10 -20 -20 8 -41 -20
2031b0jM8l4J0jJ6Kk4K1J0k5L2k9k0J9J8mJ3mLk1lj2K1j9J3LPl0j9L2Jk0K2K7
$$ -20 -21 27 -7 3 2 18 20 -4 17 27 2 34 5 -15 4 22 18 31 27 30 9 6 -6 15 -4 9 12 19 -11 -30 2 3 -17 5 32
2066C2k3l4J6J8j1J5oJ3J6j4l5rJ5kpL8r%j7M1m6K8j8N5m0%j0K8k7K1K6p7M2j1
$$ 32 9 -25 -9 9 -2 13 7 20 36 22 -13 -22 -7 -9 -16 22 13 13 -4 37 -9 19 1 56 16 16 6 34 7 28 54 -23 19 8
2100HrK3J1l2LkKl0J2M6o1K0j0J7pk5K3R%%J6n4N4k1K1k9K0OLRk0Qj1j1K1jJ7
$$ 8 -1 22 33 1 4 2 4 -26 -14 32 -29 -9 -19 -2 -9 -34 -11 -2 -2 -2 14 -40 14 -7 14 -15 5 11 14 23 3 11 0 -11 10 9 26
2137B6k3kj9M3n4J9J4JL8l7kJ9l0J5kK3J0n1oJ5j0K2jpK3j7k0%J6j5J5K0n8J4
$$ 26 3 1 -18 25 -29 -10 4 5 43 6 4 23 -7 8 6 29 39 -12 -18 -3 -13 9 8 1 24 7 -13 -13 3 -12 3 23 -35 -21
2171b1L4k4k0L2mllM2m3kNJ1k1NJ1K2k4mK7KJ0k6ROo2J9P0n3L5l4K4Nl7K1K9k8
$$ -21 13 -11 -31 1 -3 -6 -9 33 -10 -12 -7 4 -17 -12 -1 21 -3 -7 20 22 32 6 15 21 -41 -22 48 -5 30 -4 20 25 -12 9 38 10
2207A0j0l6N8k8Mk3QK3J7jm6L0oj1J3l8J7J2nJ0j6L5n6K1QJ7jn4O0m5M1j1K5k1
$$ 10 0 -36 22 -6 -2 -25 -17 6 23 22 -24 6 0 -11 2 -36 -19 -7 -12 -2 -18 17 -39 -18 -10 7 6 -48 12 -33 8 -3 22 1
2241AK6l9L0j4k8NL6k1K1Ol9J8J7k9kK3M2m7K9k7j8l4M1J8j3kl0OO3n6j4L3K0
$$ 1 27 -12 18 4 -24 -19 17 -4 17 23 -16 2 19 -10 -12 11 53 6 35 8 -10 -44 -3 15 2 0 -30 -24 39 -17 -31 2 22
2274B2j1K0n4N1ql5NOL2j9j5k3K8J3QJl1J2m%Qk9M7l6O2q5N1j5jK6j6OnJ7k1q
$$ 22 11 31 -23 28 20 -15 -10 -4 28 9 -6 -29 -1 12 20 21 -10 2 -2 -2 6 -23 24 -12 50 -35 16 1 0 26 10 16 11 28 7 -1
2310aj6J0L9l7K2qrJ5k3K6K3m2J7k9kmL1n0L2jk2K5jJ2mlJ1K3ol9j9N8l3J9%k
$$ -1 -17 -7 32 -5 17 9 0 15 -8 18 41 -1 16 -13 -15 -19 12 -38 -6 -7 -29 -4 -5 7 3 0 11 34 28 -11 -30 28 -5 14 14 12
2346A2JL1n7L6k2j9RJ6j1K0J4k3rk2L1K8m1J2Mn8K8M4l5JK4m9M4l0Nrk7P7l5N
$$ 12 13 44 -13 23 1 -18 -9 7 -4 16 30 7 -2 -24 7 35 -6 6 10 -48 -20 24 -11 -10 14 -35 9 -21 -16 -25 -52 25 -10 -5
2380eK9mk9PJ3j3k6P0l9l4J8L3j8k0K3jKm0M4K2n8j8jL3j7M9k8mL8Lk4K7kq0K7
$$ -5 24 20 -9 -2 11 -2 -28 42 3 -31 -13 20 2 -18 5 4 6 -34 10 32 -26 -44 -45 -12 -29 20 -8 -12 26 29 5 32 30 -50 -23
2415b3Rj9L6k8nJ9NRKom7K1L0j4Nk6M9o1M0JRm8L1MM6m1oK3j0j7J0k1K8Jj7J2
$$ -23 -14 -33 3 -25 -30 -11 -6 3 5 -1 -48 -27 3 -11 -6 -32 17 -44 -4 -3 6 -42 -11 -7 39 -2 -8 15 5 -12 -2 -23 5 6 -11 1
2451AM6%m8K0kj1RqJ4J6k5Mj4j3kJ2K6m4J5J9j5L0l7nK2Jl0J1j9K7oj0K9Jk9P
$$ 1 47 47 -1 19 17 6 15 7 21 37 12 16 2 -11 -13 -1 25 -19 -4 15 0 30 -7 -12 10 11 -19 -8 -27 0 -6 -16 13 14 -15 -8
2487hj8K3%k3K3J4j1k8MkM4k1K4j2%l7L3L7n1K7Jj0J5j8mJ3k7pj2O5m3LNn1M3
$$ -8 -26 -3 -3 -26 -3 11 0 -28 -24 -26 18 -3 21 9 9 -28 5 42 -9 18 19 9 24 6 2 15 -12 -19 -31 34 -9 -6 -1 -52 -9
2522ij5l1N8j0j6L2j3j2Nk0J6K6n4M9K3o6N8j7L8j8m8K3J0k0jJ7n6O1J8J7l1K7
$$ -9 -24 -55 3 -7 -23 9 -4 -16 -11 -31 -15 11 -43 6 29 -37 21 4 42 24 -24 -1 9 -11 -12 5 -51 10 28 45 14 41
2554D1l0j4MMJnpj1J2lJ0pj3K4J2j4j7j2J8J4k3K4nmnLQk9kK0oJ7rJ8l4nK2Pm2
$$ 41 11 -3 1 5 6 1 -6 -17 -5 -8 2 -5 -18 6 18 4 -13 -25 -7 7 -16 8 3 -1 -6 -3 5 -24 -26 -6 -12 5 -4 14 -20 -25 -3 4 -38
2593c8RK8JpK1oK5n1M7n9N0l1j4N5l2J0M1l4Nm0j7K9k0L6qJ2l4N1j9j9J1k2Qj6
$$ -38 -29 -1 0 -7 14 8 33 -18 29 -30 20 -11 -25 30 -2 8 49 15 20 -20 -37 -8 -28 8 0 12 -22 29 10 -9 2 -20 -12 -28
2627b8M2j2j0MK4n3N0k3MqmmL7k6j4K5lL5k0Ql0J4k0L6l2OPM2j5l8L5J1j00Q0
$$ -28 14 2 -8 -4 20 -33 17 -6 -2 -10 -14 -18 19 -7 -21 4 1 36 16 24 -6 8 -12 24 -8 -2 5 47 32 -6 29 40 -60 20
2661B0k9J0K0Nj2rk2J4J9qj6NJ7m8J8K2Npj9Mj9K0J9l7L4l3J9J3L7m0l3L3J1j0
$$ 20 -9 1 21 26 14 5 -17 -3 16 8 -8 -3 14 -34 -16 6 11 4 -15 -11 -30 -10 9 -28 6 -27 -8 5 42 2 -31 2 13 3
2695COM0m0Nn%J2k2l3J5K6Ll3K0RRj0pmPJ5pKK9m9K0QKo3L3RkL1l2j4K3%N2l6
$$ 3 9 49 9 14 9 9 21 -1 -34 -19 7 10 -23 -3 6 15 5 -2 -6 1 16 9 11 40 -9 11 19 21 -42 -9 0 -2 29 -3 -17 6 6 58 22
2734B2l5PJ6k9J3j6QJ7k3NmL2l2K5Kj4k0mP6k4l1K7lKj6J3J2mJ2m6K1K3j7nqj0
$$ 22 -13 -6 10 -19 -6 -22 -14 3 -20 -15 -19 13 -19 6 8 -6 -26 -30 46 22 -9 18 15 17 1 14 26 22 34 -12 9 32 15 10 2 -8
2770hRJ3L6k8l7O3p1L0l7J5J3n%m2J8L2J2j4k8J9J2k9K7l7O1l2ppKL0ok0K1K4
$$ -8 1 14 50 22 -15 48 -23 7 -30 -15 -2 -7 -7 -49 -31 1 13 -1 -29 -10 2 -27 0 -37 24 -8 -15 -22 -20 10 4 -16 5 29
2804B9o3M2K0pn2O6j0J1l8Nl2J7J5J3Pk6j1NL5n2J6J1Pj8pK9J2j9k8L8l0L7k6
$$ 29 -34 8 28 21 -31 35 25 36 -2 3 -29 -12 3 16 23 -3 -14 -9 26 -26 -10 1 8 -10 -17 12 24 5 -23 15 -15 22 -4
2837dJ0L2m6RnPqj8qL4J5j2Pj1qNM1j7l4lJ8K2k1j3NJ2j7LK1j4j9K6k6JM5J0K
$$ -4 6 38 -8 1 -4 3 -5 -23 -31 3 18 6 13 2 -6 -1 40 23 -11 -14 4 26 5 -8 -3 9 -8 -5 16 2 -17 9 -17 -16 29 39 41
2874D1m9lOJ%rM2m2k0K8Ll9N6l7nJ2k0K8j6LK2kJ6J7Nl2J7lm6oL0K4K8p6J4j8
$$ 41 -8 -11 -5 -4 -4 -13 29 -13 -33 -5 -2 -41 15 -22 -27 -15 -35 -7 -23 -20 2 0 16 33 38 6 23 20 -26 -32 -2 22 50 -26 -12 -30
2910c0L7Mj1MkQljj0K7J5l4L1l6j0kJ1J0J0l6K2K2p5M5J0rk5K5lm1N9Rj2pk7J6
$$ -30 7 11 0 4 2 10 7 6 -4 23 38 4 35 -1 -11 -13 -2 8 18 -18 4 26 -49 -4 6 -3 -28 -3 -6 -47 12 21 9 2 -25 -9
2946ioL7l7RJ9k6Kj3pJ6L1MJ6j4k2lL4l7mj3J5O0q2J3L4j9Qj2nK3m5K2L3l3Rl3
$$ -9 -15 22 -15 -6 13 -13 -11 -24 -31 -15 16 20 36 22 0 -3 31 -6 -10 -23 -8 52 -30 -17 17 -2 6 -6 -11 12 -33 -11 22 -11 -2 -35
2982c5K1J3k4L3m5L2nj9L3k5mK0K2k8J1Ok6M3m5rJ0M2k8j3L8j9M4j7j6j3k1M5
$$ -35 -14 -1 -25 8 -37 -5 -10 -29 4 -21 -25 -5 17 -11 0 6 -20 23 -22 -31 -21 21 -7 -20 18 -1 43 26 10 -3 -24 21
3014B1lk0lK3kokRK2n2l0M8JK8j8k4j1M4jol7Rmj0K4jL8l8mq%K8J9n7K7K6l2j6
$$ 21 18 -2 -5 18 16 10 8 17 39 -13 -43 5 6 34 16 -8 -19 25 24 18 -19 -10 -14 -24 0 -1 37 -1 -5 -13 -13 15 34 -23 4 30 -2 -18
3052a8JK7l2J4jJ6k6O0m4L5qk3J4J3nk6oJ7J7k4MJ1k2OM8q2N7mj9pok4L4J2Jk5
$$ -18 -17 10 -22 -8 -9 7 -19 41 -3 32 24 1 15 28 23 -3 -9 8 25 1 5 16 -6 0 48 -34 23 19 0 -7 -13 -37 -3 9 10 -15
3088a5jL2kN2o5N4q2J7Mm0N2L3o3N9m7Mj0L7n7K4K3m0K0LJ9j7J3rJ8Km0J3K2N
$$ -15 -16 16 14 66 1 55 -27 -10 -6 -46 6 39 -24 35 -12 -8 -18 19 -38 -14 9 -31 -11 -8 11 -6 7 -2 16 18 -22 -9 13 18
3122A8k0K8j0J0k2lmJ0k0nJ0J2m5K8LJ9K4m6mj0K6Mj2K5J3n6M8j2k1nJ7j0jJ3
$$ 18 -2 26 16 26 4 1 -3 7 -13 -18 -8 4 -41 -13 -10 9 33 -13 -17 -27 -1 3 -9 16 29 -27 21 9 -12 -17 0 -10 -11 2
3156BrKLjRJ2Mj3k4M0j7J7k3PkK1Pj4J0mk2Oml2J8K3mJ3l9J5K8n5K0QK1k6lj3
$$ 2 -7 -5 -2 -3 6 18 22 9 -15 25 8 25 2 9 7 28 35 21 31 27 5 11 7 -25 -7 16 12 25 -14 1 29 -26 -6 2 23 -3 -6 -19
3194a9J7JOj0%l5M4qJ8m0k4K5MQK9K2m2K1o6L8J3l0J2j0J9M0m5J6j3J6rO1o0K7
$$ -19 -2 -1 5 -5 -5 -40 4 -4 14 -26 -50 -25 -21 -13 16 38 -4 17 -49 -11 2 -28 -16 -26 -7 33 -12 4 -9 7 -2 59 -1 26
3228B6%j3k9O5m6Mk2J4l0LM9m3Rj9M7l3K5oL2k8J9m0K4J0JMk6K9l2K0l0L1nK1
$$ 26 26 13 -16 49 3 7 -15 -1 -31 -28 21 -22 -13 -32 15 -18 7 1 33 5 24 -16 8 18 19 23 -3 26 -6 14 -16 15 10 31
3262C1m9j0K2qNK7qk7j7K9J6l9J1M1Jj9oLL0j7k2k6K9knJ2Pn7M0J2K3j9Oj5pM9
$$ 31 -18 -28 -6 -14 -9 18 10 -17 -34 -5 11 -28 -17 24 25 6 0 3 33 16 -6 -32 -3 -5 -10 2 9 -48 -8 4 27 8 14 -1 -8 41
3298D1l2j7K0Nqj0J9j7RJ9l9nJ1j3mMK6K1j1oj6K6l4L9Lok6Pk4N3k3k2P1m6J2
$$ 41 9 -8 12 17 9 -1 18 1 10 29 -10 -15 -4 -17 -21 -17 9 30 19 13 -3 23 -11 28 31 25 -1 6 -18 35 12 -10 61 15 27
3333B7mLJ1m7L%K9ok0NR%j6J7j5L4m1J2k3J7r%Mj1K4rJ4L5j0m1pK4k0KRJ8K2p2
$$ 27 23 26 37 -10 -7 -7 22 16 -4 1 10 10 -6 11 -4 30 -11 1 -22 -5 -14 -14 -10 -21 3 -6 8 43 33 -8 -15 9 -11 -9 0 18 40 -32
3371c2M0K7k3mj7J6l1K1M1o8L4l4K1PK3jm1mM7k1%pK4l8K0l4jK5LpLJK3j7J3l6
$$ -32 8 35 12 8 -9 7 -24 -3 38 -30 4 -30 -9 -2 21 20 -21 -25 22 1 1 -6 18 -20 0 -34 -35 -10 -7 -14 -11 -10 13 -4 9 -27
3407b7j3J8L2qj4Pj6N3j4n0K1JK9m3N2l3L2k3J1Mk4qj0L3On3N0J9m5L6j1j5KK2
$$ -27 -40 -22 10 2 -12 -5 -21 32 18 -32 -11 -10 19 -24 28 -5 27 4 15 19 -5 -13 -23 10 16 -37 13 32 -13 23 12 -3 -1 21
3441B1rj1l1N4pl4J8Rm3M4m9O9k8nm6M8L7q8M1j8K6Pj9Q8j02j3M9k2RpK2l2KL3
$$ 21 12 1 -30 24 17 -17 1 10 -33 11 -38 31 3 -2 -48 0 37 -51 -10 -28 -2 5 -14 74 -28 -41 8 -14 -5 -12 10 -22 -20 13
3475A3jkpOk8K9NK6L1q0M4j9j5pj6J7l3M8Nl3J3k7O%L4l6oK2Mj8M1l2NM9o6K9
$$ 13 12 10 3 9 -19 10 15 41 72 -8 36 17 2 -5 -21 -4 -37 11 16 -17 -4 -31 -25 -25 9 -27 -33 -11 -7 -25 16 -16 -11 38 -28 1
3511AK0l0PK1k2Pj5RJ7Pj3K5l3nKJ0k6K3K1k6Pj4k6K5L0kk9K4l9OK3j1jMJ2pJ3
$$ 1 21 -9 -2 19 -3 4 -11 -2 15 22 9 34 1 -4 -2 8 -18 5 26 0 7 -7 -33 -8 22 20 -9 15 -24 -18 5 -6 -7 -3 9 2 15
3548A5k0J0K2n9J1L2l7K5j0l5N4K9m2j0J2J9K8l3kj4QL5l3mqK0m0K1N1m5jjL8
$$ 15 -5 5 27 -32 -21 11 -26 -1 -11 -46 8 37 -5 -15 -3 16 44 11 9 -5 3 38 5 1 -7 13 -27 -6 45 0 -1 -2 36
3581C6m3l3O7j2k9K2j4K2Oj1QqJ1PJ1m4K0Nm3J1rN5j3j6k8L3oQKl8M6l7OK5oL0
$$ 36 -7 -40 27 15 -14 8 -6 16 22 11 19 11 22 29 40 -4 16 21 -22 -11 -20 35 22 6 -22 11 5 13 15 -23 23 -14 -8 17 11 41
3617D1j6j5k4MK8l7pK2mJ9pk2QK2j2Lk0J1J9J1rlm9N9lj2k1M5k5k1J0K1m9J9O
$$ 41 25 10 -14 -10 18 -19 -26 -4 -8 11 4 -18 -10 12 0 3 -17 -6 13 24 15 12 -37 22 19 7 -14 31 6 -15 -5 16 -33 -14 -8
3652hmK5n2J6M0j5JJ3k4L6j0l6M0lj5rO4o6j2L8J3k7J6o1L4jmJ4l0J7J2K0m2K7
$$ -8 -12 13 -39 -23 17 2 3 16 -8 28 18 -18 22 19 4 -5 59 -7 -19 19 32 5 21 -40 -6 -7 -11 3 -27 -10 2 22 -20 7
3686Gj4K3j9J4Ml1j3M4k4PlJ2j4J7l4NNJ9oK1o9M5kJJ3k6K7j3J6Kql9rM6J3Qm9
$$ 7 -7 16 -3 11 15 -16 -29 15 -9 -2 -5 7 -7 10 -24 -19 -14 5 -1 20 -49 -4 -6 -5 8 -18 9 -4 12 14 6 -33 -42 4 17 25 -24
3723b4M1J3%o8M7Rkj4k5jK7j4J3K5m3K1Pk6M2n0M0j7l2L4pmk5L3l0M4k3j7K0j1
$$ -24 17 30 30 -38 9 18 16 2 -23 -24 3 -11 2 27 -16 5 12 -14 28 -22 18 1 -31 3 -4 -8 -33 0 -30 14 -9 -26 -6 -17
3757a7L2k1JK6n0J3mO5n7L1j2k4M0j8M5k9j0qK0J4k9k0J9j6j7M7l5J1L5Nl1n2
$$ -17 15 -6 -5 21 -29 -16 -20 45 -12 19 7 -17 23 5 50 21 11 3 23 37 8 -12 7 -9 -26 21 -14 -3 32 37 6 -46
3789d6Q2k6j5j9K5j1j3P5o0j3nK3l2M1j9K5j2k1Q2p1k1K2qj4N5l4RL4j5m4J4K3
$$ -46 36 10 -5 -24 1 -10 -23 52 -8 -21 -26 -3 -35 6 -13 12 0 -21 61 -10 -31 -9 -17 -31 24 -10 -1 33 18 -26 -12 11
3821A1J5l7k6M6k6J0j8K5k3O0l2j3OjJJ2nj8nj4O9k1m3J4JJK1K1k6j2lk3L2j2
$$ 11 26 -11 -37 9 -17 -7 -25 0 -23 37 5 -8 -2 -3 -2 10 5 -13 -18 -32 37 16 -27 -13 -12 -11 10 31 5 -7 -10 -33 -1 -13
3855a3K5l7OK8poMj2QJ3k1J1j7j0M0Qm4L5J6l5M3l2J5l1lK8j0J4k5J4Qk3Mm5O2
$$ -13 12 -25 -19 9 2 -4 0 -12 -4 9 -12 -1 -18 -28 12 20 -24 11 27 -8 35 3 18 -13 -16 12 2 16 -9 5 13 -10 -6 -51 11
3890A1k6j0K3k0K3M3l3j3M2m6K1l0J4l6L1RJj9K0ml0M6n9K8K3j0%Nk2M3l3J6j8
$$ 11 -15 -25 -2 -22 1 44 11 -2 40 -6 15 -15 -1 -37 -6 3 4 -15 5 1 -29 17 -42 -14 9 -1 -1 4 -18 25 -8 8 -10
3923a0K0l4J8M0l6K6l1K3jqk0L0kJ2Ok8LK4rRj6j3MJ6j0M5n7j3L7l6K7j1J9k7
$$ -10 10 -24 -6 34 -2 24 -7 16 15 7 -13 17 15 27 33 5 8 32 23 32 16 3 7 23 13 58 1 -12 25 -11 16 5 24 -3
3957cNJ9m7O2n1k4O3o2M5j1M1m7J8j3L0l1J7J0k5kK7k4L4l1j0j1M5l5kN1l9QJ1
$$ -3 2 21 -26 36 -15 -39 24 -38 7 -4 37 -10 8 -5 25 -6 11 21 -4 -6 21 -3 31 0 -10 -21 24 -11 -13 38 -1 7 18
3990A8j5j0L5l7PK4j2qLnJ3J6LMn2OJ9k9K6j6PN1l1j2j3J4J1Rn8K6rL3m7J8L2
$$ 18 3 -7 28 -9 -2 22 10 2 5 0 13 29 32 36 -16 -10 9 -20 6 -10 -3 48 17 5 -8 6 17 26 -32 -6 -15 18 -29 -11 21
4025B1k2J3j9kOJj9Pj3K4j1j7O7l1OJ2Rm3jK4pJ8l2J5J6l7K0J5k6L9qo5N1%J2
$$ 21 -1 12 -7 -9 -3 -2 -21 -14 -27 -3 -14 -31 36 5 11 23 32 -11 -12 12 5 23 -9 6 22 -15 5 20 -6 33 25 -40 11 11 23
4060B3j7k4J9k6J6L2rJl1K2l5K4L5n4LK8JJ7l2J5JmQoK3l3PpJ8jj6j3J2k6K0O
$$ 23 6 -18 1 -25 -9 23 14 15 -16 6 -29 -5 30 -24 -21 7 8 25 -7 8 9 5 13 7 30 -3 4 -3 15 14 -2 -15 -3 -29 -9 -3
4096cpK5nl0M1qJ7rm2M0j8J6j6J9m5PJ9j9RNL2k4rPJ3Nrk7J3MN7m0ok3J1l%J9
$$ -3 -10 15 10 -20 21 13 30 21 -21 19 1 17 1 20 -25 -18 1 -18 -9 -4 28 4 -5 2 15 20 11 -16 -3 1 58 18 12 -11 0 -3 -3 16
4134A6mj5rM2j6lj2oLr%pJ3LlJ7j2J7lkj3oK1rj4J3J%K8j6qMj2KJ4j7K6l6M6o7
$$ 16 12 -3 -12 30 14 11 -1 -7 -4 -13 -13 -20 -7 -4 -7 10 -2 15 12 10 -3 -9 12 3 -11 2 3 3 31 15 7 11 -1 1 15 -2 24 -12 34 -33
4174c3J8KQJ5j1NNlnl6J6mK8K1n2K4k8j1N8m1L8n4M2J5j7L1m5j6M6k7K9ll6L1
$$ -33 -15 -13 -5 10 -1 4 9 6 1 -35 -19 -23 5 26 -26 -2 -30 -41 17 -24 14 -40 2 17 0 31 -14 -30 16 -11 18 15 -21 10
4208A0Kjm6M3l9N0pMl1J2j6M9o8K0M1m8J7LL5j8m0ORJ8K5k8j5%K3qNk5NMJ2kJ5
$$ 10 12 11 -35 8 -31 19 12 16 -15 -3 -19 30 -38 -18 23 -25 -8 -5 30 12 -28 -22 -13 5 30 2 -13 -13 10 2 7 -18 -13 -9 3 1 16
4245A6k0K1m2J9K8l9MMJ1qn2N4PjLJ9mj1k4L7rk7QkNJ3K0n2J1RMk8NM2n2J9K1
$$ 16 -4 17 -25 -6 22 -17 -13 -9 2 -6 -58 -4 3 2 5 24 20 9 -15 22 13 -14 -6 -8 -3 10 30 -22 -11 -2 2 -26 -21 21 -31 -12 9
4282IPKm1K2l8K4k3M4L3j6m2J3jOK2J6k0k1mL0j0J8l1M9l4JJ4m4K7ojK3k8j1m
$$ 9 16 18 -23 -1 -39 -15 -38 6 39 23 -19 -6 -7 -1 21 37 17 -4 -8 22 12 30 -1 48 14 15 29 -15 12 6 5 28 0 -11 -15
4317a5L1j0K6l2kJnQK7j3nk5O1p7N8k0k1J3k3M6o0L0j1ML9k8%K6l2k4L2nJ0K1
$$ -15 16 6 32 0 -2 -1 -6 2 29 16 11 -14 47 -30 28 8 -13 0 -23 23 -37 -7 -18 -14 25 -3 -3 23 -9 -33 -1 -6 4 25
4351B5m1MJ0J3MmJ1Pk8K6j8J7jo4K1M5k1Ln%j8L1l5j5L2j2L8j8j7J1nj0J2m2Q0
$$ 25 -16 -12 -2 11 15 11 22 29 1 27 9 26 25 -39 -18 27 6 9 4 4 -14 17 -18 -33 -1 -13 25 7 -10 1 -4 -14 -2 -44 36
4386C6j6Rk5k4K2J9ql1K6nlNk4oK3LJ1l3K4j4K6j6oM3o0N5k4j3J9J3kk9Ol6M1
$$ 36 20 29 4 -20 2 21 13 -18 8 3 0 5 -19 -25 -2 1 12 -21 3 -11 15 -1 -7 36 -24 31 7 -6 13 26 24 -5 1 -35 6
4421Fl2K1j2mQkJ7K5k2k2j1K4K4n9L5Kl5NK5k2J1J5rJ4m2J1L0k7j4L6OQm0K4K
$$ 6 -26 -5 -17 -21 -13 -15 2 27 5 -17 -28 -4 20 -39 -4 -2 -37 -32 -7 -29 -18 -3 -12 2 -40 -29 1 -26 -40 -4 2 10 -30 -6 -4
4456dQK8l6mK3Jl8J5j3M0m8N9k5l7M2k8J1J3k9J0K6k2l8L5l0M2nNj3J4j7J1k5
$$ -4 4 32 -4 -8 15 16 -22 -7 -20 20 -28 31 6 -31 11 -17 -6 7 -22 -12 14 -8 -46 -11 -41 1 -4 1 -12 2 -15 -4 -29
4489b9J8J5J0Kl1J1nrL6m2J4M7l5L0l5Qj5J7j0K9oJ3m0k4J0j0K7j3M3n2N5l8J5
$$ -29 -11 4 14 16 -15 -4 -9 -18 18 -24 -10 37 2 32 -3 5 -10 7 -3 26 20 33 -7 -31 -21 -31 -4 -17 26 -26 29 -9 6
4522FLk7K2qNj1nJ0k1Rl0M8m2kL5jMj3J3j6J9NrJ0k9J8j4KK7l3K4J6l0k6J7K1
$$ 6 9 -18 4 -4 1 -10 -15 -5 -26 -17 -47 1 -41 -43 -8 -9 -5 -18 -5 -21 -2 3 -6 4 -25 -7 -21 -19 8 -25 -1 15 -15 -41 -24 -3
4558cJk5J0%KJ4j8J5OoqJ4J6j4J7j2k1K6l5RL8j8qk6J5QL0J7k5l9J9J3k4K7j9
$$ -3 -2 -27 -17 -17 -15 -1 -19 -4 2 -4 -12 2 18 4 21 9 -12 14 -21 -12 26 8 0 -26 -11 -3 27 44 19 -20 -1 12 -12 15 -4
4593dK9j8rK3j7J2k3KL%K4kj1Jk3K5lm8O7m7O9o5L6k1QJ0k9kJ9k6K3M1n5j9J9
$$ -4 25 7 -2 21 4 16 -7 -5 -2 -2 22 20 9 10 -13 12 9 -39 28 -19 50 -15 21 0 8 18 -11 -13 6 -20 3 44 -11 -30 -11
4628a1JQKQj6jJ5m3P5m1ojRJ3m8P4pj5qKj0%J5%J9km1RJ1M6q7K8RJ6k0kjjjK0
$$ -11 -10 -2 0 8 -8 -9 6 -37 38 -3 -9 -10 -1 12 -36 38 31 16 8 10 0 0 15 15 34 32 -9 0 11 57 -30 -2 7 23 3 1 0 -1 -2 18
4668A8k7L2k3J9J6m4J1oMPLK5m0%ok1K3j8RJ1K2j4J4j0QJ5j8j6nM3n8J4M1o8K6
$$ 18 -9 23 0 19 35 -9 2 -4 0 7 10 35 -5 -5 -11 -32 -9 -27 -18 -7 15 1 15 5 13 28 10 -6 -11 32 -26 -12 29 -39 -13
4703a3J8k2K5mrk0J4J5K0ok6K9no0K9J2k8L2jj2QL6k6k7J9kMK3m1K5rJ3lmk2O
$$ -13 5 -17 8 4 -5 -25 -11 4 24 18 -8 21 16 -44 -15 -3 -31 1 0 -12 -4 32 6 -21 -2 -4 0 23 -18 7 -2 11 8 4 -18 -12
4739a2K6Pk7j5K1NK9n2j7jLJ3K2rL6m1K2nK3J0k2oL6m5K2k1oj4Q5m8j9J3j6K3
$$ -12 14 21 -6 -21 0 5 34 -18 -35 -36 -33 -20 2 -7 29 -12 10 5 28 38 16 10 46 1 23 2 -4 -18 67 19 0 13 -3 20
4773B0j8j3K8k3JJ9k3NQl9M4rj4K2M%m0MM2m0k4N0NjK7r2K9M7k7L2k8JL3k1j0
$$ 20 2 -11 17 -6 -5 14 -9 -4 4 -35 9 0 -14 8 12 12 -28 -24 18 -22 -46 4 9 8 35 -57 -28 19 -8 24 -4 -3 30 9 -1
4808amKl3M4J4o9N0PK6k6k8K4j7jJ1QJ1k9OQk1pM3J1l5j9K8K4k1k4K0J3j1l5N0
$$ -1 -5 -3 -36 8 22 -47 3 10 36 10 -18 6 -11 -12 -1 7 18 -11 -5 3 -18 -25 18 29 -6 -25 3 27 6 -18 2 15 4 -31 19
4843A9k0Qj5K2m8J6K1J2l9j4L6oQkj4J0K1jk5K7k3j8M6m6L7k7L2lkNK2%m2j1J4
$$ 19 -1 7 -8 14 -34 -18 3 15 -24 -38 -2 -8 0 -2 -16 -6 15 14 -11 16 -7 -25 21 -25 12 -15 17 14 12 17 39 39 -3 -14 0
4878@lj2K1n5N6k1P0o6j7M4n4L6j0lJ9l0J3L3l5K5j3K9j8j0rMJL0l4mK6k1LJ9
$$ 0 -3 -15 6 -49 7 -14 56 -10 -27 17 -37 -1 -11 -14 5 -25 -12 21 -14 11 -2 27 9 -1 -10 -6 -5 25 -9 -13 13 -8 -5 14
4912A4m1O6m7j7O2m1j0L9Ll7j3J0Rj3j0L1JRj4JL1l2J3l3j2J5nPM6l0l4N2m6r
$$ 14 -27 39 -8 -25 37 -4 -14 25 28 -9 -22 -12 -3 -16 -26 5 6 15 1 2 33 1 14 -19 -31 -16 -21 -14 32 2 -32 20 -26 -35
4946c5L9lJ2m6L5j3J0k8LM3J5n5K2j5K0l3PK2k3M2j6l6L1qllPPJ2qjJJ2l3J4Q
$$ -35 4 1 13 -33 2 -11 -1 -29 -26 17 32 -23 -1 -16 4 -29 -22 0 -23 19 3 -33 -2 -10 -13 -16 -9 -2 10 2 1 2 14 -19 -5 3
4982CL2j5K0n1o%j7L7prOL9n0L8k6K1l6K9j0NpRk3M1k1K7n4K2mJ9nj7%J4QK5n3
$$ 3 35 20 40 -11 -17 -17 -34 3 -4 -13 -7 32 -18 20 -6 15 -21 8 -2 3 -4 5 -18 23 2 29 -25 -3 -7 12 7 -10 -10 4 12 37 -16
5019a6j2M7k3QpK6k8j6L0k0L1k1OnNJ1Oj9lRKj6j4NJ1K9l9k7J0L9j1kK2l2Jj1
$$ -16 -28 19 -4 4 -3 23 -5 -21 9 -11 20 -1 5 0 5 16 22 3 0 9 11 -5 -19 -14 -3 26 -13 -40 -30 9 -2 -4 18 -14 -13 -24
5055b4L2rKQMl3M1m6L0j5K3n2L6J1j2mkM1m2J4qJ6rj6L3ln0K6j4K6j1J8J2j0J0
$$ -24 8 -1 1 9 13 -20 21 -25 5 -10 13 -39 -3 8 -4 -8 -10 31 -11 3 -5 11 2 -14 19 16 -34 -8 -22 4 -7 11 23 13 23
5090B3ll4l7Q2m8mJ3j7J7K8k4J7l8PL6Qj1k8mM2l4J0Rk3pK2J8j5K2kn9L4J8j3
$$ 23 20 -14 -51 31 -17 -21 -8 -25 -8 20 -4 13 -25 -18 18 26 15 -13 -17 25 -9 1 10 -13 -20 2 20 5 27 25 -34 0 18 5
5124EJ9l2j9K1j0lJj1N6k2JK5o2K6j2RL3k1l4K7kpQj1K3k7k3P1j2ok5rN2m5j2
$$ 5 24 -8 -27 -6 -16 -19 -18 -29 27 5 6 31 -31 -5 -17 -8 25 4 -30 -3 -5 -12 -4 -15 8 -19 -42 29 17 11 -14 -23 29 -16 -28
5159b8L2j4mKK0J2l6K9mNJ1n1L1j3kJ1J4k5Pk6M4mlmk1J9QJ5k8J5J6l1LJ2l1K0
$$ -28 4 -10 -14 -12 8 20 -16 13 9 14 25 -26 5 -8 -10 1 15 -10 -3 -29 15 11 8 4 -17 2 10 25 -3 12 28 -3 0 12 -19 1
5195Ak4L0Njk6J9k5J6mJ1k6M7k2j7J1J8j1j9K6oJj2j5LK1L2m3P2o9rj6K4NJ0k4
$$ 1 -23 7 12 11 -15 4 -21 -5 -9 2 -24 23 1 -16 -5 13 2 -17 9 3 4 -8 -23 -20 1 33 -10 62 -7 -16 -32 -8 -3 7 -17
5230a7N9l9j8K1l5L0Nk6K6J8l4K3kl6N2p3L4Ql1K5qM4j7Qo9N4n9O9kJ4pjlk6m
$$ -17 42 3 -15 6 -29 1 6 -20 6 24 -10 13 11 -25 27 -46 -12 -4 -35 -10 -18 26 9 17 -52 2 -57 12 10 24 17 16 13 -13 -17
5265a7K4K5o1M3j3L7mk2Jk7K7J9m2Rk9K0j4K4j0K7Pj5j8l9N1nkJ2k1NqJ0qlO0
$$ -17 7 32 -29 14 1 38 34 12 13 -14 13 32 -10 -1 -30 -10 -24 0 -10 17 24 9 -9 -48 3 -2 -4 8 -13 -8 -16 -6 -14 -17 43
5300D3n7J1ll2K3Nj0joJ9rN5m3K6K1k0m6K7m0K0NJ8Mj6J2jPRm6K6JJ1oJl9L2J2
$$ 43 -14 -3 -6 -38 -15 -10 -20 -21 -27 -8 -17 38 -5 21 42 22 -24 3 -37 -17 -12 6 10 -6 6 5 12 21 -25 1 2 13 7 8 -31 1 13
5337A3k7rkK1NQqlJ1k2nM5m3K1j0ojJ9l4L2j6nk5J3K5l5N0jj8J7m6M9Jl2QK6n
$$ 13 -14 -23 -25 -4 1 9 1 -2 9 -13 -18 27 -16 5 -5 -11 -12 7 -27 5 -11 -16 -41 -28 -3 -38 12 11 -7 10 -36 13 14 -18 -10 16 11
5374A1m0L1j2J1lj9N4m4QM7k9rL2m0r%NJ7k1Kl1%M0K0m4K9pk3L5l8J5J%Jk9pN8
$$ 11 -29 2 -10 1 -2 -21 33 -11 -3 44 15 6 38 -2 -11 -11 -6 11 -10 -8 -39 -39 1 21 -23 6 -1 -24 11 -27 -12 -11 -11 -10 -39 -46 12
5411A2pj7j1K9KL5q7M8j4j3L8j8L3l3%J4k4J7nk9pJ9qM8j6j8J6k4j0L5Mk7nJ8
$$ 12 5 -12 -23 6 8 43 -44 4 -10 -23 15 -3 30 -3 -3 11 -13 4 -1 -30 -37 -18 -26 22 6 -12 4 -20 -30 5 9 -18 -23 -5
5445ek5M2K1m5N6n4rL5l5L4J0m3J9j0n1J5M6k7pJK6k2K9j4J3m6P6j6Kj7%lm3K4
$$ -5 -30 12 33 -12 44 -10 -19 16 -19 15 25 -18 1 -9 -60 -45 1 -26 -33 -32 -6 -28 1 -13 0 -46 30 14 16 -1 -1 -4 -47 -23
5479b3KN3k3prK7j5L3m6Qj1Pj0L6k1l1N5k3j1k3K8j5NKRLm1M7rJKj2m0N9j5Qm
$$ -23 -21 32 9 2 -7 20 5 38 -8 0 -11 -4 -14 22 1 -30 25 2 -9 -32 -4 -19 -14 -12 -3 0 -41 6 -3 -2 0 -12 -52 7 -8 0 -4
5516dj1J4l8O0l1J3Kk7L7l8L4kk7L5l1J0j6K3Lj0K6m7M4kqJrMj6k8N3j9j4qJ4
$$ -4 -15 -1 -39 21 -10 3 5 -22 15 -23 11 9 -18 17 -14 -4 -20 3 6 -4 22 -25 19 17 9 10 1 5 -11 -39 14 -5 -19 -27 -13
5551a3m2P2pl8M7j5j2RjnK3l1M5n1nK1K7k3j0J5Ok4lL2j0K3p4L3oK8qK4nl3J8
$$ -13 -55 17 10 -28 19 4 -8 1 0 -5 18 -13 32 -19 -24 -3 24 1 -9 6 12 -12 -15 17 7 30 -44 -11 -17 11 3 27 22 -11 7
5586GLj1l1N3j1K8l0J5j8j2j0K9jj4J7l5N3m6j3M8l9M2k1j0L0lk8NJ9k7k5N3J3
$$ 7 10 -1 -32 21 10 38 8 23 5 -7 -17 12 11 -3 14 -21 32 -14 -27 21 -18 24 3 -7 23 20 -8 -3 16 -11 -36 17 30
5619C0m1J4k5j1N8j3j1nj1K8rorJ6qJ8J3m3L2Lk5K3Kj4JqJ2k2N9m4j1jj4NlJ3
$$ 30 -11 3 -22 -33 25 12 1 -4 -15 13 4 -2 -11 5 -3 15 28 -15 17 20 -5 18 20 6 7 -1 11 -11 48 4 -7 -8 -22 -17 -20 -7
5655gj1M9k7J3k9J2K7p6N0lpmoK7k2J8l6M3m2K0l8J4L5j4J0l5NN1qJ6n4K8oN3
$$ -7 -18 31 4 17 -12 0 27 -49 1 -2 -9 -13 -19 8 -14 4 -32 11 -31 -11 -49 -35 0 -14 -4 -39 -34 17 9 25 -29 -1 -7 46
5689D6l4Rj3%j1K0k0j0M2Oj6JRm8OJ9lKKj1j1j5L2J0k0K4n5L0M0m9QokpRJ0K0
$$ 46 12 21 8 8 -3 17 -3 -13 29 35 19 20 29 -19 -13 6 3 5 7 -4 -15 -30 2 12 -8 16 -39 -9 31 -18 -10 -16 -18 -25 -16 -6 14
5726A4m1K7j6K1nk0K9k2L1j0j7l%pM1j3J8j9k4J4j0Kj0%J0J8rK1J2n4L1K5qm1
$$ 14 -27 0 -16 5 0 -20 9 -13 18 8 -9 -12 -12 -19 22 9 27 8 -16 -2 -12 -10 -20 -20 -10 8 -1 20 32 -22 9 34 26 -15
5760a5jJ5rk4K5pNkR%K2l2J0%nL0jl9j2L0J6Om5M5j2qJ5j0rN1l3j5J2K2l0qK1
$$ -15 -16 -1 -10 -34 -9 -16 -11 -13 -4 -4 18 -14 -4 -4 -9 21 20 -19 -31 -1 15 21 -24 21 9 1 16 6 -3 48 15 0 12 34 4 -4 17
5797A7nK1l5Lk8L9QmK7o7K7J2j1J2j1J6m8M1j6kql6M6jk2K1J2qJ9k1L2k0Qlko
$$ 17 12 33 -2 1 -27 12 20 16 43 -24 3 15 4 16 5 21 -27 14 -2 -4 -12 -48 -2 -3 -25 -4 8 0 19 -2 30 10 18 15 13 7
5833Gjm0PK8K4j6K1j2qj0nJ5J6Rm0L4m2L3l7P4m8kK4n0K6l5M7j6QOk8K2kJ3l0
$$ 7 6 -34 -27 1 25 9 30 18 10 0 -5 10 26 35 -5 29 -13 20 -17 57 9 7 31 -19 7 -28 19 3 11 17 -11 11 9 22 -8
5868hl7M6K4l6k3K9L5o0J9J0M5l7k4N8m8OK1k5M1m0j1M1mm1L2OJ4k5M0l2k8L8
$$ -8 -45 1 25 -11 -34 -5 30 -30 -11 -1 44 7 -17 41 -7 -1 20 -5 36 -4 -15 26 22 -19 13 19 33 8 48 16 -12 26
5900B6mj0J1m0J7nK4nK9m2j9J8K9l4j1K1l3K4K8m0K4m0K8J5n3L1K0Pm9N7k1j6
$$ 26 22 12 23 -17 0 -5 19 14 43 1 -18 0 29 -5 -16 5 -28 -4 24 -16 8 -32 -4 11 -42 -11 9 16 -33 24 3 -13
5932a3K4rnOK5j0K5n9J8l0M6Ok2k3K8K7j7qMpJ4Kj6J2k0M4j5nk8j2kJ8opNJ5j4
$$ -13 11 2 -3 3 28 18 43 -16 2 -28 18 24 2 -21 7 34 17 9 13 6 20 22 6 18 -2 42 27 22 -6 -18 -20 -2 -8 -15 -10 5 -9
5969iK5j3KPpjk2K9M0j1n5K8j1j4l0N1K9l2Lk4oK4KJ6j6j9K5jqpN1m6MJ0J7j2
$$ -9 16 3 5 12 5 4 -18 11 51 40 -15 13 2 -12 -42 9 38 6 9 -15 -21 3 5 21 5 -14 11 10 2 -5 46 0 4 14 31 19
6005A9L0n1J2J2m8L8rJ9kn7L0L5n2K4k0kqK0j8LPj1N5o1N0mk7J5K0J4j4J2k3k7
$$ 19 49 -2 10 22 -26 12 3 22 20 -37 -7 28 -24 0 -20 -22 -30 -10 -28 -25 -18 -29 26 -35 15 11 -16 -1 19 33 19 31 8 -19
6039a9KPnL0LJ1Mm4LL4k7l2K5M9m7J5j7KPqoPnQoqJ5j4J6moPqJ4l4J5%OJ3NK4
$$ -19 -17 -10 -15 15 18 29 33 -11 -8 26 -1 -33 -8 41 -6 9 -8 -6 1 -7 -13 -6 -11 -3 -9 -17 -2 -16 0 -4 -10 -3 -11 3 -31 -16 -16 -10 3 8 32
6080C2n4jmK3Rm4L9l2L3K1Rl0Jk4J0J6K6j1j1J1m7K3K9m3L7J2l5J2k5K2Pl8O2
$$ 32 -22 -23 -27 -4 5 -39 0 -32 1 22 31 1 2 -22 -12 4 30 19 8 19 -28 -5 24 -19 18 30 -5 7 -18 4 11 -27 35
6113C5m0L1k4nl6J5J6J4l9J1Nk6M8l0NKPj%Pk9k1J5N7k9nJ0j7O3k3%j5Qj7k8K1
$$ 35 -5 26 2 -3 -39 -24 -8 6 -33 -22 -17 -43 5 -25 -20 -18 -11 -12 -12 -5 -34 -55 -40 17 -12 -17 -7 -24 39 16 16 1 9 -8 -36 -15
6149a5mK3j1N5m9j0RK1j8K5l6Ok3J6J2J0ol0K7l3k3K0J4MM2l9JL7nNj6qk3JJP
$$ -15 -19 4 -7 48 -1 -11 -2 19 1 26 -10 -4 -27 -11 1 11 5 -25 2 -31 -54 -34 -20 -16 26 -13 -12 25 20 25 9 1 -22 -21 -20 -13
6185a3kl3K8oL1Rj7oPNJ7j9Jk7K6Kk0M7j9j3J0K7m3koJ0L1l0K7m8J1J3l8M3j9
$$ -13 -15 -48 -20 -26 5 14 -3 -9 -2 3 20 1 2 -25 1 3 -17 30 11 -2 8 35 -8 -10 -16 -6 25 -5 22 -26 -15 -2 -40 3 -16
6220a6%L6l4J0j4K4k2K6Mk4Pj0Oj6k2N2jJ5n4O7l8J3pKJ9j2m0K0oQN7n3J2j0J0
$$ -16 -16 20 -14 -4 -18 6 -16 10 14 -10 -3 -13 -7 -23 -45 7 6 21 -33 34 -4 9 2 4 23 11 -29 -9 -15 -7 50 -3 9 -1 9
6255IQj9j1M2m3j6K0lK2oK8n0L5%Mk7J5J0l4J2K2l5j8M4l7N6l0l5N2j2PJ5p4N0
$$ 9 17 -2 -13 29 -14 -30 -10 -13 9 3 31 -19 16 16 20 -7 8 18 -16 -4 18 -17 -35 9 -28 28 -2 -37 15 3 10 25 -49 1
6289AK2m3J5mJ1J8j2j0lQOL1k5ol1L8j5J7J3j3l0nK2J4j9K7nl1J2rj8J2Rl7P0
$$ 1 23 -20 -5 -9 2 20 8 -2 -5 3 9 40 15 9 -22 16 1 18 31 18 -12 -17 5 19 0 27 22 -9 3 -6 -24 -12 -3 -40 30
6324C0k9j3k2kM5LJ2l9j1O0j6j0n1M7m0L4K9Nl9J1Qk8M7j1K0o0J3J8Ok1K7j0K2
$$ 30 1 -12 -34 -36 9 12 24 -15 -26 34 18 8 -43 4 -36 -2 27 32 -7 4 12 -16 31 20 40 -20 -7 11 17 -4 23 13 35
6357C5k6K4k5J3k9j1Rj0L6MJrj3j9M4n%k9J5j2j3lL4j9pPJ3j8J4j0RK4m1J0J4
$$ 35 9 33 8 21 -8 -19 -10 -20 16 20 21 12 -1 -20 24 19 19 -10 5 -7 -20 -23 11 -8 -15 -8 5 -13 1 -9 0 24 -17 -7 7
6392Gj7PN7q0M5Kj0rlM3l0JL1m9J6k6K0NPok8J5L1Pk2k3JL9mmj2l3RJ5k7jK0j9
$$ 7 -10 -3 54 -26 19 21 11 2 -1 42 12 13 44 -5 11 -15 5 10 17 11 -17 -2 29 36 14 -9 -8 31 27 23 11 -22 -13 2 -25 -26 -6 -25
6430b5K6lJ1K2m5%K9k2k7K7j7L9On9O8k2J3j2rj1N4k7m2N2k0k5L2RPOl4NLJ0M
$$ -25 1 -2 9 31 -14 -14 15 -7 -34 -7 -24 15 21 -38 30 8 21 9 0 -11 43 16 -26 26 6 -19 13 22 29 35 1 6 9 19 23
6465B3j7K0j3n1K1rM5k7L0j6ook3K5J8k3K3j8pL9l5J9pRj2PmMQNnl8J2K6nL3l4
$$ 23 6 26 13 -38 -17 -26 19 -8 22 6 0 -6 -29 -4 14 -9 14 -4 -11 28 -7 12 5 14 2 9 5 9 17 22 17 -21 -9 17 12 45 11
6502A1j7N2m9N5ql5LK5k7jJ0j1L6j5k2k0K6k5K8K5m0Lll0J5Lj9J8k5N4l2kj4L3
$$ 11 -6 46 -3 52 44 9 12 37 10 9 19 8 44 29 7 -13 13 -12 16 41 1 4 1 -29 -14 -11 -30 -12 -37 17 -15 -17 -31 2
6536Bl3QK8j4K0l6M2pl4K9mjOJ5l7k4M8m%J8PJj4j8LK9j2PKj4mol9P3j5mj0k6
$$ 2 -31 -23 5 -9 11 -25 17 10 -24 5 1 0 6 21 -16 -40 8 4 4 22 29 30 16 -2 1 30 18 25 27 13 9 3 -36 37 22 18 8 -18
6574a8J7K4n7M2j8j2N6l0k1K6J3k9LLL5m9j4M2m1L7j4%J0Mk1J6J5nJ3J9l8l8M4
$$ -18 -1 23 -34 8 -10 -22 34 4 -17 9 22 -7 -4 -1 34 -15 -29 13 -28 9 -5 -5 5 9 -12 4 19 14 27 46 8 -30 14
6607A4JlK%J0k3P8p0J2JJ4m4J7j9J7j0J3%l8J7M3o2J4RJJ7k5J7Pl5K1j4mJ9Rk
$$ 14 15 12 14 14 24 1 79 9 21 22 36 -8 9 -10 7 -3 10 10 -28 -11 32 -30 -16 -7 -6 11 -14 3 10 -25 -4 -18 -22 -3 6 4
6643Dlk0K4K8k3j3M1Jk5j1qjL1m1M8j0k7J6K4k2OjJ2j3l4L3l3K7l4M7l3N2m5M4
$$ 4 1 -19 5 33 10 -3 38 39 14 3 -5 -6 25 -16 32 22 -5 11 35 13 19 18 30 17 -17 16 -17 10 -24 23 -10 42 -3 41
6677D1m5k0oL3ok9M4On9L3jj6J2J6kk2N1l7RK0k2J7Mk3M8k7jQn1P0m6J9L2l7n
$$ 41 -4 -24 -30 3 -3 -32 12 18 -41 -8 -9 -25 -13 3 1 -21 30 -7 2 22 0 17 21 -2 46 19 18 26 -25 45 -1 18 50 13 8
6712Hk3J7J4K8lp2N3k6RJ5j7k1lJ5J6Mk7O3o6M8j5n6L8k6L6j1Mj0l7K9K8rlOk0
$$ 8 -15 2 16 44 41 -31 22 -4 5 20 3 -18 -21 -6 10 14 -13 50 -16 32 17 -39 -1 -27 9 -2 2 -8 -45 -16 12 3 0 6 -14
6747a4J4J7M6n2j2M3j6k6L4k6joJ1lJ2l1j3N3m1J4m5L0qN1m0JK0oloJ9j2LL3j7
$$ -14 0 17 63 11 -1 42 26 0 34 8 7 1 12 9 21 -10 -23 30 -11 3 -42 -12 -20 31 -9 -8 12 6 3 -3 16 4 7 40 23
6782B3m6K7Jk6noM2k1j9J8LKqM0Lk2J3k1%J1rPPk2j9N0j3m6O6m1L9J0j3m2K2j
$$ 23 -23 4 5 -21 -26 -32 10 -11 -30 -12 -9 -7 -15 25 28 6 19 -2 -2 9 0 7 14 -8 -27 23 10 -36 30 -11 28 38 25 -17 5 4
6818DK4k2K1j3Mn5K2K2j0L6m6K9k7KM3k7J4Lm6oM4n6M4j1Kk9K2JK2mj4J8J2l2
$$ 4 28 6 27 14 18 -37 -15 7 -3 33 -13 16 -11 -9 34 7 21 24 -22 -28 16 -40 4 -7 -5 -34 -12 -11 11 7 -7 11 23 -9
6852ij4lK3L7qOjmpk5K2j4K4n2M8jj1qM7p4K0K9k2Rk1J2jL2j5KJ1l4MKJ1J6j3
$$ -9 -23 -26 -3 34 26 32 31 27 20 -5 17 3 27 -25 23 22 11 3 50 -24 -4 25 3 12 -9 3 2 34 19 21 32 -2 2 4 15 31 18
6889A8l5NJ0j3Nj0oM9mrm6L4L2ql2k2M1L4k9JJ8j9k2L1k4O0j4m4J1J0mj8N%L1
$$ 18 -17 -12 -2 -15 -10 -20 -26 23 19 10 -36 -2 30 22 -10 -32 9 43 14 15 33 14 -8 23 -1 59 45 1 12 22 18 0 5 5 36
6924C6n8K8oM4l5l5L2j9LLK3pl0M1l7K2jroJ1k0K8jnL5k4Ql4K6j2%klK3l9M5J1
$$ 36 -22 6 0 44 9 -26 6 -13 -10 -7 16 9 -21 20 -17 5 4 -5 -11 0 -20 8 7 2 37 13 21 -13 13 1 1 -1 -4 19 -20 25 36
6961C6no0M7mK2l2kJ4jJ6m6M0k1j0nmK7Qk1Kj1pJ8j8QlJ0j4LoJ5K9m0K6kk5K0
$$ 36 31 -29 18 14 36 4 2 16 15 31 -15 25 4 -6 -11 -15 12 20 -1 1 -10 -17 1 -17 -9 -12 -2 -16 -13 -19 -4 25 -15 11 9 -16 4
6998DJjrj2lM0k9N3j2l6J2j3M0l8J0j4J5pL4j2J6Pm6K9J9mNk9%j0k3K0K1Pl7O0
$$ 4 5 4 -5 -17 -20 20 -9 44 32 -4 8 -5 35 -3 7 -7 8 1 35 23 39 46 0 29 48 44 49 20 20 10 -13 7 28 35 -2 58
7034E8o7M8m2K0l6K3j0ojJ2km5N1Kk3K9l3Rj3K3L4m2LK0K6k2k0L0ol3RRJ5%Jk4
$$ 58 -9 39 -3 17 -19 4 -6 -12 -13 -1 -3 -48 3 5 -18 11 -22 -13 -26 -3 31 -11 -8 12 38 16 -4 26 20 -13 -4 5 20 20 21 -3
7070cJ3p%j3j0K6J5j6kj0K8j4K3l4N8q8N2k2j3L2l1M1j5m2K0j1mJ6kK0J4k7Lk0
$$ -3 10 3 3 -10 -20 6 21 5 3 -7 21 7 30 -4 54 -34 18 -4 -17 15 -16 25 10 -32 -12 -23 -27 -11 -13 7 21 -6 -3 -23
7104b3J8J5j0OlK6%qj0pPNJ8j6Nj1nqJ0L8k1j6NlL8j7k1JkK6l4M1m6N9q6L1K9
$$ -23 -5 10 0 6 3 29 29 21 11 4 11 16 34 18 23 12 7 -1 9 47 26 10 15 12 50 33 12 13 11 37 3 44 -2 57 -29 2 31
7141C1n7J8J6l5N4j9j6j8k4O5l3K2k3j1K2M3l6pJ1Kj1K8l5M1j8K4j2J7jql8N9
$$ 31 -26 -8 8 -27 27 8 -8 -26 -50 15 -18 4 -19 -30 -8 35 -1 -8 3 5 -6 22 -13 28 10 34 22 39 38 30 -8 51
7173E1k0n2N4m5jN1n7N7j1n7N6n7N3Pl3k5J8Pj0K4%jl0J5M3n0PK7j3koj7J3O%
$$ 51 31 -21 33 -12 -13 38 -19 38 27 -30 26 -31 22 29 -4 -29 -11 -4 -14 10 10 9 -21 -6 37 -13 -6 21 8 6 0 -17 -4 2 2
7208BMk6J1K7L5m9k4K9RqrM8o3K0J4J8j8J1k8K3J0n1NQKJ7Qj6k0k0N5l3QnJ5k6
$$ 2 6 -20 -9 18 53 4 -20 9 18 10 1 49 -14 6 20 38 20 31 3 26 36 -15 -10 -2 0 17 25 9 -11 -31 24 -9 -1 -6 9 -17
7244a7K4lK9o1%J0k5N4l5K4l0OPM2Nk6j1%L7Mo4O4m7J7L7m6L6m3K4M2l5kMm4L8
$$ -17 7 4 33 -28 -28 -18 -43 11 -24 0 -30 -24 -17 25 30 4 -7 -7 30 34 -30 34 -13 4 41 -5 31 -12 12 54 19 17 21 -23 15
7279A5l9M3j8j3lm4P6j2k2L9L1n1Nj3J2nPn1P3l0L0l6J5LRqNk6K2k6L9rKl1K1
$$ 15 -24 19 1 -12 -15 -59 17 5 -17 22 53 2 7 -6 6 1 8 -43 30 0 30 -6 9 12 21 13 18 -8 14 -12 27 18 20 -11 10
7314A0OJ8l3j4J6L4k7l2M3K6Nn6K2Ml7K1J1j6J6l6N6k3J1m6J4K1j0Mk5J1j3J6
$$ 10 16 34 1 -13 3 37 10 -22 21 47 52 -4 18 22 -15 6 17 1 17 -19 37 14 25 -21 -7 14 4 8 -17 -6 -19 -3
7346cQk9J9j0J9j6J4pL1Qj9J8l4qK2L6n3J0M3p6O7l1l2N4m0mL3pOK2k2l4K0jL3
$$ -3 5 -24 -5 -15 4 -12 2 -5 26 34 15 33 -1 -9 13 49 -4 6 49 -27 40 9 -23 31 -9 -13 20 13 19 41 19 -15 5 4 37
7381C7o2J8L0K9l6lpoK8l0rLjPK2l1J1j0PnQjk0QK0j1K0j5j5N1k0m0N3j6l1L3
$$ 37 -25 -7 23 52 16 13 6 0 28 -2 -11 -8 -9 -2 20 -11 0 -10 -3 -8 0 -1 -21 -13 7 -4 16 1 -14 37 17 -23 30 14 -17 16
7417A6j2M9k8k4J4j1L6j3Mj7KJ3n8L8NMj1L2l9L9l1jk8k6K6L4l5N7p8L7ql0N1
$$ 16 4 53 25 1 15 4 40 27 31 14 16 29 -29 9 14 18 7 39 0 39 8 7 -21 -47 -21 13 -22 35 -43 -6 -14 -44 7
7450Gj7J2k6%j0K3j8J7K4j5K3j0k2L9k1k0j0L8J9j3j3jMLm3M7NJ6rj6ok3K6K5
$$ 7 -10 2 -24 -24 -34 -11 -29 -12 12 -3 20 10 -12 27 6 -14 -24 14 33 20 7 6 10 13 -30 17 22 38 29 13 7 -16 10 35
7484C5j5Kj3j2L5m1mK7j9qmK5Pj2J4j3Oj3KJ7moj5lJ6k8L1K9m2jl3K3O1k7nn0
$$ 35 20 22 9 -3 32 -9 -13 14 -5 -13 -17 8 15 3 17 4 10 -3 -1 16 12 6 -9 -12 4 -24 7 36 -6 -7 -40 -17 44 17 12 -38
7520c8N0RJ0k4J4MLk2K3l4L1K3m1L6l3j6L5K6m5kK8n1k0L0Pj6J3j9K4k7RnLoK
$$ -38 12 21 31 7 21 25 28 6 29 -5 26 49 8 44 11 -5 30 56 11 9 37 -14 -34 -4 3 -13 0 -19 5 -22 -13 -18 -15 -21 -19
7555a9j6L6rJ2J6k5J8m0K8J5k9L9km8M0MK2j3J5m2J3J8k7Nl1N1n9P3m2L4k0j2
$$ -19 -35 1 -8 4 20 -5 13 -27 1 16 -13 26 24 -24 16 20 42 29 44 2 15 33 6 11 -20 31 -28 45 3 37 17 5
7587EkKKK2k7LJj1K9n9K8j1KL1k3NQrl7L2NK5m6k3M7jQk6L5j1j2M5k6Ql2qP5n1
$$ 5 3 5 7 29 2 5 6 -5 24 -35 -7 -18 -16 15 -8 -3 5 -4 -41 -9 -4 21 -25 -48 -1 -2 6 -20 15 4 -8 37 11 19 -13 -21 54 3
7625CK2j1l2K4j3mN2k8L8l1K9l7L2k6K2j4k3l%noJJ8mK6lpk3j6J0Rj1J1Lk4O0
$$ 3 25 14 -18 6 -7 -11 41 13 51 20 49 12 44 18 40 26 3 0 0 -5 -11 -10 8 4 30 27 20 -3 -19 -9 0 -11 0 3 -21 39
7661C9p5O5l7L7m5J7k8J7K8j7K4m2J8L0o2M9j5QNm0O9m7OKJ0L6l2K2k6k7J1J3
$$ 39 -36 29 -8 29 -16 1 -27 -10 18 1 25 -17 1 31 -31 18 3 11 16 -24 45 -2 4 6 16 52 20 42 16 -11 0 13
7693A3K5mJ9p5Oj9J3j0L1rj3NK4Qj8l3J5qK5K9j7MJ7l1k6P3m6J6j3j0J7J4Rj5
$$ 13 38 34 53 -22 -16 -35 -22 -32 -1 -10 -23 -18 6 14 -4 -37 -22 -30 -5 24 7 11 28 -3 -29 44 -2 14 1 -9 8 22 31 16
7727A6j0NK5k4J1kL0n1J6k2MK9J2k6N8n9J5nk0K1Qk1k2K1J1l6L3m4JK7oj2qN1
$$ 16 6 11 36 12 23 21 51 0 16 -6 -2 27 39 13 71 12 27 22 2 23 31 10 -12 9 20 -16 17 -27 -26 1 -5 -17 -25 26
7761B6j2Jj5Mn0L2K3Nk5OL7n5N8kk9K4Lk2Jk4JN1l0OK4lk9J6l4L6k5Pqk1N2m5
$$ 26 14 15 0 4 -46 -14 9 14 -11 -5 32 -23 35 33 4 28 31 9 10 -14 -13 38 8 14 38 35 6 22 -12 24 -1 6 -2 -23 29 -16
7797a6NQpKj5JK9Pj6K5j2k4lNK6j7K5n2N4l3M1l3M2n6K2j5%K1J8k1kK4J8k1j5
$$ -16 -11 -3 -10 -8 -23 -22 7 14 -2 23 11 -13 -16 -11 15 -2 23 -29 25 -8 33 0 42 -14 8 -7 -7 14 32 11 9 33 51 30 15
7832A5M8m1L2o4J2NJ0k1J1M6J7m0m7J9j4J5nNk7M7j9kK8n5J8NJ1K8p5M5j3pKj4
$$ 15 63 22 54 -10 2 7 17 -4 7 53 70 30 -17 2 -12 3 -2 3 -24 23 4 2 30 -25 -7 -2 9 37 -38 7 -6 -13 -11 -25
7866b5J9K6L2l4J8ll5rJ7K6J5j6ql2K3moj3M0rLNk2J6J1K3n1nk6N9Mk6lk2L7q
$$ -25 -6 20 52 18 36 33 -2 -11 6 32 47 31 23 -9 14 10 4 -9 31 22 25 30 8 24 35 58 7 2 -24 35 39 13 10 -12 25 17
7902A7l9M5l5k0K7J2K0l3K1j9JJ2qOJ8l9J6pK2j9K1Oj1j3K6nj5mJ0k3L4Om4K1
$$ 17 -22 23 -12 -32 -5 7 27 -6 15 -4 -3 9 1 7 25 -14 2 -5 17 -2 19 25 14 1 27 22 7 3 13 -10 24 30 -14 7
7936GROQm7J2L2jJ8l6L1L1m6k4J5j8OKOj5k1L0l0Qj0L4l9%lK2K3j7K0k6PM5m7
$$ 7 16 22 30 -17 -5 27 26 44 8 39 70 24 0 15 -3 3 5 11 -4 -25 5 -25 -17 -27 7 -32 -32 -35 -13 10 -7 13 -13 -6 39 -8
7972hPL4l9K0mKM1k5j9J6lj4K3J3l0J3Jqol0M8m5K7j6J2qK7j7l2L4J7n3K4j5k3
$$ -8 -1 33 -6 14 10 12 53 28 9 25 22 8 31 44 14 27 28 20 14 -16 32 -13 14 -2 10 2 29 12 -20 14 31 -22 2 -13 -36
8007c6M1j6j0K6%Pj5j4OK7k5L0j2J0Nqk4L4K3n5j5L9ok5J2KLJ2J8m1J9K5kJ5l0
$$ -36 5 -11 -21 5 5 12 -3 -17 -11 16 -9 21 9 19 24 16 -8 26 49 -6 -21 18 12 -13 -1 1 4 16 34 -7 12 37 35 50 20
8042B0j9pJ1j8L6k3j6K4k1K6nrPkj8%J3J0rj1L0m6K7Lm8K9KLj1jOK5k9M1p%%K
$$ 20 1 -6 5 -13 23 0 -16 8 -13 13 8 -1 6 4 -14 -14 -1 9 0 -11 19 -27 0 3 -45 -16 -14 -11 -22 -23 -17 8 -21 20 13 13 13 15
8080A5K7k5LJ6pk1jML7o5K6K8j7Oj1J0j8J7J0m1Rj4M3j5k9M3l6L1J9m9Kj5K0m
$$ 15 42 17 20 36 29 8 7 11 48 -17 9 37 20 26 15 25 7 24 34 -7 2 -12 31 16 -13 30 -6 25 44 -5 -3 -18 2 -2
8114bJ1m9M5J4j3l9M4j1k7L6j5pRPk2ROL8m9M6KM7p1K0m4L0j7J2k2K2n%J6j2K0
$$ -2 9 -40 5 19 6 -33 11 0 -27 9 -6 -13 -4 3 -19 -10 -4 34 -15 31 33 80 9 29 -15 15 -2 10 -12 10 5 5 21 9 29
8149B9j3J2j7j7J5kL5j8qj7j2K3plj2rj7M0K0m5O7m0j3M8m4mK2K5n0K1L4l6MQ
$$ 29 16 28 11 -6 9 7 42 24 16 -1 -13 10 3 0 -12 -21 -38 2 22 -23 44 4 -9 39 -5 -9 13 38 -12 9 43 7 11 19
8183A9j4QOk1kM5k5J1
$$ 19 5 13 19 -2 -4 41 16 27
8191B7
$$ Imaginary data points
##PAGE= N=2
##DATA TABLE= (X++(I..I)), XYDATA
0@%%%%%%%%%%%%%%%%%%%%%%%%%rK5l2L2l2L2l2L2m1N7o4O4p0Q6r6R9j15J28j39
$$ 0 0 0 0 0 0 0 0 0 0 0 0 0 0 0 0 0 0 0 0 0 0 0 0 0 0 -9 16 -16 16 -16 16 -16 16 -25 32 -32 32 -38 48 -48 51 -64 64 -75
44g5J55j71J88k09K33k56K82l10L44l80M16m60N09n64O32p09Q02r15J056j236
$$ -75 80 -91 97 -112 121 -135 147 -163 181 -199 217 -243 266 -298 334 -375 427 -488 568 -668
64f68J479j831K372l340N620k1572k1465P089j2510r680o768Q718J8701K7471
$$ -668 811 -1020 1352 -1988 3632 -17940 -39405 -32316 -44826 -54506 -61274 -52556 -33855 -6384
78f384J9632Q324r29L197O971N853k127n557p701j1112j7695j7570j0572L52O416
$$ -6384 13248 21572 20643 23840 30811 36664 34537 28980 21279 10167 -7528 -25098 -35670 -35318 -28902
93b8902O206p33m689P79J4846K4302K1199P213n439p351q3M473P11p386j2114
$$ -28902 -22696 -23429 -28118 -27339 -12493 11809 33008 40221 34782 27431 27348 31821 32532 25146 13032
108A3032j2211r978p804n722k232K933O559M966o54l625J456J2091J7369R725
$$ 13032 821 -9157 -16961 -22683 -24915 -21982 -15423 -10457 -11111 -14736 -13280 -1189 16180 25905
122B5905m873j2139p175J959N762J265p497j2472r123j276L540K574Q09K119M832
$$ 25905 21032 8893 1718 3677 9439 10704 3207 -9265 -18388 -19664 -16124 -13550 -12741 -10622 -5790
137e790M217k02k430J989Q633R467K015p345j0179l712O278R017J505q425j1141
$$ -5790 -1573 -1775 -4205 -2216 6417 15884 17899 10554 375 -3337 2941 11958 13463 5038 -6103
152f103m667L912O781K435l031k901J037K677M14j216N53M042M167o29o334o537
$$ -6103 -10770 -6858 -77 2358 -673 -3574 -2537 140 554 -662 -109 3933 8100 7471 1137 -5400
168e400j8P325P678r3r026r764j099O980O489p19n913m694M44M193L884Q95m72
$$ -5400 -5418 1907 9585 9492 466 -9298 -10397 -3417 3072 2353 -3560 -8254 -7810 -3617 267 1162 690
185F90J243K708N06l509m121P17O051M409l142q772o070J669P026N282j924p199
$$ 690 1933 4641 5147 1638 -2483 -1766 4285 8694 5552 -3220 -9290 -7621 -595 4687 2763 -4436
201d436m965K295O862N006k19k690o76K142J276j895k910L1K539J083l333n912
$$ -4436 -9401 -7106 -244 4762 4543 1853 1177 3319 4595 2700 -210 -179 2360 3443 110 -5802
217e802l081L211P201M082k835o449k870M022P335L597k686m794j649J985K110
$$ -5802 -8883 -5672 1529 5611 2776 -3673 -6543 -2521 4814 8411 5725 931 -718 1267 3377
232C377l95k339j783K01N45j759l345j051L419N496K268l219n146r67M800N639
$$ 3377 2982 643 -1140 -939 -394 -2153 -5498 -6549 -3130 2366 4634 1415 -3731 -4698 102 5741
248E741Q99m346n462j698K834L747M81k776k317J93J477L19j259n78K220L272
$$ 5741 6640 2294 -3168 -4866 -2032 1715 2196 -580 -2897 -2704 -1227 -908 -2167 -2745 -525 2747
264B747O47k838l059N03M199L906m31m812m756k45L879L724j03l233k769M88K568
$$ 2747 3394 556 -2503 -2000 2199 6105 5674 862 -3894 -4139 -260 3464 3361 128 -2641 -2153 415
281D15J321r55j150L07R47p7j651j561Q03L150K367j162l919k933R39L973K699
$$ 415 1736 781 -369 -62 885 808 -843 -2404 -1601 1549 3916 2754 -1165 -4098 -3159 814 3513
298C513j460l918k161J269K973J758o11j819q80O04P10l58o76O18J792J312j025
$$ 3513 2053 -1865 -4026 -2757 216 1974 1363 -456 -1336 -732 -22 -380 -1056 -438 1354 2666 1641
315A641k684j313J804K975R15k244l480j593J685L224J705j184k151q68J106J486
$$ 1641 -1043 -2356 -552 2423 3338 1094 -2386 -3979 -2294 930 2635 1451 -700 -1568 -462 1024
331A024L13q19m92N70K94r03j270j07J393J670R3k109k561m79K131K733Q44j608
$$ 1024 1337 518 26 596 890 -13 -1283 -1390 3 1673 1766 -343 -2904 -3383 -1252 1481 2325 717
349G17k026j59J876J709J81j081j117n92p2o4l01M9P39Q16k03j296j118M11J983
$$ 717 -1309 -1468 408 2117 2298 1217 100 -492 -564 -628 -929 -880 -141 675 472 -824 -1942 -1531 452
368D52J680k64j907j377M50J769J441L1j445j614n44L21M00l3j93J3K27K3m16
$$ 452 2132 1868 -39 -1416 -966 803 2244 2275 830 -784 -1328 -1007 -607 -640 -833 -820 -593 -570 -986
387i86P2J075J318M62q25j429q04N83J490R48n44j507j185k8Q07O68j32o10m06
$$ -986 -914 161 1479 1941 1116 -313 -1117 -534 956 1904 1360 -147 -1332 -1360 -553 115 -17 -627 -1033
406a033PJ06N44Q75Q10M13j15p52q51j88N77O62n2r65j243n08O11R52M52k19n15
$$ -1033 -1026 -920 -376 499 1309 1722 1607 855 4 -184 393 1055 1003 38 -1205 -1713 -1102 -150 302 83 -432
427d32n04j53O28Q44P07K63j79m76m36j97J65K46j39q45j084n26L05P67P91N18
$$ -432 -936 -1089 -461 383 1090 1353 1174 698 262 65 230 476 337 -508 -1592 -2118 -1813 -1046 -255 263
447B63m5l85j61L89O55N90K04l37o45n67j78K36M04k7q22r34m11K50O38P63N28
$$ 263 218 -167 -328 61 716 1306 1510 1173 528 -39 -217 19 423 396 -426 -1360 -1771 -1521 -883 -120 408
468D08K33JP9K86L04L37l0l84q06r38p06j0N95L82l59p34l78J87Q26Q88L77j09
$$ 408 641 642 721 1007 1311 1648 1618 1234 428 -510 -1216 -1226 -631 -249 -608 -1342 -1720 -1533 -707 181 558 449
490D49j43J21M05M16P1j57l51m73p81q41l61L19N21K90j68m30J09Q17J176O29
$$ 449 306 427 832 1248 1319 1162 811 338 -443 -1284 -1645 -1326 -805 -515 -683 -1113 -1004 -187 989 1618
510A618j84o05m79K31M78K11l79n59l01l00l24m01j99J70M19J25l07k23K83Q83
$$ 1618 1434 829 350 581 1059 1270 891 332 31 -269 -593 -994 -1193 -1023 -604 -479 -786 -1009 -726 157
530A57J037L83o28r82k31M24N15r6o22n55j66K93K13r7j24J00J88J64k15l69K41
$$ 157 1194 1577 949 -33 -264 160 675 579 -43 -598 -764 -471 -258 -355 -479 -379 -191 -27 -242 -611 -370
551c70Q67P86J5o95o07P5N95M44k95q38o90N1M69M16q7m54j63K56J17k90l12J68
$$ -370 497 1283 1298 603 -4 71 666 1110 815 -23 -713 -662 -193 223 136 -318 -481 -225 -108 -398 -710 -542
573e42N29L72l5m97l11L57O86L91m21r18o96K14P46L51l37m69O1L93L20Q6k00
$$ -542 -13 359 324 -173 -484 -127 559 950 529 -389 -1085 -871 -125 226 -111 -580 -519 -126 194 280 80
594H0l2K19L16j06l33j88L21O67K31n93r14l53M05N23Q7m13n36lN50O21L6l64
$$ 80 48 267 583 477 144 -44 277 944 1175 582 -332 -685 -280 243 330 -83 -619 -622 -72 549 585 221
616B21k31N9J44r6n07l06K72M06J06m16m53p7N84O05N4o19m21J84O47N85km53
$$ 221 -10 49 193 97 -410 -716 -444 -38 68 -348 -801 -878 -294 311 365 -254 -675 -491 156 741 739 286
638B86l21J14K37j02l93l36J25L40J47k27k14K28O87M20j02n27n07Q7M87L30l35
$$ 286 -35 79 316 214 -179 -515 -390 -50 97 -130 -344 -116 571 991 889 362 -145 -58 429 759 424
659D24o31k71K31K61n1k88l56P6K74P5m7m5K06M90L83j26n47l52K43L70J2m64
$$ 424 -207 -478 -247 14 -37 -325 -681 -605 -331 -256 -303 -348 -142 348 731 605 58 -294 -51 319 331 -133
681a33n34p9L30M83J10j77k33K0K84K22j44k44J14L76J68k59k77q8K06K98r7n05
$$ -133 -667 -746 -416 67 177 0 -233 -213 71 293 149 -95 19 395 563 304 27 -61 145 443 346 -159
703a59m20m6M01M24Q0l28l04K21L41L0j88k04m5P8J37Rj66PL17K60m6m15l48R3
$$ -159 -579 -625 -224 200 280 -48 -352 -131 210 240 52 -152 -197 -119 18 27 -139 -132 185 445 399 -16 -364 -271
727b71L79K08k30l54q6J84K96J50j46k53r5J59R5o8n1M5K41K31j23l04j66R1J81
$$ -271 108 316 86 -268 -354 -170 126 276 130 -123 -218 -59 36 -32 -83 -38 203 434 311 7 -159 -68 113
750A13l6k46l80p1K98L66J47j85j20K8J62R6l6j57o0J93R3p4j51l7J06J55k5k78
$$ 113 77 -169 -549 -620 -322 44 191 6 -114 -86 76 172 136 -21 -81 112 205 131 -20 -57 49 204 179 -99
774i9l06R9K70K28M1j41r9O7K40Q3j89k07q7M8M6r5j09K2K20J18k5k14j07OJ99
$$ -99 -405 -306 -36 192 233 92 -7 60 300 383 194 -13 -100 -52 -6 -101 -210 -188 32 150 125 -89 -196 -190 9
799IJ55j26k64m2K19K01O3j47j92o5J17L4q8l2L5J75J72M0j42r3Q5J63m6k62k36
$$ 9 164 38 -226 -268 -49 152 215 68 -124 -189 -72 -38 -126 -158 -123 52 224 264 122 29 114 277 231 -31 -267
824b67l1J87J84Q5j56n8oJ42J13j09j37j8J68O7o8q2J7J06P2q0k35k63K7J70J48
$$ -267 -298 -111 73 158 2 -56 -62 80 193 84 -53 -71 97 164 96 14 31 137 209 129 -106 -369 -342 -172 -24
849b4%r8j00J93K22O8r7j42m2K8N7k8j11p3J93O2m2j18j45K3J70J00q2j77M4J75
$$ -24 -24 -122 -222 -29 193 261 164 22 -20 8 65 37 -74 -147 46 108 66 -52 -197 -174 -4 96 14 -163 -119 56
875E6K17rq0j02j12P7K2j55r0kJ19R1Kq7k8J52J72n6j60j54NJ10K06j7j42q8M
$$ 56 273 264 184 82 -30 47 69 -86 -176 -178 -59 32 34 -53 -81 71 243 187 27 -127 -122 -12 194 177 35 -53 -49
902d9R8M1p8j48l7P8Q2k2l9O1J16J13Pj47j65L5R8J0m1j44n5J18J54M6o2j53m4
$$ -49 49 90 12 -136 -173 -95 -13 -35 -74 -13 103 216 223 76 -89 -54 44 54 13 -131 -186 -68 86 132 70 -83 -127
929a27J24J7Kj01L9J14R2j4j21k3RL0N2j14j76j1J46J41J9p9n2QJ09J8j28l6l6
$$ -127 -3 14 16 -85 -46 68 160 146 25 2 11 41 93 -21 -197 -208 -62 79 98 19 -33 -25 84 102 -26 -62 -98
956i8J37J3N4j9o9N1J05m5j60j18K9N9J05jp5k6O9J29Ko6j48m8O7P1k8o4LQ6Q1
$$ -98 39 52 106 87 18 69 174 129 -31 -149 -120 -61 44 43 -32 -58 11 140 142 76 -72 -120 -53 18 -10 -74 -71 15 96
985I6j8r4p7j9R2M0m1j06l1J10J70O9j72q3L3QK7o5n7M1P6L0O1p2n1O7N3Or7j03
$$ 96 78 -16 -93 -112 -20 20 -21 -127 -158 -48 122 191 19 -64 -31 -23 4 -61 -118 -77 -1 29 90 18 -33 34 87 93 -4 -107
1015a07l1J29Q8K1n9l3J8K6J6q6o2k1O3M1Pj4kM1P1k3j22q0LR0L7l1o0k2J01P6
$$ -107 -138 -9 79 100 41 8 26 52 68 -18 -80 -101 -38 3 10 -4 -6 35 106 83 -39 -119 -116 -26 11 -20 -80 -102 -1 75
1045G5L6r2q7l4N6O4n7l8m1J48P8Mr4n7J0M8M9r6m3m1J26J00rn4p0l3O4L3o3n3
$$ 75 111 19 -68 -102 -46 18 -39 -77 -118 30 108 112 18 -39 -29 19 68 -28 -71 -112 14 114 105 51 -19 -52 12 45 -18 -71
1075g1l9P5R6J0n0L4k6L0M7r7j29l3R3J30l0p0k9L6P8j1o3n1k6K1P2K3l0j9L7
$$ -71 -110 -35 61 71 21 55 29 59 106 9 -120 -153 -60 70 40 -30 -59 -23 55 44 -19 -70 -96 -75 -3 20 -10 -29 8
1104HP2Jj03j1o0O0J1K0o5m2Q7J15k7pj05k3M9L9on9nK8O1M5kj08L9%K5k7r1M
$$ 8 80 81 -22 -33 -93 -33 -22 -2 -67 -109 -22 93 66 59 -46 -69 -20 19 13 -46 -51 -23 38 83 81 -27 12 12 37 10 -81 -77
1136g7M9Q1K7k3q2j1O4ml1m6k2K6R0K8p5J9J5N1l1n4l0o0J0J25m8j3n8P6J3N9
$$ -77 -28 53 80 57 -25 -36 28 24 -7 -53 -75 -49 41 69 -6 13 28 79 48 -6 -36 -96 -86 39 -9 -22 -80 -4 9 68
1166F8n2p5k3M5P6l6LJ3K3J1L4m5o6m7N0K2k0j9o2P2R7J2k0n8j5K3N5nq7m9P6
$$ 68 16 -59 -82 -37 39 3 6 19 42 53 87 42 -24 -71 -21 1 -19 -38 -100 -28 69 81 61 3 -12 11 66 61 -26 -75 1
1197AK8qn5Nj3L6k6Jrk2K9N3M2j9k1p3J02lo8q6M3J7M2L6m6k2K8K4lL4q7mK4O8
$$ 1 29 21 -34 -29 -42 -6 -32 -31 -40 -62 -33 20 62 43 22 -51 51 48 -20 -106 -63 -46 -4 32 -14 -36 -8 16 13 47 -40 -44 -20 48
1231D8k6J0m6K1M4N2n4o6lk8J1K9k3k2N4M5K8l5o8K5J9OL0r8knN2M1j8k2k1K2
$$ 48 22 32 -14 7 51 103 49 -17 -20 -48 -37 -8 -31 -53 1 46 74 39 -29 -4 15 21 51 -47 -49 -54 -2 39 21 -1 -22 0
1263@k5qj3M1j8K5N1kk7l4L9k2l5j4Ll2M9KPK2j2NL6l6k1J2l0M3OJ2j2ml5M6N
$$ 0 -25 -33 -46 -5 -23 2 53 51 24 -10 29 7 -28 -42 -39 -71 -22 -20 -13 9 -3 2 38 2 -19 -7 -37 6 12 24 12 8 -27 19 24
1298B4Pq2M9L5l8j9K3k6O5K4m3k8J2j2J%j3L1k5MO2j8n7qO3n7J5j9M%MN9l4J2
$$ 24 31 -51 -2 33 -5 -24 -1 -27 38 62 19 -9 3 -9 -8 -8 -21 10 -15 -11 51 33 -24 -32 31 -26 -11 -30 -26 -26 -22 37 3 15
1332A5j2QL8or4%MM7J7k3J0pM8l7J6l3K5p0L4O0j2j6OM1nn1k5J5Nm4N2k6Pj2N5
$$ 15 3 11 49 43 -51 -51 -47 0 17 -6 4 -3 45 8 24 -9 16 -54 -20 40 28 12 18 59 54 3 -22 -7 -2 -46 6 -20 -13 -25 30
1367C0JJ1m6j8J4N1m0n8L1ROM3Kl6lJ8Mmm4k0L5K7lj9Oj0K3j8L4n1PK4K5K0o5
$$ 30 31 42 -4 -22 -8 43 3 -55 -24 -15 -9 34 36 0 -3 15 19 15 -29 -49 -14 13 10 -9 -3 -13 10 -8 26 -25 -18 6 31 51 -14
1402a4K4pJ0j8j6J7j1m0O9k8J5PrL5J1pn8OlM7j2m5K2K1rK0Qj5p7M5L1k9k6NM6
$$ -14 10 3 13 -5 -21 -4 -15 -55 14 -14 1 8 -1 34 45 38 -20 -14 -17 30 18 -27 -5 16 7 27 35 20 -57 -12 19 -10 -36 -31 15
1437A5K0oKn3L1m1M2L5o0Lj3L8POm6NK9m5J3K8l9NJ5M0J0m7MNK1l3J4l7pJKN3
$$ 15 35 29 31 -22 9 -32 10 45 -15 -12 -25 13 20 26 -20 -15 14 -31 -18 10 -29 -24 -9 31 41 -6 -2 3 24 -9 5 -32 -39 -38 -36 17
1473A7n1L9qL3l1qnn0M5K7k3pK7J4j1J1m3KL1l0J6K2k1j7N8rJn8J0qJ0Pj0K1K8
$$ 17 -34 5 -3 30 -1 -9 -14 -64 -19 8 -15 -22 5 19 8 19 -24 -22 9 -21 -5 17 -4 -21 37 28 29 -29 -19 -27 -17 -10 -20 1 29
1508B9LJ7j0k2j3K8l6kJ3l6L3L2m6M6l4j0J8j4j0J6k2k0nN9kmm5M3m3K9j7K5n
$$ 29 32 49 39 17 4 32 -4 -6 7 -29 4 36 -10 36 2 -8 10 -4 -14 2 -20 -40 -45 14 12 8 -37 6 -37 -8 -25 0 -5
1541enL7m9L9k3L9Rm9k9NJ2K6oj8j3J4K0J6k7J8n8K5K4l0JJK5K0J0l0Kl2M1k6
$$ -5 -10 27 -22 17 -6 33 42 -7 -36 -31 -19 7 1 -17 -30 -16 4 20 -7 11 -47 -22 2 -28 -27 -26 -1 19 29 -1 1 -31 10 -16
1575a6J7J9o5J8J6m2M0N3l2m8L3j5J9o3Q9k1jj5L9j6nK3k9J5k4K7l1K5n2L5j8
$$ -16 1 20 -45 -27 -11 -53 -13 40 8 -40 -7 -22 -3 -66 23 2 1 -14 25 9 4 27 -2 13 -11 16 -15 10 -42 -7 -25
1606b5M9jk6oKl0K1J2J5k6M8k5ln7N0l8K0Pjk5J2L7lJ6m0J5j6M6n3jJ2POK3mk2
$$ -25 24 23 -3 -9 -7 -37 -16 -4 11 -15 33 8 5 -52 -2 -40 -20 -13 -14 -39 -27 10 7 23 -17 -2 -18 28 -25 -26 -14 -7 -1 22 18 -4
1642dk8M3L6m7l%k3K5L7ok8K6j8Np2Q8j3k5j9K3K1l8jQlK7j7l5J4K7mnrL4m5K
$$ -4 -32 11 47 0 -3 -3 -26 -1 36 30 2 28 10 15 -57 31 18 -7 -26 -3 18 -20 -21 -13 -16 11 -6 -41 -27 0 -4 -9 -18 16 -29 -27
1678b7K6ojj3Qn%K1k4kM0l5J9K3rk1l6L5j5j1J6K3J1j1N0m6J3l2nRj4QJ1LK9J2
$$ -27 -1 -7 -8 -21 -13 -18 -18 3 -21 -23 17 -18 1 24 15 -6 -42 -7 -22 -33 -17 6 17 6 56 10 23 -9 -14 -5 -19 -11 0 3 32 44
1714D4p7J6J5j4l0N7k2K3k5K8j8nM0j2Lm9LJ2J3QRl8K0pL1on6M0k9l3K4K9L7K
$$ 44 -33 -17 -2 -16 -46 11 -11 12 -13 15 -3 -8 32 20 23 -26 -23 -11 2 10 19 -19 1 -6 25 19 -37 3 -26 -59 -35 -6 31 33
1748C3j2K2l1j1k7J4M0k0JlJ6j6J2Lm1L8j6K1m7MpJ8%l3M0K0pl4L6On5J9JJ7o
$$ 33 21 43 12 1 -26 -12 28 8 9 6 22 6 18 21 -20 18 2 23 -24 -20 -27 -9 -9 -42 -2 18 11 -23 13 19 -36 -17 -16 1 -5
1783eK6k0n2O6jJ7l3m9M8j0J9k5L9j0L3m2Ql0J0RK2l0k5L0K1j0J2k%qpjJ1m1J8
$$ -5 21 1 -51 15 14 31 -2 -51 -3 -13 6 -19 20 10 43 1 9 -21 -11 -2 20 -10 -35 -5 16 6 18 16 16 8 1 0 11 -30 -12
1818a2j5OK5ljKl5J2mJ4j2J0J2J3k1K0L6p2K0j4Pk0J4llK6jL9J5rl5K5l9j0J6
$$ -12 -27 -21 4 1 0 2 -33 -21 -25 -11 -23 -13 -1 12 -9 11 47 -25 -5 -19 -12 -32 -18 -21 -24 2 1 40 55 46 11 36 -3 -13 3
1853CJ1J2nk8l2P5o2P8q2N2j8k4jL8kk4K8ml7J9J7j4j9J0MJ6m0M1k8J0K7j0lJ6
$$ 3 14 26 21 -7 -39 36 -26 52 -30 22 4 -20 -21 17 15 -9 19 15 -22 -3 14 0 -19 -9 -5 11 -29 12 -16 -6 21 11 8 24
1887B4m7j1LMM9l0L%O4m1Jk0k8L6m4N5k2M1l5L2m5J7kJ8l9L4j4kK4l2N2n7J2j8
$$ 24 -23 -34 -31 -27 22 -8 -5 -5 59 18 19 -1 -29 7 -37 18 -4 37 2 34 -11 6 4 22 -17 17 3 1 25 -7 45 -12 0 -18
1921a8JM3j9l8K4K3l7K1k2K0j2lJ0l7O2m0l3N5lk2L8jJ2l0M2n6K4%LJ7j8j7K2
$$ -18 -17 26 7 -31 -7 16 -21 0 -22 -2 -14 -17 -7 -44 18 -22 -55 0 -3 -25 13 12 24 -6 36 -20 4 4 7 24 6 -11 11
1954A1j9L9j4nJ9l9Oj4J5J7n5RO0m4Nj0RNPj2J4j5k3N3k9Ll0L2Nl2L5j4lM6j9
$$ 11 -8 31 17 12 31 -8 -2 -16 -1 16 -39 -30 30 -14 -9 -19 -10 -5 2 -10 4 -11 -34 19 -10 -7 -37 -5 0 -32 3 -11 -14 32 13
1989A3k1k1RK9m5PL3J5J0j6Rk5j5j9J6J8j2J2qK3k0MMK1Rj0j5L4l6k3L1nJ1j6
$$ 13 -8 -29 -20 9 -36 -29 4 19 29 13 22 -3 -18 -37 -21 -3 -15 -3 -11 12 -8 -4 0 21 30 20 5 39 3 -20 11 6 17 1
2023ARl7J1RjM5p0j7J7L3Rl2NJ5J8Ok3k2K5j5K%oK3kj6NLnJ2KJ0l3K4rj3K4j8
$$ 1 10 -27 -16 -7 -8 37 -33 -50 -33 0 9 -23 -18 -3 15 21 -2 -24 1 -14 -12 -12 -18 5 3 -13 -8 -5 -10 2 4 14 -19 5 -4 -17 7 -11
2061a1J4j2K7rM1p0OJ4LJ9J9k8k5K8l5M3j2mQl8Jk3M4kl1RLKM6k2Jk0K9j2OOJ6
$$ -11 3 -9 18 9 50 -20 -14 0 3 22 41 13 -12 16 -19 24 12 8 16 -22 -21 -44 0 -2 -33 -24 -21 -19 27 5 6 -14 15 3 9 15 31
2098C1l1Kj5KL1l6L9k8L0j9LJ8mn1M8k4QNj5J9m0L0Rk1QRlm5P7l4njKLNj3j2O
$$ 31 0 2 -13 -11 20 -16 23 -5 25 6 9 27 23 -28 20 -4 4 9 -6 13 -27 3 12 -9 -1 8 5 -40 37 3 -2 -3 -1 2 7 -6 -18 -12
2136a2j2K1n4N2oJ0Rl9K8nK3nk4Oj0J7L5m6MrJ5j2nN8l4J3l0O3j2p0K6rK0QLj3
$$ -12 -24 -3 -57 -5 -11 -1 8 -31 -3 -8 15 10 -14 -8 -18 -1 34 -12 -8 -17 -2 -14 -19 39 5 18 -12 51 39 -31 -5 -14 6 14 17 4
2172DK%k0K7m2%K6j3NJ5k8OOoL3k1Mj1kK3l2K6l1QK8jjMMj6M8n0K0j1J7l5K4o
$$ 4 6 6 -14 13 -29 -29 -3 -16 -11 4 -24 -18 -12 -18 15 -6 -2 -13 -15 8 -24 2 -29 -21 7 6 5 9 13 -3 45 -5 15 4 21 -14 10 4
2210DnK4j9J1j1lJ5lKMOk9M0m6K1pK1j7k0kJM7m3K2j3nk1O7n0j8K3k7L8m8L9J2
$$ 4 -1 23 4 15 4 1 16 13 15 19 25 -4 36 -10 11 4 25 8 -12 -14 -13 34 -9 13 0 -5 -26 41 -9 -27 -4 -31 7 -41 -2 10
2246A0pj7L1k8L0j8j1PoN5p5L6jk1J2J5k6K6MJ1k2J7k1K3k0J3l8M7n4M7J0p2K5
$$ 10 3 -14 17 -11 19 1 -10 -3 -9 46 -29 7 6 -15 -3 12 -14 12 16 27 5 22 1 24 4 17 -21 26 -28 19 29 -43 -18
2279a8J3J9k6K1m4L6m2L2K9l9JL2qj2j2L3Jm6KN0k2mj4K0mkNK2m6K9N8n6K2m4
$$ -18 -5 14 -12 9 -35 1 -41 -9 20 -19 -18 14 6 -6 -18 15 16 -30 -28 22 0 -4 -18 2 -2 -4 1 23 -23 6 64 8 30 -14
2313a4k3N0K4k4J5Kk0%K9n0L5Ll4L4k9qpLPMoJ9k2j4pK9jMj0J6j9QqJ2j8K3k7
$$ -14 -37 13 37 13 28 30 10 10 39 -11 24 27 -7 27 -2 -10 -17 -14 -7 -3 -9 10 -12 -26 -33 -4 -5 -1 -11 5 -14 -6 -14 -2 -20 3 -24
2350b4J3j3J0M7n6J2pNL0k3OJ0j1rJ9j0k8M5j3NL2j2L0l9J8o6M9m8k3K5M6mk6
$$ -24 -11 -24 -14 33 -23 -11 -18 -13 17 -6 0 10 -1 -10 9 -1 -29 16 3 8 40 28 58 19 37 -29 20 -28 -51 -26 20 16 -10
2383a0K5j9pJ4k0J6k0nK4l5K5K4rm4PL1ql0M0k1L3j6n0N9J9ML2m6L0m6oJ2PKj7
$$ -10 15 -4 -11 3 -17 -1 -21 -26 -2 -37 -12 12 3 -41 -34 -3 -11 -41 -1 -22 11 -5 -55 4 23 27 59 13 43 -3 -9 3 10 12 -5
2418eL2Pm2RPM2m4Qj1J6m6J4K4jk0lPRK8lm6N3p4OK2J5Qk1J5j0l%JnrJ8j4j8L7
$$ -5 27 34 -8 1 8 50 6 14 3 19 -27 -13 11 10 -10 -13 -6 3 31 28 -18 35 -39 -33 -11 4 12 -9 6 -4 -7 -7 -6 -11 -20 -2 -16 -34 3
2457CM6n5jK1J2kj1%ol1J1L4qllnKK0j9K2LKn0K5j0j0ROJ0om8O6n4N2l2J7Jl8
$$ 3 49 -6 -7 14 26 24 13 13 7 -24 -13 21 13 10 7 2 4 24 5 27 30 32 -18 7 -3 -13 -4 2 12 6 -42 24 -30 22 -10 7 8 -30
2495c0L5oJ0k7K1l9k6M9J1nl8L8Jj8L2j0J0RJ7l6j8M9Ql7QqJ4Nj2kj2LJ6J5j8
$$ -30 5 -1 9 -18 3 -36 -62 -13 -2 -7 -45 -7 -6 -24 8 -2 8 17 34 -2 -20 29 37 0 8 0 14 19 7 5 -7 -4 12 27 9
2530Il0N0m8K7Nm9KM7mk8pMJ6j4kM0l3KJ9Mj8J9j4%%kNm2M4kj3K3J6j5lL0k4m2
$$ 9 -21 29 -19 8 13 -36 -34 13 9 -19 -26 -22 -6 -20 -22 18 -15 -13 6 10 -8 11 -3 -3 -3 -5 0 -42 2 0 -13 10 26 11 8 38 14 -28
2568b8O4l6Qk5J0L5m3L4J5m3nJ6K6m4J2J3j8J5k1QRj4Kj1M7m0K2j2j2J4Rk6K1
$$ -28 36 0 8 -17 -7 28 -15 19 34 -9 -14 2 28 -16 -4 9 -9 6 -15 -7 2 -12 -10 -21 26 -14 8 -4 -16 -2 7 -19 2
2601BJ8k3%J3J2k9Qk0J1mJ1J0%pQk8M0LKk3PK1mj4NMkk6J7j9N0m6J4j5%l7O0K6
$$ 2 20 -3 -3 10 22 -7 1 -19 -8 -12 -1 9 9 2 10 -18 22 25 27 4 11 32 28 14 19 23 21 -5 12 -7 43 -3 11 -4 -4 -41 19 45
2639D5p1j5M2k6J8J2k8j9K1KK2j2J1Mk9mKL7l2J9QMOK3m5J6l1J1M9pl2k0K0j0
$$ 45 -26 -41 1 -25 -7 5 -23 -42 -21 -19 3 -9 2 6 -23 -27 -25 12 -20 -1 7 11 17 40 -5 11 -20 -9 40 33 1 -19 1 -9
2673iL1Qk4qK1J3k7K8nk7j8J0K5Qll0j7PrM4j5pk3N1J9l0k5%J8j5M4rj0K9l6j8
$$ -9 22 30 6 -2 19 32 5 33 28 1 -17 -7 18 26 23 -7 -24 -17 -26 18 3 -4 -27 24 43 13 -12 -12 6 -9 35 26 16 45 9 -9
2709iK7Oj2%J0rN%j6PJ1pj8O0l9QOnj4pk7L9J1l5J2K9n1J6J2J6l5rKJK5j2j3K7
$$ -9 18 24 12 12 22 13 18 18 2 9 20 13 -5 55 16 24 30 25 11 4 -23 16 27 -8 4 33 -18 -2 10 26 -9 -18 -16 -15 10 -2 -15 12
2747A2k6J4j9m3P6k2J5J1l3K4j9l%J6QlrJ6oK3o4O6%n%k8L0j7l5O9n4N5m3k5L0
$$ 12 -14 0 -19 -62 14 -8 7 18 -15 9 -10 -13 -13 3 11 8 -1 15 9 32 -32 34 34 29 29 1 31 14 -21 48 -6 49 6 -19 11
2782A1j9kL2k0M5j4mm3NL7j5l4L5j5k6N8pp6L2J8l2K9rPmKk2M4j3j5O0o9N5lp
$$ 11 -8 -10 22 2 47 33 29 -14 -9 28 13 -21 14 -1 -27 31 24 -52 -20 -2 -34 -5 -14 -7 -11 -9 -31 13 0 -15 45 -24 31 28 21
2817B1RoK5j8j5J3J1l8K8qn3K7N7k7k4J4j7j3K4K7j8k9J1l5K2mL4k2j4J5M9o7
$$ 21 30 24 49 31 16 29 40 2 30 22 -31 -4 53 26 2 16 -1 -14 10 37 19 -10 1 -34 -12 -16 18 -4 -18 -3 46 -21
2849b1K3k6J8j4K3on7O5k3J2j1L2j9mj9K5PKk9QK2J0j5Jk3M2J5j5j4m0K9l1M6
$$ -21 2 -24 -6 -20 3 -3 -60 5 -18 -6 -17 15 -4 -8 -27 -2 5 7 -22 -14 8 18 3 4 -19 23 38 23 9 -31 -2 -33 13
2882A3lmj7RJ4jj8j2L0j3QNj9j4K0l0M4j4QrrK2k8L4j7jRj6nM5m2rM5k3LJ3rj5
$$ 13 10 6 -11 -2 12 11 -7 -19 11 -2 6 11 -8 -22 -2 -32 12 -2 6 -3 -12 10 -18 16 -1 -2 7 -9 -14 31 -11 -20 25 2 5 18 9 -6
2920fpK1J3j9J3m7N6Mm0NK2oK4j6l7L3Qj5J8m4OJ3L4l7NLk9j3L5k7L9l8J7Rkk3
$$ -6 -13 8 21 2 15 -32 24 28 -12 -7 15 9 33 17 -20 13 21 6 24 -20 -14 -1 33 -4 1 4 -25 -38 -3 -30 9 -29 -12 -3 -5 -28
2956b8L3jK4j3n1M6j0J3j1j0J5J8j7k9L3K5l6N3o0M9j9j7j8L4jr%lmn9L8L3J0
$$ -28 5 4 28 15 -36 10 0 13 2 -8 7 25 8 -21 12 37 1 54 -6 43 24 7 -11 23 22 13 13 10 6 -53 -15 18 28
2989B8j5Lnk9J5k3K5J1Nl8MJRJ4j3KL%j9L1p3N3jK0Ql1QJ5K5l2Ll5N9l5M3m9J9
$$ 28 13 16 11 -18 -3 -26 -1 10 15 -23 -19 -18 -9 5 -8 -6 -3 -3 -22 9 -64 -11 -12 8 16 -15 -7 8 33 1 4 -31 28 -7 36 -13 6
3026FjNqK2Pj0Km0M6k0j3k8K7J7j2qL5rk1J5J4k6rK9ml7m3P8k5j0JrM0j5j1L3
$$ 6 5 10 2 24 31 21 23 -17 29 9 -4 -32 -5 12 0 -8 27 18 -3 12 26 0 -9 20 16 -21 -64 14 -11 -21 -20 -29 11 -4 -15 18
3062A8l4mK1J6m8M2J0k0Rk1K6l4M1l8L9k5J7jJ2rJ7j6j6k3K3Lj9KnJ0QJ5k2k5
$$ 18 -16 -20 1 17 -31 11 21 1 10 -11 15 -19 22 -16 23 -2 15 14 26 17 34 18 2 -21 2 5 -14 -12 -17 -7 1 16 -6 -31
3096c1L6k6L0j7Pk6J4j1JK0j3J6J2j2l3J1N5n6N5l1MK8n4K7l7O5l2j4J8j7OoJ4
$$ -31 5 -21 9 -8 -1 -27 -13 -24 -23 -3 -16 0 12 0 -33 -22 33 -23 32 1 5 33 -21 6 -31 34 2 -12 6 -11 -5 -11 3
3129C%L0k9j9J3L7m0K2m5O7n1K5j4J2nMk5J2K1m7L3J5l2J9k6rK3m7M2m2L8k1k
$$ 3 3 33 4 -15 -2 35 -5 17 -28 39 -12 13 -1 11 6 10 -15 -3 18 -29 4 19 -13 6 -20 -29 -6 -53 -11 -53 -15 -36 -38
3162c8L2j8J9mJ6Mjk1K6k4K6j2Rj9K0pLKj1K4J4k6k8M4l9N2l2nMNj7l5Q1m6L3
$$ -38 -6 -24 -5 -9 7 11 10 -11 15 -9 17 5 14 -5 15 8 11 13 2 26 40 14 -14 30 -9 43 11 6 10 15 -2 -37 44 -2 31
3197C1m1j1PJ1NL5k9Jk7QQk8J8lMl9N0K1nQk4J3N3n3k8Pk4J3J3K2J5ml3J9J0l2
$$ 31 -10 -21 -14 -3 2 37 8 9 -18 -10 -2 -30 -12 -15 -11 -50 0 21 16 24 0 13 66 13 -15 -8 -32 -19 -6 16 31 27 -6 13 23 -9
3233iN2l0j0L9pm4J1M1qn2JK3j5Lk1L2oNj8KK3k7L5j1l9K8k2k0Q3o1PJ0k3K8l
$$ -9 43 13 3 42 35 -9 2 43 35 -17 -16 7 -8 -5 -26 6 0 5 -13 -11 12 -15 20 9 -30 -2 -24 -44 39 -22 -15 -5 -28 0 -3
3268cnL1l3N2j0j9K8l3J6Ml8jK6NJ2L3k8j8K4k2j4Okrj1j2J9J1l3L6j5K4l1k3
$$ -3 -8 23 -10 42 32 13 41 8 24 28 -10 -11 15 20 32 65 37 19 43 21 7 13 11 2 -9 -21 -2 9 -24 12 -3 21 -10 -33
3302c3j9M1QJ9Nk7Nk3K0m4N7Jl4K6j5LJ6k2lL5k2J1N0o4K2j8J5L4n5L0n8K0L7
$$ -33 -52 -11 -3 16 21 -6 -1 -24 -4 -48 9 10 -24 2 -13 -10 6 -16 -19 16 -6 5 55 -9 13 -5 10 44 -11 19 -39 -19 18
3335A8k4LlL0J5j9j3J1K2l1n4J05n5j6JJ0K3l8rRL4j6l5OK5j8OM2j0m3L5rMJ4
$$ 18 -6 -3 -6 24 39 20 7 18 40 9 -45 60 5 -11 -10 0 23 -15 -24 -15 19 3 -32 -26 -1 -19 -13 29 19 -24 11 2 6 20
3369B0j6J0k6L5l1K5Kl0NL2m5M4j4k6J6L6k3Oj2Om3N4j2rOPLj7J7l2k4L0K5j9
$$ 20 4 14 -12 23 -8 17 19 -11 -6 26 -19 25 11 -15 1 37 14 20 8 14 -29 25 13 4 10 17 20 3 20 -12 -36 -6 19 0
3403@MqJ3m2K5k4MM5k1k6J3lrj3M9Nk6K6l0NM8l3nl1O8n5M9j0J7Lk6k8M0j9J5
$$ 0 4 -4 9 -33 -8 -32 -28 17 -4 -30 -17 -20 -29 -42 7 12 -14 12 -18 -13 35 2 -3 -34 34 -21 28 18 35 38 12 -16 24 5 20
3438B0Rl0Oj4jK2Kj5oJ1K3om0M3l0j7K8Or%jooK2j9KJ3QOK1o3J8j6M8j5m0M8l3
$$ 20 29 -1 5 -9 -10 12 14 -1 -7 4 27 21 -19 24 -6 -23 5 11 2 2 1 -5 -11 11 -8 -6 7 15 21 42 -21 -3 -19 29 14 -26 22 -11
3476a1mrL9J8Qm5L9l7OJ2k8K4%j2MQk9J7LNJK3k3rRj0j1K0mqK0j4m2K5K1K1m4
$$ -11 -15 -24 15 33 41 -4 35 -2 4 16 -12 12 12 0 4 12 -17 0 3 8 9 32 9 0 9 -1 -12 8 4 -4 16 2 -40 -15 6 27 -17
3513a7J0K%k5J3Rj4J7L2Rk9k9J6J2RJ7k8qL%lL8k0k9KqR2o2L6J2n3J7j8j3J3J2
$$ -17 -7 -5 -5 -30 -17 -8 -22 -5 27 36 7 -22 -6 6 15 32 4 -4 -1 -1 -4 34 14 -15 -13 -21 71 9 45 57 4 21 3 -10 3 15
3549A5j3oL7k0MnLl6KkJ3j1o%Qk4mN3k3K3k7JMK4k3L6j5rj9L1k7J6J1Lk9M8k0
$$ 15 2 -4 33 13 17 12 15 -21 -19 -21 -8 -19 -25 -25 -17 -41 -45 8 -15 8 -19 -18 -14 10 -13 23 8 -1 -20 11 -16 0 11 14 -15 33 13
3586A3rlK0Qm0J0J1J1k8j6K8l9K2%K3qj9K9K0j2k9pJ1j2J6Nj2Rj5k9K0m0K5L3
$$ 13 4 1 21 29 -11 -1 10 21 -7 -23 5 -34 -12 -12 11 3 -16 13 33 21 -8 -15 -4 -16 0 5 -7 2 -13 -42 -22 -62 -37 -4
3620dj6nJK0k0P6j00K6KL2k1Nk6L1j1J7j4L6l9M4j6K0rj6K1k0j2qN6l0l4QJ2k
$$ -4 -20 -25 -24 -4 -24 52 -48 -22 -20 12 -9 -4 -30 1 -10 7 -7 29 -10 34 18 38 29 13 34 14 2 -6 50 20 -14 -6 6 4
3654DPo1L1j5J9nJ5oK9m2%J7mj2M2m0NJ9L7om5KL8Jnl6J1j2J5l6L9J6%K2pk7j7
$$ 4 11 -50 -19 -34 -15 -20 -5 -11 18 -24 -24 -7 -11 -23 19 -21 -16 3 40 34 -11 -9 29 30 25 -11 0 -12 3 -33 6 22 22 44 37 10 -7
3691gJL5k5%JK4J7ro5NL2k4mJ8K5J2k9%j5k5N0k7L1k7kJ0m0O3k1j6K6ll7N1nl6
$$ -7 -6 29 4 4 5 29 46 37 -28 -23 9 -15 -19 -1 24 36 7 7 -8 -33 17 -10 21 -6 -8 2 -38 25 4 -12 14 11 -26 25 20 -16
3727a6M8l3L5j3j3j8M0j2oj9J5K5m9J0J4m0M6Jm1K8rJ2J6k9M2m9J8L%Pl1J0j2
$$ -16 32 -1 34 21 8 -10 30 18 12 -7 8 33 -16 -6 8 -32 14 15 -26 2 -7 5 21 -8 34 -15 3 6 6 13 -18 -8 -20
3760b0J4Lj4K8k9j4J8l7K5KL0l2N0n8L4j6l4L1J8m1L3N4l7L4l6Jm3N0j0J9k3L6
$$ -20 -6 -3 -17 11 -18 -32 -14 -51 -26 -24 6 -26 24 -34 0 -16 -50 -19 -1 -42 -9 45 8 42 6 7 -36 14 4 23 0 36
3792C6%m6JK0k6j4M9k9J6k1JL0k9j2J9K1j7Ml1K8%j2J2M5o9K2k5j1N2J5m3j8L7
$$ 36 36 -10 -9 11 -15 -29 20 -9 7 -14 -13 17 -12 -24 -5 16 -1 3 -28 0 0 -12 0 45 -24 -2 -27 -38 14 29 -14 -32 5
3825EnMj6j8J9K2lRjl5j9L3L3l2k4M9J1j0%k4%J3Oj6jL4k6m0J3K2n0L0N1j9n8
$$ 5 0 4 -12 -30 -11 11 8 17 16 -19 -38 -5 28 -4 -28 21 32 22 22 -2 -2 11 17 1 0 34 8 -32 -19 3 -47 -17 34 15 -43
3860d3L1k1L9K2o5Pj5K3L1qj8j2K7Jk4J1%J2k2J3M3p5M5j8L1l1K6Ol3N5l1qj3
$$ -43 -12 -33 6 28 -37 -30 -45 -22 9 1 -17 -29 -2 -1 -25 -14 -14 -2 -24 -11 32 -43 2 -16 15 -16 10 16 -17 38 7 -1 -14
3893a4L3j3j5M4k5QJpK0j3pm0J8L8l1J4j1j2N1l7pj4mJ6N1o1Qm7J6jK5j1oM6m8
$$ -14 19 6 -9 35 10 18 19 12 32 19 12 -28 -10 28 -3 11 0 -12 39 2 -5 -19 -23 -7 44 -17 -9 -56 -40 -41 -16 -27 -33 13 -35
3928c5K3j6mL1Pj9O2j9l4QLqK7k4J0J9J5o8L6Lj6J8j0KQk0lOJ2k0j5M5kj7Nj7
$$ -35 -12 -28 -32 -1 6 -13 49 30 -4 4 7 -1 26 2 12 31 46 -22 14 17 1 19 9 11 19 -1 -4 2 14 -6 -21 24 22 5 10 -7
3964gj7M0j6l2rjK7K4jkl2K7j8j9K8J7j7QjJ1qK0k4LK2qPjj7K3j0l8L4j9NKj6
$$ -7 -24 16 0 -32 -41 -42 -15 9 8 6 -26 1 -17 -36 -8 9 -8 0 -1 10 2 22 -2 1 23 15 22 21 4 27 17 -21 13 -6 -1 1 -15
4001a5J2JJL0m1J0L7rrk8LJ5Qm4OOJ0%J0j0j3qKL3m5M2m6L2k1OJk2L3j2M3m5J5
$$ -15 -3 -2 -1 29 -12 -2 35 26 17 -11 -8 7 15 -29 -23 -17 -7 -7 3 -7 -20 -28 -26 7 -38 4 -42 -10 -31 -25 -24 -46 -13 -25 18 -27 -12
4038a2K6m5J9klK8j2JL4m1K9j5L3m3L7k5K8j6k1K2lpm3L3l4N8k0Lp6M6M3mn3K0
$$ -12 14 -31 -12 -14 -17 11 -1 0 34 -7 22 7 40 -3 34 9 37 21 0 22 19 12 -31 2 -32 26 6 9 -67 -21 22 18 -35 -15
4072a5k6M8k8J1j6K9Pj8K1n4J9LO4l1Lkn5K7J7K4j0m4L0J9j7l4J6L8k2L0Nk4j3
$$ -15 -41 7 -21 -10 -26 3 10 -8 13 -41 -22 -19 45 14 17 15 -40 -13 4 28 18 -26 4 23 6 -28 -12 26 4 34 39 15 2
4105BL8l5j6PljL8n5J0pMK0JonjPj0Nl5K5L3kk0qlQk3K5%K7k8k2J8k1N9omKk4
$$ 2 40 5 -11 -4 -7 -8 30 -25 -15 -22 -18 2 3 -3 -8 -9 -2 -12 -7 -42 -17 16 14 -6 -14 -17 -9 -32 -7 -7 20 -8 -30 -12 -33 26 20 16 18 -6
4145fRONpj9NJ0J9l8J7Lj4J1Q0q8k7L1Kk3J1k1QM5m9M6o2N2mOj5Rj9jj5J2K6p0
$$ -6 3 9 14 7 -12 -7 3 22 -16 1 4 -10 1 81 -7 -34 -3 -1 -24 -13 -34 -26 19 -30 16 -46 6 2 8 -7 2 -17 -18 -33 -21 5 -65
4182f5M0J2J3k2l1N1j4K1Mn0K6k4K7K8pj1Rl3K7qL7l2l6N5k1k3L7Kk4j4K5L5n4
$$ -65 -25 -13 0 -22 -53 -2 -16 5 9 -41 -15 -39 -12 16 9 -2 7 -26 1 -7 30 -2 -38 17 -4 -27 10 12 -12 -26 -1 34 -20
4215b0mL2p2L9L8k3K5k4j3NJ0K9n5K1K5j2Ql3jK2QKnrj5KJ9L4l2L2o6M3k3M9m0
$$ -20 -24 8 -64 -25 13 -10 15 -9 -22 -17 -7 22 -33 -12 13 1 9 -24 -25 -3 5 7 2 -7 -22 -20 -1 33 1 33 -33 10 -13 36 -4
4250dL1mj0KJ1Mm9N7k5K4lm6pK8L9m7J8j8j2J2k0L0j0ok5rL3n2P0%Ml2K2Mk3K8
$$ -4 27 23 13 15 26 30 -19 38 13 37 34 -12 -19 9 48 1 19 1 -11 1 -19 11 1 -5 -30 -39 -6 -58 12 12 16 -16 6 10 -13 15
4286A5Pm4LL1j2m4M2k9L8j5Kj9K0qK1n4O8k1oK3Nj2ML0m1plJ6JK0n3pM8jl9J1
$$ 15 22 -22 -19 12 0 -44 -2 -31 7 -8 -6 -25 -5 -13 8 -46 22 1 -5 18 23 11 15 45 4 -3 -6 10 11 31 -22 -29 19 18 -21 -10
4322a0mJ0l7K3%Rj3K9Mk5j9J6jPQl6J0J4J9j8J5k2K8rJ6rKj0J0J4k7J2J4k2J6
$$ -10 -14 -4 -41 -18 -18 -9 -22 7 11 -14 -33 -17 -18 -11 -3 -39 -29 -15 4 -14 1 -21 7 -2 14 5 7 -3 7 21 -6 6 20 -2 14
4357A4l2N2m0J4mjNjL7o9kMOK6j9j9kJ9J4k0M0k2rJ8l6LL2k5jJ1Ork6J6J3k4J3
$$ 14 -18 34 -6 8 4 3 8 7 44 -25 -27 -23 -17 9 -10 -29 -31 -12 2 -18 22 0 -9 9 -27 -24 8 -17 -18 -7 -1 -10 -36 -20 -7 -31 -18
4394a8j7J5M1nk9J4K5qmJ7m8rO5m7J7j5%j4L9j3nk3L6j0Lml8L5J9m3K4j7mplM0
$$ -18 -35 -20 21 16 -13 1 26 18 14 31 -17 -26 39 -8 9 -6 -6 -20 19 6 1 -22 14 4 7 3 -35 0 19 -24 0 -17 -21 -28 -31 9
4430Il1K9j7j1L1k7JJ1j8L2n5M8k4J9K3k6NjK8m8J7OnL9l0k6L2m6N4l8L9J4k1
$$ 9 -22 7 -10 -21 10 -17 -16 -5 -23 9 -46 2 -22 -3 20 -6 -1 -2 26 -22 -5 1 -4 35 5 -21 11 -35 19 -19 20 34 13
4463A3qj6K2k7j8N6l9NLJ0l1J1Qnj6O%rK9l0JJ5pK2l3L6m9L6k3L6o%L2j5l9L0
$$ 13 5 -11 11 -16 -34 22 -17 -12 -9 1 -30 -19 -11 -16 -32 -26 -26 -35 -6 -36 -35 -20 -27 -5 -38 -2 -51 -15 -38 -2 -8 -8 24 9 -30 0
4499@K9l9M3kk7J1K0jj6k1k4K9QJ9k6k1J2j7K9j6K9Ql6PJ7m0M4k1k3J2j1K9l0
$$ 0 29 -10 33 31 4 15 35 34 18 -3 -27 2 10 29 3 -18 -6 -23 6 -10 19 27 -9 -2 15 -25 19 -2 -25 -13 -24 5 -25
4532b5N3l7k5K1J6plJkk1MJ3k2K0j9K3mK1l9O4l9kJ6j5RK2j8M3o4O3m5kL8l0K4
$$ -25 28 -9 -34 -13 3 -4 -7 -6 -8 -29 -25 -12 -34 -14 -33 -10 -14 7 -32 32 -7 -9 7 -8 1 23 5 48 -16 47 2 0 38 8 32
4567C2ll2J5j5Lk0J4J8pj7K5%n7K0Kj6M2ll3J8pmKM2j9l0JK8K8j9l5L5lj3K2L
$$ 32 29 -3 12 -3 0 -20 -6 12 5 -12 13 13 -44 -24 -22 -38 4 1 -32 -14 -21 -25 -23 19 0 -30 -29 -1 27 8 -27 8 5 -8 14 17
4603A7j1Kk%J3j2j1j%N0p2L2Rpj1Rj0j3L1k3Kk4N2k8k4J9L4k3j5l0M1jlRk4Ll
$$ 17 6 8 6 6 19 7 -4 -5 -5 45 -27 5 14 7 -4 5 -5 -18 13 -10 -8 -32 20 -8 -32 -13 21 -2 -17 -47 -6 -7 -10 -1 -25 -22 -25
4640b5J1jj8M5nk4J0j1k5O6%m6K5l0LNJ0K0J0k5K1K6n5K2l7K4M6l2Mpl9O1k8q
$$ -25 -14 -15 -33 12 7 -17 -7 -18 -43 23 23 -23 2 -28 -25 -20 -10 10 20 -5 16 42 -13 9 -28 -4 42 10 14 7 -32 29 1 -7
4674gJ9l7QJ6J2j9nk1J3QMJ6m4L8j3K0k8RK4jmj6rL2j0l2M0rQqk1j0L3pmJ3J8
$$ -7 12 -25 -17 -1 11 -8 -13 -34 -21 -13 -9 7 -37 1 -12 8 -20 -11 13 12 8 -8 -17 15 5 -27 13 4 12 4 -17 -27 6 -1 -5 8 26
4711B6Nk4kK9nj7j4Mk6K7J3J2k0k7J9J5l3J1%m8J6M5l6j4L5j3K3j0k7K2RrQk5
$$ 26 31 7 5 34 29 12 -2 2 -24 3 16 28 8 -19 0 15 -18 -7 -7 -55 -39 6 -30 -44 -9 -22 1 -9 -36 -14 -5 -14 -6 -31
4745c1K4j8PpRK8l2Pj1K9K8l6%j8L2J4k6K2j9L9l0J0nj6j0lQjj1L2j4R%J4j1r
$$ -31 -7 -25 -18 -25 -16 12 -20 -13 -24 5 33 -3 -3 -21 11 25 -1 21 2 41 11 21 16 0 -10 -13 -5 -6 -17 15 1 10 10 24 13 4
4781DPj6k8M1qJj6J4j2l6MN4lk2LK9l3M6l2J0j2J7J8o6L7K0J1m5j8K3j4K7J5j3
$$ 4 11 -5 -33 8 0 1 -15 -1 -13 -49 -45 9 6 -16 -13 16 -17 29 -3 7 -5 12 30 -36 1 21 32 -13 -31 -8 -22 5 20 7
4815Gl2K5J4ok5M6k4lnK8k4l7KK1j7L1Jk5K7lj2k8L8J8qj5k9J1J3j2L5j7J6m7
$$ 7 -25 0 14 8 -17 29 5 2 -3 25 1 -36 -34 -13 -30 1 2 -23 4 1 -11 -39 -1 17 9 -6 -35 -24 -11 -23 12 -5 11 -36
4849c6K1O0l5k3qpK2K0qj5k5M8Poj2J9j8J0RQk3MoL1k4j0k2pN1l4nK2Lj4pOj8
$$ -36 -15 45 10 -13 -21 -28 -6 14 6 -9 -34 14 21 15 3 22 4 14 23 31 8 12 6 37 13 3 -19 -26 25 -9 -14 8 11 -3 -10 -4 -22
4886b2K3lK4m2J4m8J6L1KOj4k0K7K8km3J2nJ5K6p2L9K1Mk6J2L3j2l2J4k1K6rq
$$ -22 1 -2 22 -20 -6 -54 -38 -7 -5 1 -13 -33 -6 22 20 -23 -11 -16 -1 25 -47 -8 13 17 -9 3 36 24 -8 6 -15 11 2 -6
4920fkJ5KJ6Jl8PJL4m0LJ9j2Kl2L3j7j0j2jN2j7j2k1K2kjJ8ql5J7M1qjJn5%Q6
$$ -6 -8 7 9 25 26 -12 -5 -4 30 -10 -7 12 0 2 -30 3 -14 -24 -36 -37 15 -2 -14 -35 -13 -15 -16 2 -6 -41 -24 17 9 8 9 -46 -46 40
4958D0km8j5qQN4k2M1l3j5j1L0Ook7J2jj8L8l6oj6M6J3n7J5j0pL0l6K3%Jj8M7
$$ 40 38 -10 -25 -33 -25 29 7 48 15 0 -11 19 25 19 -8 4 3 -15 23 -13 -19 -35 11 24 -33 -18 -28 -35 -5 -41 -18 -18 -17 -35 12
4993A2pn0L7J1%nK5n3N5l2m0M0RJ7l3L0k0j3J3J3j9K3nj6M0m2L9j8Jl3N1j6j3
$$ 12 5 -45 -8 3 3 -2 23 -30 25 -7 -47 -7 2 19 -14 16 -4 -17 -4 9 -10 13 8 -8 32 -10 29 11 12 -21 30 14 1
5026AOJ9k8L1oj9Ol5J0J1pK9Ml2J0mj2L0j4m5M5j6L5k6M7l5k7J3N5l2k3K0mk2
$$ 1 7 26 -2 29 23 4 10 -25 -15 -4 -11 18 22 -10 0 -4 -16 14 0 -45 0 -16 19 -7 40 5 -22 -9 46 14 -9 11 7 -15
5060a5L3j4J6n7P4l3PJ4k3J2PorMJ4oJ4l6jK3Rp2O3j4K7m3Kj0L8j6j9ll1M0j2
$$ -15 18 4 20 -37 37 4 11 25 2 14 21 15 6 10 24 18 32 -4 -5 18 27 -45 18 4 31 -12 -10 -20 18 2 -17 -20 -51 -11 -23
5095b3M1m0J8lk7qOL4J4q2Q4n4O1l4rJ6J1j0K4k8PJ6m9N0Pk7L8l9J8j6K8jJ6k6
$$ -23 18 -22 -4 -7 -34 -42 -36 -2 12 -70 14 -40 21 -13 -22 -6 5 -5 19 -9 -2 14 -35 15 22 -5 33 -6 12 -4 24 23 39 13
5129A3j1j3Mj6NJ3J4m1%K2j3K0pMj7L5n1OoN8m8mL9Rn4K7oJ8Lm2L2%NL8p1O3l8
$$ 13 2 -11 -7 -23 -18 -5 9 -32 -32 -10 -23 -3 -10 -6 -23 12 -39 -33 -39 19 -29 -33 6 15 -39 -12 -18 0 3 -39 -7 -7 -2 36 -35 28 -10
5166a0pL5l4J8J9jj8OqL8j0m3J4k4L2N%k9J9J8l8llK3k7J7Pl8J3J7j7J8OL1n2
$$ -10 -17 18 -16 2 21 20 2 8 0 38 28 -15 -1 -25 7 12 12 -17 2 20 -18 -21 -24 -1 -28 -11 -4 -42 -29 -12 -29 -11 -5 26 -26
5201b6K5Mj8j0K3J3K8l4Mk0KJ1MJ8qJ2k3j7M7k7j4K5J7n1oL5k2J8j6rNN3j2j2
$$ -26 -1 3 -15 -25 -2 11 39 5 9 -11 -9 2 6 24 16 28 5 -12 35 8 -6 19 36 -15 -21 14 -8 10 -6 -15 -10 43 31 19
5235A9m1M2j2k5K3j5J7OKl3K0j0l2J4RJ4L2n6J7nPkK0Mn0K7J0pJ2L4m1M1o2N0
$$ 19 -22 20 8 -17 6 -9 8 14 16 -17 3 -7 -39 -25 -16 -2 30 -26 -9 -14 -7 -9 11 15 -35 -8 2 -5 7 41 0 41 -21 29
5269B9j6nJl6JL4K1Nk9L1l2lLK4m2KJ6K1k0Lk2L1l1%J4Rl3K5L0m6J9j8OM0l2l9
$$ 29 13 8 9 -27 -26 8 29 34 5 36 4 1 4 28 -14 -12 4 25 5 8 -14 17 -14 -14 0 9 -24 1 31 -15 4 -14 -8 32 0 -39
5305c9N6m3K2j5L4l1K3l4L6n8R1k0j9lk9K6N2j4j4pk8L6mk2j3K8k1J5%Kj0j4K0
$$ -39 17 -26 -4 -19 15 -16 7 -27 9 -49 42 22 3 0 -29 -3 49 35 21 14 -14 22 18 -4 -17 11 -10 5 5 7 -3 -17 3
5338Ck0k4K5j0j2M1j2k5K7j9PK4m1M8nj7r%J3KJ0k9L9mk8N2m0ooJ6K3k5Jk6L7
$$ 3 -17 -41 -16 -26 -38 3 -9 -34 -7 -26 -19 5 -36 12 7 -10 -19 -19 -6 -4 6 -23 16 12 -16 36 -4 -10 -16 0 23 -2 -1 -27 10
5373A0%k2j4M5kk6J0L8j2k7QJ1l4K7pljj6kj4oK1%j4M4l9l1M3j6MK1J9J9j5k9
$$ 10 10 -12 -26 19 17 -9 1 39 27 0 8 19 -15 12 5 2 1 -15 -17 -31 -37 -16 -16 -30 14 -25 -56 -13 -29 -25 -4 15 34 19 -10
5408a0K2Lm9KJ0k7Q3p0J3oL1J9j1lQmJ4k0J1k8L0k3Lk6O2l8j1J4jJ2J8k5J8m4
$$ -10 12 15 -34 -32 -22 -49 34 -36 -23 -29 2 21 10 7 15 11 25 5 16 -12 18 -5 -2 -28 34 -4 -15 -1 -2 10 28 3 21 -23
5442b3M5Jk4m1J2J9J0j3J2m0K7lK0j5JnLpk6M9pK1k1J2pNk6L2j3L5j9J5Pm1K6
$$ -23 22 23 -1 -42 -30 -11 -1 -14 -2 -42 -15 -18 2 -13 -12 -17 -14 -21 -47 2 -5 16 -5 7 0 5 -21 11 -2 33 14 29 36 -5 21
5477B1k5kLJ9k0L4k9LK5k6Ook5M5j0k7OM3n5K9n7K5M0m4Nj3K6qj4J5K0Ok4mj5
$$ 21 -4 -6 -3 16 -4 30 1 4 29 3 9 3 -22 23 13 -14 -8 35 -20 9 -48 -23 17 -27 -22 -35 -9 -17 -31 -16 4 10 -14 -18 -33
5512c3L7j5OK7J1j6k0kj4LL6j7mK7mL0o1O3p7M0Qmk3K3k6k1J7NKj3K6mm0OK5j3
$$ -33 4 -11 -5 22 33 17 -3 -5 -19 -16 20 3 -1 26 22 52 -9 54 -23 17 25 21 -2 21 -5 -26 -9 -4 -2 -15 11 7 -33 -27 -2 -15
5548a5oK3l4K8jm1L6J8k0K3k5k8N6jk1Lj5kK1J6J1j0k0j4K6LJ8k5RR%jJ6j3k1
$$ -15 -21 2 -32 -4 -5 -46 -10 8 -12 11 -14 -42 14 13 -8 -5 -20 -22 -1 15 26 16 -4 -18 8 11 29 4 13 22 22 21 37 24 3
5583CK1j5J2K7p0L6j1J6k1j4J0l5L2K5l6J7K6l5J9Mj7k7JJ0%j2J0J3jK0jj7Nm
$$ 3 24 9 21 48 -22 14 3 19 -2 -16 -6 -41 -9 16 -20 -3 23 -12 7 11 -6 -33 -32 -22 -22 -34 -24 -11 -12 8 7 -10 -5 -9
5617irJ7j7L5k4PJjK2k1kJ6J9j4OJ9n1L2j8pL9j9k3K8m0QL6k7K8o9P0l7l5N5j4
$$ -9 -18 -1 -18 17 -7 0 1 0 22 1 -1 15 34 20 26 45 -6 26 8 1 40 21 -2 26 -14 -6 30 3 31 -38 32 -5 -40 15 1
5652Ajk5K1%K7k7k5K2j9L6n5L9j4ML2j4k2OJ7J0%K3n6MM2%m3RM7l0K6l4Pk7L5
$$ 1 0 -25 -4 -4 23 -4 -29 -7 -26 10 -45 -6 -20 -16 16 2 -20 -14 3 13 13 36 -20 -16 26 26 -17 -8 39 9 35 1 8 -19 16
5687A6j9J9j6k8M2j7j1N2o3L9l9Rlj0L2nj7l1MK4M0k4%omJ4j7j9K6Jj2oM1k2K
$$ 16 -3 16 0 -28 14 -3 -14 38 -25 14 -25 -16 -19 -29 3 -2 -19 -50 -46 -22 18 -6 -6 -12 -16 -2 -19 -38 -12 -11 -23 -29 12 -10 -8
5722hK1m9J7L6k4L0l0L8j8kj0K4lpM3m1K5k3kk7k3J8j8jK5LJ4Km6K5OK0l3mj9
$$ -8 13 -36 -19 17 -7 23 -7 31 13 11 1 25 22 15 58 17 42 19 17 -10 -33 -15 -33 -34 -9 -6 8 10 -36 -11 -5 15 -18 -22 -41
5757d1K2Ok4L7j8mK4j4K2loQj8j3M0m8M7Pl5K4K7n7K6kJ4oJ3j4Pn1M7Kk6M6n9
$$ -41 -19 -13 -37 0 -18 -22 2 -12 10 7 1 9 -9 -22 18 -30 17 24 -11 13 40 -17 9 7 21 15 28 14 21 -30 17 19 -7 39 -20
5792b0L2l0jPqK0j0lM9m2jl1K3pK8k7lK5ONm6N6l0oK1n2K1J0J8l9K7j5M3Nk6K
$$ -20 12 -18 -19 -12 -20 0 -10 -13 36 -6 -7 -38 -15 -22 6 -21 -24 1 7 12 -34 22 -8 -14 7 -45 -24 -14 4 -35 -8 -23 20 25 -1 1
5828AL0k0j3oP9l7j7J1k5JJ1j5l9M5j3J0j7J9K7j7n8O5j5nj2nK9mk1K2Nm5K7P
$$ 1 31 11 -2 -8 71 34 17 28 3 4 15 0 -39 6 -7 3 -14 5 32 15 -43 22 7 2 -10 -15 14 10 -11 11 16 -29 -2 5
5862Emk7K4j8K8Pn7M3j8Jj0L8J6n9M7j9J7qMj1J4LNNrj4M5k4m9L8k5K4K3k9kJ1
$$ 5 1 -26 -2 -20 8 15 -42 1 -17 -16 -26 12 28 -31 16 -3 14 6 10 -1 13 16 21 26 17 3 48 24 -25 13 -12 12 35 6 4 15
5898A5k0QnJ1Ll8OJ0P%K1n8L0K2m8K9l0K3N1m7K7Ok2nkL0k0K4k1J1oRJ9n4%J6
$$ 15 -5 3 -2 9 12 -26 -20 -10 -3 -3 18 -40 -10 12 -36 -7 -37 -14 37 -10 17 23 1 -4 -6 24 4 28 7 18 12 21 40 -14 -14 2
5934BJL2l6J5j3j2M2m2J5L6m4K2l2lK4k8K8nK1j8k6K5kj3K4n7K9K6n2L4j2J9k7
$$ 2 3 35 -1 14 1 -11 31 -11 4 40 -4 18 -14 -17 7 -21 7 2 23 5 -21 4 2 -11 13 -44 -15 11 -41 -7 -19 0 -27
5967b7LL5l1nK3k6K6j4J1jj3j8%N6J4l1J2mk4L0PK6k4qj6M0m8J0%kK6o5N1J2l7
$$ -27 -24 11 -20 -25 -2 -28 -2 -16 -5 -6 -19 -37 -37 19 33 2 14 10 -14 16 23 49 25 17 1 41 -7 3 3 1 27 -38 13 25 -12
6002a2M8l6k2lL0k8M5j5k9RQOk5K3MLLj0rJPJj5K5Kkj4jPj2K3N0n4KJ3Pl5J2o
$$ -12 36 0 -22 -25 5 -23 22 7 -22 -13 -5 1 -24 -1 3 6 9 -1 -10 -9 -2 -1 -16 9 11 9 -5 -6 1 -11 12 62 8 10 23 30 -5 7 1
6041Ak7%K5L6l4KNoj1N2o5nM4k8M7m6Rkk5L3m4J2K2Pj9K9J7n6K0OJ7j9J1M5m6
$$ 1 -26 -26 -1 35 1 3 8 2 -9 43 -22 -27 17 -11 36 -10 -1 -3 -28 5 -39 -27 -5 2 -17 12 29 -27 -7 -1 16 -3 8 53 7
6076GJ2k1j1J9lj2oPK8mJ3m8K3J3rK9o3M7l6j8J9J0L6l3K1oqMNL6n4krj0K9k8
$$ 7 19 -2 -13 6 3 -9 -15 -8 20 16 29 -19 4 17 8 37 -26 21 -15 -33 -14 -4 32 -1 20 14 6 10 15 51 -3 -5 -14 -24 5 -23
6112b3j7J8Rj8JL8l5j2K4nj6NM3jnLl5L6m4N8n1M6K9k8Nk7K4l0jj2M5njk2K8m0
$$ -23 -40 -22 -13 -31 -30 8 -27 -39 -15 -20 -36 -31 12 11 6 9 -26 10 -34 24 -27 19 48 20 25 -2 22 -8 -9 -21 24 19 18 -4 24 -16
6148a6J6J0j5K1l1J9j8RK9n9M6l4J0lQj1m8Q3n5L9n8J7KM6jprK6k6J1l0J4L5j1
$$ -16 0 10 -5 16 -15 4 -14 -5 24 -35 11 -23 -13 -16 -8 -19 -67 16 -39 0 -58 -41 -39 7 6 -1 -10 16 -10 1 -29 -15 20 9
6182IKj1J8k9K3J7lk1j9J1M8k7%l4K5Pm7L7lk0K2J0j5Ql8L7K8m5Lj4LJ4oJ1k7
$$ 9 11 0 18 -11 12 29 26 5 -14 -3 45 18 18 -16 9 16 -31 6 3 -17 5 15 0 8 -30 7 35 -10 -7 -21 -18 -4 -10 1 -26
6217b6L3k1mnQj9K1JQL6o5M4J5k1oj0J4J4j8L5m2L1K8l2Kk3J7l3M8l6j6M0k4K
$$ -26 7 -14 -18 -23 -15 -34 -13 -12 -4 32 -33 11 26 5 -1 -11 3 17 -1 34 -8 23 51 19 21 -2 15 -18 30 -6 -22 18 -6 -4
6251dK0k6k1M2k3K2l6K7j5K9l1N8k5j9lk7j4M3J1l0J4Nk9j1K0j3L6j5j5L1J6j1
$$ -4 16 -10 -31 11 -12 10 -26 1 -14 15 -16 42 17 -2 -5 -32 -46 -3 8 -22 -8 -3 -32 -43 -23 -36 0 -15 -30 1 17 6
6283FRk9lO2k5l6O2l4l0K0mJoLJ0J7o6O0J4k5j4OOM0l6j0K4j8J8n1l1K6J7L5n1
$$ 6 15 -14 -17 45 20 -16 46 12 -18 2 -2 -1 -7 -4 6 23 -43 17 31 6 -8 -2 4 44 8 -2 22 4 22 -29 -60 -34 -17 18 -33
6318c3LM6Pl3J3l7L3mJl5L0k1NJ3j4J6oJ2j2N0l4N3p2M4n7K3K2j4J6l2PK8Rk6
$$ -33 -30 16 23 -10 3 -34 -1 -5 -4 -39 -9 -30 -25 -12 -26 -10 -16 -4 -16 34 0 53 -19 25 -32 -9 13 -1 15 -17 -10 18 27 1
6352AJ7j9rJmj1L2K3k7m6K1PRk2j5L3K3jn6N8k6K6m2L6%L9n8Kk8K5nj9M0l1N0
$$ 1 18 -1 -10 -9 -13 -24 8 31 4 -42 -21 -14 -5 -27 -42 -9 14 13 -43 15 -11 15 -27 9 9 48 -10 -8 -36 -11 -16 -35 5 -26 24
6387B4l9M0k7J5qMJ8m2NLJ9l3J8RpPj4M2Pn9JL0J3l4Qn5M3j4J1K1J3j1n1j8M7
$$ 24 -15 25 -2 13 5 9 27 -15 -10 -7 12 -21 -3 6 -1 6 -8 34 41 -18 -17 13 26 -8 0 -55 -12 -26 -15 6 19 8 -43 -61 -14
6422a4j4J6O3p7K3j0KJ6mJ9km0l0O3j0j2J6lj0K4K9m6J5J4k0jK3k4oLPOm7K4J0
$$ -14 -28 -12 51 -26 -3 -13 -11 5 1 20 18 -22 -52 11 1 -11 5 2 -8 16 45 -1 14 28 8 7 30 6 0 3 10 16 -31 -7 3
6457C%j7jNL8j8k6k0K9K5l9K9j4K8m7J6K0k1k3Nk4L1j0L8rJj1kK6l1M4k9j7L3
$$ 3 3 -14 -15 -10 28 10 -16 -36 -7 18 -21 8 -6 22 -25 -9 11 -10 -33 -28 -52 -21 -31 7 -2 -1 -12 -14 12 -19 25 -4 -21 12
6491A2l8O4m4j5QOK2l0J8lL2j0JK1m2oJ9l8N8k4j3Ol0OL9j5JNj9mrOJ4PpMj3K8
$$ 12 -26 38 -6 -21 -13 -7 15 -15 3 0 32 22 23 44 2 -4 15 -23 35 11 -2 4 -26 -20 19 4 5 10 -9 -13 -22 -16 -2 5 -2 2 -11 17
6529A7kp0O0nOK1j8j7Lk9N8j0qj2M3k6OmK4l4k5NL0j7J2J0Mmk9J9lRk8M6l8j2
$$ 17 15 -55 5 0 6 27 9 -8 -5 -34 24 14 6 -6 37 11 17 13 37 3 -22 -17 13 -4 8 18 22 18 -11 8 5 14 -14 32 -6 -18
6565a8M5k7L5k8Lj8J4J3mm3K3k7L6j9MJ1Mj7j9O8o1OJ2K7k3J8KJ3rk2Pk2LJ7P
$$ -18 27 0 35 7 10 -8 6 19 15 -28 -5 -32 4 -15 -11 0 4 -13 -32 36 -25 -19 -7 20 -3 15 17 30 21 -1 6 -16 -13 4 11
6600A1k3K7qmqJ2J2ol5K3Rk2K5Nl2lM7l9%K6j1rPk3Mnk6L9k2K7j4l4P1j7J1m3
$$ 11 -12 15 7 3 -5 7 19 13 -22 1 10 -12 13 18 -14 -17 30 -9 -9 17 6 -3 4 -19 -15 -20 -46 -7 -29 -2 -16 -50 21 4 15 -28
6636b8RJ0J6l2J3L2j9j2K0rM1m0k1K3j0J9j5L1j3%m5L3m5L2K4J5l7K0K1l6J7k7
$$ -28 -19 -9 7 -25 -12 20 1 -11 9 0 41 1 -20 3 -7 12 -3 28 15 15 -30 3 -42 -10 14 29 -8 12 33 -3 14 -13
6668a3K2l3PJ1J4m1K6L4m6k2L4m2M1j0J7M5m2J3oj4k2J5mj3J4OJ8Ml6L1k7K7j7
$$ -13 9 -24 -17 -6 8 -33 -7 27 -19 -41 -7 -49 -8 -18 -1 44 2 15 9 -5 -27 -12 -16 -29 -15 -9 9 13 -23 8 -19 8 -9
6701ij5J2J2%j6J5K7j6k2J8rj4M1j3J0j3jl3L1l3K2lJ2qk1J1J1J1lj8NJ4k5N1
$$ -9 -24 -12 0 0 -16 -1 26 10 -12 6 -3 -17 24 11 21 8 7 -26 5 -28 -6 -9 3 -5 -26 -15 -4 7 4 -14 -9 5 -20 31
6735C1o5L7kK6n9M3m0L8J4k4K2j7r%K1l4k1M9jKj7J7Qj2pJ4j5l7L2NL6ll0j8J7
$$ 31 -34 3 1 27 -32 11 -29 9 23 -1 21 4 -5 -5 16 -18 -39 10 9 11 -6 11 19 7 0 14 -1 -38 -6 -1 35 32 2 -16 1
6770Aj2nk8M8k5K9k4M1m6J7J1j2k3J2%rJ0j9N8nlj4NJ9k4K1j5K3k2Pk3K3oMk1
$$ 1 -11 -16 -44 4 -21 8 -16 25 -21 -4 7 -5 -28 -16 -16 -25 -15 -34 24 19 16 2 7 26 2 23 8 31 9 16 -7 16 10 14 -7
6805gMK1j5NMmrK0j4MJ3%k5m5P3j7l9M0j1k4k2M3L5l9mK1mk9JK1oLj3MJ6M4m8
$$ -7 -3 18 3 8 12 8 -1 19 5 9 22 22 -3 -48 25 8 -31 9 -2 -26 -48 -5 30 -9 -13 8 4 -25 -24 -3 -9 -6 -19 -15 1 45 -3
6842cpJ1J3lJ7j4k7jL0jk2L9j7r2R9j8PJ2l0N5l5j4K1j0j4J4l7jJ0K3kjk5j5K6
$$ -3 -10 1 14 11 28 14 -13 -14 16 15 -7 32 15 -77 22 4 11 23 -7 48 13 -1 20 10 -4 10 -27 -28 -18 5 3 2 -23 -38 -12
6877a2K2n5J5mO0m7K4N0p2M5m7kM3n2nP7nmk4k6J5K0l9L6j6rK2Mkl%Qm8M5k4J7
$$ -12 10 -45 -30 -34 26 -21 3 53 -19 26 -21 -23 20 -32 -37 40 35 31 7 -19 -4 16 -23 13 -3 -12 10 14 12 9 9 17 -31 14 -10 7
6913GK6m1JLk7k1N1Rrk4j4K6k3L9J4J7k2l5J2%rj3K4J7l3J5J3m5K3J8Mkj6J0K
$$ 7 33 -8 -7 -4 -31 -52 -1 8 -1 -25 -39 -13 -36 3 17 34 12 -23 -11 -11 -20 -33 -9 8 -25 -10 3 -42 -19 -1 3 1 -15 -5 -3
6948cqk4L8L6m1j1L2J4l5LJ4lJlj9M3Kj1Mml4MJ1Ok6J5m2M4Oll2PQk9K7Lj7N1
$$ -3 -11 -35 3 39 -2 -13 19 33 -2 1 15 12 13 10 -9 34 36 25 29 25 -9 -5 6 12 -14 1 -41 3 9 6 -26 -19 -11 -40 -13 -10 -27 24
6986B4J9p7M0j3PK1o1P1k3j0Qj8MNj4M2jj4lpL1m3RplK3k5K2Qm5M4k0j9J3J5r
$$ 24 43 -34 6 -7 0 21 -40 31 8 -2 6 -12 -8 -3 -17 25 24 10 7 0 31 -12 -3 -10 -13 10 -15 7 15 -30 14 -6 -25 -12 3 -6
7022fk8K6%j6pK2%Lk4J6J6j7nk6K1QJ1rJ8kkM9l1L1n7L1m5K9j0j9QN8m7J3Qj7
$$ -6 -34 -8 -8 -24 -31 -9 -9 -6 -30 -14 2 -15 -20 -46 -25 -17 -6 -15 3 1 -1 48 17 48 -9 22 -23 6 -4 -23 -15 43 -4 9 17 0
7058@Lj0KRRK8j1J7l4j9J2k8LK0%k0J9J1L3p5K5K1k2l8J9k1L5pKOj3mk9J3J4L0
$$ 0 3 -7 -5 4 13 41 30 47 13 -6 6 -22 -19 1 1 -19 0 11 44 -31 -6 15 -7 -45 -26 -47 -12 -19 -17 -11 -24 -28 -57 -44 -30 0
7094@l6J7K1j0J3lj5L1k1pk1L2mOK3j1k0K3l7mK6K9m6M0l5k6L8KNJ9p3M6Qj9K3
$$ 0 -36 -19 2 -8 5 2 -13 18 -3 -10 -31 1 -3 3 26 15 -5 18 -19 -23 3 32 -14 26 -9 -35 3 5 10 29 -44 2 10 -9 14
7129A4l9R%RMmPk6J3L4m0oJ3O%J4J1ql1oK6QJ2Qll3K2l5O7j6l0j6kRL3op2J0P3
$$ 14 -25 -16 -16 -7 -3 -7 0 -26 -13 21 -19 -25 -12 -6 -6 8 19 11 -20 -26 0 8 20 28 25 -8 14 -21 46 30 0 -16 -18 -9 24 18 -54 -44 29
7168B9l9O0j8k2J1J7n8J1J2L9l5Mn2J6L2l5M5p6L8L3k4OK3m0j3O2k3pk9KL1RJ9
$$ 29 -10 50 32 10 21 38 -20 -9 3 42 7 11 -41 -25 7 -28 17 -59 -21 12 -12 -6 17 -23 -36 26 3 -4 -33 -31 0 9 28
7201B8k9Rj7J6Nk0MJ4%L0k3n7N9j2J6n8M7j4K6rJ1l5jL5l0j4RL1J0l5Pj6J3J0
$$ 28 -1 8 -9 7 12 -8 -4 10 10 40 17 -40 19 7 23 -35 12 -2 24 15 26 -9 -10 25 -5 -19 -10 21 31 -4 3 -13 0 10
7235A0k8K0K4l7J0K8m5j6oN1l0K8k5l1N6Rrk4J8rN5m1lk9L0Pk7J5j2M1OJ1k6J1
$$ 10 -18 2 26 -11 -1 27 -18 -34 -40 11 -19 9 -16 -47 9 18 9 -15 3 -6 49 8 5 -24 6 13 -14 1 -11 30 36 47 21 32
7269C2m5L2m5J0N0l0j1JL6k5k9K7m1J9L1K8p4k4L5J3N%j6N0k3j7pk4JM1l1J8L9
$$ 32 -13 19 -26 -16 34 4 -7 -6 30 5 -24 3 -38 -19 12 40 -34 -58 -23 -10 -5 -5 -21 29 6 -11 -18 -42 -41 0 -31 -13 26
7302B6j8njmK4l0K1k5qN5l3L3m0J2J4L3n2Rk3MK1K3k5k7M6l6jL5J2m2k6M8m4K2
$$ 26 8 3 2 -2 22 -8 13 -12 -20 35 2 35 -5 7 21 54 2 11 -12 -8 13 36 11 -16 30 -6 -7 28 40 -2 -28 20 -24 -2
7336bJ4J4o5J1K5j6K4mj2l1M9k6L4k8qJ0RRL0j1q%K1n2K5K2o3nJ5J9KJ6l9QM4
$$ -2 12 26 -39 -28 -3 -19 5 1 -11 -42 7 -19 15 -13 -21 -11 -2 7 37 26 18 18 39 -13 12 34 -29 -34 -19 0 2 18 -21 -13 31
7371C1l5QRrJ8j8J5l3k1J9l3N9l7nL1j2N8m4l1J5pK9j4J7km5L6j7qM2LJoLOl7
$$ 31 -4 4 13 4 22 4 19 -14 -35 -16 -49 10 -27 -32 -1 -13 45 1 -30 -15 -22 7 -7 10 8 -37 -1 -18 -26 16 19 20 14 17 23 -14
7407a4J0j1j3M6Kk9N2l2oRk1lJ4K1J7k1pj2L4k5k4J0pOj3K2K3m0K4k2JKl2L8K6
$$ -14 -4 -15 -28 18 20 -9 43 11 5 14 -7 -10 4 25 42 21 14 2 36 11 -13 -3 -10 -4 -17 5 28 -12 12 -10 -9 -7 -39 -1 25
7442B5l4lM7j9lkOk1K2l4M1j5Nrl8M7J3k7L7j4mk7OKJ7rJ9Nj7qkK3k8J5J6j1l9
$$ 25 -9 -12 35 16 13 11 17 -4 18 -16 25 10 15 6 -32 15 28 1 38 24 20 -7 -1 1 18 9 28 33 16 8 6 29 1 16 32 21 -18
7479a8L8k4K5Jk2Mm2K6qM8m2j2Rm4M7PK4m0M8J0n3J7l4J8J1M1k4n5K4L1j7J1J6
$$ -18 20 -4 21 22 0 4 -38 -12 -20 28 -14 -26 -17 -61 -14 -7 17 -23 25 35 -18 -1 -35 -17 -6 35 11 -44 -20 11 -6 5 21
7512B1rQ%J1j4k3K5%K3m3K9j1mj0L4l7K3m1K8Oj5nPROj5j6J0J1Jlk6j3N6p5J3
$$ 21 12 20 20 31 17 -6 19 19 42 -1 28 17 13 3 37 0 23 -18 10 16 1 -4 3 12 18 3 -13 -3 8 9 6 -20 -33 23 -52 -39
7548c9J2J7kj2OL2J1m8K1%k4J8l9K5K1J4j8J2mJ9J3k0oj2kj5J5JL6mm0K5K0m2
$$ -39 -27 -10 -12 -24 -18 14 25 -23 -2 -2 -26 -8 -47 -22 -1 13 -5 7 3 22 35 15 9 -3 -5 -20 -5 -4 32 28 -12 13 33 -9
7582iNMJ3K3rk5L9k0j6m4J6Rj6L4Mj6%mJ0Nj8mJ8j0k1L2ok2N2m7NNK4K4qj9K2
$$ -9 -4 0 13 36 27 2 41 21 5 -39 -23 -14 -30 4 8 -8 -8 -12 -2 3 -15 -19 -1 -11 -32 0 -6 -28 24 -23 -18 -13 11 35 27 8 30
7619C0m4J9knJ5RKPk4rJ4m5O5l4J4k2K7qk9K6Rj3j5M0k4k0L7k4Nqj8j2J6K4nk3
$$ 30 -14 5 3 -2 13 22 24 31 7 -2 12 -33 32 -2 12 -10 17 9 -20 6 15 2 -13 27 3 -17 20 -4 1 -7 -25 -37 -21 3 -2 -25
7655b5J2L2j3oK9j2J2LrJ3j6l3K5J4l5J9J6l3NM4l2k2J9K5l4Ok7L1k5K5Jj5J1
$$ -25 -13 19 6 0 29 17 29 32 23 36 20 -13 12 26 -9 10 26 -7 -2 42 10 -12 7 32 -2 4 -23 8 -17 8 9 -6 5
7688ErpRlj1J0J3Kj8oMk1PJ7kJ1Kn3M5J5j2K1n2M3qJ5klK0m2j8L7QJ2k7J3K7o5
$$ 5 -4 -11 -2 -5 -16 -6 7 9 -9 -15 -11 -32 -25 -8 -10 1 3 -50 -5 10 -2 19 -33 10 2 17 15 12 32 -10 -28 9 17 29 2 15 42 -23
7726b3L8M6q8M4J9Lj7l5J7PJj7Q0o4m1M3k0K2%j9j2J4jj2K2K1q2L2j1lL0J3jm
$$ -23 15 61 -27 17 36 39 22 -13 4 11 12 -5 75 11 -30 13 -7 15 15 -4 -16 -2 -3 -15 7 28 -54 -22 -33 -36 -6 7 6 2
7760Bl6P9m2j6QN5m3j0L0j9K2l5NjK2l8J9J6onOj4K4K5Jm7j2LJ2j4Om0L4nQm3
$$ 2 -34 45 3 -13 -5 50 7 -3 27 8 30 -5 0 -1 21 -17 2 18 12 7 13 -1 23 48 49 2 -10 -7 5 -9 -3 -43 -9 -14 -6 -49
7796d9O5m4MM9m5LJ4Rj3J3J8l3l0M2NK6j4l8nJ7PJ6k5j5M1k6J9Pqk1K0J2k0Pj6
$$ -49 16 -28 -24 25 -20 -17 -3 6 -7 6 24 -9 -39 3 8 34 20 -18 -23 -6 1 17 -8 -23 18 -8 11 18 10 -11 9 21 1 8 -8
7831hM8l2J4j0Nk9JNJ8j5rK7o2K6K6L1ko5J0pN0j2NJ5k9j9jL6k6jj8N1k8J6k9
$$ -8 40 8 22 12 17 -12 -11 -6 12 -3 -12 15 -47 -21 5 36 34 -31 -21 -28 22 10 15 30 1 -18 -19 17 -9 -10 -28 23 -5 11 -18
7866a8QLO3k1j8Pj2L1n9N0n1M1kj7J6l7K6Qk5j2L7LKl0Nj6oL6Lm2K9j6k9P6q1
$$ -18 -10 -7 56 35 17 24 12 43 -16 34 -17 24 22 5 21 -16 10 18 -7 -19 18 21 23 -7 -2 -18 -24 12 15 -27 2 -14 -43 33 -48
7901d8M5L6l7j0jjJ0k1J1J7m1K7jK5j6L3nk0L9m8K8K1m0J6j9K0j5J9J3n5N4n4
$$ -48 -3 33 -4 -14 -15 -16 -6 -27 -16 1 -40 -13 -14 11 -5 28 23 3 42 -6 22 43 3 19 0 20 5 24 37 -18 36 -18
7933a8j0K4K5k2J6l7J6J7k5J2jM5o5L4n7L1M6l6j3L4ol1L0k0mM8k3l0K0J5k4j
$$ -18 -28 -4 21 -1 15 -22 -6 11 -14 -2 -3 42 -23 11 -46 -15 31 -5 -18 16 10 -21 9 -11 -15 33 10 -20 0 15 -9 -10
7965a0K1k5RK3j1k1K0Nl9M1j2KoPM1o4N2K3n5%J9n4MO1k5mk6OK5k5RL1n3K7Nj7
$$ -10 11 -14 -5 18 7 -14 6 11 -28 13 1 3 -3 4 45 -19 33 56 1 1 20 -34 -30 31 6 2 -24 -18 7 -18 -9 22 -31 -4 1 -16
8001a6k8J1J6J7l8N1m0L1J0m0JN1l3J8JPqj8rK3k5M4Pl8N0n9J4J0j0J5k5K5K6
$$ -16 -44 -33 -17 0 -38 13 -27 4 14 -26 -25 26 -7 11 12 19 11 -7 -16 7 -18 26 33 -5 45 -14 0 10 0 15 -10 15 41
8034D1j4K7k3Ml9k3K9K5k3k5K8J4m2rk4K2km2N9l1K9QkrKRk0J3QJJ6k0N1m9K9
$$ 41 27 54 31 35 -4 -27 2 27 4 -21 7 21 -21 -30 -54 -32 -34 -76 -17 -48 -19 -11 -13 -22 -20 -11 -31 -18 -10 -9 7 -13 38 -11 18
8069A8J5k6J3j7Rk3L1n1K1k7M6K0Kn7O2o8N9pjm4K6K5n8M8k6j2M4k7pmJ1K9l8
$$ 18 33 7 20 3 12 -11 20 -31 -10 -37 9 29 31 -26 36 -32 27 20 19 -25 1 26 -32 16 -10 -22 22 -5 -12 -16 -5 24 -14
8102a4j6O8p0K9j9JJ3k7K3Oj3L4lm3K8PQk6J7J7Qm7N2n1K2J6Qj4J6m9M9k8l5M1
$$ -14 -30 38 -32 -3 -22 -21 -8 -35 -12 -6 -19 15 12 -31 -3 4 12 -14 3 20 28 -19 33 -18 4 20 28 14 30 -19 30 2 -33 8
8136HJ1K8n3K3l9J5QJ1k0Kj4NmJk1J5oK9J4j7j5j2RK0j5MML1m1KJ4j9L8J2k1r
$$ 8 19 47 -6 17 -22 -7 1 12 -8 -6 -20 -15 -19 -18 -39 -24 -30 -1 13 -4 -19 -31 -22 -2 -17 -13 -9 22 -19 -17 -3 -22 16 28 7 -2
8172bJj4%L2j9J5kjJ8ol5N7kqj2ol9L8k3
$$ -2 -1 -15 -15 17 -2 13 11 10 28 22 -13 44 42 34 22 16 -23 15 -8
8191h
##END NTUPLES=NMR FID
##END=
