##TITLE=1H ikalashn
92-2024-BAU
18.10.2024
##JCAMPDX= 6.0         $$ Bruker NMR JCAMP-DX V2.0
##DATA TYPE= NMR FID
##DATA CLASS= NTUPLES
##ORIGIN= UXNMR, Bruker Analytische Messtechnik GmbH
##OWNER= root
$$ TOPSPIN		Version 1.3
$$ 2024-10-18 13:48:48.609 +0400  Irina@DPX200
$$ Compression mode = diff/dup
##.OBSERVE FREQUENCY= 200.131392401
##.OBSERVE NUCLEUS= ^1H
##.DELAY= (6, 6)
##.ACQUISITION MODE= SIMULTANEOUS
##.ACQUISITION SCHEME= undefined
##.AVERAGES= 32
##.DIGITISER RES= 18
##SPECTROMETER/DATA SYSTEM= spect
##.PULSE SEQUENCE= zg
##.SOLVENT NAME= D2O
##.SHIFT REFERENCE= INTERNAL, D2O, 1, 17.95386
##AUDIT TRAIL= $$ (NUMBER, WHEN, WHO, WHERE, WHAT)
$$ ##TITLE= Audit trail, TOPSPIN		Version 1.3
$$ ##JCAMPDX= 5.01
$$ ##ORIGIN= Bruker BioSpin GmbH
$$ ##OWNER= Irina
$$ $$ F:/spectra/data/iren/nmr/1H/4/audita.txt
$$ ##AUDIT TRAIL=  $$ (NUMBER, WHEN, WHO, WHERE, VERSION, WHAT)
(   1,<2024-10-18 13:48:01.140 +0400>,<Irina>,<DPX200>,<TOPSPIN 1.3>,
      <created by zg
	started at 2024-10-18 13:45:53.125 +0400,
	POWCHK disabled, PULCHK disabled
       configuration hash MD5:
       BE 6D 3F 07 2A EA 11 49 91 17 2B D3 AF B3 58 0D
       data hash MD5: 16K
       FA 0D D8 FB 86 C7 9F FA D7 3E 86 8C E2 9D 3C 39>)
$$ ##END=
$$ 
$$ $$ hash MD5
$$ $$ 13 D0 28 2C 2D 53 6C F9 92 EE 5E 38 AD B4 1B BA
##$RELAX= 
##$RELAX= 
##$RELAX= 
##$RELAX= 
##$RELAX= 
##$RELAX= 
##$RELAX= 
##$RELAX= 
##$RELAX= 
$$ Bruker specific parameters
$$ --------------------------
##$DU= <F:/spectra>
##$EXPNO= 4
##$NAME= <1H>
##$PROCNO= 1
##$TYPE= <nmr>
##$USER= <iren>
##$AMP= (0..31)
100 100 100 100 100 100 100 100 100 100 100 100 100 100 100 100 100 100 
100 100 100 100 100 100 100 100 100 100 100 100 100 100 
##$ANAVPT= -1
##$AQSEQ= 0
##$AQ_mod= 1
##$AUNM= <au_zg>
##$AUTOPOS= <>
##$BF1= 200.13
##$BF2= 200.13
##$BF3= 200.13
##$BF4= 200.13
##$BF5= 200.13
##$BF6= 200.13
##$BF7= 200.13
##$BF8= 200.13
##$BYTORDA= 1
##$CFDGTYP= 0
##$CFRGTYP= 5
##$CHEMSTR= <none>
##$CNST= (0..63)
1 1 145 1 1 1 1 1 1 1 1 1 1 1 1 1 1 1 1 1 1 1 1 1 1 1 1 1 1 1 1 1 1 1 
1 1 1 1 1 1 1 1 1 1 1 1 1 1 1 1 1 1 1 1 1 1 1 1 1 1 1 1 1 1 
##$CPDPRG= <>
##$CPDPRG1= <>
##$CPDPRG2= <>
##$CPDPRG3= <>
##$CPDPRG4= <mlev>
##$CPDPRG5= <mlev>
##$CPDPRG6= <mlev>
##$CPDPRG7= <mlev>
##$CPDPRG8= <mlev>
##$CPDPRGB= <>
##$CPDPRGT= <>
##$D= (0..63)
0 2 0 0 0 0 0 0 0 0.06 0 0.03 0 0 0 0 0.0002 0 0 0 0 0 0 0 0 0 0 0 0 0 
0 0 0 0 0 0 0 0 0 0 0 0 0 0 0 0 0 0 0 0 0 0 0 0 0 0 0 0 0 0 0 0 0 0 
##$DATE= 1729244880
##$DBL= (0..7)
120 120 120 120 120 120 120 120 
##$DBP= (0..7)
150 150 150 150 150 150 150 150 
##$DBP07= 0
##$DBPNAM0= <>
##$DBPNAM1= <>
##$DBPNAM2= <>
##$DBPNAM3= <>
##$DBPNAM4= <>
##$DBPNAM5= <>
##$DBPNAM6= <>
##$DBPNAM7= <>
##$DBPOAL= (0..7)
0.5 0.5 0.5 0.5 0.5 0.5 0.5 0.5 
##$DBPOFFS= (0..7)
0 0 0 0 0 0 0 0 
##$DE= 6
##$DECBNUC= <off>
##$DECIM= 32
##$DECNUC= <off>
##$DECSTAT= 4
##$DIGMOD= 1
##$DIGTYP= 9
##$DL= (0..7)
0 120 120 120 120 120 120 120 
##$DP= (0..7)
150 150 150 150 150 150 150 150 
##$DP07= 0
##$DPNAME0= <>
$$ [...]
##$SW= 21.9925939549014
##$SWIBOX= (0..15)
0 0 2 0 0 0 0 0 0 0 0 0 0 0 0 0 
##$SW_h= 4401.40845070422
##$TD= 16384
##$TD0= 1
##$TE= 300
##$TE2= 300
##$TE3= 300
##$TEG= 300
##$TL= (0..7)
0 120 120 120 120 120 120 120 
##$TP= (0..7)
150 150 150 150 150 150 150 150 
##$TP07= 0
##$TPNAME0= <>
##$TPNAME1= <>
##$TPNAME2= <>
##$TPNAME3= <>
##$TPNAME4= <>
##$TPNAME5= <>
##$TPNAME6= <>
##$TPNAME7= <>
##$TPOAL= (0..7)
0.5 0.5 0.5 0.5 0.5 0.5 0.5 0.5 
##$TPOFFS= (0..7)
0 0 0 0 0 0 0 0 
##$TUNHIN= 0
##$TUNHOUT= 0
##$TUNXOUT= 0
##$USERA1= <user>
##$USERA2= <user>
##$USERA3= <user>
##$USERA4= <user>
##$USERA5= <user>
##$V9= 5
##$VALIST= <valist>
##$VCLIST= <CCCCCCCCCCCCCCC>
##$VD= 0
##$VDLIST= <DDDDDDDDDDDDDDD>
##$VPLIST= <PPPPPPPPPPPPPPP>
##$VTLIST= <TTTTTTTTTTTTTTT>
##$WBST= 1024
##$WBSW= 25
##$XGAIN= (0..3)
0 0 0 0 
##$XL= 0
##$YL= 0
##$YMAX_a= 830381
##$YMIN_a= -1153506
##$ZGOPTNS= <>
##$ZL1= 120
##$ZL2= 120
##$ZL3= 120
##$ZL4= 120
##$ABSF1= 10
##$ABSF2= 0
##$ABSG= 5
##$ABSL= 3
##$ALPHA= 0
##$AQORDER= 0
##$ASSFAC= 0
##$ASSFACI= 0
##$ASSFACX= 0
##$ASSWID= 0
##$AUNMP= <proc_1d>
##$AXLEFT= 0
##$AXRIGHT= 0
##$AXTYPE= 0
##$AXUNIT= <>
##$AZFE= 0.1
##$AZFW= 0.1
##$BCFW= 1
##$BC_mod= 2
##$BYTORDP= 1
##$COROFFS= 0
##$CY= 7568.61572265625
##$DATMOD= 1
##$DC= 2
##$DFILT= <>
##$DTYPP= 0
##$F1P= 17.9538593292236
##$F2P= -4.03888763876832
##$FCOR= 0.5
##$FTSIZE= 32768
##$FT_mod= 4
##$GAMMA= 1
##$GB= 1
##$INTBC= 1
##$INTSCL= 1
##$ISEN= 128
##$LB= 0.02
##$LEV0= 0
##$LPBIN= 0
##$MAXI= 945.577
##$MC2= 0
##$MEAN= 0
##$ME_mod= 0
##$MI= -402.1523
##$NCOEF= 0
##$NC_proc= 0
##$NLEV= 6
##$NOISF1= 8.587773
##$NOISF2= 6.764455
##$NSP= 1
##$NTH_PI= 0
##$NZP= 0
##$OFFSET= 17.95386
##$PC= 1
##$PHC0= 224.2479
##$PHC1= -34.38509
##$PH_mod= 0
##$PKNL= yes
##$PPARMOD= 0
##$PPDIAG= 0
##$PPIPTYP= 0
##$PPMPNUM= 100
##$PPRESOL= 1
##$PSCAL= 0
##$PSIGN= 0
##$REVERSE= no
##$SF= 200.13
##$SI= 32768
##$SIGF1= 18.5376
##$SIGF2= -6.396296
##$SINO= 400
##$SIOLD= 32768
##$SREGLST= <1H.CDCl3>
##$SSB= 3
##$STSI= 0
##$STSR= 0
##$SW_p= 4401.40845070423
##$SYMM= 0
##$S_DEV= 0
##$TDeff= 0
##$TDoff= 0
##$TI= <>
##$TILT= no
##$TM1= 0
##$TM2= 0
##$TOPLEV= 0
##$USERP1= <user>
##$USERP2= <user>
##$USERP3= <user>
##$USERP4= <user>
##$USERP5= <user>
##$WDW= 1
##$XDIM= 8192
##$YMAX_p= 0
##$YMIN_p= 0
$$ End of Bruker specific parameters
$$ ---------------------------------
##NTUPLES= NMR FID
##VAR_NAME=  TIME,          FID/REAL,        FID/IMAG
##SYMBOL=    X,             R,               I
##VAR_TYPE=  INDEPENDENT,   DEPENDENT,       DEPENDENT
##VAR_FORM=  AFFN,          ASDF,            ASDF
##VAR_DIM=   8192,          8192,            8192
##UNITS=     SECONDS,       ARBITRARY UNITS, ARBITRARY UNITS
##FACTOR=    0.0002272,     1,               1
##FIRST=     0,             0,               0
##LAST=      1.8609952,     23,              -46
##MIN=       0,             -1153506,        -1153506
##MAX=       1.8609952,     830381,          830381
$$ Real data points
##PAGE= N=1
##DATA TABLE= (X++(R..R)), XYDATA
0@%%%%%%%%%%%%%l2O4o4O4o4R6j28J60j92K24k81L13l52M16m80N71o67P36q32
$$ 0 0 0 0 0 0 0 0 0 0 0 0 0 0 -32 32 -32 32 -32 64 -64 96 -96 128 -153 160 -192 224 -256 315 -352 384 -448
32d48R60j088J248j408J568j760J983k222K470k743L040l366L718m121M562n019
$$ -448 512 -576 672 -736 832 -928 1055 -1167 1303 -1440 1600 -1766 1952 -2169 2393 -2626
48b626N531o098O708p397Q162r006R940j0995J2201j3573J5159j7028J9261k1981
$$ -2626 2905 -3193 3515 -3882 4280 -4726 5214 -5781 6420 -7153 8006 -9022 10239 -11742
62a1742K5386k9791L5742m4277N7644q1801J39506n39138p05035L93015M36263
$$ -11742 13644 -16147 19595 -24682 32962 -48839 90667 -448471 -1153506 -760491 -324228
73c24228O24464L63015J23530k86704m71446n60007l51590p5996K89933M88740
$$ -324228 300236 663251 786781 500077 28631 -531376 -882966 -958962 -669029 -180289
83a80289N47792L55628P3145k65701m62029n01901l18622l7686K79291M68805
$$ -180289 367503 723131 796276 530575 68546 -433355 -751977 -789663 -510372 -41567
93d1567M95040L17523L9559k60715m42719m60100k88917j7411K65849M36844M44925
$$ -41567 453473 770996 810555 549840 107121 -352979 -641896 -659307 -393458 43386 488311
104D88311K77309J0935k59496m21631m24074k60981k621K53781M05195M00639
$$ 488311 765620 776555 517059 95428 -328646 -589627 -592248 -338467 66728 467367
114D67367K40153j0907k56001l98693l89261k31667J0652K44441L78561L64518
$$ 467367 707520 696613 440612 41919 -347342 -579009 -568357 -323916 54645 419163
124D19163K09073k4898k47790l73665l55434k02331K4119K37326L55865L34529
$$ 419163 628236 603338 355548 -18117 -373551 -575882 -551763 -314437 41428 375957
134C75957J84155l4492k37791l47876l23259j75448L6188K30747L33827L07242
$$ 375957 560112 525620 287829 -60047 -383306 -558754 -522566 -291819 42008 349250
144C49250J63148m1792k27748l23633k94357j52951M5608K23319L12496K81359
$$ 349250 512398 470606 242858 -80775 -375132 -528083 -482475 -259156 53340 334699
154C34699J43321m8213k18115l01400k68473j33197N1965K14445K92199K57531
$$ 334699 478020 429807 211692 -89708 -358181 -491378 -439413 -224968 67231 324762
164C24762J24974n3434k08451k81130k44996j15461N6624K04877K72832K35448
$$ 324762 449736 396302 187851 -93279 -338275 -453736 -397112 -192235 80597 316045
174C16045J08605n7491j98971k62161k23692r9942O0377J95529K54022K14788
$$ 316045 424650 367159 168188 -93973 -317665 -417607 -357230 -161701 92321 307109
184C07109R3977o0988j90195k44250k04148q6349O3111J86246K36163J95312Q0486
$$ 307109 401086 340098 149903 -94347 -298495 -384844 -321733 -135487 100676 295988 376474
195C76474o3929j81559k27643j86379p4269O5042J77167K19433J77591O8012o6170
$$ 376474 312545 130986 -96657 -283036 -357305 -292263 -115096 104337 281928 349940 283770
206B83770j73064k12116j69879o2902O6512J68508K04307J61381N6881o7654j64922
$$ 283770 110706 -101410 -271289 -334191 -267679 -99171 105136 266517 323398 255744 90822
217I0822j97461j54039n2224O7965J60601J90197J46644M7294o8668j56849j83373
$$ 90822 -106639 -260678 -312902 -244937 -84336 105861 252505 299799 231131 74282 -109091
228a09091j39473m2662O9327J53115J77044J33115L8685o9341j49102j70367j26352
$$ -109091 -248564 -291226 -221899 -68784 108260 241375 280060 210719 61617 -108750 -235102
239b35102l4157O9985J45836J64469J20509L0713o9603j41778j58458j14553k7010
$$ -235102 -269259 -199274 -53438 111031 231540 262253 192650 50872 -107586 -222139 -249149
250b49149O9710J38197J52898J09023K3587o9558j34786j47489j03828k0904O9054
$$ -249149 -179439 -41242 111656 220679 244266 174708 39922 -107567 -211395 -232299 -163245
261a63245J31026J42058R8444J7518o9102j28075j37217r3901j5032O8442J24426
$$ -163245 -32219 109839 208283 225801 156699 28624 -108593 -202494 -217526 -149084 -24658
272b4658J31925Q8827J2188o8374j21411j27366q4549r797O7828J18196J22573
$$ -24658 107267 196094 208282 139908 18497 -108869 -193418 -203215 -135387 -17191 105382
283A05382Q0329P492o7261j15020j18118p6073n195O6935J12246J14013P2329
$$ 105382 185711 193203 125942 10922 -107196 -183269 -188464 -121529 -9283 104730 177059
294A77059L162o6106j09030j09663o8298j004O5754J06378J05854O4806p36o5025
$$ 177059 180221 114115 5085 -104578 -172876 -173880 -108126 -1748 104106 168912 168176 103151
306A03151j03491j01898o1182K567O4478J00731R8095N7809m150o3885r8193r4454
$$ 103151 -340 -102238 -163420 -160853 -96375 4356 102451 160260 156110 92225 -5968 -100422
318a00422n4743N725O3123R5455R0743N1527p245o2627r2949q7516m8611Q606
$$ -100422 -155165 -149440 -86317 9138 99881 151408 144163 81536 -11413 -98929 -147540 -138934
330a38934O1774R0496Q4068M5731j0048o1101q7975q0975m3013J1174O0412Q5627
$$ -138934 -77160 13336 97404 143135 133087 71986 -15989 -96964 -139977 -128803 -68391 17236
342A7236P7889M0458j2270n9585q3292p4882l7875J3289N8813Q1015P2161L5595
$$ 17236 95125 135583 123313 63728 -19564 -94446 -132321 -119032 -60219 20796 92957 128552
354A28552j4231n8011p8742o9281l3296J5061N7121P6639O6705L1235j5816n6306
$$ 128552 114321 56310 -22432 -91713 -125009 -109948 -52827 23812 90517 121752 105936 49630
366D9630p4442o4138k9260J6416N5495P2382O1669K7366j7059n4493p0453n9256
$$ 49630 -24812 -88950 -118210 -101794 -46299 26083 87752 115118 98059 43566 -26887 -86143
378h6143k5636J7717N3551O8440N7002K3876j8160n2668o6431n4806k2259J8579
$$ -86143 -111779 -94062 -40511 27929 84931 108807 90647 37979 -28452 -83258 -105517 -86938
390h6938N1772O4495N2786K0656j9003n0872o2749n0586j9162J9401M9931O0890
$$ -86938 -35166 29329 82115 102771 83768 32896 -29853 -80439 -99601 -80200 -30269 30621
402C0621M8592J7655j9764m9072n9200m6582j6306K0074M8184N7436M4644J4926
$$ 30621 79213 96868 77104 28032 -31168 -77750 -94056 -73982 -25798 31638 76282 91208
414I1208k0417m7408n5691m2841j3562K0657M6468N4070M1049J2231k0869m5636
$$ 91208 70791 23383 -32308 -75149 -88711 -68054 -21586 32484 73533 85764 64895 19259
426A9259n2463l9241j1054K1178M4778N0872L7563R869k1336m3938m9260l5910
$$ 19259 -33204 -72445 -83499 -62321 -17543 33329 70892 80761 59425 15487 -33773 -69683
438f9683q693K1580M3115M7804L4316P623k1719m2319m6330l2675o534K1896M1504
$$ -69683 -78376 -56796 -13681 34123 68439 76062 54343 12024 -34306 -66981 -73515 -51619 -10115
451a0115M4835L1133N580k1998m0673m3400k9676m601K2028L9785M2052K8295
$$ -10115 34720 65853 71433 49435 8762 -34638 -64314 -68915 -46887 -7102 34950 63245
463F3245L652k2192l8944m0718k6899k808K2124L8208L9347K5528J950k2127l7363
$$ 63245 66897 44705 5761 -34957 -61856 -64664 -42540 -4332 35015 60543 62493 40366 3003
476C003l8067k4275j191K2161L6472L6884K2990M99k2054l5744l5619k1830K49
$$ 3003 -35064 -59339 -60530 -38369 -1897 34987 57977 58476 36422 678 -34941 -56771 -56522
489e6522K1975L4954L4358K0725r12k1815l4121l3200j9601J432K1770L3378L2005
$$ -56522 -34547 407 34765 55490 54578 32763 -1358 -34558 -54159 -52727 -30957 2421 34426
502C4426J8590k060k1629l2591l0958j7473K568K1508L1875K9811J6499l078k1396
$$ 34426 53016 50956 29327 -3264 -34222 -51695 -49127 -27619 4256 34067 50566 47488 26092
515B6092l1097k8766j5593L714K1170L0332K7713J4641m204k1001k9585k6788
$$ 26092 -5005 -33771 -49364 -45650 -24480 5852 33565 48206 44002 23001 -6584 -33372
527c3372j3626M572K0884K8879K5714J2842n043k0700k8155k4788j1963N455K0504
$$ -33372 -46998 -42426 -21542 7337 33051 45893 40850 20150 -8005 -32793 -44756 -39301 -18797
540a8797K7501K3787J1130n830k0331k6758k2879j0367O218K0059K6089K2040
$$ -18797 8704 32491 43621 37791 17460 -9298 -32177 -42544 -36326 -16267 9822 31862
552C1862R588o567j9847k5451k1171q858O911J9728K4731K0291Q133p197j9446
$$ 31862 41450 34883 15036 -10415 -31586 -40444 -33533 -13805 10926 31217 39350 32153 12707
565A2707k4139j9444p418P468J9246K3508J8670O768p769j8984k2807j7887o129
$$ 12707 -11432 -30876 -38294 -30826 -11580 11928 30598 37366 29597 10613 -12194 -30081 -36210
578c6210P961J8751K2227J7099N553q199j8530k1665j6371m970Q309J8313K1013
$$ -36210 -28249 -9498 12729 29828 35381 27182 8652 -13013 -29384 -34354 -26045 -7732 13281
591A3281J5649M331q587j7988k0546j4915l857Q683J7717J9865J4225L328q864
$$ 13281 28930 33261 24674 6686 -13860 -28775 -32632 -23949 -6232 13633 27858 31186 22322
604B2322j7507j9329j3622k894Q989J7227J8766J2967K410r122j6911j8216j2364
$$ 22322 4815 -14514 -28136 -31030 -22041 -4814 13952 26919 29329 20207 3296 -14920 -27284
617b7284j911R245J6699J7781J1791J574r304j6375j7108j1179j076R387J6218
$$ -27284 -29195 -19950 -3251 14530 26321 27895 18591 2216 -14892 -26071 -27147 -17760 -1542
630a542J6696J0666Q28r394j5817j6144j0063l54R474J5642J5727R618M7r524
$$ -1542 15154 25820 26648 17254 1437 -14707 -24770 -25124 -15650 -8 15719 25337 25384 15860
644A5860j5332j5229r087K95R525J5083J4710Q620o38r567j4882j4351q093R07
$$ 15860 528 -14701 -23788 -23493 -13968 1115 15825 24445 23807 14240 -642 -14993 -23086 -22179
658b2179R478J4552J3795P562j287r588j4298j3456p208J441R572J3970J2877
$$ -22179 -12701 1851 15646 23208 21921 12333 -1965 -15421 -22629 -21188 -11616 2354 15231
671A5231O743j801r549j3803j2503o344K079R491J3475J2059N860k216r503j3156
$$ 15231 21974 20173 10624 -3179 -15682 -22026 -19947 -10456 3019 15078 20938 18722 9219 -3937
685c937j1642n467K411R532J2930J1308N095k602r397j2701j0833m639K854R368
$$ -3937 -15579 -21046 -18635 -9103 3827 15135 20230 17628 8231 -4470 -15303 -19942 -17088 -7720
699g720J2445J0443M390k988r300j2067j0122l989L183R270J1919R636L696l349
$$ -7720 4725 15168 19558 16570 7270 -4797 -14919 -18908 -15725 -6455 5464 15100 18796 15447
713A5447r193j1573r347l407L467R092J1270R001L061l656r056j1140q574k861
$$ 15447 6254 -5319 -14666 -18073 -14606 -5514 5756 14757 17818 14162 5106 -6034 -14608 -17469
727a7469L720Q916J0828Q186K553l862q950j0527p951k308M006Q729J0269P653
$$ -17469 -13749 -4833 5995 14181 16734 12872 3922 -6605 -14556 -16864 -12858 -4129 6140 13793
741A3793K082m107q690j0022p312j776M163Q652R789O985J660m226q530r480o635
$$ 13793 15875 11768 3078 -6944 -14256 -16032 -11869 -3217 6572 13557 15217 10991 2461 -7019 -13654
756a3654j393M368Q398R346O422J220m418q235q996o070j035M458Q238Q764N907
$$ -13654 -15047 -10679 -2281 7065 13487 14707 10289 2054 -6942 -13012 -14047 -9589 -1351 7413 13320
771A3320Q16m507q038q540n604o63M487Q016Q293N324M56m628p857q062n128k87
$$ 13320 14136 9629 1591 -6949 -12553 -13216 -8729 -713 7580 12904 13360 8732 875 -7187 -12315 -12602
787a2602M613P722P808M828Q5m626p636p611m629K0M660P484P364M332k28m650
$$ -12602 -7989 -267 7541 12369 12454 7828 192 -7419 -12048 -12028 -7368 116 7480 11812 11584 6934
803F934p373p186m086K44M703P280O975L857m59m665p097o769l723O28M707O991
$$ 6934 -439 -7625 -11711 -11467 -6764 516 7491 11348 10889 6224 -873 -7642 -11365 -10737 -6030 961
819I61O501L540p36m674o875o282l306Q34M680O738O162L115r59m626o624n891
$$ 961 7462 11002 10266 5592 -1283 -7565 -10871 -10037 -5357 1381 7543 10658 9699 5073 -1551 -7442
835g442k999J119M601O464N723K742j097m578o412n519k612J203M629O255N305
$$ -7442 -10441 -9322 -4721 1743 7466 10208 9111 4533 -1879 -7398 -10010 -8807 -4178 2077 7382
850G382K471j350m622o100n113k304J451M535N952M987K112j477m574n769m841
$$ 7382 9853 8503 3881 -2219 -7332 -9636 -8185 -3650 2302 7289 9401 7924 3350 -2419 -7260
865g260j937J603M461N716M667J746j669m419n545m435j648J712M367N428M289
$$ -7260 -9197 -7594 -3133 2583 7250 8996 7327 2908 -2637 -7072 -8720 -7008 -2641 2787 7076
880G076J525j778m356n319m097j382J804M311N177L950J314j921m325n025l863
$$ 7076 8601 6823 2467 -2852 -6949 -8331 -6527 -2216 2961 6911 8225 6304 1979 -3046 -6909
895f909j091J913M296M904L611J025j983m210m817l521q69K058M117M728L312
$$ -6909 -8000 -6087 -1791 3113 6724 7749 5766 1556 -3261 -6782 -7651 -5593 -1476 3252 6564
910F564P99k078m123m521l272o57K119M083M482L000N95k139m023m323k906m22
$$ 6564 7363 5285 1162 -3359 -6631 -7288 -5169 -1086 3396 6396 6991 4852 829 -3494 -6400 -6822
926f822K151L975M245K730L87k196l884m127k649k63K268L840M029K457J67k186
$$ -6822 -4671 -696 3549 6279 6666 4470 586 -3541 -6190 -6453 -4185 -345 3684 6141 6308 4122
942D122l839l907k345j19K277L749L746K325Jk285l732l604k183P7K274L596L577
$$ 4122 283 -3624 -5969 -6088 -3811 -62 3684 6009 6010 3725 -7 -3611 -5794 -5717 -3443 153 3730
959C730K061j78k241l633l428j952K00K244L555L354J814k73k341l417l221j779
$$ 3730 5791 5613 3372 -261 -3689 -5641 -5441 -3197 358 3712 5526 5253 2912 -505 -3726 -5505
975e505L35K288L425L170J611l82k308l348l051j486L69K318L266K984J465n67
$$ -5505 -5170 -2882 543 3713 5324 4942 2634 -714 -3765 -5251 -4882 -2564 702 3686 5151 4584
991D584k301l219k787j347N07K344L130K768J262o25k285l059k683j197O88K358
$$ 4584 2283 -936 -3723 -5070 -4563 -2219 911 3679 4941 4316 2031 -1028 -3711 -4908 -4220 -1862
1007a862L009K505J111o40k294k991k462j066Q21K236K948K317J012q32k234k846
$$ -1862 1147 3652 4763 4123 1829 -1162 -3624 -4690 -3869 -1633 1315 3632 4644 3812 1578 -1268
1023a268k316q99Q49K301K728K219P99q54k216k745k152p38Q65K210K719K057
$$ -1268 -3584 -4483 -3634 -1333 1395 3614 4413 3559 1343 -1402 -3554 -4292 -3427 -1217 1502 3559
1039C559O31r18k251k581j934o32J003K099K564J910N06r58k210k483j801m91
$$ 3559 4190 3272 1021 -1560 -3494 -4126 -3123 -1024 1540 3450 3956 2998 788 -1695 -3496 -3987
1055c987J009K164K462J733M09j072k116k378j646l82J037K116K366J567L26j063
$$ -3987 -2978 -814 1648 3381 3790 2718 602 -1776 -3422 -3804 -2767 -651 1715 3282 3608 2545
1071B545k055k273j554k20J125K028K207J515J57j126k008k121j415j61J091K098
$$ 2545 490 -1783 -3337 -3557 -2432 -404 1803 3318 3475 2349 341 -1780 -3195 -3356 -2265 -167
1087a67K015J337J22j131k018k007j257l8J143J958J924J240Lj171j915j912j139
$$ -167 1848 3185 3307 2176 158 -1849 -3106 -3144 -2001 -43 1881 3121 3124 1953 38 -1874 -3013
1104c013k6J206J908J860J102n1j242j881j751j120J45J178J902J759R21j30j211
$$ -3013 -3039 -1833 75 1935 3037 2986 1744 -137 -1888 -3008 -2863 -1685 217 1976 2897 2767 1556
1121A556j796j710r39J88J226J794J688Q26k40j201j745j588q66K63J229J741
$$ 1556 -240 -1950 -2889 -2701 -1475 319 2007 2833 2593 1392 -353 -1941 -2807 -2544 -1315 426
1137D26J552P19k63j234j714j472o72K70J208J674J423P16l32j231j649j403o38
$$ 426 1978 2697 2434 1200 -514 -1986 -2658 -2388 -1180 494 1917 2633 2301 1070 -579 -1982 -2620
1154b620L18J318J520J374N78l29j243j621j259n67M48J160J581J223N78m68j194
$$ -2620 -2302 -984 536 1910 2488 2159 916 -705 -1964 -2531 -2083 -923 658 1881 2459 1991 797
1171G97j504j270m04M56J207J472J189M31m76j194j427j163m18N15J255J411J089
$$ 797 -707 -1977 -2381 -1925 -718 754 1943 2374 1898 704 -723 -1886 -2304 -1789 -534 877 1966
1188A966L50n96j179j370j032k80N20J196J296J010L28o12j180j305r98j80N61
$$ 1966 2316 1720 541 -829 -1861 -2141 -1621 -425 871 1881 2209 1597 417 -888 -1886 -2066 -1505
1205a505J152J239R25J70n92j124j242r09j38O39J088J182R04P9o12j068j249
$$ -1505 -353 886 1811 1981 1389 265 -977 -1886 -2024 -1385 -297 885 1789 1868 1256 188 -1061
1222a061q05p7O69J064J161P52P6o09j082j143p12m2O50J060J178O33N9p37r85
$$ -1061 -1866 -1943 -1274 -210 951 1703 1779 1170 88 -1055 -1767 -1809 -1159 -99 1079 1712 1771 1034 49
1241D9j066o33m4O59J124R65O94n3o65j055j009o08J9P29J053R74M83no97j050
$$ 49 -1017 -1650 -1694 -1035 89 1054 1748 1695 1030 -25 -1034 -1642 -1623 -894 159 1133 1616 1611 914 -136
1261a36r10n68J24O90R58R46N20j45o45j004q51n32J05P56Q95Q65M63j58o94r72
$$ -136 -1046 -1614 -1490 -800 158 1104 1624 1479 834 -170 -1021 -1553 -1448 -692 203 1068 1531 1373 679 -293
1281b93p94m16J33O76R33Q39L60j37p38r25p92l18K33O00R36P50L54k49o46q56
$$ -293 -1087 -1503 -1370 -694 239 1078 1438 1301 563 -362 -1154 -1472 -1239 -639 297 1047 1401 1152 506 -350
1301c50p73k70J62P22Q79O91L08l01o88q25o54l02K91O15Q98O57K63k85o63q14
$$ -350 -1123 -1393 -1231 -509 370 1061 1369 1068 380 -445 -1099 -1401 -1110 -495 403 1060 1323 1038 375 -439
1321d39o41k44L00P07Q15N84J81k88o64p85o30j17L38O21P36N94J73l62o57p10
$$ -439 -1080 -1324 -1024 -317 498 1082 1263 975 311 -474 -1104 -1221 -883 -262 474 1068 1241 879 222 -488
1341d88n68j29L05O73P41N18Q4k84o69o66n28r4K97N94P37M60J13k83o71o46m82
$$ -488 -1056 -1185 -880 -207 534 1052 1136 852 183 -483 -1011 -1105 -808 -214 523 983 1096 813 142 -504 -986
1362i86j30M11N96O30N20ol48n95o66m20q9L90O17O14M31Ll35n92o44l45kL19
$$ -986 -1116 -705 -109 521 1041 1035 687 92 -574 -994 -1083 -693 -76 538 969 972 637 45 -599 -944 -946 -627
1384f27O23N64L32M9l36o08n39m20K5L83N88N26L30K0l96n38n92k93RL73N45N46
$$ -627 -4 560 892 941 605 -3 -542 -962 -937 -554 34 560 890 910 514 -24 -616 -909 -900 -527 18 564
1406E64L29q2l33n57n10k90L5L89N20M67L17o5l89n09m84k49Q7L39N20M46L01
$$ 564 893 811 478 -79 -589 -879 -844 -455 65 532 849 784 395 -114 -598 -847 -760 -421 99 545 846
1427H46r7l40n19m25k75J14L05M85M96J82p5l24n41m28j71P2L81M33M25K30j29
$$ 846 749 409 -110 -535 -810 -696 -391 94 590 772 697 373 -168 -596 -767 -695 -314 119 544 774 645
1448F45l37m34m29j84Q0L72M80L98J26j12l49m47l64j57J18L28M16L89J73j42
$$ 645 308 -126 -555 -739 -659 -287 193 591 717 605 256 -191 -555 -712 -594 -266 150 539 712 570
1468E70l27m40l62j07Q4L38M42L41J11p8m36m14k79j18J86K99M09K93J09j10l50
$$ 570 243 -197 -559 -666 -582 -244 198 539 650 572 136 -278 -557 -675 -489 -190 219 512 621 511 161
1489A61m43k55r3J33L62L70K83J13j52l26m15k86QR7L33L92K27P0j20l85l17k63
$$ 161 -282 -537 -630 -497 -135 235 518 631 479 153 -262 -548 -540 -443 -110 282 509 579 459 74 -243 -506
1511e06n8J63L07L38K61L7j67k96l77k00p4J90L32L01K44L9j58l08l73j67m3J48
$$ -506 -564 -401 -94 244 505 542 375 79 -298 -498 -572 -382 -50 251 495 534 376 68 -305 -472 -515 -367
1533c67L53K71K51Pj74k89l27j90n9K29K64L41J66jj66l11k65j94j8J84K87L16
$$ -367 -14 257 508 515 341 52 -275 -465 -524 -295 -31 310 476 475 309 -2 -267 -461 -479 -295 -8 308
1555C08J45j9k26k66k40k00O7J39L00K90J36lj64k90k53j67N5J96J81K52J63n9
$$ 308 453 434 208 -58 -298 -498 -431 -292 8 298 434 431 267 -23 -276 -443 -388 -192 -11 241 404 345
1577C45j44k48k59j14qK25K70J69J38n0j49k18k54j03L7J83K59J89J86r7k03k49
$$ 345 201 -47 -306 -420 -428 -203 67 236 374 324 175 -43 -297 -400 -363 -180 79 268 454 357 154 -95
1599i5k00r3Q2J53K35K35L0n4j72k09k40m1P2J63K42J68P4l0k29j73k20m0LJ84
$$ -95 -295 -388 -306 -153 82 317 347 293 121 -88 -328 -369 -297 -134 108 276 350 320 91 -82 -302 -342 -339 -155
1623a55K59J97K3m7k19j68j64n5L3J59K34J64M2q8j54j82j68k4O7J57K44J13L4
$$ -155 104 301 324 277 58 -110 -274 -329 -296 -137 97 261 303 215 61 -121 -289 -313 -246 -89 155 268 302
1646C02o1j99j60j07r8J10J62J92J51K5j55j08j48j72l3R2J61J97J31Pp6j95j54
$$ 302 241 42 -118 -225 -323 -213 -51 141 292 317 162 54 -94 -266 -299 -207 -46 151 282 289 213 18 -136
1669a36j30nL5K20J49Q4N7o3k12j65o5j3J03J03J91J08l2r1j19j76r8jR9J47J42
$$ -136 -266 -271 -236 -16 133 217 274 211 -1 -166 -231 -244 -141 -38 153 261 229 138 19 -157 -255 -256 -157 -10 132
1694A32J10Nr2j51j63n2J0P7J27J35N1jj4j90j06r3J1O3J18J46R7J4j34j11j45
$$ 132 242 247 155 4 -159 -211 -201 -124 3 138 189 188 174 -16 -122 -215 -204 -141 -23 123 220 234 100 -11 -156
1719a56o5k4J02J62J36N5K5j11j37j28n6pJ14J26Q4R5J8j45j57q9m1L8J19J10
$$ -156 -221 -245 -143 19 155 210 235 124 -13 -141 -197 -204 -90 36 120 215 233 88 -69 -158 -199 -161 -42 68
1743F8J30kK0r1j58o9p9K8J15N8J07N4Pr5q3j07o5N0L5J18N9P2K6j02j62n1o8
$$ 68 198 196 216 125 -33 -102 -181 -153 -38 20 127 181 188 93 10 -97 -162 -112 -77 41 100 172 198 96 -66 -117 -185
1770a85pJ15R1J44L8m0j06j08o7k4KP6J14J17m2j2r9p7n8j3l4J33P4M4P5l7r9
$$ -185 -192 -77 14 158 196 156 50 -58 -125 -149 -147 -71 43 160 118 106 7 -70 -128 -141 -175 -42 32 76 151 114 15
1797A5n3o9o9K2R5J22O5M5n6p6j62k1l0P9P4R0L5K1n7k4j31k2l5N8P1M2O2K8k8
$$ 15 -38 -107 -176 -154 -59 63 128 173 117 41 -121 -142 -172 -93 -19 71 106 127 70 46 -85 -107 -142 -84 -13 29 91 119 91
1826I1j06n3n9k0Q8K3Q5O5Mm7p7p5k3k4J7J32P5nJ8m1q5k7l3oN2N1N7M4K2n4r1
$$ 91 -15 -68 -127 -147 -59 -36 49 114 118 71 -6 -81 -104 -128 -111 21 96 91 109 68 -17 -44 -77 -83 -31 20 77 121 143 89 -2
1857b%p7L8J8O3L1K2N3n1j20J0j14O9j9J06J8L5JJ4q6r3l4m0R2M4R1K8kp9Pq6
$$ -2 -2 -79 -41 -23 40 71 93 146 95 -25 -15 -129 -60 -79 27 45 80 81 95 9 -84 -118 -158 -66 -22 69 97 95 16 23 -63
1888f3l8KM8M4J16m0%k7o9j2k4m9J05M4M3M4k3l1p9o7J0j2J1R1O0J1l8mm2p7J4
$$ -63 -101 -99 -51 -7 109 69 69 42 -27 -39 -63 -112 -7 37 80 124 101 70 -9 -76 -66 -78 -67 24 84 95 57 53 11 -66 -52
1919e2l0N1J08j7K8j4m9k4o0rm7N3P3J0N1K9o2p5j8l2J1N2M3N9lJ1m0l8q1J4Q
$$ -52 -82 -31 77 60 88 74 25 1 -59 -68 -115 -62 11 21 72 101 39 -36 -54 -86 -75 -23 20 79 76 87 47 9 -72 -58 -50
1950e0O9M1K6K6n1l8o2j2j1K4P3L5OK6p4k7k5p3L2J4N8K2NJ09j10j9m6k2k8J4
$$ -50 19 60 86 112 61 23 -39 -51 -62 -38 35 70 76 102 28 1 -24 -97 -65 -51 7 29 34 143 33 14 -32 -54 -82 -68
1980f8L9O3NnJjm8k8m9J2J8Q6M4qop4k5j9NN8L1K4J7k1j0pn5qk4L2O3%K0J4l6
$$ -68 -29 34 39 34 35 34 -14 -42 -91 -79 -61 25 69 61 55 -19 -44 -63 -58 0 31 55 72 51 41 34 -21 -29 -53 -21 42 42 62 76 40
2015D0l5lm9J4m3N4P8K7m5nl5l9J3l3J7M5oP7j5o1J0j0l2oK8J9P5j4k2kj0n1l6
$$ 40 5 2 -47 -33 -76 -22 56 83 38 33 -2 -41 -28 -61 -44 1 -5 72 57 -4 6 -4 -36 -42 -14 5 80 66 44 42 32 -19 -55
2048e5k6N0J3Q8J2n1K8p9Lm9mP1l5N8NJ1m4Pl5k6J9J1j2M2J1L3o5j1KNn7O1J7
$$ -55 -81 -31 -18 70 82 31 59 -20 -17 -66 -70 1 -34 24 29 40 -4 3 -32 -58 -39 -28 -40 2 13 46 -19 -30 -28 -23 -80 -19 -2
2081bK7J0n8N2m8j6l8M0k2L3L5J8J9pj9n4pN5j0j3J1J0M2o4nOj9kK6L2K2j1k1
$$ -2 25 35 -23 29 -19 -35 -73 -33 -55 -22 13 31 50 43 24 -30 -37 18 8 -5 6 16 58 -6 -11 -5 -24 -26 0 32 54 43 22
2114B2k2jj4k8L5l5P7j0j2L0l2l5ml0J5j0J02l1l8L5m3j8rK5k3N0NK1j7M3m4j6
$$ 22 0 -1 -15 -43 -8 -43 34 24 12 42 10 -25 -29 -59 -44 -54 48 17 -21 14 -29 -47 -56 -31 -54 -4 1 22 5 48 4 -12
2146a2k7J6K1K0J5K1l3K8k3k4Ko2L4Nj4P2l5M2o6K6j7m7M7MM7n7L5k3J6j2o7K9
$$ -12 -39 -23 -2 18 33 54 21 49 26 2 4 -58 -24 -19 -33 39 4 46 -20 6 -11 -58 -11 -7 40 -17 18 -5 11 -1 -68 -39
2178c9J0M7j9j2N4lk9k3K0j4j1j8M3j3L1k8nNk8K4n1M5K0lL8l7rj9K7nJ8n2N0
$$ -39 -29 18 -1 -13 41 38 9 -14 6 -8 -19 -37 6 -7 24 -4 -9 -4 -32 -8 -59 -14 6 3 41 4 -5 -24 3 -2 16 -36 14
2211A4OqnJ5j9j0m2L0K4mN3k0k8rl6KJ5j6QM5l9M6m2Qm1OoP5J3k4K9m9km0L8j8
$$ 14 20 12 7 22 3 -7 -49 -19 5 1 54 34 6 -3 -39 -37 -22 -38 -30 15 -24 22 -20 -12 -53 -47 -53 22 35 11 40 -9 -11 -51 -13 -31
2247c1J3L8%l4LM8j0l0n4L8l2M1L6k3%L6%l1k1J7pJ7QPk7M8r4NJ6j6J8K9k3K4
$$ -31 -18 20 20 -14 -11 37 27 -3 -57 -19 -51 -10 26 3 3 39 39 8 -13 4 -3 14 22 29 2 50 -44 -39 -23 -39 -21 8 -15 9
2281Ij8l2K8Pj3o2L4M6k5L4j3k7j0L1j6PJ7qK8k9jL2mj6n1K1L6OJ2N8o1mj9k2
$$ 9 -9 -41 -13 -6 -19 -81 -47 -1 -26 8 -5 -32 -42 -11 -27 -20 -3 -11 17 -12 -13 19 15 -1 -52 -31 5 11 23 81 20 16 -3 -25
2315b5L3m4J8L4N2n4J2k7n6N3j2l5K1M3qj9O5l9l7oL9m1l3N1L0l7J8Qm6l0M3K6
$$ -25 8 -36 -18 16 68 14 26 -1 -57 -4 -16 -51 -30 13 5 -14 51 12 -25 -31 8 -33 -66 -15 15 -22 -4 4 -42 -72 -29 -3
2347cL4l4L2Mpj0Jo9Q3m3j3K5N0m7j1P8m3J9n7J1j4M3%j8J5j0K2lm1m0M7Rj9%
$$ -3 31 -3 29 33 26 16 17 -52 31 -12 -25 0 50 3 -8 70 27 46 -11 0 -14 29 29 11 26 16 38 35 -6 -46 1 10 -9 -9
2381iJ1l1K6l5L0K8j0%n6R8n3J4k2J4j6J1Kj3m0M2k1J6M3m7Oj3j0M6J7kl8N4j9
$$ -9 2 -29 -3 -38 -8 20 10 10 -46 52 -1 13 -9 5 -11 0 2 -11 -51 -9 -30 -14 29 -18 -12 -25 -35 11 28 26 -12 42 23
2414B3kjrk8L3Rk9j3K5Kj7M7n5p%J7j9M1lm0K7J4p5M6QRP3o6k9oK2oj5K5l4Q1
$$ 23 21 20 11 -17 16 25 -4 -17 8 10 -7 40 -15 -22 -22 -5 -24 17 14 -26 1 15 -60 -14 -6 3 76 10 -19 -25 -3 -9 -24 1 -33 48
2450D8m8l0O4k8ojj2J2j1P5r6N5qJ6lj8Rlk0K3K7o1J4j3K8m2L2Nj7rL1j0j2l2
$$ 48 0 -30 34 6 0 -1 -13 -1 -12 63 -33 22 14 30 27 9 18 15 -5 18 45 -16 -2 -15 13 -29 3 8 -9 -18 13 3 -9 -41
2484d1L5LL0k5j7Mm2O6rl5J3rk5K5K3K1j1Ml2O4j8m4l8L1KN0mk7Pk2O3l0Nmk5
$$ -41 -6 -3 27 2 -15 -11 -53 13 4 -31 -18 -27 -52 -27 -4 17 6 10 -22 42 24 -20 -58 -27 -25 25 21 -6 1 -21 42 12 17 13 -12
2519a2L7MLl2j7L2k1j1K4K7o7L3k7M2j0j1qkL0Oj8Olm8K5rOJ6j2J2Mj1N5l6J1
$$ -12 25 29 32 0 -17 15 -6 -17 7 34 -33 0 -27 15 5 -6 -14 -16 14 20 2 8 5 -43 -18 -27 -21 -5 -17 -5 -1 -12 43 7 18
2554A8l7L4o3M4O4p9L4n9K5M7k2rJ8On9J5J6M5j0n0M2J8k5k6J8l0o%K1J7MJ6k8
$$ 18 -19 15 -48 -4 60 -19 15 -44 -19 28 6 -3 15 21 -38 -23 -7 38 28 -22 20 38 13 -13 5 -25 -31 -31 -10 7 11 27 -1
2587ajj6K0L4l2qqj5Kj7O1m7k8J4J0J2J7J2j1j6K2jQk0M0k1k4K0K8l8JOM1k8K2
$$ -1 -2 -18 2 36 4 -4 -12 -27 -25 -42 19 -28 -56 -42 -32 -20 -3 9 -2 -18 4 3 11 -9 31 10 -14 6 34 -4 -3 3 44 16 38
2622C8qm0K8nl8LJ6L9mn3P1p8J9N4j9k1J0m1N7l3l0M2k3k1L6OJ7k2M6o2J4rK5
$$ 38 30 -10 18 13 -25 -22 -6 33 29 -24 47 -31 -12 42 23 2 12 -29 28 -5 -35 7 -16 -37 -1 5 22 0 46 -16 -2 -11 14
2655A4m8P0m3J4L3p7M5k4K7j9J5Lk1j9N9k8k4L9l1J9L7m3j0N7lRo7J8j3L0j9K
$$ 14 -34 36 -7 7 40 -37 8 -16 11 -8 7 10 -11 -30 29 1 -23 16 -15 4 41 -2 -12 45 42 51 -16 2 -11 19 0 2
2687BK4m2k1L5k9j5K9m1O5j7L9k3lk0K0K8p0N7l0j2L7k8K2k0J5N1o6nM7m5P9q7
$$ 2 26 -16 -37 -2 -31 -46 -17 -58 7 -10 29 6 3 -17 3 31 -39 18 -12 -24 13 -15 7 -13 2 53 -13 -18 29 -16 63 -24
2719b4M8j1l2QN1m0J3lLk9M0k1K8o1N7lj7rJ8Oo2M8k7j9J4lL0j3k8O7k1n1M0l9
$$ -24 24 13 -19 -11 40 0 13 10 13 -16 24 3 31 -30 27 24 7 -2 16 22 -40 8 -19 -38 -24 -27 3 -10 -38 29 8 -43 -3 -42
2753d2M5j2L0lm0N4m3jqQj3K3J6m3K2lK6l5K9j1k1J0K5k0L2l3L5q4N6j3RJ0J7
$$ -42 3 -9 21 18 -22 32 -11 -12 -20 -12 -25 -2 14 -29 -7 -10 16 -19 10 -1 -22 -12 13 -7 25 -8 27 -57 -1 -14 -5 5 22
2786B2l1j8l3N1j7K0J2K4o1O5l5l6L3J7j6j7%j2j4ML7%n0M2J6j6Mj4k0J6K8Jl
$$ 22 -9 -27 -60 -9 -26 -6 6 30 -31 34 -1 -37 -4 13 -3 -20 -20 -32 -46 -42 -5 -5 -55 -13 3 -13 -9 -23 -43 -27 1 2 -1
2819aOJ9l4KP3m5Rj8J5o2O3m4L1Oj2PJ1m4qL0j2J1k6M2j9kNlJ5j3QJ1pj4K3l8
$$ -1 5 24 -10 -8 65 20 29 11 26 -36 27 -17 14 20 8 15 26 -18 -26 4 -8 3 -23 19 0 -2 3 0 15 2 10 21 14 0 23 -15
2855a5J3O5n7k2M0m0j4K0J3lj1J6m6K6%J7Mj6MJ3j7NL2J4p4l1Q2l2K3l7J3L8l0
$$ -15 -2 63 6 -16 24 -16 -30 -10 3 0 -11 5 -41 -15 -15 2 6 -10 -6 7 -10 -5 27 41 -33 -64 18 -14 9 -28 -15 23 -7
2888gJ1OpJ8o5N2jj3JJ8m0Mk2L1R%j7J1rK5Kj8K4oj0L7m2J0rKO4l1jm8J8J8m3
$$ -7 4 10 3 21 -44 8 7 -6 -5 13 -27 -23 -45 -14 -5 -5 -22 -11 -20 5 7 -11 13 7 -3 34 -8 2 -7 -5 59 28 27 -21 -3 15 -28
2925b8J6J5j5M3n4M2l0M7l4lK6m2J1On%jj7j2L4j8J1J3J5l5j0l0M5l8M8K3l7J7
$$ -28 -12 3 -12 31 -23 19 -11 36 2 -1 25 -17 -6 0 -5 -5 -6 -23 -35 -1 -19 -8 5 20 -15 -25 -55 -10 -48 0 23 -14 3
2958CQo9M6N0k1J4p2N2nRK6m0K7m9N1k0L1J1m1j7J8J7k9k7LN6l1j3j8O7m1J4q
$$ 3 11 -58 -12 38 17 31 -41 11 6 15 41 1 28 -21 30 10 41 52 11 -6 12 29 0 -27 -24 32 1 -12 -30 37 -4 10 2
2991Bj1k5M9k5Nj3k4J2moM9Lj8N7p1J4J9rJ4l2J7j5Pk7Q4n2J5k1Qn1N4rk7N1o4
$$ 2 -9 -34 15 -10 -5 -18 -42 -30 -34 -40 9 12 -6 51 -20 -6 13 4 18 -14 3 -12 -5 -32 52 0 15 -6 2 -49 5 -4 -31 20 -44
3026d4N5o1L0J5J3J1l8J4Ml5P1k8lJM5m5k0KJ3j8N6j7l0J1J9m0J1j7NJ0l5L7L
$$ -44 11 -50 -20 -5 8 19 -19 -5 -1 -36 35 7 4 5 50 5 -15 -13 0 -18 38 21 -9 2 21 -19 -8 -25 -20 -10 -45 -8 -5
3059elk6L0oM6o4L2j0oRK7l1K4j5LmJ9j8j6rK4o1O3Oj3l8R3q1L0Nnl2K8L0n6J6
$$ -5 -8 -34 -4 -10 36 -28 4 -6 -12 -3 24 -7 17 2 5 1 20 2 -14 -23 1 -60 3 9 -4 -42 51 -30 0 5 0 -32 -4 26 -30 -14
3095a4K2k0L2kk2j7J2L9l4jQk9J3K3k0j4JJ3J2l9L6m0RO1m3jk2L5k1M4Jn3O7m1
$$ -14 8 -12 20 18 -4 -21 -9 30 -4 -5 3 -26 -13 10 -10 -24 -23 -10 2 -37 -1 -41 -32 29 -14 -15 -37 -2 -23 21 22 -31 36 -5
3129ek0lMOL8j4l0J9qj3QNJ3Jn0M6k9NJ6k3N0l2m0L2J4J2K1l6lpM8l9J9n3N3%
$$ -5 -25 -28 -24 -18 20 6 -24 -5 -13 -26 -18 -13 0 1 -49 -3 -32 -27 -11 -34 16 -16 -56 -24 -10 2 23 -13 -16 -23 25 -14 5 -48 5 5
3165Ej2J1k8M7k8ML1k6j6K8l4L7l6K6nnj3J8J3l1J9Llm6K4RlK1J5m2L7l3K0k3
$$ 5 -7 4 -24 23 -5 -1 30 4 -12 16 -18 19 -17 9 4 -1 -14 4 17 -14 5 8 5 -41 -17 -8 -11 10 25 -17 20 -13 7 -16
3199a6j2JPj9M2lk5J1Mlj9L3k2k0NJ5qL7j1mnK1l3L2mmk4KL3j6mL6k4K7j6J2K4
$$ -16 -28 -27 -20 -39 3 0 -25 -14 -10 -13 -32 1 -21 -41 -36 -21 -29 8 -3 -7 -12 9 -24 8 4 0 -24 -22 11 -5 -9 27 3 30 14 26 50
3236E0k0QKk0n0mL3m4P3l4J8pm6O0k7J4K9n5pK9k2PNJj5j1L6j8kj5rO3p7L2K2
$$ 50 30 38 40 20 -30 -34 -1 -45 28 -6 12 5 -41 19 -8 6 35 -20 -27 2 -20 -13 -8 -7 -22 -33 3 -15 -17 -32 -41 22 -55 -23 -1
3271aJ0j6pK5n1J0M1j8J9Kj9MOJ0l0N6m9M1n2L4j5jJ1kJ0m5L3n0L6j8K0k2J6%
$$ -1 9 -7 -14 11 -40 -30 11 -7 12 14 -5 -1 5 15 -15 41 -8 33 -19 15 0 -1 10 8 18 -27 6 -44 -8 -26 -6 -28 -12 -12
3305a2J6j4K2Kj4k3O0m6k5M1Lk1J6Nm0K2j3J2l3Q4p0M8L9m2j8m1O7K0o6M7k6n3
$$ -12 4 -10 12 14 0 -23 37 -9 -34 7 10 -11 5 10 -30 -8 -21 -9 -42 42 -28 20 59 17 -1 -42 25 45 -21 26 0 -53
3337e3R8pm5K3Jm6N2l4J1lJOL7k4k2%K6j5jk3K9k9K0Jj4j4l2M1M3l9k2N4Oj5n5
$$ -53 45 38 -7 16 17 -29 23 -11 0 -3 -2 4 41 17 -5 -5 21 6 5 -18 11 -18 2 3 -11 -25 -57 -16 27 -12 -34 20 26 11 -44
3372d4J7QJ6k1K0j4L2k7j0M3J2m4MM6OOm7l7K1M0lm1O6m6k1L1nJ1nj0Pj3K0Nk6
$$ -44 -27 -19 -3 -24 -4 -18 14 -13 -23 20 32 -12 -8 38 44 50 3 -34 -13 27 24 -17 49 3 -18 13 8 19 14 4 11 -2 18 23 -3
3407cL0n3K7Nql3M5rjK2J1m1KK0j2J6k7l0j0N7l9K6l1N3j6rJ7J4NpM7j2n2l5M9
$$ -3 27 -26 1 6 -2 -35 10 1 0 22 33 -8 -6 14 2 18 -9 -39 -49 8 -31 -5 -36 17 1 -8 9 23 28 21 68 56 4 -31 18
3442A8rjk6K8j2K8j5k3k1L9J1J1J3n8P%J6k9mPNk0P5o3jK0rp%K4l2L7m7L4Nj9
$$ 18 9 8 -18 10 -2 26 11 -12 -33 6 17 28 41 -17 -10 -10 6 -23 -27 -20 -15 -35 40 -23 -24 -4 -13 -20 -20 4 -28 9 -38 -4 1 -18
3478a8kNk9N3kk6M6n0M0m4K3j4L9l8K3j7L0L0m2PoK9k8Om0J5j3J0L0k9j4K4j9
$$ -18 -20 -15 -44 9 7 -19 27 -23 17 -27 -4 -18 21 -17 6 -11 19 49 7 14 8 37 9 15 -25 -10 -23 -13 17 -12 -26 -2 -21
3511b1K4j7LML3l9K9l0jl4K2K8L5j1l2L3k1Jm8JpO8l0K0Qjn4K2nJ5j1j5Q5k4n7
$$ -21 3 -14 -11 -7 26 -13 16 -14 -15 -49 -27 1 36 25 -7 26 5 6 -42 -41 -48 20 -10 10 18 17 -37 -15 -20 -5 -16 -31 54 30 -27
3546b7M2nK1n5O1j3n9L2l5L7k4On7L9K7RnK2j6MJ5o9M2k0k2L2Oj1K6l9M2j0L5
$$ -27 15 10 31 -24 37 24 -35 -3 -38 -1 -25 -19 -76 -37 -10 -1 -6 16 0 4 19 -50 -8 -28 -50 -18 -12 -23 3 -36 6 -4 31
3579C1l1rKJ0m6L0J5rNk0%M8J3n8K6J0Pl7K6l6M1n0j6J6PJ0k6K6LJ3j1j1qj2L5
$$ 31 0 -9 -7 3 -43 -13 2 -7 -2 -22 -22 26 39 -19 7 17 24 -13 13 -23 18 -32 -48 -32 -25 -15 -41 -15 -12 1 -10 -21 -29 -41 -6
3614fklj4kQK1m8K3L2j7J1j7J3k7J1MJ3k4nO8l0Lm3L7k9L3l6J2J1k2J6j1J4J0
$$ -6 -8 -11 -25 -27 -19 2 -46 -23 9 -8 3 -14 -1 -28 -17 -13 0 -24 -29 39 9 12 -31 6 -23 10 -26 -14 -3 -25 -9 -20 -6 4
3648DjJ3j6J2k9K5K0l1Mjj9J4j9nj8M0Lk7L1j3J7rj9K6j9jNlJ8k3L3k7rK2K4o
$$ 4 3 16 0 12 -17 8 28 -3 1 0 -19 -5 -24 -29 -47 -7 -4 -31 0 -13 4 -5 -24 2 -17 -18 -13 -16 2 -21 12 -15 -24 -2 22 16
3684A6k3K6j4L6j4m9K2J3J3k8K0k4k1M6Mk2Qj4ll3Q8k3npj6l6M2K3q2P3k4m5L4
$$ 16 -7 19 5 41 27 -22 0 13 26 -2 18 -6 -27 19 23 1 9 -5 -8 -41 47 24 19 12 -4 -40 2 25 -57 16 -8 -53 -19
3717a9QL2k8j7J5k6Qk7M9l2K7oJ4j1j9J3oNN8o2M2k6K7rL3q9L7k6P1k8j6n7M5
$$ -19 -11 21 -7 -24 -9 -35 -27 -54 -5 -37 -10 -16 -2 -13 -32 -19 -25 -20 38 -24 18 -8 19 10 43 -46 -9 -35 36 8 -8 -65 -20
3750b0K8m7J1K3jQk0pJ2j5L1Rm6J1jPLM3k3l2LjRK7m0kK7kJ7j3j2J7k1J7j1K6
$$ -20 8 -39 -28 -5 -6 2 -18 -25 -13 -28 3 12 -34 -23 -24 -17 -14 29 6 -26 -23 -24 -15 12 -28 -30 -3 -5 12 -1 -13 4 -17 0 -11 15
3786A5j7rK1j1j1K6j9j7K4J1k1k2L7Jk1OJ4L5n7lOQj0nj5J5jRl4K8kl9M2j3k0
$$ 15 -2 -11 10 -1 -12 14 -5 -22 2 13 -8 -30 7 8 -13 -7 7 42 -15 -18 -12 -4 -14 -19 -34 -19 -20 -11 -45 -17 -19 -58 -16 -29 -49
3821d9K9K7j2nJ8l9NL8k0Mj2K4m4P1m3K5n3N5l1L6k0J1m5jL3Nj2MrK0NJ1J4r4
$$ -49 -20 7 -5 -10 8 -31 -26 12 -8 -4 -16 8 -36 35 -8 17 -36 19 -12 24 4 15 -30 -31 2 7 -5 -1 -10 10 15 26 40 -54
3855e4M1J5K6K4q5pM4o0R5m0J8k8K6m7J7KK2J3l5kjK9l7N4n2K2J1rlPj1JpJ5k1
$$ -54 -13 2 28 52 -33 -40 4 -56 39 -1 17 -11 15 -32 -15 -13 9 22 -13 -15 -16 13 -24 30 -22 0 11 2 -1 6 -5 -4 -11 4 -17
3890a7m1N5K6%Rq3O0M9r4O9pMk3n7J2M9m5K8l9N6J8k5KKj5K2l0J2j1j2lL7k5k5
$$ -17 -58 -3 23 23 32 -51 9 58 -36 33 26 30 7 -50 -38 11 -34 -6 -45 11 29 4 6 8 -7 15 -15 -3 -14 -26 -29 8 -17 -42
3924d2L6Mm8O8Nk1j5j1O3m2K1l3N7n2K1j0%j9M1j4pJ5k6K1j5l0j2M0Om9L0k0M0
$$ -42 -6 -2 -50 18 23 2 -13 -24 39 -3 18 -15 42 -10 11 1 1 -18 23 9 2 17 -9 12 -3 -33 -45 -5 1 -48 -18 -38 2
3957Bj8J0J6j1mLK5qMp1N1M3m8K1j9k2K0Lj5j3P3p3L1kK2l3J5K6l6K3K1k6j3M0
$$ 2 -16 -6 10 -1 -5 -2 23 15 19 -52 -1 42 -6 15 -4 -26 -6 -3 -18 -31 42 -31 0 -2 20 -13 2 28 -8 15 36 10 -3 37
3991C7k2jJ3k0J0m7lN4j1M1m7j0jJ0k1L1Om7M3l4J1M8m6M0n7L2l0N8k2l8OL9m1
$$ 37 15 14 27 7 17 -30 -33 21 10 51 4 -6 -7 3 -18 13 19 -28 15 -19 -8 40 -6 34 -23 9 -21 37 15 -23 -17 22 -19
4024a9J7j3nML4Nk6j5J3kJ1RRm7K3OL3n1J6J1k2oN1Ok5J1m8R2p5Q1o9pK3k6l0
$$ -19 -2 -15 -20 -16 18 23 -3 -18 -5 -7 4 13 22 -25 -2 4 37 -14 2 13 -9 -15 36 42 17 28 -20 72 -3 78 9 2 25 -1 -31
4059c1M0K9l7n8ON2m1M9Lmj1j1nM2Rk7Pj0l2M1k4j5J6RMQk3pj9O1n8QQM8l7J3
$$ -31 9 38 1 -57 -51 1 -40 9 12 8 -3 -14 -19 23 32 5 12 2 -30 11 -13 -28 -12 -3 1 9 -14 -21 -40 21 -37 -29 -21 27 -10 3
4095CK5o6J9L6j1J3NPl0k0ML9j2m1K9L0k7l2J1K1l7jRnKJ5K7l1j3NK8mpO%K2l1
$$ 3 28 -38 -19 17 6 19 24 31 1 -19 -15 24 12 -29 0 30 3 -29 -18 3 -34 -35 -26 -31 -29 -14 13 -18 -31 -26 2 -2 -9 -3 -3 19 -12
4132a2OJ9k0l5NL5j6RN2o1J3J7k5j5L0k5M9j2qJ9rrk%oj1K0J0k5k8K8%%L3LpJ
$$ -12 -6 13 -7 -42 -37 -2 -18 -9 43 -18 -5 12 -13 -28 2 -23 26 14 6 25 16 7 5 5 -1 -12 8 18 -7 -35 -7 -7 -7 26 29 22 23
4169B3l1J6n7L4J9lJ3p0P1j4k7K0J1knL1k8k3j1L9lJ7J4j7l2Q1o3k5L1Ll0j0M6
$$ 23 -8 8 -49 -15 4 1 14 -56 15 1 -26 -6 5 3 -2 29 1 -22 -33 6 3 20 34 17 -15 66 3 -22 9 12 -18 -28 18
4202A8j1ok8L6L2l7L2m6K1k8kK7k0J8k3J6m4L3L8l0j2L8k3K5j5p9P8K3kk3jp4
$$ 18 7 1 -27 9 41 4 36 -10 11 -17 -19 8 -12 6 -17 -1 -45 -12 26 -4 -16 22 -1 24 9 -70 8 31 29 6 5 -69
4234f9Q8J2n0N8m0l2P4ql8j2N6o1MrM5Jk6K2j6J6J3pQo9M9j1M7j0l4j2qQL3J2
$$ -69 19 31 -19 39 -1 -33 41 33 -5 -17 39 -22 -18 -27 18 19 -7 15 -1 15 28 21 29 -40 9 -2 45 35 1 -11 -19 -11 22 34
4268C4l0qj3qM4l7J5Kl6N4Rj8K4l8NojJ0J8m5j5P8m0n2N5JKk2Q1r6L1k7N2qJ3
$$ 34 4 -4 -17 -25 19 -18 -3 -1 -37 17 26 8 32 -6 -1 -7 -8 2 20 -25 -40 38 -2 -54 1 2 4 -18 63 -33 -2 -29 23 15 28
4303B8m6jL9k0k0N0l0L3m4L7k4J3oJJ9k2j0qJ7Rk3m0O7l3Ml0N2nOPn5Kj4L2OK1
$$ 28 -18 -19 20 0 -20 30 0 33 -11 26 2 15 9 10 29 7 -3 -11 6 15 -8 -48 19 -14 -10 -40 12 7 13 20 -35 -33 -47 -15 -9 12
4339A2m2J4M8l5Rpj0l3K9K0L8j2oKj1l8J5NJ0Lk5K8K3m0K7m8O1K2k9jr%j1Pm1
$$ 12 -30 -16 32 -3 6 -1 -11 -44 -15 5 43 31 25 27 16 -22 -7 -2 8 11 -14 14 37 -3 24 -24 37 59 30 29 20 20 9 16 -25
4374b5K2L0K8r3J8K5k2MM3n7J2K7j1J4k9k0L8k4nO7r6O6Ml0LJ1J8k7J5l7O0k0
$$ -25 -3 27 55 -38 -20 5 -17 -13 30 -27 -15 12 1 15 -14 -34 4 -20 -25 42 -54 12 16 -14 -11 0 18 -9 6 -31 29 9
4406Il1K4J4mJ5qk1L7j7l5J8K2l1J8J0p2R9j7m4M9n1O9m0Jj0p1P7L6o7M3j4pJ9
$$ 9 -22 2 16 12 27 19 -2 35 18 -17 1 23 -8 10 20 -52 47 30 -14 35 -16 53 13 14 4 -67 10 46 -21 22 8 1 20
4439B0p6N0j0QQj4OL1J8r1M8LoJ6N8m4Nk9K4J3qqj0J5mjok1OKJ0Jj2ML3m8kMJ4
$$ 20 -56 -6 -16 -8 0 -14 -8 23 41 -50 -2 1 -5 11 69 25 30 1 25 38 30 22 12 27 23 22 16 -5 1 3 13 14 2 6 39 -9 -11 -7 7
4478Gn1L3J4Joj7Jk8M4pL9k1rL7m2J7k1M0j3j5J5l1N6n4jJK9Nm0O4or7M6L3Ln5
$$ 7 -44 -11 3 4 -2 -19 -18 -46 -2 -9 30 9 0 37 -5 12 -9 31 18 3 18 -13 43 -11 -12 -11 18 23 -17 47 41 -56 -10 23 26 -29
4514b9L6K3n2O6k4Ln5M0k9JK1L0k9L9k8Jm8L0M8k4m1pJ0mJ7l0P2p5M8l0K2mK0
$$ -29 7 30 -22 44 20 23 -32 8 -21 -20 1 31 2 41 13 14 -34 -4 44 20 -21 -28 -18 -22 -5 -35 37 -38 10 -20 2 -2 18
4547A8l0L3l0J3OQJ7l0K8k1j3K7k0j0N9m0k5K6J1Qj1m4L8J3k8k1L9oK9n1J2j0
$$ 18 -12 21 -9 4 10 18 35 5 33 12 -1 26 6 -4 55 15 -10 16 27 35 24 -20 18 31 3 -18 21 15 44 -7 5 -5
4579eK7J1k7j0nl1L1Oj2J8K1l8j1k4K5j1K7N0j6o8L0OJ2L1l8j2M1m2K3j5LNNo3
$$ -5 22 33 6 -4 -9 -40 -9 -3 -15 3 24 -14 -25 -49 -24 -35 -8 42 26 -42 -12 -6 6 37 -1 -13 28 -14 9 -6 -3 2 7 -56
4613e6N2plK7J8k2lN2o3J7m0K7l3P1j5k1Lm0K8KL6p5R9o6L7n0pL6K7k1l0L0n3
$$ -56 -4 -11 -14 13 31 9 6 58 -5 12 -28 -1 -34 37 22 1 4 -36 -8 -6 30 -45 54 -12 25 -25 -32 4 31 10 -20 10 -43
4646d3O6j2k7JkJ8k1P5n4qRK5j4j7k2L8Oj0JL6k0l7N4k6l4M1rk0K1j4kK8J5o2
$$ -43 23 11 -16 -15 -17 1 -20 55 1 -7 2 27 13 -4 -26 12 18 8 9 45 25 -12 42 16 -18 23 14 -6 15 1 -1 27 42 -20
4680b0RK5M2l7k7lPJ1lk3L2k5L2J0m7N3m4k4L9rJ8%l4J0N7l8k0M9l5k0K5j6k9
$$ -20 -11 14 56 19 -8 -11 -4 7 4 -19 13 -12 20 30 -17 36 -8 -32 7 -2 16 16 -18 -8 49 11 -9 40 5 -15 10 -6 -35
4713c5N8j9j2rK0K4L5j12L2LL8k5Mk6J5J5j7rj4L4Kj7lPk2K9j6L5l3L2j2j4Nr
$$ -35 23 4 -8 -17 3 27 62 -50 -18 -15 23 -2 2 -24 -9 6 -11 -20 -34 0 2 -15 -18 -11 -33 -4 -20 15 -18 14 2 -12 -7 -16
4747a6QK7pj9RP7j02J1JJL1m2J5k4J2mK6J8j6PKJ4m6M7%m8P4o9k5j6J7O6n6L5
$$ -16 -8 19 12 -7 2 79 -23 -12 -11 -10 21 -21 -6 -30 -18 -22 4 22 6 13 15 29 -17 30 30 -18 56 -13 -38 -54 -37 29 -27 8
4781Hm4K9K5l8l0L9j9J9L3l8MQj2O1n1j1k4J7PK7m9K0L3k4J2k6K6j3L8j5kRo5
$$ 8 -36 -7 18 -20 -50 -11 -30 -11 22 -16 -12 -4 -16 45 -6 -17 -41 -24 -17 10 -39 -19 14 -10 2 -24 2 -11 27 12 10 19 -46
4814d6M4l2J6L5Onm5N5k4j5j2M2m0L7K5j2j5k2j5%K2k7J8L2p8M0j4K6mJ0K6m9
$$ -46 -2 -34 -18 17 23 18 -27 28 4 -11 -23 19 -21 16 41 29 14 -8 -23 -23 -1 -28 -10 22 -56 -16 -30 -4 -8 2 28 -21
4846b1L4l3k6M1JOj7L3l6lNlRk9M1kK1j7Jl7qO0k4J1nM7rj0n5J7J4K1l0L0k3m5
$$ -21 13 -20 -46 -5 -4 2 -15 18 -18 -21 -16 -19 -10 -39 2 0 21 4 5 -32 -40 20 -4 7 2 49 40 30 -25 -8 6 27 -3 27 4 -41
4882d1Q9q2K6l1J9K5Qj6k3L2k1K9k3j3LJ6NjJ7mkk4N3m0Pj6L6l9NPP2n9n0Q1k
$$ -41 48 -34 -8 -39 -20 5 13 -3 -26 6 -15 14 -9 -22 -19 -3 2 1 18 14 12 -12 41 1 8 -8 28 -11 -6 1 73 14 -36 45 43
4917D3k5J5lj0Nj1K9k2j5l6N3j8j3K1j8L4oj4l2pN3l1j9qN5l2j9NL7K5p1P3l4
$$ 43 18 33 30 20 25 14 43 21 6 -30 23 5 -8 13 -5 29 23 9 -23 -30 23 -8 -27 -35 20 -12 -31 -26 11 36 -35 38 4
4950Dl3K8M8m2j5Nm0K2M2k9K5l5N3l6L1j5J1kkk4j9M8rn3J8KJ3L2m2L6l5%m8N0
$$ 4 -29 -1 47 5 -10 -5 -45 -23 19 -10 15 -20 33 -3 28 13 24 22 20 -4 -23 25 16 -37 -19 -17 -4 28 -14 22 -13 -13 -61 -11
4984a1k8Q6l2k4j0j3L8l3K0rjk4J5j9M6MLK2k5K2l2m7M5L1j7pj9N2l8k0N3J5j9
$$ -11 -39 47 15 -9 -19 -32 6 -27 -7 -16 -17 -41 -26 -45 1 5 8 30 5 27 -5 -52 -7 24 7 0 -19 33 -5 -25 28 43 24
5017B4J3n3k2M3Q0q2l0N2k8K6Mj6l0J3M3l7pK5JJ5o4J4J1nj1j6K4m5L3J7mj5O9
$$ 24 37 -16 -38 5 85 3 -27 25 -3 23 27 11 -19 -6 37 0 -7 18 19 34 -30 -16 -5 -10 -21 -37 -13 -58 -25 -8 -12 -27 42
5050D2q4K1J3NL0o1J01n1J0Oq0L9L5l9k4L1NJL5oJpM3q7K9L7l6J9lrMj4N2p0O
$$ 42 -42 -21 -8 -3 27 -34 67 16 26 32 -48 -9 26 -13 -37 -6 -1 0 35 29 30 23 66 -21 8 45 9 28 25 16 20 6 58 -12 -6
5085fJ9l1J8L4mnj9RK9p1L4j4pj2K8n4J7N2k0L4m5Oj3MN1m8L1qj5K2j7JPL7k0
$$ -6 13 -18 0 34 30 25 6 15 44 -27 7 -7 -14 -26 2 -52 -35 17 -3 31 -14 -8 -21 -17 34 -14 17 9 -6 16 -1 0 7 44 24
5120B4kj1k6K1NKj6rP0j00O3m4P1j0k2J3l3M9o4J5j4J3L8l5j5j0k1KK0Nl1N5R
$$ 24 22 11 -15 6 11 13 -3 -12 58 -42 21 -23 48 38 16 29 -4 45 -19 -4 -18 -5 33 -2 -17 -27 -48 -46 -26 -21 -52 3 12
5153A2N7o6m4L9N0J0n3k3N7k8K0m3P2m4m1M4m2j0J4N7k1J0j2l1L6M1o3K0PQk7
$$ 12 69 3 -41 -2 48 58 5 -18 39 11 31 -12 60 16 -25 19 -23 -33 -19 38 17 27 15 -16 20 61 -2 18 25 33 6
5184FQJ2k7lL4pLlJ0o9P2n6K9m1ML4oj9M8m4mPL0l9NJ4M0j7k2pj1N3m3O7k8k1
$$ 6 14 26 -1 -4 30 23 26 23 33 -36 36 -20 9 -32 -28 6 0 -19 29 -15 -19 -12 18 -21 -16 -2 38 21 -1 -8 -19 34 -9 58 30 9
5220IoN7o7K8l8L3Mj5Rkj7j4J4k1J2oJ7Jnj5k2N3l7J3KPlk1K8K6k9k7lL6rL9j1
$$ 9 3 60 -7 21 -17 16 20 5 14 12 -5 -19 -5 -26 -14 -20 -3 -2 -7 -22 -44 9 -28 -15 -13 -6 -9 -30 -2 24 -5 -32 -35 1 -8 31 20
5257B0o2J3J7jL9p3Q0m8j3L0m8N0kK5j4l0L4pojM7l9K8l8J0l0j9N2Ql5K1J9l5
$$ 20 -42 -29 -12 -13 26 -47 33 -15 -28 2 -46 4 2 27 13 -17 17 10 4 3 50 11 39 1 11 -19 -38 14 22 -13 8 27 -8
5290hj1L9m0J2QL7j7m6L1j1Nm7K2M4k4j3J0J1m2nK5pM0Ml4Rj5lK7K7k6j0rjJ6
$$ -8 -19 20 -20 -8 0 37 20 -26 5 -6 -1 -48 -26 18 -6 -19 -9 2 -40 -45 -20 -27 13 17 -17 -8 -23 -26 1 28 2 -8 -17 -18 -2
5325bj9M8n0J4K6k4L7j0m6N7rpk7K4jn0N2j8QJ1l7J9L4j9nj2n5P0j0k9k7K5j3
$$ -2 -21 27 -23 -9 17 -7 30 20 -26 31 22 15 -12 12 11 -39 13 -5 3 14 -23 -4 30 11 6 -6 -61 9 -1 -30 -57 -32 -45
5358d5P3m8K0k3L2J1l2K3Nl5klJ7j1L8Oo4K8N9j0l3J0J4l0jrL2k0J2m6QM4N8q2
$$ -45 28 -20 0 -23 9 20 -12 11 16 -19 -21 -24 -7 -18 20 26 -38 -10 49 39 6 16 30 0 -1 -10 22 2 14 -32 -24 20 78 -4
5392dK7j5Kj3K1Oj9jj0NL0q0K5J4L6m9J6L4jpnlmL5n6J5MJ6n3L7mL4k7L8n4ml
$$ -4 23 8 10 -3 18 24 5 4 -6 -1 29 -51 -26 -12 24 -25 -9 25 24 17 12 9 5 40 -16 -1 3 19 -34 3 -1 33 6 44 -10 -14 -17
5429a7K7j1J8k3j7J1J3L1p3M9ql4oL4%L4kk8rJ3K5n2M4k4k2JN5j3k0L1j9J7n9
$$ -17 10 -1 17 -6 -23 -12 1 32 -41 8 0 -34 -40 -6 -6 28 26 -2 -11 2 27 -25 19 -5 -27 -26 29 16 -4 27 8 25 -34
5462c4K9noM1k5k0M9m2RK7o9K3L5j3j0KK8j6K9Nl8k3P2n3K0j2K2k7QJ8o4MK3m
$$ -34 -5 -10 -16 25 0 -20 29 -13 -4 23 -46 -23 12 -1 -11 -9 19 3 32 37 -1 -24 48 -5 15 3 25 -2 6 24 -40 -36 -13 -17
5496a7nJ5QK1m5L5Pm9L2rM3m2kK8j6j9RK2Mm7J8j9O0k2j0l8K3L7l0l2J2P8n6K7
$$ -17 -22 -7 1 22 -23 12 19 -30 2 -7 36 -6 -8 20 4 -15 -6 16 20 -27 -9 -28 32 10 0 -38 -15 22 -8 -40 -28 50 -6 21
5530B1l9L5j6L7j8RJ0n6pJ3K3m5K7k2N1l0qlRJ3K0q0O0Jj9J0RpK4K0o2Lj7K9M1
$$ 21 -18 17 1 38 20 29 39 -17 -24 -11 12 -33 -6 -28 23 -7 -15 -18 -9 4 24 -56 4 5 -14 -4 5 -2 22 42 -20 -17 -34 -5 36
5565C6l7OJ1jk6L2Jn7L4oJK2m4N8pj2qK2j9k1K3OOj1J3Jjj8OLk1k6P6m4K0l5L8
$$ 36 -1 5 16 15 -11 21 22 -35 -1 -7 -6 16 -28 30 23 11 3 25 6 -15 8 14 20 9 22 23 22 4 10 13 -8 -34 42 -2 18 -17 21
5602B1l4RM5l8k8L0J0No6OkM2k2k5L4Pj6J7Jo5O4M4j1kOo5L7kk8L9RLJ5l3KJ4
$$ 21 -13 -4 41 3 -25 5 15 20 -46 -40 -42 0 -22 -47 -13 -6 -22 -5 -4 -69 -5 39 28 26 32 -33 4 2 -26 13 22 25 40 7 9 23
5638B3L9m6oNl3K1nk6J2k8N3k2pN7l9Qqk6L5k6k6K4J0j1J5K4m4J3Kk7L1L2lk3
$$ 23 62 16 10 15 -18 3 -2 -28 -16 -44 9 -13 -20 37 -2 6 -2 -28 7 -19 -45 -21 -11 -22 -7 17 -27 -14 -12 -39 -8 24 21 -2
5672bL4m0l0L4K2l4O3l9K8n3kN1qk9M3m4mK4K3On5K8oNj0OJ8J7m8J2J0jk7K5q
$$ -2 32 -8 -38 -4 18 -16 47 8 36 -17 -19 32 24 -5 38 -6 -10 14 37 43 -12 16 10 15 5 11 29 46 -2 10 20 19 -8 17 9
5707Im2J8K8n4N4L3n0L2l6m2L8M6qn4L4n0N6K2n3J8L1j7MmLNj2L8m2M1o3O1n0
$$ 9 -33 -15 13 -41 13 46 -4 28 -8 -50 -12 34 26 -28 6 -44 12 34 -19 -1 30 13 17 13 16 21 9 47 5 46 -17 44 -6
5740fm4M7L5l3JJ2QK4k5j8Ql3l1M8L4m6PL3j9Pk0rK2pj9J1J5j6J7Nl7Om4N7J8
$$ -6 -50 -3 32 -1 0 12 20 44 19 1 9 -24 -55 -7 27 -19 -12 21 2 9 -11 -20 2 -5 -24 -13 2 -14 3 8 -29 -23 -67 -10 8
5775Hj2L7Qk2j6j3kJ3L2l3K1J3m2L6l6L3K5q1M2j5N7m5j0L5m7K4L5k4k9L8n6M9
$$ 8 -4 33 41 19 3 -10 -12 1 33 0 21 34 -8 28 -8 25 50 -31 11 -4 53 8 -2 33 -14 10 45 21 -8 30 -26 23
5807B3n3M0nmj4J3M2j01K1P%J8oJ8j9k3N6Qk9Kj6%M4k6MM5l3j5K1k0K8lqjj7k0
$$ 23 -30 10 5 1 -13 0 42 -59 -38 -31 -31 -13 -19 -1 -20 -43 13 21 -8 -6 -22 -22 22 -4 0 45 12 -3 18 -2 26 23 15 14 -3 -23
5843b3j0L7L0l6KkNJ1j1K6m6Mj1Rj8J1lK7K0m7k0K0mM7p0Q5m8lO3o5kJ4k5N0j1
$$ -23 -33 4 34 -2 0 -2 3 14 3 29 -17 -13 -24 -15 -33 -22 -25 2 22 -25 -45 -25 -29 18 -52 33 -15 -18 45 -20 -22 -8 -33 17 6
5878FOk8j2L2J0k8K6K7m2M7j7n2P2j5l0M8o5J9pJ8J5j0Pk9J5j6K6l1rj5K2qM4
$$ 6 12 -16 -28 4 14 -14 12 39 -3 44 27 -25 47 32 2 50 -15 4 -3 15 30 20 27 -2 13 -3 23 -8 -17 -32 -10 -18 26
5911B6m2J5jpQrL4n5J2L7k9j2Jj3lL5nJOK5k7Kk5M3K7n0LOJ9Nq9L5N1Nk1m6L6
$$ 26 -16 -1 -2 -9 -1 -10 24 -31 -19 18 -11 -23 -22 -35 -38 -3 -8 -7 -1 24 -3 -1 -26 17 44 -6 -3 3 22 27 -62 -27 24 29 8 -38 -2
5948bK9l9pNM1o3N8k4m5O5K5m3pL7n0Pl8O4j8K8%j9pk9O4j0o9N2k8M6m1L1k5J6
$$ -2 27 -12 -19 -14 27 -36 22 -2 -47 18 43 0 -7 30 -20 -13 -51 13 -5 23 23 4 -3 -32 32 22 -47 5 -23 23 -18 13 -12 4
5982DN5p4L5kL5j8K0Oj1l7PKK7j9l4j7L6n2L5L4k9j2K6Nlm1J6mJ5k7lRPl1L2L2
$$ 4 59 -15 20 18 53 35 55 61 50 13 20 22 49 30 -4 -21 15 -37 -2 32 3 -9 17 22 19 -22 -6 -10 5 -22 -25 -16 -9 -40 -8 24
6018B4k6Mk1OJ1j5lN8m7J8n2M3Rj5j8L3k1K9PJ0n7M9J2J3l6j8K4Qqrk1J2j3N0
$$ 24 -2 2 -19 -13 -2 -17 -20 38 -9 9 -43 0 9 -6 -24 9 -12 17 24 34 -23 26 38 51 15 -3 21 29 21 12 -9 3 -10 40
6052D0m4K6Nl5J6J0qJ7Mm0Pm0L6L2j8l6J4pMJ9jl4J6Jj2K9j4M1J0l1M9l5K%j4
$$ 40 -4 22 27 -8 8 18 10 27 31 -9 -2 -42 -6 26 8 -28 -14 -21 -17 2 1 -33 -17 -16 -28 1 -13 28 38 7 56 21 23 23 9
6087Ik9L4k8J8kK9k5MN4m5k5K3L0p6pM6mnl4L6k2L1k7J8qNJ6o2K2N5rm7K0k8M
$$ 9 -20 14 -14 4 2 31 6 10 64 19 -6 17 47 -29 -36 10 6 1 -33 3 -19 12 -15 3 -5 0 16 -46 -24 31 22 -25 -5 -33 -29
6122b9M1n2jM4m0M8j4k6l3J06l8K6k1Mm8MJ3KK0K4L5n0%l0L0J1J7jj0j9K7l5N7
$$ -29 12 -40 -41 3 -37 11 -3 -29 -62 44 6 32 11 15 -33 -29 -16 -14 6 30 65 15 15 -15 15 26 43 42 32 13 40 5 62
6155F2m4j1J8%l2LK2Pl9L6m9OL3l3J9J7k2j3M8k7j7N1k7ORpj5K5%p3Q4l4j6K8
$$ 62 18 7 25 25 -7 -4 18 25 -14 22 -27 -21 12 -21 -2 15 -7 -20 28 1 -16 35 8 14 23 16 1 26 26 -47 37 3 -13 15
6189A5j0j2L8k6rj9ORnL8Jl1L4J8j7Kpj3j8J1l0J9RJ6l6O8m3J5j9j2J0lK3j6m
$$ 15 5 -7 31 5 -4 -23 -17 -8 -13 25 26 -5 29 47 30 32 25 12 -6 5 -25 -6 3 19 -17 51 8 23 4 -8 2 -1 22 6 2
6224Bn4N1qk1KM4r%Jm2L2m2L6QJ8KjoNj0L2n3L2K2oJKl3P5p4K8j8k2MJ6k8K4m4
$$ 2 -52 -1 -9 -30 -28 16 7 7 8 -34 -2 -44 -8 0 18 20 19 13 18 8 40 -13 19 41 35 36 38 5 80 6 34 16 -6 -2 14 -14 10 -34
6262c4K9kM8l9j0J3mkj3J9k5KKK2J7j14R4Jk2Pk4K4l1L9j2J7M8m5lJ5L3m7j0J8
$$ -34 -5 -7 41 2 -8 5 1 -1 -14 5 -20 -18 -16 6 23 -91 3 4 -18 -11 -35 -11 -42 -3 -15 2 50 5 2 17 50 3 -7 11
6296A1j8O4m2l4M3J4m7K4Nk1N1m9KJ9j8%j9K5Jj0j8M2j5K1j2k2%L6J7r7O6j6m
$$ 11 -7 57 15 -19 24 38 -9 15 20 -1 50 1 3 22 4 4 -15 10 11 1 -17 25 10 31 19 -3 -3 33 50 -47 19 3 -1
6329aj3K9l4L6l3j3L2j4RJ0mJ4l5K1JPL8p2j9M0J6mLrrl3K7J5M7o8L8Rl3k5K5
$$ -1 -14 15 -19 17 -16 -29 3 -11 -2 8 4 18 -17 4 5 12 50 -22 -41 -1 15 11 14 5 -4 -37 -10 5 52 -16 22 31 -2 -27 -2
6364bK7m6RJ6k1j5k3O0k0O9q0N4qm6O3l6p5N4%M1j7l1K5l6oJ8M6l2j1JL6Oj9j7
$$ -2 25 -21 -12 4 -17 -32 -55 5 -15 54 -26 28 20 -26 37 1 -74 -20 -20 21 4 -27 -2 -38 -44 -26 20 -12 -23 -22 14 20 1 -16
6398a6N0j2j3kjL2q8J07Mk9Pk8Pn2QKO1l1M8n6K3qo0M3%J2j1M1o7M3k2nL3k2K1
$$ -16 34 22 9 7 6 38 -50 57 61 32 39 11 18 -34 -26 -24 37 6 54 -2 21 13 -47 -4 -4 8 -3 38 -29 14 -8 -13 20 -2 19
6433A9n5N2j5L6Lk1r%j8kQJ8j3l6J0M6n2J8%O2n1pL5Jj4mj1jj5MM2l2J4M1l0l0
$$ 19 -36 16 1 37 40 19 10 10 -8 -10 -2 16 3 -33 -23 23 -29 -11 -11 51 0 -7 28 29 15 11 0 -1 -16 -12 30 -2 12 53 23 -7
6469gJJ7j3J7m3j2mJ0j0k5M7O2l7klNJ5j9K1k8j8J0J9j8j7J5M7l0J0Pn1M3rRK8
$$ -7 -6 11 -2 15 -28 -40 -44 -34 -44 -69 -22 40 3 1 -2 3 18 -1 20 -8 -26 -16 3 -15 -32 -17 30 0 10 17 -34 9 0 9 37
6504C7J8p4Q5m7k3K2k9L4Mk0okK6Nk6J8lj0nK8k4k3J5MM1m4lk3RJ1L3m4NJ9k6
$$ 37 55 -19 66 19 -4 18 -11 23 27 7 1 -1 25 30 4 22 19 9 4 32 8 -15 0 4 45 1 -2 -25 -16 -5 28 -16 -11 8 -18
6539a8QLM7n6K8o5R0l7K3lj0L1n2J4J5J3l5J2jRl8N2rL3k7m1L7Jm5KK1K4j1k6
$$ -18 -10 -7 40 -16 12 -53 37 0 23 20 10 41 -11 3 18 31 -4 8 7 16 -22 30 21 54 27 -14 23 24 -21 -19 2 26 15 -11
6573a1L7Mk0l6L0J4J1k4j0Ll2L7%kmM7o7J6K2Kk8kJ3K4m4%MK1J3j7j0L6m8P8j
$$ -11 26 30 10 -26 4 18 29 5 -5 -2 -34 3 3 1 -3 44 -23 -7 15 17 -11 -13 0 24 -20 -20 -16 5 18 1 -9 27 -21 57 56
6608E6n1%%mk3L1Qj7J2k6K2Kk9L7pj7K1K1q2M0Nql4M0Pl1L2j3mNJ7j8N9n8Oj0
$$ 56 5 5 5 1 -22 9 17 0 12 -14 8 10 -19 18 11 -6 15 36 -46 -6 -1 -9 -43 -3 4 -27 5 -8 -12 -7 10 -8 51 -7 -1 -11
6644a1RMM3o7NJ6Mj1L1QqM0k7k3j5jKK4j4L0k0ol0M8n6O4m0j2M4n5K5J3j6rj4
$$ -11 -2 2 45 -22 -17 -1 3 -8 23 31 23 63 36 13 -2 -3 -1 23 9 39 19 13 -17 31 -25 39 -1 -13 31 -24 1 14 -2 -11 -25
6679b5j6lK1J9nk5K6lk3J8L0j1j2j1J6jJ0l8Q9o2L0L1l2m1KJ7L5n1j0L2k9L0J1
$$ -25 -41 -44 -23 -4 -9 -34 -8 -11 -34 -16 14 3 -9 -20 -4 -5 5 -33 56 -6 24 55 23 -18 -16 1 36 -15 -25 7 -22 8 19
6712A9MJK5m2Mk8N7l3k9l2Q6%Qp7N8m0L1m5K6N0q5J1%K7M9p9k0L4JJ3j2L7k3l1
$$ 19 23 24 49 7 11 -17 40 7 -22 -54 32 32 40 -37 21 -19 12 -33 -7 43 -42 -31 -31 -4 45 -34 -54 -20 -19 -6 -18 19 -4 -35
6746c5K7J4m3J3MN1j7Nj5J4k8k1N1jJ7m0K3k6pJ4K2nK1p7O5l4J6pnj6J0K9J1k1
$$ -35 -8 6 -37 -24 -20 31 14 19 4 18 -10 -31 20 19 36 -4 19 -7 -14 0 22 17 38 -39 26 -8 8 1 -4 -20 -10 19 30 9
6780Ijl5LO5m6k6Lj6nO9l2QK2j8J4Qm8jMP3j8k3jj8MN5n0k9jM3J6m7L2j6O1o1
$$ 9 8 -27 -24 41 -5 -31 -28 -44 -49 20 -12 -4 18 0 14 22 -26 -27 -23 50 32 9 8 -10 -6 49 -1 -30 -31 12 28 -19 13 -3 58 -3
6816cK0jjK8n7K3l1L1l1L6l7K0K4L7j02J3RK7Jj0K0Mj7k0L9j2j2nJ9l7PK4k8J2
$$ -3 17 16 15 43 -14 9 -22 9 -22 14 -23 -3 21 58 -44 -31 -22 5 6 -4 16 20 3 -17 22 10 -2 -7 12 -25 -18 6 -22 -10
6850a0MK3j0j9ljj6N0j6j8M5Jl7N5m5j6K9K4m4K8k8K6J0lj8J8L7o7J1l3K1J0o
$$ -10 -6 17 7 -12 -15 -16 -32 18 2 -16 29 30 -7 48 3 -13 16 40 -4 24 -4 22 32 29 11 29 66 -1 10 -23 -2 8 2
6883BM5m4Ll7J0mK6l5K2n9O3JkN1Jj07NM2L1m6J1j8N8jK1m6lJ4k8L1k2K2K2k0
$$ 2 47 3 6 -31 -21 -25 1 -34 -12 -71 -8 -7 -9 42 43 -64 -59 -17 14 -32 -21 -39 19 18 39 -7 -10 4 -24 7 -15 7 29 9
6917IK0j9L0k9k9pqN8n8N4n6M5K6m1M2k9Jl8nN8k5j9K2Kj7m0M7mmN9l7mn1K8J3
$$ 9 29 10 40 11 -18 -25 -33 25 -33 21 -35 10 36 -5 37 8 9 -29 -34 24 -1 -20 2 4 -13 -53 -6 -10 -14 45 8 4 -47 -19 -6
6952fn8J14n3M5l9j2L0NLl5J1J8J2l0k7N9j4m3K2J8l0K1j1NJ1m4L8n2L1jK5mj2
$$ -6 -64 50 -3 42 3 -9 21 26 29 -6 5 23 35 5 -22 37 23 -20 2 20 -10 11 0 5 16 -28 10 -42 -11 -12 13 9 -3
6985cL8m7j5K0j1j1M9k6rjK0k7M1l6k1N2k9Qk3O1l8j2M2qkk3M2k5J7Pk6QJ7n5
$$ -3 35 -12 -27 -7 -18 -29 20 -6 -15 -16 4 -23 18 -18 -39 13 -16 -8 -31 30 -8 -20 22 14 12 -11 31 6 23 30 4 12 29 -26
7019b6O5p6O2j5NJ3po4N0Rpn5K6PJ3NpJ7l4Qj3K1l9K0NJ4Oj2j7PK4l5Q1l9J8p0
$$ -26 39 -37 25 10 15 28 21 -43 7 16 9 -46 -20 -13 0 5 -2 15 -19 -11 -24 -3 -42 -22 -17 -3 3 -9 -26 -19 5 -30 51 12 30 -40
7055d0N7k2ljoL9k3mKlL4m9L2j5N0n1mL1m%l4J1J6K0k9j5j7qK8P0j01N6l2j6N
$$ -40 17 -5 -8 -9 -15 24 1 -3 -1 -4 30 -19 13 -2 48 -3 -7 24 20 20 -14 -3 13 33 4 -11 -28 -36 -8 62 -39 17 -15 -31 -26
7090b6j2M4j1Ok0mL0J2p6M4m7K3NL2K1l9KOmj2L6LKlL5m3J6j3K4Rl6KJ3J3j8l7
$$ -26 -38 6 -5 1 -19 -23 7 19 -57 -13 -60 -37 -32 0 21 -18 -16 -10 -14 -26 10 13 15 12 47 4 20 7 31 40 4 6 19 32 14 -23
7126b3K7L6j4k0k6M9k3k0LL2K4km8k8K4K0nk6%oK8j1L0j9K6n6jN3k9K2k1kK1l
$$ -23 4 40 26 6 -20 29 6 -14 -11 21 45 43 -5 -33 -9 11 6 -20 -20 -26 2 -9 21 2 28 -28 -29 24 -5 17 -4 -6 15 12
7160A2K0om6O1q6O5L3l8kK2j3kl2j9K7L8j5J4RNl5k6J2J4k3k8L9QK4l3Kl5L3j6
$$ 12 32 26 -20 41 -45 20 53 15 13 35 22 20 -12 -31 -4 34 19 33 42 47 12 -14 -2 12 -11 -39 0 8 32 -1 1 -34 -1 -17
7194a7L8o6J1J8JRklNJ2k3kJ6k5j5O7k1Nm2K0K3k8j2O2j5rM1l9J4l1P%mJ9k6M1
$$ -17 21 -45 -34 -16 -15 -6 -8 -11 -6 6 -17 -19 -3 -28 -43 24 3 8 -34 -14 9 -19 -31 31 16 7 48 9 23 -8 -1 -1 -5 14 -12 29
7230B9l0K3L2m9j4L9l2j2oQ7q2k2K0MJ4pJ7m2L8k7nK1K7m2j7M3N1n0Pl3J5k0J1
$$ 29 -1 22 54 5 -9 30 -2 -14 -20 67 -15 -37 -17 -13 1 -6 11 -31 7 -20 -25 -4 23 -19 -36 7 58 8 15 -18 -3 -23 -12
7263a2NK8m9J1K5K0k5k4O8p1L9J8l1K4k0N4Km7K6n6M1o2j0K6J8L3l4L6m8j9J3
$$ -12 -7 21 -28 -17 8 28 3 -21 47 -24 15 33 2 26 6 60 62 15 41 -15 26 -36 -46 -20 -2 31 -3 33 -15 -34 -21
7294b1M3l3J2l5L1lj7j5O7m4NLJ1j4mJ9K8l4K7m9RJ4L6j1l8J8PJ4Mj4j8L6Pl7
$$ -21 22 -11 1 -34 -3 -6 -23 -38 29 -15 -10 -7 4 -10 -14 5 33 -1 26 -23 -14 0 36 25 -13 5 12 26 30 16 -2 34 41 4
7328DRJ3m0K4J6j9nJ6l5J5K9k3k8KQM3m3k5M8rm8M0jj8K8L0l2L9q5N1k6L0Oj3
$$ 4 13 26 -14 10 26 7 2 18 -17 -2 27 4 -24 -22 -14 29 -14 -39 9 0 -48 -8 -9 -27 1 31 -1 38 -47 4 -22 8 14 1
7362AJ2KqK4r0M8O1r7N9Oj6J6M5p2L5QJ9l7J8l4M7k2qk9L5j7J1Lk%m6N4%J4n4
$$ 1 13 15 7 31 -59 -11 50 -47 12 18 2 18 63 -9 26 34 53 16 34 0 47 25 17 -12 23 6 17 20 18 18 -28 26 26 40 -14
7397a4j6K5Kj9J8J9l0K3J2k6nL5p0Q5m4k8L5olj2K4mkk3j2N0k7L8nl8Q5m5J8n4
$$ -14 -30 -5 -3 -22 -4 15 -15 8 20 -6 -11 24 -46 39 -5 -33 2 -4 -7 -19 5 1 -1 -24 -36 14 -13 25 20 -18 67 22 40 -14
7431a4O3j8Ql0K4%m5J8j5kj9L8J8km1M1n0qJ1l3P1j6%J3l5K7l3K8J5l3J1k4J7
$$ -14 49 31 39 9 33 33 -12 6 -9 -11 -30 8 26 24 -17 24 -26 -34 -23 -56 15 -1 -1 12 -23 4 -29 -1 14 -19 -8 -32 -15
7464a5J9LoN8m6mPL3j2l0k4N3K2k7lmmJl0jl3M3j3K0k4j3K0J4n2M6mL5l4%qmr
$$ -15 4 7 1 59 13 9 16 49 37 7 -17 36 58 31 28 24 20 21 -9 -10 -43 0 -13 7 -17 -30 -10 4 -48 -2 -6 29 -5 -5 -13 -17 -26
7501b6PL9oj1j0M9p9j7M3NL8k7m5M1lk1rK3jL2j8K8k4m9P6j9Rk2l3N9k4L8l9K9
$$ -26 -19 20 14 3 -7 42 -37 -54 -11 -6 32 5 -40 1 -2 -23 -32 -9 -10 22 4 32 8 -41 35 16 25 3 -30 29 5 43 4 33
7535C3k8L3k5n9J9N5l7K7J5o5O5l8M1o7J7l5J1M5j3Krk9O3Qmj5l2N2l4m3L0J9
$$ 33 5 38 13 -46 -27 28 -9 18 33 -32 33 -5 36 -31 -14 -49 -38 7 -6 -4 -13 -42 21 29 25 10 -22 30 -4 -47 -17 2
7567B%kJ4j6nK9K3l5PK5n3J2K2MJ1m6O0m6M9n9k6P5n9JK3j1M6n5qK3j1J6j0L6
$$ 2 2 0 14 -2 -7 22 45 10 17 42 -11 1 23 27 38 -8 52 6 55 -4 -30 45 -14 -13 10 -1 45 -10 -18 5 -6 10 0 36
7601C6m4K5k6L0m7M3l6L9n2K3olJ5n3L6K3J3k7lk1N3j5k7L5j6lJ5mL6lM8p7K0
$$ 36 -8 17 -9 21 -26 17 -19 20 -32 -9 -15 -18 -3 -56 -20 3 16 -11 -14 -35 18 3 -24 11 -5 -8 7 3 39 36 84 7 27
7634B7l7kL4k1L9m1K4l2j4N4l6l2M0j4Pm5J1L2pK3Rk7J7l1K2m8O3J2j4L8o1J1
$$ 27 -10 -12 22 1 40 -1 23 -9 -23 31 -5 -37 3 -11 -4 -49 -38 -6 -13 10 19 -8 9 -22 0 -48 15 27 13 51 -10 1
7666Aj2J6L8n6K7kjjl9L9nNj4L9k4J6j3l6L5Rn0rO9l9j0J2PJ8j1J6o0K2M3%l1
$$ 1 -11 5 43 -13 14 12 11 10 -29 10 5 10 -4 35 11 27 14 -22 13 22 -28 -37 32 -7 -17 -5 2 20 9 25 -35 -13 30 30 -1
7701aj2N2k6Qqm7K7J5l8J4K2N2o7L7j6m4J6K3ml4K9qJ6o7N3L2j7qL8n4M4qk9Q
$$ -1 -13 39 13 21 13 -34 -7 8 -30 -16 6 58 -9 28 12 -32 -16 7 3 -31 -2 -10 6 -61 -8 24 7 -1 37 -17 27 19 -10 -2
7735bPNK4l6M0o3K8J2l6K7Pj6K9jj4l8N3qj6j8N6l4J2j5j0l9N4k2J8Rl0J7PQl0
$$ -2 5 10 34 -2 38 -25 3 15 -21 6 13 -3 26 25 11 -27 26 18 2 -16 40 6 18 3 -7 -46 8 -14 4 13 -17 0 7 15 -15
7770a5J8K3jm2M4n6MM4Oj1Ql2rj9M2oqmNRQRpm8K9L4k6J0k8N7p9N5J6j4m0K2j0
$$ -15 3 26 25 -17 27 -29 -25 19 25 14 22 -10 -19 -38 4 -2 -10 -14 -9 0 8 17 10 -38 -9 25 -1 9 -19 38 -41 14 30 16 -24 -2 -12
7807a2nJ1L9o7j3mM2lj0RPk8M0oJ6L0j4l8NM0l5Ll2L1NL2l7K4l1Ql3O1j7L1m9
$$ -12 -17 -6 33 -34 -47 -51 -9 -12 -22 -13 -6 -34 6 0 16 46 32 -6 -1 39 4 7 -25 6 11 43 6 30 -1 7 -26 35 18 49 0
7842@K8k2Rm4L5k5J0Nj3L7k0j7j6M6%n7N4jj5K3l6J9Kj7QK2k7k3N8o2KK5M2k6
$$ 0 28 6 15 -29 6 -19 -9 -4 -17 20 0 -17 -33 13 13 -44 10 9 -6 17 -19 0 2 -15 -7 15 -12 -35 23 -39 -37 -12 30 4
7876Dl5L0PM1m8mL5l2JK5Ql5K3j9M4qj7L0k3J1l4rK6Nm1OQLqQNK5l5j7K8mJ7l5
$$ 4 -31 -1 6 47 -1 -5 30 -2 -1 24 32 -3 20 1 45 37 20 50 27 38 4 -5 21 26 -15 -9 -1 2 -6 2 7 32 -3 -20 8 4 21 -14
7914a4MNoJ3J1j2pPj0J5j1j0n0R0l4M8n7Q9n8j8OPM0k1j3k4N6j7k8J8nJ6j8Rl8
$$ -14 -10 -5 -11 2 13 1 -6 1 -9 6 -5 -15 -65 25 -9 39 -18 71 13 -5 1 8 48 27 14 -10 46 29 1 19 14 30 12 21 -17
7949a7LJ7j3j8M6jn3kM2Rm3QK9K3Pm3N4o4rL5k7l3M7l2L4lJ4j9M3pn6N0k7k5J8
$$ -17 -14 3 -10 -28 18 17 -36 -38 4 13 -30 -22 7 30 37 -6 48 -16 -25 10 -17 -50 -3 -35 -1 -4 10 -9 34 27 -29 21 -6 -31 -13
7984a3J9nK3j8K9n3J6%K1ll2L7KmkLm7M7nm5K4L1j8j5M4k8J4K1o3MK1l2K5mpO
$$ -13 6 1 24 6 35 -18 -2 -2 19 16 -16 21 23 19 17 20 -27 20 15 -30 -6 25 7 -8 36 8 22 43 -20 -16 5 -27 -2 -6 -13 -7
8020gL8k3k0Mj5L7l3RMMK4j0j4%PQRm4lMJ1K8K8m7L0Mk6J5l6J5j5J9k3jlj4k2
$$ -7 31 8 -12 -8 -23 14 -19 -10 -6 -2 22 12 -2 -2 5 13 22 -22 -25 -21 -10 18 46 -1 29 33 7 22 -14 1 -14 5 -18 -19 -22 -36 -58
8057e8M9K6m1mK0K9l1n6M2J6k4L0m3O3n4nK4QM2o0L1k7L1LnmJ1l0L8k8J0LPkP
$$ -58 -9 17 -24 -28 -8 21 -10 -66 -24 -8 -32 -2 -45 18 -36 -41 -17 -9 33 -27 4 -23 8 11 6 2 13 -17 21 -7 3 6 13 11 18
8092A8l1N0k2m5K8Rjk5jK1jL0m2O0J8o9Rk9L6m8M1J8j6n0J8j5K9Pl6J3K8J3j8
$$ 18 -13 37 15 -30 -2 7 6 -19 -20 1 0 30 -12 48 66 -3 6 -23 13 -35 6 24 8 -42 -24 -39 -10 -3 -39 -26 2 15 -3
8125cj3J3l8K3L0j3J8l6M1Km9L3J6K0m0K9n0L1pj9j7P7l0K4o5QJ8Qjk1M5n0kk3
$$ -3 -16 -3 -41 -18 12 -1 17 -19 22 24 -25 8 24 44 4 33 -17 14 7 -12 -29 48 18 42 -23 -15 3 11 10 -11 34 -16 -18 -41
8159d1K1k4L6K9j0o6R3r4N7k%J0j7rM2m4M1l1Lk1K0j1Qj6J7J8koJ7%K1j6
$$ -41 -20 -44 -8 21 11 -55 38 -56 1 -1 -1 9 -8 -17 25 -19 22 -9 -6 -27 -7 -18 -10 -26 -9 9 7 1 18 18 39 23
8191B3
$$ Imaginary data points
##PAGE= N=2
##DATA TABLE= (X++(I..I)), XYDATA
0@%%%%%%%%%%%%%%%%L2o4O4o4O4r6J28j28J60j92K24k56K88l40L72m16M80n44
$$ 0 0 0 0 0 0 0 0 0 0 0 0 0 0 0 0 0 32 -32 32 -32 32 -64 64 -64 96 -96 128 -128 160 -180 192 -224 256 -288
34b88O23p19Q00q96J007j118J246j384J544j712J896k102K308k535K800l089L403
$$ -288 335 -384 416 -480 527 -591 655 -729 815 -897 999 -1103 1205 -1330 1470 -1619 1784
51A784l752M141m568N042n574O176o865P654q586R696j1031J2690j4811J7647
$$ 1784 -1968 2173 -2395 2647 -2927 3249 -3616 4038 -4548 5148 -5883 6807 -8004 9643
65I643k1638K7732l8286O1600k06266J73980N96727K19208n5130m25290n38241
$$ 9643 -11995 15737 -22549 39051 -167215 6765 603492 822700 767570 342280 -195961
76a95961n09719k25573R3330M16344N40113M89100K22747r7984l96936n16119
$$ -195961 -705680 -931253 -837923 -421579 118534 607634 830381 732397 335461 -180658
86a80658m52959j96855J17952L96787N08218M37511J89826j16793l79879m84380
$$ -180658 -633617 -830472 -712520 -315733 192485 629996 819822 703029 323150 -161230
96a61230m08709j69549J26327L74215M70190L89058J56378j29433l64723m53882
$$ -161230 -569939 -739488 -613161 -238946 231244 620302 776680 647247 282524 -171358
106a71358l70110j44594J29777L52179M32961L45850J26096j38366l48692m22481
$$ -171358 -541468 -686062 -556285 -204106 228855 574705 700801 562435 213743 -208738
116b08738l34097j20321J34221L33120L99684L10990J02859j42244l29900l89319
$$ -208738 -542835 -663156 -528935 -195815 203869 514859 617718 475474 145574 -243745
126b43745k99715r6778J39754L18098L71633K82415Q5473j41674l10309l57107
$$ -243745 -543460 -640238 -500484 -182386 189247 471662 557135 415461 105152 -251955
136b51955k66855p4691J43774L04127L46258K56421P0286j39364k91571l28677
$$ -251955 -518810 -593501 -449727 -145600 200658 457079 527365 388001 96430 -232247
146b32247k38480n7164J44313K88810L21327K31126N4874j38349k75664l04167
$$ -232247 -470727 -527891 -383578 -94768 226559 457685 512559 374210 98546 -205621
156b05621k14878m4073J41616K71406K95715K06859M0461j38717k61852k82593
$$ -205621 -420499 -464572 -322956 -51550 244165 451024 491485 352768 90916 -191677
166a91677j95154l4156J37660K53774K70937J84350K7535j38078k48317k62415
$$ -191677 -386831 -420987 -283327 -29553 241384 425734 453269 315191 66874 -195541
176a95541j77000k5227J33607K37940K49103J64519J7183j35365k34148k42640
$$ -195541 -372541 -397768 -264161 -26221 222882 387401 404584 269219 35071 -207569
186b07569j58863j5816J30609K24249K30285J47591R033j30964k19538k23009
$$ -207569 -366432 -382248 -251639 -27390 202895 350486 359519 228555 9017 -213992
196b13992j41216o796J28059K11822K13151J32739K553j26673k05530k04481j25258
$$ -213992 -355208 -362004 -233945 -22123 191028 323767 326320 199647 -5883 -210364 -335622
207c35622R17J25297J99780J96891J18893l618j22855j92867j87880j11099P675
$$ -335622 -334705 -209408 -9628 187263 306156 302538 179683 -13184 -201064 -312163 -304488
218c04488J22063J87925J81256J05600r565j19418j81267j73069r8444J3196J18311
$$ -304488 -182425 5500 186756 292356 282791 163373 -17894 -190963 -289407 -276211 -157900
229a57900J76580J66665R3132j5091j15815j70660j59383q6958J7866J14500J65924
$$ -157900 18680 185345 278477 263386 147571 -23089 -182472 -269430 -251564 -137064 28860
240B8860J53145Q1797j9725j12299j60428j46590p6611K1757J10556J55643J40662
$$ 28860 182005 263802 244077 131778 -28650 -175240 -251851 -230094 -119538 36105 176767
251A76767P2027k3369j08509j50815j34782o7467K4936J06505J45957J29242O3195
$$ 176767 248794 225425 116916 -33899 -168681 -236148 -211212 -104707 41250 170492 233687
262B33687k6456j04770j41644j23962n9158K7611J02611J36980J18560N4891k9116
$$ 233687 207231 102461 -39183 -163145 -222303 -194692 -92081 44899 163459 218350 189234
273A89234j00995j32989j13988n1374K9986R8764J28537J08865M7504l1250r7104
$$ 189234 88239 -44750 -158738 -210112 -180126 -81362 47175 156040 203544 172294 75190
284G5190j24731j04524m4399L1934R5067J20755R9981M1078l2931r3317j16924
$$ 75190 -49541 -154065 -198464 -166530 -71463 49292 149273 190351 157420 64103 -52821
295e2821r5689l7928L3668R1565J13394R1686L5111l4323q9711j09588q7540l2156
$$ -52821 -148510 -186438 -152770 -61205 52189 143875 178986 144663 54952 -54636 -142176 -174332
307a74332L5179Q8109J06247Q3921K9543l5578q6108j02771q0149k6828L6151
$$ -174332 -139153 -51044 55203 139124 168667 133089 46981 -55790 -135939 -162767 -126616
318a26616Q4426R9611P6654K4388l6517q2705r6381p3255k2018L6937Q1019R3256
$$ -126616 -42190 57421 134075 158463 121946 39241 -57140 -130395 -152413 -115476 -34457 58799
330E8799O9856J9667l7379p9365r0324o6750j7691L7532P7659Q7374O3582J5663
$$ 58799 128655 148322 110943 31578 -58746 -125496 -143187 -105655 -27996 59378 122960 138623
342A38623l7868p6031q4546o0712j3880L7972P4373Q1773N7981J2023l8055p2839
$$ 138623 100755 24724 -59822 -120534 -134414 -96442 -22069 59704 117685 129708 91653 18814
354A8814p9120n5280j0315L8108P1203P6588N2669Q851l8089o9559p4060n0312
$$ 18814 -60306 -115586 -125901 -87793 -16590 59998 112667 121518 83429 13870 -60190 -110502
366a10502p308L7904O8070P1683M7946N939l7825o6455o9217m5789m743L7696
$$ -110502 -117810 -79906 -11836 59847 107793 113732 75907 9452 -59765 -105554 -110297 -72601
378g2601O4957O7007M3580L547l7450o3462o4825m1520k419L7227O1934O2688
$$ -72601 -7644 59363 102943 106490 69040 5578 -59247 -100767 -103186 -65959 -4025 58663
390E8663L9562J397l6984o0439o0540l7688k73L6728N9003N8598L5790o74l6451
$$ 58663 98225 99622 62638 2199 -58341 -96029 -96302 -59574 -571 58027 93817 93143 56692
403E6692n7612n6489l3972J642L6177N6174N4623L2213k518l5864n4847n2782
$$ 56692 -920 -57409 -91381 -89739 -53562 2612 57235 89448 86930 51066 -3781 -56563
415e6563l0454L351L5552N3540N0858K8812m222l5231n2225m9124k7293M971L4937
$$ -56563 -87017 -83666 -48114 5426 56284 85096 80874 45643 -6582 -55706 -82999 -78028 -43091
428d3091N0904M7298K5720n741l4624m9617m5617k4261O495L4262M8420M3859
$$ -43091 7813 55111 80831 75090 40466 -9151 -54768 -79029 -72534 -38272 10148 54007
440E4007K2841p169l3879m7213m2310k1361P837L3628M5962M0755K0009q441l3107
$$ 54007 76848 69679 35800 -11413 -53723 -75084 -67247 -33619 12343 53098 73107 64666 31559
453C1559m4807l9132j8724R045L2792M3617L7738J7412r491l2405m2461l6264
$$ 31559 -13248 -52380 -71104 -62059 -29267 14350 52088 69500 60009 27604 -14857 -51121
465e1121j6216R989L1989M1308L4870J5021j0454l1584m0198l3474j3937J0808
$$ -51121 -67337 -57348 -25359 15949 50819 65840 55386 23802 -16396 -49870 -63807 -52999
477e2999L1121L9050L2105J2865j1239l0701l8035l0815j1833J1498L0229L6910
$$ -52999 -21878 17172 49277 62142 50903 20202 -17833 -48648 -60481 -48983 -18754 18156
489A8156K9549J0875j1880k9756l5876k8348j0011J2113K9308L4834K7211R129
$$ 18156 47705 58580 46700 16944 -18932 -47280 -57291 -45178 -15870 18964 46175 55304
501E5304j2436k8819l3875k6006q200J2622K8295L2910K4917P409j2853k7804
$$ 55304 42868 14049 -19826 -45832 -54032 -41410 -13115 19795 44712 52121 39268 11464
513A1464l1865k3866o678J3091K7374L0989K2789N850j3121k6911l0047k1761
$$ 11464 -20401 -44267 -50945 -37854 -10480 20509 43298 49148 36027 9116 -20931 -42692
525d2692n102J3337K6446K9195K0816M423j3528k5895k8214j9795l789J3661K5506
$$ -42692 -47794 -34457 -8011 21184 42000 46423 32895 7000 -21214 -41009 -44798 -31137 -5631
538e631K7420J8881L091j3754k4989k6488j7946k408J3860K4498K5713J7067J862
$$ -5631 21789 40670 43761 30007 5018 -21470 -39416 -41824 -27964 -3466 22247 39314 41176
551D1176j3917k4043k4924j6181j281J3983K3628K4007J5348P20j4063k3199k3264
$$ 41176 27259 3216 -21708 -37889 -39170 -25187 -1559 22448 37796 38516 24453 1254 -22010
564b2010j4660j54J4030K2645K2586J3656l15j4115k2301k1761j3011P15J4069
$$ -22010 -36670 -36824 -22794 -149 22437 36093 35778 21663 -638 -22399 -35410 -34695 -20626
577b0626K1781K1027J2247j238j4063k1384k0361j1626J682J4067K0848J9706
$$ -20626 1155 22182 34429 33191 19128 -2256 -22617 -34243 -32561 -18494 2354 22060
589B2060J0841k082j3939k0485j8928j0233K436J3986K0073J8268R591k751j3845
$$ 22060 32901 30819 16880 -3605 -22533 -32766 -30330 -16344 3729 21997 31588 28837 14992
602A4992j9638j7613q944L184J3828J9171J7032Q411l397j3783j8699j6404p777
$$ 14992 -4646 -22259 -31203 -28019 -14191 4980 22012 30423 27026 13243 -5456 -21860 -29637
615b9637L709J3673J8336J5772P206l955j3555j7966j5180o728M232J3393J7525
$$ -29637 -25928 -12255 6081 21853 29059 25104 11549 -6417 -21597 -28325 -24093 -10700 6825
628F825J4627O181m466j3347j7182j4080n730M698J3162J6725J3536N313m966
$$ 6825 21452 27633 23167 9820 -7362 -21442 -27172 -22474 -9312 7413 20949 26262 21296
641B1296j3121j6346j2934m875N087J2993J5942J2489M342n250j2845j5554j1951
$$ 21296 8175 -8171 -21105 -25980 -20893 -7900 8042 20531 24873 19623 6778 -8776 -20727
654b0727l952N416J2825J5196J1508L573n613j2538j4875j0914l136N743J2484
$$ -20727 -24679 -19263 -6438 8758 20266 23839 18226 5688 -9187 -20101 -23237 -17494 -5010
667e010J4488J0556K792n872j2281j3980j0074k429O076J2212J3637R614K113
$$ -5010 9478 20034 22826 16954 4673 -9307 -19381 -21810 -15734 -3522 10115 19729 21842
680B1842o098j2027j3299r187j777O193J1866J3000Q682J515o364j1727j2650
$$ 21842 15744 3717 -9582 -18769 -20546 -14353 -2487 10513 19195 20710 14346 2619 -10031
693a0031q318j092O305J1512J2243P893P85o448j1392j1906p555n85O464J1184
$$ -10031 -18349 -19441 -13136 -1624 10619 18512 19297 12849 1457 -10449 -18004 -18589 -12125 -941
707i41J1565P134K96o552j1078j1240o768r3O537J0868J0882O459k11o575j0674
$$ -941 10624 17758 18054 11502 424 -10816 -17584 -17677 -11140 -272 10610 17069 16858 10283 -391
722c91j0588o108M73O589J0501J0245N832o42o680j0270r901n473Q06O696J0128
$$ -391 -10979 -17087 -16614 -10025 476 10721 16553 15911 9231 -1039 -10940 -16413 -15607 -8911 1217
737A217R594N197r81o680r958r249m923J199O694R766Q905M709j332o697r622
$$ 1217 10811 16008 15027 8347 -1611 -10860 -15783 -14584 -7890 1876 10781 15490 14158 7461 -2161
752b161q631m394J518O676R371Q369M190j681o692r249q026l862J714O632R025
$$ -2161 -10792 -15186 -13668 -6992 2379 10748 14938 13257 6565 -2684 -10710 -14572 -12858 -6226 2799
767B799P856L614j887o637q824p643l374J965O608Q682P298L204k148o544q484
$$ 2799 10655 14269 12382 5745 -3079 -10722 -14096 -12131 -5523 3159 10457 13661 11513 4969 -3515
782c515p030k923K186O540Q321O754K733k349o420q184o472k498K451O430P882
$$ -3515 -10545 -13468 -11282 -4742 3579 10333 13066 10717 4297 -3887 -10359 -12857 -10406 -3976 3906
797C906O296K309k535o394p678o020k120K637O312P554N774J956k728o193p353
$$ 3906 10202 12511 9976 3582 -4096 -10116 -12236 -9599 -3287 4267 10041 11997 9269 3076 -4277
812d277n614j679K812O137P166N347J630k843o105p014n224j358K881O080O846
$$ -4277 -9891 -11570 -8758 -2621 4545 9892 11522 8679 2574 -4440 -9664 -11022 -8141 -2061 4785
827D785M904J260k925o018o641m748j064K932N892O486M587Q78l000n822o355
$$ 4785 9689 10949 8024 2006 -4635 -9383 -10447 -7515 -1623 4863 9450 10328 7328 1506 -4849
842d849m355q42L110N676O165M199O25l086n649o034m010m60L099N537N823L869
$$ -4849 -9204 -10046 -6936 -1260 4905 9104 9729 6643 994 -5040 -9050 -9510 -6411 -874 4949 8818
858H818L43l171n492n631l636k58L134N457N501L432J57l173n288n436l216kL181
$$ 8818 9161 5990 498 -5133 -8769 -9027 -5893 -436 5065 8497 8654 5481 193 -5243 -8459 -8461 -5280
875e280N268N172L104n8l260n113n008k959J79L295N055M866K770k79l235n012
$$ -5280 -12 5160 8264 8206 4946 -167 -5175 -8134 -7955 -4660 395 5261 8031 7752 4517 -495
891d95m718k622L41L265M904M532K530m82l226m803m467k383O23L229M717M288
$$ -495 -5213 -7835 -7494 -4229 675 5207 7737 7255 4029 -774 -5241 -7624 -7001 -3772 945 5233
907E233K194o23l267m598m182k079P48L236M517M032J956q03l195m477l901j812
$$ 5233 7427 6804 3537 -1061 -5243 -7322 -6574 -3338 1179 5211 7167 6364 3169 -1308 -5209 -7021
923g021Q51L267M362L749J693r19l272m260l633j528R81L206M267L378J542j115
$$ -7021 -6170 -2903 1459 5208 6901 5982 2710 -1550 -5183 -6711 -5730 -2524 1743 5121 6663 5548
939E548l170m083l403j334J117L161L961L278J223j105l216l904l130j180J207
$$ 5548 2378 -1705 -5108 -6442 -5325 -2164 1797 5075 6298 5193 1977 -1927 -5057 -6237 -5030
954e030L118L830L029R90j204l118l748k898r58J282L149L625K787Q73j349k990
$$ -5030 -1912 1918 4947 5937 4733 1615 -2133 -5031 -5989 -4707 -1558 2067 4854 5727 4378 1388
970A388l614k651p63J333L079L463K574O70j408k996l386k450n96J438K982L351
$$ 1388 -2226 -4877 -5640 -4307 -1228 2235 4809 5479 4071 1075 -2311 -4761 -5357 -3919 -937 2414
986B414K302N73j492k895l251k246m75J520K901L165K143L61j490k893l006k123
$$ 2414 4716 5289 3797 902 -2349 -4595 -5070 -3550 -649 2516 4659 5020 3530 637 -2369 -4492
1002d492k95J517K803K997J965K60j614k771k897j871j84J581K746K806J802J10
$$ -4492 -4787 -3270 -467 2530 4495 4755 3141 370 -2527 -4398 -4582 -3001 -255 2551 4353 4463
1018D463j637k693k726j745o7J648K661K615J658K3j626k587k641j535P9J619
$$ 4463 2826 133 -2593 -4338 -4405 -2757 -96 2519 4177 4200 2574 -13 -2654 -4189 -4110 -2491
1034b491K592K514J471q2j659k530k464j431K19J659K508K359J329k13j669k477
$$ -2491 101 2615 4086 4004 2345 -185 -2649 -4080 -3861 -2202 306 2665 3994 3781 2112 -365
1050c65k297j244K94J673K425K221J164l24j633k410k148j103L54J619K371K148
$$ -365 -2662 -3906 -3612 -1939 486 2707 3871 3547 1914 -496 -2644 -3747 -3393 -1774 597 2745
1066B745R99m03j703k290k002j041M84J682K287J942Q50m13j721k208j875q34
$$ 2745 3744 3341 1638 -652 -2654 -3695 -3211 -1529 758 2700 3550 3137 1416 -792 -2667 -3501
1082c501M63J719K143J857P50n27j638k177j752p09N42J663K058J717O42n56j685
$$ -3501 -3038 -1319 824 2681 3431 2904 1266 -911 -2663 -3372 -2830 -1167 891 2608 3250 2694 1009
1099A009j999j633o65O62J596K054J549N63o35j658j931j559m95P26J587J917
$$ 1009 -990 -2623 -3288 -2626 -1030 1024 2573 3136 2501 843 -1088 -2647 -3142 -2416 -829 1088
1115A088J438M72o54j666j815j448l98P04J607J828J345L99p70j572j810j273
$$ 1088 2526 2998 2344 678 -1137 -2585 -2983 -2279 -672 1156 2501 2900 2130 558 -1252 -2525
1131b525l32Q40J544J752J212K89p78j566j685j204j94P94J537J659J163J70q13
$$ -2525 -2857 -2017 -473 1279 2491 2780 2002 436 -1249 -2453 -2647 -1853 -316 1343 2506 2676 1863
1148A863j514j637j106j18Q20J453J581J073R9q55j503j465j047o4Q77J433J505
$$ 1863 349 -1288 -2394 -2512 -1692 -239 1342 2415 2514 1659 156 -1309 -2356 -2420 -1543 -110 1395
1165A395R53K0q39j465j497q58JQ47J437J417Q46K1r27j405j387q37P3R65J361
$$ 1395 2348 2368 1529 64 -1433 -2291 -2290 -1443 -6 1411 2257 2278 1351 -54 -1441 -2278 -2205 -1240 121
1184A21J341P74j26q75j380j332p46J39R65J270J261P12j29r07j366j198o38J43
$$ 121 1462 2236 2110 1235 -145 -1477 -2223 -2084 -1119 151 1412 2124 1995 1088 -278 -1476 -2114 -1971
1202a971R77J259J187O15k35q98j268j142o35K37R47J226J059N94k37r71j163
$$ -1971 -994 265 1452 2067 1832 934 -334 -1476 -2111 -1874 -927 299 1358 1952 1715 744 -419
1219d19j060n44L03R25J220J023M63l12q84j189r81m32K90R44J137R88L46l08
$$ -419 -1479 -2023 -1720 -795 425 1448 1911 1599 715 -474 -1455 -1887 -1597 -653 484 1472 1818 1510
1237A510r03j104r47l08L10Q78J137Q95L61m04q55j104q79k82L56R38J041Q32
$$ 1510 607 -497 -1444 -1752 -1442 -564 573 1468 1829 1425 570 -534 -1413 -1695 -1339 -401 640 1472
1255A472K71l70r22j072p93k24M27Q63J032P53K02m18q93j000p11k07M36Q34R77
$$ 1472 1743 1373 451 -621 -1414 -1638 -1211 -348 684 1437 1639 1221 328 -672 -1383 -1590 -1154 -320 657
1274F57O76K07m73q83q88o96j62M05Q99R19O12J51m77p96r07o24r0M86Q13Q92
$$ 657 1333 1540 1067 184 -704 -1400 -1562 -1157 -258 661 1273 1424 947 151 -756 -1380 -1470 -984 -171 721
1294G21N66P4m53q14q85n56o6N35Q21Q00O18j7n47p40p87n57k4N41P77P80N49
$$ 721 1287 1361 908 94 -791 -1347 -1413 -878 -57 743 1361 1344 797 57 -730 -1287 -1311 -770 7 787 1336
1315A336k6m87q45p80m29%N50P40P49M77n4n29p63p34m22O3N13P69P13L79j13
$$ 1336 1310 823 -22 -802 -1231 -1231 -681 59 808 1285 1231 702 -61 -795 -1217 -1154 -641 128 841 1220 1107
1336A107n24p11o69l25L4N31P13O37L79r8n07p71o28k91P0N23O63O77L15j59n07
$$ 1107 583 -128 -797 -1122 -1088 -557 156 793 1172 1074 567 -204 -832 -1123 -1053 -530 133 810 1125 966 459
1357D59o18o78k95J10N43O96N72L12j75n10p06n30k82J49N26O56N79K18k00m94
$$ 459 -159 -837 -1132 -1022 -479 217 789 1101 926 416 -290 -820 -1102 -953 -427 229 808 1026 826 332
1377C32o03n50k42J87N36O52M82J93j99m67n82n47j60J69M98O04M76J72j96m40
$$ 332 -271 -821 -1063 -876 -340 312 794 987 788 321 -261 -808 -968 -799 -301 303 779 951 755 315
1397C15o12m72j49K25M58N62M91Q6j88m70n16m95j10J77M68N59M22J23k53m51
$$ 315 -297 -769 -918 -693 -235 327 818 904 716 246 -270 -765 -875 -698 -230 329 751 874 621 170
1417A70n21l92j33K22M81N09M18N1j70m98m97l89q6K51M57M91L59P9k08m82m75
$$ 170 -351 -743 -876 -654 -173 336 754 805 635 137 -360 -749 -835 -584 -127 364 723 802 594 112 -363
1438c63l62l9K05M40N08L84K1k80m16m70l49%K37M06M72L03k6k09m18m39k93m
$$ -363 -725 -764 -559 -119 389 773 794 514 98 -372 -721 -721 -484 -78 394 697 671 462 44 -395 -688 -692
1460f92K40L73M70L20n5k44l84m73k18m2K57M28M29K44j7k66m14l55k65J1K88
$$ -692 -452 -79 391 711 656 412 28 -445 -663 -705 -448 -20 409 653 636 370 -44 -399 -664 -653 -365
1481c65L69L96J83pk19l89m11k22N8K54M05L51K16j0k94l43l73j65J4K60L59L50
$$ -365 4 400 583 576 357 -32 -443 -665 -607 -353 52 403 619 609 315 -28 -401 -566 -552 -292 67 417
1503D17J79j13k03l15l82j62P1K38L51L52J21n4k61l18l42j13J9K68L46L07Q0
$$ 417 596 483 280 -35 -417 -579 -508 -270 81 433 554 500 239 -79 -421 -534 -515 -247 99 406 486
1524D86k2k66l51k08j84Q6K55L17K65J43n3k74l18k83r1O9L20K04K73J45j01j85
$$ 486 464 198 -153 -361 -545 -459 -204 113 378 521 468 194 -124 -407 -498 -429 -109 95 368 513 412 227
1546B27l41k88j12J19K42K86K55P9o7k36l00k20q8J11K25L14J70Q7j42k29k25
$$ 227 -114 -402 -514 -395 -153 133 388 467 400 164 -136 -356 -444 -333 -108 206 376 463 321 92 -133
1567a33k77J7K0K37K83K10O0p1k16l03j88l7J22J96K14J99O3m7k47k91k06k2J77
$$ -133 -410 -393 -373 -136 147 357 417 346 130 -173 -361 -398 -276 -80 134 333 396 349 102 -189 -395 -417 -240
1590b40J46K66J98J3j11k28k18j98PQ7K63J78J85L6j36k19k21j46p6J33K32K61
$$ -240 -94 172 370 383 272 44 -174 -372 -365 -278 -15 163 348 384 248 29 -192 -338 -414 -281 -49 212
1612B12R1O8j50k45k07q5kR1K02K35R1lj18j80k53j31K5J76K05J34J57oj44j96
$$ 212 303 371 221 -24 -231 -316 -318 -227 -25 210 301 298 180 0 -253 -384 -359 -183 22 156 313 307 163 -33
1636c3j66j15L5J17J54J87J17j3q2k13j91j15L9J48K15J24J08p4p1k14j23r6J2
$$ -33 -199 -314 -279 -162 -8 179 296 283 201 -12 -203 -318 -279 -131 84 208 316 242 171 -43 -166 -262 -250
1659b50Q0K00K03O0k9j11j64k06o1K1J56J44J46L2J8j57j68j32k0KJ07J76K05
$$ -250 -170 30 233 293 264 153 -11 -217 -278 -257 -101 43 189 221 239 82 -86 -218 -238 -236 -129 47 252
1682B52jm2j29j73j51k3K9J45J50J42K7l8j09j48j20r8J16J12J47Q5L4Oj07k05
$$ 252 251 209 80 -93 -244 -267 -238 -93 57 199 226 188 79 -69 -189 -287 -171 -59 88 173 207 213 106 -99
1706i9n6q5L9J19J48J00N4k0j39j41q2o7M6J28J77Q5oj6j70q2j41QL5J36O9J19
$$ -99 -155 -240 -201 -82 66 166 220 200 61 -80 -162 -229 -183 -55 122 207 201 185 15 -67 -208 -200 -165 -29 40 159
1732A59N7o7j49n4j05o4N2J61J26O0j7Rj81r1p8K6M6P4J47O2M5q3n6j57j22J6
$$ 159 216 149 0 -54 -159 -223 -171 -10 116 176 159 168 -13 -104 -182 -156 -110 -36 111 173 218 135 79 -78 -200 -184
1758a84J0J57J07J01J5j02p7p6r9k0L8J17J03O7L3p7j08j07p8PN0J15R3O8Nm6
$$ -184 -174 -17 90 191 206 104 27 -49 -148 -168 -130 -13 90 157 190 113 5 -102 -180 -173 -123 -8 85 153 158 112
1784A12j29q9l8nN6Q5J16N3ro2o9j44%j6M6J08Q7K9K4m7j51j4j22O4M8P0R3J0
$$ 112 -17 -106 -144 -149 -93 -8 108 161 152 90 21 -123 -123 -139 -93 15 102 131 155 108 -43 -57 -179 -115 -67 3 96 106
1812A06K9l4j05j00n8L0P9O8N5M9K1o5r5j20M1l8M5R6J14J1kl2j07r4k3J1J02
$$ 106 135 101 -4 -104 -162 -132 -53 15 70 119 140 75 -20 -140 -99 -137 -92 4 118 129 127 95 -12 -106 -129 -118 -16
1839a6L8L4R5l2o5j2j39m6L6O8N9Q0M7l1k8o0j22m7N8O7L9N1L8l0m7n3n6l6K5
$$ -16 22 56 151 119 54 42 -97 -143 -107 -39 20 100 147 116 88 28 -94 -141 -83 -16 23 74 112 82 35 -18 -74 -110 -85
1868h5J08rM7N4m3k5p8l8%j2L6P4K8K8k0p8j3p9k9K9O6O1O5K5m3n3n7o8KK7Q9
$$ -85 23 14 61 115 72 47 -31 -69 -69 -81 -45 29 57 85 65 -13 -26 -105 -134 -105 -39 22 87 112 69 16 -41 -109 -107 -80 9
1899IM3J5K6j5k8j12P1q5J5O0P5krrl2n6l0n6P9K2P9Nj6ro3k9n5K4K0M5J00o9
$$ 9 52 67 93 78 50 -62 9 -76 -61 -1 74 72 63 54 22 -34 -64 -120 -41 -19 60 65 49 40 -23 -52 -107 -83 -63 -18 82 13
1931A3N7l5o8m9KK3J1N2lO9j9j3o6K6q9K6K7L2M2%K3k0q9l6j5L0J2K9M0Q5ml1
$$ 13 70 35 -33 -82 -80 -57 -46 6 3 72 53 40 -26 0 -89 -63 -36 -4 38 38 61 41 -48 -84 -99 -69 -57 -28 12 97 93 62
1963F2j00j4l6k2Q1L0lJ3O8p2l7p4K5K8J4N5k6J08k5m4k5o0j1K9j9R8RJ1km8k3
$$ 62 -38 -52 -88 -110 -29 1 -2 11 79 7 -30 -104 -79 -51 -37 18 -8 100 75 31 6 -54 -65 -36 -55 43 52 63 61 13 -10
1994a0m9K3k2J0O2M0L6m2n8j7n3M2LmN5N4J5l2k8k6%n2L4k4Q2OJ9j0K2r2k3n7
$$ -10 -59 -36 -58 -48 14 54 90 48 -10 -27 -80 -38 -35 -39 16 70 85 53 25 -1 -1 -53 -19 -43 39 45 64 54 76 -16 -39 -96
2026i6M8M7L0J2rM9p8p3j5J6j4N2j7N3O3o8kNk6j1L5j0J3J8M3n0j1ok0j9L0K0
$$ -96 -48 -1 29 41 32 81 3 -70 -85 -69 -83 -31 -48 5 68 0 -2 3 -23 -34 1 -9 4 22 65 15 4 -2 -22 -41 -11 9
2058IOM0l0J7m4l3poK2M1l3M6olK1o7k5n1L4M7LJ6L2Rm9k0O%j8L1L2L2j1m1K5
$$ 9 15 55 25 42 -2 -35 -42 -48 -26 15 -18 28 22 19 40 -27 -52 -103 -69 -22 -19 -3 29 38 -11 -31 -25 -25 -43 -12 20 52 41 0 25
2093B5l3m8J3K3M2Ll7R9p5Kqn8O4k4O3k8PM4l1l1k9j2j4L9K9KLJ7l5o2L2Nj6m2
$$ 25 -8 -56 -43 -20 22 25 -12 87 12 14 6 -52 12 -12 51 23 30 74 43 12 -17 -29 -43 -4 25 27 30 47 12 -50 -18 -13 -29 -71
2127g1P7J2J2Jp6L6K1m4L1qqN8Lkp6M4l2m0lO2J5lmJ8pm7m4M6L1J1Rj7J4KL3l5
$$ -71 6 18 30 31 -45 -9 12 -32 -1 -9 -17 41 44 42 -34 10 -22 -62 -65 -3 12 9 5 23 16 -31 -75 -29 2 13 22 5 19 21 54 19
2163A9k3m2L1kL3M5j5l3k2j4J0j1jM6m9J8jK7l3JPm5jP5l4L9Nj7Jll0m0K7rK7
$$ 19 -4 -46 -15 -17 16 61 46 13 -9 -23 -13 -24 -25 21 -28 -10 -11 16 -17 -16 -9 -54 -55 20 -14 25 30 13 14 11 -19 -59 -32 -41 -14
2198a4M3rl5J5k4Nl5O6k2J2M3J3j5k8J7l4K0n1K0L1onj9K3qj6J9j4K8RoOPl0J
$$ -14 29 20 -15 0 -24 -19 -54 12 -10 2 45 58 43 15 32 -2 18 -33 -13 18 12 7 -12 11 3 -13 6 -8 20 29 23 29 36 6 7
2233Gk5J4j7n5P4k1N5p5L5K1l2J7k6oO0qM1m9n6J9oO3k4K1k6M0Ll3k0Oj9M6k8
$$ 7 -18 -4 -21 -76 -2 -23 32 -43 -8 13 -19 -2 -28 -34 26 18 59 10 -46 -27 -33 30 6 27 1 41 44 11 -9 -3 -22 24 -4
2266dK2JK4l7lQl9K6j6l5L9K6k7K2j5L2k5l1JKQ4m0mJ6l6jM0n5mN3m1L0k1j6M0
$$ -4 18 19 43 6 3 11 -28 -2 -18 -53 -14 12 -15 7 -8 24 -1 -32 -31 -29 55 15 11 27 -9 -10 30 -25 -29 24 -17 13 -8 -24 16
2301A6m3Rj7M0M6l6QJ0j3m4K7QJm7L1%L1k2OJK2k3k9L3ppJ5J4L4r2L8j6k6L0Q
$$ 16 -27 -18 -35 5 51 15 23 33 20 -24 3 11 12 -35 -4 -4 27 5 11 12 34 11 -18 15 8 1 16 30 64 -28 10 -6 -32 -2 6
2336Fj5J1KLj1o%Nnj2Pk9O2LQl0k9NL8m1L5l7M2l5M7m0RLKj9K6k5M2rK5j6k2J5
$$ 6 -9 2 4 7 -4 -10 -10 -5 -10 -22 -15 -44 18 21 29 -1 -30 -25 13 -28 7 -30 12 -23 24 -16 -7 -4 -2 -21 5 -20 22 13 38 22 0 15
2374A5j2K1o8O6m8P3l1l0L5k8kj2K2K3l8Pj1mj9M8kk9M4k1pk3L0l0L8j5nj6M1
$$ 15 3 24 -44 22 -26 47 16 -14 21 -7 -9 -21 1 24 -14 -7 -18 -22 -41 7 5 -24 20 -1 -8 -31 -1 -31 7 -8 -13 -29 12
2407A2rOJ2m4j8P5l1k0mPK7k2lK3J0J2k8j1J6l7O1rk8J7j9oj2J7j9L5ojJ7o4J5
$$ 12 3 9 21 -23 -41 34 3 -17 -21 -14 13 -9 -12 11 21 33 5 -6 10 -27 34 25 -3 14 -5 -11 -23 -6 -25 10 4 3 20 -44 -29
2442b9K3J7n1k1Q4k9J5k7L9pl1LL8Lj7lJ1j8N5m3j9k6J1L5j3K1Lk1Rj9P0r7J0
$$ -29 -6 11 -40 -61 23 -6 9 -18 21 14 -17 -14 24 27 10 7 18 0 55 12 -7 -33 -22 13 0 21 24 3 12 -7 63 -34 -24
2475b4M6nOo7N8l5J0Pl1Q1n1jK7l8PJ8j7jk6J6LK8j6jJ3k0m9K7K9j2JlJ7PrrO
$$ -24 22 17 23 -44 14 -21 -11 -4 -35 46 -5 -6 21 -17 -10 8 -9 -10 -36 -20 -17 11 -5 -6 7 -13 -62 -35 -6 -18 -17 -20 -3 4 -5 -14 -8
2512hK1RJ0m8L0jl7J9J6K0jm8LJ7J4m0M5j0k5J6k4%J9poL3m3J3J4J6j0LQk1J5
$$ -8 13 22 32 -16 14 13 -24 -5 11 31 30 -18 -15 2 16 -24 21 11 -14 2 -22 -22 -3 -10 -16 17 -26 -13 1 17 7 10 18 -3 12
2547A2m4N7k4Ojlj2J2k9nO9n8RM4l9J6mk0M8m5K1K1J5m4J6o0M2jj7P0l0kJ8l8
$$ 12 -32 25 1 7 6 3 -9 3 -26 -31 38 -20 -11 33 -6 10 6 -14 34 -11 10 31 46 2 18 -42 0 -1 -18 52 22 20 38 0
2581@J4j3pK1n0Q4n7m0P3o4K4J6rL0o0j2RK9qk3J2K2m0N0J3j1j4PPpK2o4K1P0
$$ 0 14 1 -6 15 -35 49 -8 -48 25 -39 -15 1 -8 22 -38 -50 -41 -12 -20 -43 -31 -9 -49 1 14 3 -11 -4 3 -4 18 -46 -25 45
2615D5m7J1pOK9n2L2mk3k8L4J8%J3j1j2M1j9J0J4l5Rl1oJ6%LM6o2k7O4n6J9M0
$$ 45 -2 9 2 8 37 -15 17 13 -10 -38 -4 14 14 27 16 4 45 26 36 50 15 24 -7 -13 3 3 6 52 -10 -37 27 -29 -10 30
2649C0l5JLJ6m4M0o1M6j9jPj8K7J6oPl8N4j9j6kN3n6j0M3Ll6L6l3JJ0Ql8L6Mj4
$$ 30 -5 -4 -1 15 -29 11 -50 -4 -23 -24 -17 -35 -8 8 2 9 -29 25 6 -10 -12 41 -15 -25 18 21 -15 21 -12 -11 -1 7 -31 5 9 -5
2685enK5K6k8j0l0M2n0N3K8o4oK0k0k8K4M5m5P7p8J3RKj9J6J5k0j1L2n7N8k2l5
$$ -5 -10 15 41 13 3 -27 15 -35 18 46 -18 -24 -4 -24 -52 -28 17 -28 49 -29 -16 -7 -5 -24 -8 7 -13 -24 8 -49 9 -13 -48
2718d8Q3n5J8j5%J2Pj7L1J8m7Qn%k1Q1m8L2j5k4M5o9J1K3J5l5m4O4K6Lj9rk5N
$$ -48 35 -20 -2 -17 -17 -5 2 -15 16 34 -13 -5 -10 -10 -31 50 2 34 19 -5 40 -29 -18 5 20 -15 -59 5 31 34 15 6 -19 -14
2752a4m8M2J4M5m9K3moJ0l2PK2j7Rn%m1M6k8OQL5J7l7J5n0M8J0m1MP2q5M4j4k5
$$ -14 -62 -20 -6 39 -10 13 9 3 13 -19 -12 10 -7 2 -3 -3 -44 2 -26 -20 -12 23 40 3 18 -32 16 26 -15 -11 61 -24 20 6 -19
2787a9QJm1N7lJ2pk5Mml1Q4l5j3jk0L2J3JJ0k8J5jk2M5m6NK6k3pJ9L3j6m6M1J6
$$ -19 -11 -10 -51 6 3 15 8 -17 -13 -17 -48 36 1 -12 -13 -33 -1 12 13 23 -5 10 9 -13 32 -14 -9 17 -6 -13 6 39 23 -23 18 34
2823C4kLk9K6j3k9J6k1OK9J4Ml1l0L5nj3J6K0k0OKj0k2j9rK1l2M8l6oJ6L5K1j6
$$ 34 32 35 6 32 19 -10 6 -15 -9 20 34 38 7 -23 12 7 -6 10 30 10 16 18 8 -14 -33 -42 -21 -53 -5 -41 -47 -31 4 25 9
2858Ij5ML0m5j1J1nJ5K1K2n1L6k8moKRRN5p6L3OMK0p3MQk6O3m5K5J4jk3k0J8K1
$$ 9 -6 -2 28 -17 -28 -17 -22 -7 14 36 -15 21 -7 -11 -17 -15 -6 3 58 -18 15 21 25 45 -28 -24 -16 -42 21 -24 1 15 14 -9 -29 -11 10
2895A0n5L6O6n1kl5L4jl0J4K5Jk9J2J0k0L5l4J0j4L8pl2J8Kl2K1J2J9qJ3%K4o0
$$ 10 -45 -9 57 6 4 -31 3 2 -28 -14 11 12 -17 -5 5 -15 20 -14 -4 -18 20 13 -19 -1 1 -31 -10 2 21 13 26 26 50 -10
2929a0M4k2k6M0m0M2j1jLok1L2l6L1po3N7l1M4J1k9J5k7M2k6J2Mn7M2k2k3J6Q
$$ -10 34 12 -14 26 -14 28 17 16 19 13 -8 24 -12 19 12 -51 6 -25 19 30 1 16 -11 31 5 17 21 -36 6 -16 -39 -23 -15
2962a5%P4p1nL5JMl2RJ1lll2K9K3j2m5k4L7J4OQm1Q1l2J4l6j9pJ8L1o2L1J6K6
$$ -15 -15 59 -12 -17 18 19 23 -9 0 11 8 5 -27 2 25 13 -32 -56 -19 -5 1 9 -32 49 17 31 -5 -24 -31 -13 18 -44 -13 3 29
2997B9m9Pk4M9mL1o6K4K2k3pJ3L1n9J0jj3J2M1l7K9j9RrmJ2M1jl7J0l1K9k1RL3
$$ 29 -20 -13 -37 12 8 39 -27 -3 19 -4 -11 2 33 -26 -16 -17 -30 -18 23 -14 15 -4 5 -4 -8 4 45 44 7 17 -14 15 -6 3 36
3032C6J6j8j2Ol3m4M5J3n4O6o4J1J4NjrN4k1Lo0L8Ln8M9M6m4N1o2M7m5k4K2RJ4
$$ 36 52 34 22 28 -5 -49 -4 9 -45 21 -43 -32 -18 -13 -14 -23 31 10 13 -47 -9 -6 -64 -15 31 -13 38 -24 23 -22 -46 -24 -15 -1
3066apM3p2K3NM6Ln5oJ9Qk6L1rlJ6l0LJ2PJ5k0MKJ4m4J%N2j5k2j0o5L2J2M1jJ2
$$ -1 -8 35 -37 -14 -9 37 40 -15 -21 -2 6 -20 11 2 -1 15 -15 -12 0 7 22 2 6 8 22 -22 -21 -21 31 16 -6 -16 -81 -49 -37 4 3 15
3104A5l3K2j7L7o8L8L3n4M2qo7O5k9J7j1J4j9MlL6k3pj9K9J9Pl2J5J9l7R1o5j1
$$ 15 -18 4 -13 24 -44 -6 27 -27 15 7 -60 5 -24 -7 -18 -4 -23 -19 -22 14 -9 -16 -35 -6 13 20 -12 3 22 -15 76 11 0
3137@J8qL7k9Nk6kj7M7j7Jk2L2Lm8N8oj3K1n4J0L4J0lk6nk5K1rKJ5K6m9L7k9J4
$$ 0 18 10 47 18 23 -3 -5 -22 25 8 9 -13 19 22 -26 32 26 13 34 -20 -10 24 34 31 5 0 -25 -4 -13 -11 4 30 -19 18 -11 3
3173CmM0l7M0l5Ok5PJ3J4j0J2k1Rk0L7j6J3k4K1j0rlm0N2K6kp3O8k2rJ5j2q0L8
$$ 3 -1 39 2 42 7 13 -12 -5 8 22 12 24 3 12 -8 29 13 26 2 23 13 4 1 -39 13 39 37 -36 32 10 1 16 4 -76 -38
3208c8K1KL0o3J0M4m2MK0k2M4l3L4j9%K4j9M0k9j8j6K5K4lk0qkL8o3nPL9J5rN
$$ -38 -17 -15 15 -48 -38 6 -36 -32 -12 -34 10 -23 11 -8 -8 16 -3 37 8 -10 -26 -1 23 20 0 -8 -10 28 -35 -40 -33 6 21 12 17
3243A7j4l4M7jJ8nk3m2RO5o1RMj4MrM9JMl9K0Lj6rj9J7k0L7n6N9l8P1l4pkkOK5
$$ 17 3 -31 16 15 33 28 5 -37 -28 37 -24 -15 -11 -25 -21 -30 19 20 24 -15 5 8 -8 -17 -36 -19 -39 -2 -58 1 -37 34 0 -7 -9 -11 -5 20
3281B0k6lqPL7J7J5m0J7j8k7J6k7J5L3m1K3K4n1l2L8l3J4M8J1l7L0l4J9j0MlK0
$$ 20 -6 -9 -17 -10 27 44 59 19 36 18 -9 7 -20 -5 28 -13 10 34 -17 -49 -11 -44 -30 18 29 -8 22 -12 7 -3 1 -2 18
3314A8l8J6K8k1K5n9oJ7L0p4M4Rk4L7n3M9Nk6pP7k1n0M7l4NK6lLJ5o8J2N4j2L
$$ 18 -20 -4 24 3 28 -31 -37 -20 10 -64 -20 -11 -35 2 -51 -2 3 -23 -30 47 26 -24 23 -11 -6 20 17 20 35 -33 -21 33 21 24
3348B4j7L4m0L6M3q8KJ2rM0o8JL5m5j3L7oK2L4on8M0j0ql2L6K5%m1OM5ml0rKR
$$ 24 7 41 1 37 80 -8 -6 6 -3 37 -31 -30 5 -40 -53 -16 -22 0 34 28 -30 10 0 -8 -40 -4 21 21 -20 -14 31 27 -3 -12 -10 -1
3384aML5k9l2N4Om2PN6o0Pj3%J9l9L4j3RqL0n3nM8j1k4j1lO2mj0m1J0L7k7jj8
$$ -1 3 38 9 -23 31 37 -5 2 58 -2 5 -8 -8 11 -28 6 -7 2 -6 24 -29 -34 14 3 -21 -32 -35 27 23 13 -28 -18 19 -8 -9 -27
3420b7N2k8l4N1qj0k3M1qJ8%k4L4k9j4J0kj5L0pNm3O6j9j9jM4Jm5L0m0okj5O9
$$ -27 25 -3 -37 14 6 -4 -27 14 6 24 24 0 34 5 -9 1 -1 -16 14 7 12 -31 35 16 -3 -4 40 41 -4 26 -14 -20 -22 -37 32
3455C2l2OJ3L9m7l8jMN1o0Qj8O6k4j9K1mK7rn1N4k8ojK3l6N6J1n5J8J7j2J3kj4
$$ 32 0 6 19 58 11 -27 -28 -24 27 -33 -25 -43 23 -1 -20 1 -3 24 15 -36 18 -10 -16 -17 6 -30 26 37 -18 0 17 5 18 16 2
3490BJ3KJ9Pn7L0kj3k2qK6nj7qM6m8N1l1J1lj5K9M6o1K6pj8K5oqp2O6k1k6P4l4
$$ 2 15 17 36 43 -14 16 14 1 -21 -29 -3 -8 -25 -33 13 -35 16 -15 -4 -7 -22 7 53 -8 18 11 -7 18 12 4 -68 -2 -23 -49 25 -9
3526ik0J8j5J4qpM2joK0j2pK2Olk2klj6L2j1L3l8K9k2J7Jl1k8K8k4qN2m0k2K4
$$ -9 -29 -11 -26 -12 -20 -27 15 14 8 28 16 9 31 37 34 12 10 7 -9 23 12 45 7 36 14 31 32 1 -27 1 -23 -31 21 -19 -41 -17
3562a7MJ1l6L9j0J1Pj0J0K6n2N4k3kj6Jj7L7j8k0L2k1mNL7o1L3LJ1k3j1J6%nN
$$ -17 -13 -2 -38 1 -9 2 9 -1 9 35 -17 37 14 12 -4 -3 -20 17 -1 -21 11 -10 -14 -9 28 -33 0 3 14 -9 -20 -4 -4 -9 -4
3597dNK8n7O7k9n0P6Oo5j3K5J3Krj2jQJ9qn2N2lok1jl8M9K7k2ql0K0rQK3PpLK6
$$ -4 1 29 -28 39 10 -40 36 42 -23 -36 -11 2 4 -5 -17 -18 -10 9 1 -51 1 -2 -8 -29 -30 -68 -19 8 -14 -22 -52 -32 -41 -33 -10 -3 -10 -7 19
3636A9k4QjjL2k5k8k0N3mn4O0k7K3l4L0k4kJ2%PKk0m4M4J0l5O9k4J2m9K5M0l4
$$ 19 -5 3 2 1 33 8 -20 -40 13 9 -45 15 -12 11 -23 7 -17 -19 -7 -7 0 2 -18 -62 -18 -8 -43 26 2 14 -35 -10 30 -4
3670dJk2P7n8oj2M4l2J5Pj4J6om3K3qM0Lpj0rN8n9nL3m0M5jm8M6k0N5q4L8j2J1
$$ -4 -3 -25 52 -6 -12 -24 20 -12 3 10 -4 12 6 -37 -14 -22 18 21 14 4 -5 53 -6 -11 22 -18 27 26 -22 24 4 59 -25 13 1 12
3706A2J0j8K0n6%L7mj5K7j%L1n3K7j4k4qk7K0K6K3J6n9N5k4l2j0K5M5n4L6k4l2
$$ 12 22 4 24 -32 -32 5 1 -14 13 12 12 43 -10 17 3 -21 -29 -56 -36 -10 13 29 -30 25 1 -31 -41 -16 29 -25 11 -13 -45
3739d5N6Km2M5j0m0L4l4J7L7n8RM0jj7L7l1J8j5L0j6K7m6L1k2m4L6K1j1j1l7L6
$$ -45 11 13 -29 16 6 -34 0 -34 -17 20 -38 -29 11 10 -7 30 -1 17 2 32 16 43 -3 28 6 -38 -2 19 8 -3 -40 -4
3771dj4m1N2K2j0K5m7J9K6j2%l4M3k8j5jK1j8J2l1K4J9J6k3j8l0K9K9m9K6M0l1
$$ -4 -18 -59 -7 15 5 30 -17 2 28 16 16 -18 25 -3 -18 -19 2 -16 -4 -35 -11 8 24 1 -17 -47 -18 11 -38 -12 28 -3
3803cK6Rl8J2J6jl7j4M9Nl1J7KKj5K4k0m1M1m0J1J8k4%L1k4prJ1J9J1k3J5J2m
$$ -3 23 32 -6 6 22 21 -16 -30 19 24 -7 10 12 14 -1 23 3 -38 3 -37 -26 -8 -32 -32 -1 -25 -32 -41 -30 -11 0 -23 -8 4 0
3838@k7mN8j1J8j0j1m7N7Rm2L0j1m2N3jj2j6J2rnnL7m0PJ8J7l4N2l1n0M8j8M2
$$ 0 -27 -31 27 16 34 24 13 -34 23 32 -10 20 9 -33 20 19 7 -9 3 -6 -11 -16 21 -19 -12 6 23 -11 41 10 -40 8 -10 32
3872C2n6L9j3k5L3J6k1%l6K9jn6RM4kJ2k5ML7k3PJ2kJ3k6L5k8L3o4K9J5j3L4l3
$$ 32 -24 15 2 -23 10 26 5 5 -31 -2 -3 -59 -50 -6 -8 4 -21 -17 20 -3 4 16 14 27 1 36 8 41 -23 6 21 8 42 9
3906IJ5k1m0L9m9O9m7qP2m8rJ2L1nmpk5J9k3j2L7o1M1J3J2Ll0nrM9qk7l5N9j1
$$ 9 24 3 -37 2 -47 22 -25 -33 39 -9 -18 -6 25 20 16 9 -16 3 -20 -32 5 -56 -15 -2 10 13 -17 -22 -31 18 10 -17 -52 7 -4
3941dkK4j4J2k2qK8J2j5%M0l3j7pK1j6k6M4J2m7kL6K2k4j1J8J2p3J7kj3O2n4K6
$$ -4 -6 18 4 16 -6 -14 14 26 11 11 51 18 1 -6 15 -1 -27 17 29 -18 -20 16 38 14 3 21 33 -40 -23 -25 -38 24 -30 -4
3975dloK2%k5rJ8Kqkk1J8K0L%J1o2Q7p0L1l6M1lj0lkJ8Mk7K5j0L9l2l4j2O4j7
$$ -4 -7 -13 9 9 -16 -25 -7 -5 -13 -15 -36 -18 2 5 5 16 -46 41 -29 2 -34 7 4 -6 -9 -11 7 11 -16 9 -1 38 6 -28 -40 24 7
4012Gk4L5o%l9J7L6l8RJ4j7M0m3PJ5m7K9K7j4k2j3JL5k0j4M4l0J9opL6l1K9k2
$$ 7 -17 18 12 12 -27 -10 26 -12 -3 11 -6 34 -9 -2 13 -34 -5 22 8 -14 -27 -26 9 -11 -25 19 -11 8 2 -5 31 0 29 7
4046Gj3K3moJ3j4J9l3O2n2J3J7j9m1K5Oj2k4M7k9NKqm2J9NK9J2k0nN2m9K1pm5
$$ 7 -6 17 13 7 20 6 25 -8 54 2 15 32 13 -28 -3 3 -9 -33 14 -15 -10 -8 -16 -58 -39 -34 -5 7 -13 -18 34 -15 6 -1 -46
4081d6P1k9m1Mj3K7K9k1OoLJ5oL6j2l5J5L0k9j1J4L3l6Kk5j2RN6l1K7j3K4l3M
$$ -46 25 -4 -45 -41 -54 -27 2 -19 -13 -19 -16 -1 -7 29 17 -18 -3 27 -2 -13 1 34 -2 0 -25 -37 -28 28 -3 24 11 35 2 6
4115FK0l2L0J3m7lK4j0k6QP5j03N0QK8p3K2k7J6J1J1ll3O7j4m8L5k4lK9j4K9k9
$$ 6 26 -6 24 37 -10 -13 11 1 -25 -17 58 -45 5 13 41 -32 -10 -37 -21 -10 1 -2 -35 32 18 -30 5 -19 -22 7 -7 22 -7
4148gK3pmj2J8k6k3lK9OJ2M1l1J9l7J9j5j8L7l0J9J3k7l6J0K0Kj4k7O3m0K1k4
$$ -7 16 9 5 -7 11 -15 -38 -41 -12 -6 6 47 16 35 -2 17 2 -16 21 -9 10 23 -4 -40 -30 -10 -8 -22 -49 14 -26 -5 -29
4181b9KK3j2j5L3Llj3J1k1qnNMk3Q1k4k2J3L0jl0M6m0pj9K2m3N2j8J2j8j3N0n6
$$ -29 -27 -4 -16 -31 2 5 2 -11 0 -21 -29 -34 -29 -25 -48 33 9 -13 0 30 29 -1 45 5 -2 -21 1 -42 10 -8 4 -14 -27 23 -33
4216c3O5k1k3kM3K2j7l6K2k0K9k6l1N3m3O5l9j5jKL0l1k9PJ1J8n3L8LRMJ6n4O1
$$ -33 32 11 -12 -14 29 51 34 -2 20 0 29 3 -28 25 -18 47 8 -7 -8 -6 24 -7 -36 -29 -18 0 -53 -15 -12 -3 1 17 -37 24
4250B4K2p4J7J9lk1L4jm1K4k2J6k5K6N9l9k4m6O1j8L2Pp1N4n2K0K2jL2j5j5k1
$$ 24 46 -28 -11 8 5 -16 18 17 -24 0 -22 -6 -31 -5 54 15 -9 -55 6 -12 20 27 -44 10 -42 -22 0 -1 31 16 1 -20
4282b0K2m6N7J6j1l1J4nOj1ol0K5K3k6L6Pmjj7Pj6M4Ol6N3o4J3k2L4rR%J7n5K
$$ -20 2 -44 13 29 18 -13 1 -4 2 -9 -15 -45 -20 3 -23 13 20 16 15 -2 5 -11 33 39 3 56 -8 5 -17 17 8 17 17 34 -21 -19
4318a9K9J6kk9nMJ5m8P3p3K7ok8K6nK2K2Nl4K7k7L3n8K1RN3Ko6k1M6l8jM8l6j6
$$ -19 10 26 24 -5 -10 -6 9 -39 34 -39 -12 -18 -46 -20 -25 -3 19 24 -10 17 -10 23 -35 -14 -5 48 50 -16 -37 9 -29 -30 18 -18 -34
4353c4N9k0l3M6k3J9K2J0mj5j5OJon6j6J01l0j0Oj7NrO6o1K7k1Lk6J6ljJ8l2M6
$$ -34 25 5 -28 18 -5 14 36 46 42 27 12 18 19 13 -43 -59 42 12 2 8 -9 -4 -13 53 -8 19 -2 1 -25 -9 -12 -13 5 -27 19
4388A9j9J2j8OqJ5qJ0L2k7J8j0MK4k2nnJ2j0Ok6mJ4K4kM3o9K0l5N0j0k0nNj6R
$$ 19 0 12 -6 0 -8 7 -1 9 41 14 32 22 26 50 28 23 18 30 20 26 0 -4 10 34 32 75 6 26 -9 41 31 11 6 11 -5 4
4424DLJ5oj9N6o2jJ8%k3oj2M1k0k2M9m9QPRK2Jm0K6k3QK3k5L5l5oN6k9L5J0j2
$$ 4 7 22 16 -3 53 -9 -10 8 8 -15 -21 -33 8 -12 -34 15 -34 -26 -19 -10 12 13 -27 -1 -24 -16 7 -18 17 -18 -24 32 3 38 48 36
4460C6j0o1L7k4N0J5n3N5k6n6N3n2K5K4lONl5L8NRm3j0L5j1lPl1l1P1lj2J1Jm9
$$ 36 26 -35 2 -22 28 43 -10 45 19 -37 16 -36 -11 13 10 16 21 -14 24 29 38 -5 -15 20 9 6 13 -18 -49 22 19 7 18 19 -30
4495c0K3n3O6j8qM5o3onO7l8P0n3k3M1J2K1k7kJ1K9l5J9m1K9k5j8K1J4k6M2j5
$$ -30 -7 -60 6 -12 -20 25 -38 -44 -49 18 -20 50 -3 -26 15 27 48 21 19 30 59 24 43 2 31 6 -12 9 23 -3 39 24
4527B4k0RKl3j0J2rk9L3QL3j4l9qK5j3L5J1qkk6lLL4j7j3QJ2k5rj3N9l2%M5j6
$$ 24 4 13 15 -18 -28 -16 -25 -54 -21 -13 20 6 -33 -41 -16 -29 6 17 9 7 -19 -22 -19 15 -2 -15 -7 5 -20 -29 -42 17 -15 -15 30 14
4563A4L5k7n5N4k7L1k6L5kj4l2KO2m3K3n5O4j8kn1M6k9J1qK5K6m4J9K9m9k1mJ5
$$ 14 49 22 -33 21 -6 25 -1 34 32 18 -14 -12 50 7 30 -25 39 21 19 -32 14 -15 -4 -12 13 39 -5 14 43 -6 -27 -31 -16
4596a6lj7K7LJJ3m0J9K1j2k5L9l9P4J3o2lL5om3QJ0j2J3kjOrNj3J6l1M5l1M4p
$$ -16 -19 -36 -9 -6 -5 8 -32 -13 8 -4 -29 10 -29 45 58 -4 -7 28 22 -21 -13 -3 -15 -2 -4 -5 1 -8 -3 -16 0 -31 14 -17 27 20
4632B0j6Ll9M3J0m4N8j4m9K3kk8O4on7J4lK3Ll0qK1K7p4P4k2L1K7o8QL8l4RJ8
$$ 20 4 7 -32 11 21 -23 35 21 -28 -5 -7 -35 29 23 -34 -20 -23 0 3 -27 -35 -14 13 -61 13 -9 22 49 -19 -11 27 -7 2 20
4666B0J3jk2j1K2k1k4rJ3%M1l5L5l0jJ8J7k8jL1k5j0n2J09l8J9l0qK6j6oL9n7
$$ 20 33 32 10 -1 21 0 -24 -33 -20 -20 21 -14 21 -9 -10 8 25 -3 -4 27 2 -8 -60 49 11 30 0 -8 18 2 -4 35 -22
4699b2j3K4J4lk9J0mj0K1kM8p8J5J9L1J5j3k6j2N8q1L8Lkj6J4k6P3o5M4j3k1J5
$$ -22 -35 -11 3 0 -29 -19 -23 -33 -12 -14 34 -44 -29 -10 21 36 23 -3 -15 43 -38 0 3 1 -15 -1 -27 46 -19 25 12 -9 6
4732FPm9j3N9n7L4l1M2k6N3n7K3J0j5k7M1l4N1l2l7N4K7Mqj9k4L3j4L2l6MJ5J7
$$ 6 13 -36 -49 10 -47 -13 -44 -2 -28 25 -32 -9 1 -14 -41 0 -34 17 -15 -52 2 29 33 25 6 -18 15 1 33 -3 1 16 33
4765C3l9Nmj0L8K1l8K7k3j3J3n4P6j3nK5o8J3J9NJ2llJ2n9J7jK3j9Npn2N2j1k
$$ 33 -6 -1 -5 -15 23 44 6 33 10 -3 10 -44 32 19 14 39 -29 -16 3 8 20 17 14 26 -33 -16 -17 6 -13 -8 -15 -67 -15 -26 -28
4800b8KJ0RrK7n9O3j9o1Q3kk8jK2k5K5lj2K7Kl8K4l2K5j8K3NMj4J9mmqK6jm6M8
$$ -28 -26 -16 -7 -16 11 -48 15 -4 -65 18 16 -12 -13 9 -16 9 6 -6 21 23 -15 9 -23 2 -16 7 12 16 2 21 17 13 5 31 30 -16 32
4837C2k1j4J6Rl2j3k0P4nll5l4M4k2J7j7K3nNj3nj4J9j6L7k8N7m1OK8k1k8L3j6
$$ 32 11 -3 13 22 -10 -23 -43 31 26 23 -12 -46 -2 -24 -7 -24 -1 -6 -1 -14 -19 -33 -14 -30 7 -21 36 -5 1 29 8 -20 13 -3
4871cM4n8pN2l5j5QK5j0j9lOPK0Ql7N2J6o9L9o8N0Qk8M5n7LRM0m7m9Q2j7ML5n4
$$ -3 41 -17 -24 28 -7 -22 -14 11 1 -18 -21 -15 -8 12 20 -17 35 51 -18 21 -47 3 11 -17 28 -29 -26 -17 23 -24 -73 9 -8 -4 31 -23
4907b3L2K0o2L7%m8K6M1k3J1K5j7LOj6J5Ok6k3kJ0%K0J0K8l2J5%nRj3j7J5k0J3
$$ -23 9 29 -33 4 4 -44 -18 23 0 11 36 19 22 28 12 27 33 7 -16 -18 -8 -8 12 22 50 18 33 33 28 37 24 7 22 2 15
4942A5p5L9nM5k9L3l2k3M9j6j2kK6k3l9K0jrL5Qk0%L0o3K1N1n2L2l7M5j1rJ2k3
$$ 15 -60 -21 -26 19 -10 23 -9 -32 17 1 -11 -13 13 -10 -49 -29 -30 -39 -4 4 -16 -16 14 -49 -28 23 -29 3 -34 11 0 -9 3 -20
4976b0L3j7k1M1m7K9l8k2K6N8q1N8j6N5J3l9l9L7Ll5L4m4K9Mn0L3RK7m4%jK4k0
$$ -20 13 -4 -25 16 -31 -2 -40 -62 -36 22 -59 -1 -17 38 51 12 -27 10 13 -22 12 -32 -3 1 -49 -16 -7 20 -24 -24 -25 -1 -21
5009b1N6m7L8n4O3l7L3l0Jk8K8J3j7KM3m8K9Ql4J1Kj5j4M1k0j5omj6OM2Lkk3N2
$$ -21 35 -12 26 -28 35 -2 31 1 2 -26 2 15 -2 0 43 -5 24 32 -2 9 11 -4 -18 23 3 -12 -18 -22 -38 -32 10 13 11 -12 40
5044D0m3J4k7J7PJ3l9Rj5J4Pkm7K9JNQM3p7QKOL8Mjml5J9K0Kk8RKJ7qJ2n7L3J8
$$ 40 -3 11 -16 1 8 21 -18 -9 -24 -10 -3 -5 -52 -23 -22 -17 -9 34 -43 -35 -33 -27 11 15 14 10 -25 -6 14 16 -12 -3 -1 16 8 20 -37 -4 14
5083A4m4N8oOk2K5o3K9k9J2K1k3N0j9r1R6m2O1o3J8M3k6k3J6m6O3k3pj3J1pK4
$$ 14 -30 28 22 28 6 31 -32 -3 -32 -20 1 -22 28 9 -82 14 -28 33 -30 -12 31 5 -18 -2 -48 15 -8 -15 -28 -17 -24 0
5115@Ok0N3l3k8kO5m4J3nk1P0j7rn1K6JK9l6J7k2Kj8L9J6o6K7M6m6J7j4RJ3k8
$$ 0 6 -14 39 6 -22 -24 41 -3 10 5 -16 54 37 28 -23 3 4 33 -3 14 -8 -6 -24 15 31 -35 -8 38 -8 9 -5 4 17 -11
5149a1Pk5M3Ok0J5Rk6J4mj0Okj3MK3Ol3N1j2j5K9o5J1lj5%M2JJ4n%j6K2m5K4J1
$$ -11 -4 -29 14 20 0 15 24 -2 12 8 -2 4 2 -11 -7 16 22 -11 40 28 13 42 -23 -12 -15 -30 -30 12 13 27 22 22 6 28 -17 7 18
5186A8j9L2k3lP3r1M0Jm3L2l0KMK4k3JK0mOk3M3o2J4J9j8L4k7K4qPOl7L6j5j1
$$ 18 -1 31 8 5 78 -13 27 28 -15 17 -13 -11 -7 17 -6 -5 15 11 17 -6 37 -25 -11 8 -10 24 -3 21 13 20 26 -11 25 10 -1
5221aj3K4ql8J3J5j6J6j2J7k8M6j6m7O0K2m6%j7K7K1m1M1j8m4QN7n0QK4l3OLJ1
$$ -1 -14 10 2 -36 -23 -8 -24 -8 -20 -3 -31 15 -1 -48 12 34 -12 -12 -29 -2 19 -22 19 1 -43 -35 22 -28 -20 4 -29 -23 -20 -9
5255iJ7n2rL5j8L7j3J0K8l2m1PN6qj3j3K6k4J1j8J9qnN6l1k4K3oM2j6j6k0J0L8
$$ -9 8 -44 -53 -18 -36 1 -12 -2 26 -6 -47 -40 16 8 -5 -18 8 -16 -5 -23 -4 -12 -17 39 8 -16 7 1 43 27 11 -9 1 39
5289C9p3KK0KJ6Lk2M6l3J7j9J3rJ1o3M0nKJ7rk2J4K0jk9M3p6N6oj4J9k5K4Lm5
$$ 39 -34 -32 -12 -10 6 9 -13 33 0 17 -2 11 2 13 -50 -10 -15 -13 4 -5 -27 -13 7 6 -23 20 -56 0 -6 -20 -1 -26 -2 1 -44
5324d4L8j4K1Nk7J8M0j8K5m6nN2m8K1n6N2Ok1j7%JpL3kJ2j8l2QMQ2o8omOlJ6k1
$$ -44 -6 -20 1 6 -21 -3 37 19 44 -2 -7 45 -3 18 -38 14 20 -1 -18 -18 -17 -24 9 7 19 1 -31 -23 -19 63 -5 -11 -15 -9 -12 4 -17
5361a7Ol8L5K0k3RK9j6J8n9O2l5l2O6n0NjK7k2K6Qk6J4nn2K2J1L1pJ2Lk9N2n2
$$ -17 -11 -49 -14 6 -17 -8 21 5 23 -36 26 -9 -41 25 -25 -20 -21 6 -16 10 18 -8 6 1 -51 -29 -18 13 6 18 21 -8 44 -8
5395hNM3j1m7nM9Qm8l8K8PJpj4QK2j1M2n5J6k5j3M7j5Om2N5l1N9k9k2J2M6lkl5
$$ -8 -3 40 29 -18 -23 26 34 -14 -52 -24 -17 -16 -23 -37 -29 -7 -18 24 -31 -15 -40 -53 -6 -21 -15 -57 -2 -33 26 -3 -25 -13 33 30 28 -7
5431goJ9m0M0LMm6J7j3J5L2Nmjl2k3J9M7n8RJ2jL5j7Ql9jJ4rK0j1J4m5k5Q5j7
$$ -7 -13 6 -34 6 9 13 -33 -16 -29 -14 18 23 19 18 -14 -37 -18 29 -29 -20 -8 -9 26 9 17 -22 -23 -9 -18 2 -9 5 -40 -65 20 3
5467Cj2J1j1ok2Q7m5kj6K7PM7n7MpOj4k4K0M6j1j9K6m0J5j9l3N7Pl8J5J8k5Nl7
$$ 3 -9 2 -9 -15 -37 50 5 3 -13 14 21 68 11 15 8 14 0 -24 -4 42 31 12 38 -2 13 -6 -39 18 25 -13 2 20 -5 0 -37
5502c7lQN7j0j1M8j9ln2j7K8L9nm5J9k6N8j3J5m1K4j6j6K5ok3Rl3N3J7l2J0k6
$$ -37 -40 -32 25 15 4 52 33 30 -22 -39 -11 28 23 -22 -3 -29 29 16 31 -10 14 -2 -18 7 1 -22 -13 -46 7 24 -8 2 -24
5535b4R9q6M9l3Pj5rM6Mm4K3l2J4jJk3N5n9N5J8p3L4rl1K6k5OJ8LPK0m3Pk6NK6
$$ -24 75 -11 38 5 12 -3 -12 34 38 -6 17 -15 -1 -2 -1 -24 31 -28 27 45 -28 6 -3 -34 -8 -33 -27 -9 -6 1 21 -22 -15 -41 -36 -10
5571a0L3n5K7L0k0l6O1j7l8llK4M9l7l1lK4LoJ9n7M5k4L4j0pj1L8k1l0qM7j7K4
$$ -10 23 -32 -5 25 5 -31 30 13 -25 -28 -31 -7 42 5 -26 -29 -5 -2 -8 11 -46 -1 -25 9 -1 -8 -19 19 -2 -32 -40 7 -10 14
5605A4k4Mk9PL0mJ0J5qk0l6kM9l0j4M1jl8NN0lOl3L0J0mk9M5k0n7L5k3L0K1J0
$$ 14 -10 -6 -35 -28 2 -2 8 23 15 -5 -41 -43 6 -24 -38 3 2 -36 -31 19 16 22 -11 19 29 25 -4 41 21 -36 -1 -24 6 27 37
5640C7j6m2J4K1m0L9J1j9N8p2rJM4k7J3m4MM9l5j3nL9j0K8j2L8o9m2O6Np6M4j6
$$ 37 21 -21 -7 14 -26 13 24 5 63 -9 -18 -17 27 0 13 -31 -27 22 -13 -26 -31 8 -2 26 14 52 -17 -59 7 12 -64 -20 -36
$$ [...]
8190Cm9
8191d6
##END NTUPLES=NMR FID
##END=
