##TITLE=1H ikalashn
113-2024
19.12.2024
##JCAMPDX= 6.0         $$ Bruker NMR JCAMP-DX V2.0
##DATA TYPE= NMR FID
##DATA CLASS= NTUPLES
##ORIGIN= UXNMR, Bruker Analytische Messtechnik GmbH
##OWNER= root
$$ TOPSPIN		Version 1.3
$$ 2024-12-19 14:08:30.343 +0400  Irina@DPX200
$$ Compression mode = diff/dup
##.OBSERVE FREQUENCY= 200.131300845
##.OBSERVE NUCLEUS= ^1H
##.DELAY= (6, 6)
##.ACQUISITION MODE= SIMULTANEOUS
##.ACQUISITION SCHEME= undefined
##.AVERAGES= 32
##.DIGITISER RES= 18
##SPECTROMETER/DATA SYSTEM= spect
##.PULSE SEQUENCE= zg
##.SOLVENT NAME= CDCl3
##.SHIFT REFERENCE= INTERNAL, CDCl3, 1, 17.49637
##AUDIT TRAIL= $$ (NUMBER, WHEN, WHO, WHERE, WHAT)
$$ ##TITLE= Audit trail, TOPSPIN		Version 1.3
$$ ##JCAMPDX= 5.01
$$ ##ORIGIN= Bruker BioSpin GmbH
$$ ##OWNER= Irina
$$ $$ F:/spectra/data/iren/nmr/1H/4/audita.txt
$$ ##AUDIT TRAIL=  $$ (NUMBER, WHEN, WHO, WHERE, VERSION, WHAT)
(   1,<2024-12-19 14:07:31.390 +0400>,<Irina>,<DPX200>,<TOPSPIN 1.3>,
      <created by zg
	started at 2024-12-19 14:05:23.250 +0400,
	POWCHK disabled, PULCHK disabled
       configuration hash MD5:
       BE 6D 3F 07 2A EA 11 49 91 17 2B D3 AF B3 58 0D
       data hash MD5: 16K
       BF D5 15 CF 39 4C AB A7 0B 03 9E D5 94 2F 86 0A>)
$$ ##END=
$$ 
$$ $$ hash MD5
$$ $$ C1 EE 4D BD 56 F2 A1 E7 20 A9 21 31 14 90 45 84
##$RELAX= 
##$RELAX= 
##$RELAX= 
##$RELAX= 
##$RELAX= 
##$RELAX= 
##$RELAX= 
##$RELAX= 
##$RELAX= 
$$ Bruker specific parameters
$$ --------------------------
##$DU= <F:/spectra>
##$EXPNO= 4
##$NAME= <1H>
##$PROCNO= 1
##$TYPE= <nmr>
##$USER= <iren>
##$AMP= (0..31)
100 100 100 100 100 100 100 100 100 100 100 100 100 100 100 100 100 100 
100 100 100 100 100 100 100 100 100 100 100 100 100 100 
##$ANAVPT= -1
##$AQSEQ= 0
##$AQ_mod= 1
##$AUNM= <au_zg>
##$AUTOPOS= <>
##$BF1= 200.13
##$BF2= 200.13
##$BF3= 200.13
##$BF4= 200.13
##$BF5= 200.13
##$BF6= 200.13
##$BF7= 200.13
##$BF8= 200.13
##$BYTORDA= 1
##$CFDGTYP= 0
##$CFRGTYP= 5
##$CHEMSTR= <none>
##$CNST= (0..63)
1 1 145 1 1 1 1 1 1 1 1 1 1 1 1 1 1 1 1 1 1 1 1 1 1 1 1 1 1 1 1 1 1 1 
1 1 1 1 1 1 1 1 1 1 1 1 1 1 1 1 1 1 1 1 1 1 1 1 1 1 1 1 1 1 
##$CPDPRG= <>
##$CPDPRG1= <>
##$CPDPRG2= <>
##$CPDPRG3= <>
##$CPDPRG4= <mlev>
##$CPDPRG5= <mlev>
##$CPDPRG6= <mlev>
##$CPDPRG7= <mlev>
##$CPDPRG8= <mlev>
##$CPDPRGB= <>
##$CPDPRGT= <>
##$D= (0..63)
0 2 0 0 0 0 0 0 0 0.06 0 0.03 0 0 0 0 0.0002 0 0 0 0 0 0 0 0 0 0 0 0 0 
0 0 0 0 0 0 0 0 0 0 0 0 0 0 0 0 0 0 0 0 0 0 0 0 0 0 0 0 0 0 0 0 0 0 
##$DATE= 1734602850
##$DBL= (0..7)
120 120 120 120 120 120 120 120 
##$DBP= (0..7)
150 150 150 150 150 150 150 150 
##$DBP07= 0
##$DBPNAM0= <>
##$DBPNAM1= <>
##$DBPNAM2= <>
##$DBPNAM3= <>
##$DBPNAM4= <>
##$DBPNAM5= <>
##$DBPNAM6= <>
##$DBPNAM7= <>
##$DBPOAL= (0..7)
0.5 0.5 0.5 0.5 0.5 0.5 0.5 0.5 
##$DBPOFFS= (0..7)
0 0 0 0 0 0 0 0 
##$DE= 6
##$DECBNUC= <off>
##$DECIM= 32
##$DECNUC= <off>
##$DECSTAT= 4
##$DIGMOD= 1
##$DIGTYP= 9
##$DL= (0..7)
0 120 120 120 120 120 120 120 
##$DP= (0..7)
150 150 150 150 150 150 150 150 
##$DP07= 0
##$DPNAME0= <>
$$ [...]
##$SW= 21.9926040160658
##$SWIBOX= (0..15)
0 0 2 0 0 0 0 0 0 0 0 0 0 0 0 0 
##$SW_h= 4401.40845070422
##$TD= 16384
##$TD0= 1
##$TE= 300
##$TE2= 300
##$TE3= 300
##$TEG= 300
##$TL= (0..7)
0 120 120 120 120 120 120 120 
##$TP= (0..7)
150 150 150 150 150 150 150 150 
##$TP07= 0
##$TPNAME0= <>
##$TPNAME1= <>
##$TPNAME2= <>
##$TPNAME3= <>
##$TPNAME4= <>
##$TPNAME5= <>
##$TPNAME6= <>
##$TPNAME7= <>
##$TPOAL= (0..7)
0.5 0.5 0.5 0.5 0.5 0.5 0.5 0.5 
##$TPOFFS= (0..7)
0 0 0 0 0 0 0 0 
##$TUNHIN= 0
##$TUNHOUT= 0
##$TUNXOUT= 0
##$USERA1= <user>
##$USERA2= <user>
##$USERA3= <user>
##$USERA4= <user>
##$USERA5= <user>
##$V9= 5
##$VALIST= <valist>
##$VCLIST= <CCCCCCCCCCCCCCC>
##$VD= 0
##$VDLIST= <DDDDDDDDDDDDDDD>
##$VPLIST= <PPPPPPPPPPPPPPP>
##$VTLIST= <TTTTTTTTTTTTTTT>
##$WBST= 1024
##$WBSW= 25
##$XGAIN= (0..3)
0 0 0 0 
##$XL= 0
##$YL= 0
##$YMAX_a= 434956
##$YMIN_a= -353035
##$ZGOPTNS= <>
##$ZL1= 120
##$ZL2= 120
##$ZL3= 120
##$ZL4= 120
##$ABSF1= 10
##$ABSF2= 0
##$ABSG= 5
##$ABSL= 3
##$ALPHA= 0
##$AQORDER= 0
##$ASSFAC= 0
##$ASSFACI= 0
##$ASSFACX= 0
##$ASSWID= 0
##$AUNMP= <proc_1d>
##$AXLEFT= 0
##$AXRIGHT= 0
##$AXTYPE= 0
##$AXUNIT= <>
##$AZFE= 0.1
##$AZFW= 0.1
##$BCFW= 1
##$BC_mod= 2
##$BYTORDP= 1
##$COROFFS= 0
##$CY= 7568.61572265625
##$DATMOD= 1
##$DC= 2
##$DFILT= <>
##$DTYPP= 0
##$F1P= 17.9538593292236
##$F2P= -4.03888763876832
##$FCOR= 0.5
##$FTSIZE= 32768
##$FT_mod= 4
##$GAMMA= 1
##$GB= 1
##$INTBC= 1
##$INTSCL= 1
##$ISEN= 128
##$LB= 0.02
##$LEV0= 0
##$LPBIN= 0
##$MAXI= 945.577
##$MC2= 0
##$MEAN= 0
##$ME_mod= 0
##$MI= -402.1523
##$NCOEF= 0
##$NC_proc= 0
##$NLEV= 6
##$NOISF1= 8.587773
##$NOISF2= 6.764455
##$NSP= 1
##$NTH_PI= 0
##$NZP= 0
##$OFFSET= 17.49637
##$PC= 1
##$PHC0= 93.04158
##$PHC1= 1.059595
##$PH_mod= 0
##$PKNL= yes
##$PPARMOD= 0
##$PPDIAG= 0
##$PPIPTYP= 0
##$PPMPNUM= 100
##$PPRESOL= 1
##$PSCAL= 0
##$PSIGN= 0
##$REVERSE= no
##$SF= 200.13
##$SI= 32768
##$SIGF1= 18.5376
##$SIGF2= -6.396296
##$SINO= 400
##$SIOLD= 32768
##$SREGLST= <1H.CDCl3>
##$SSB= 3
##$STSI= 0
##$STSR= 0
##$SW_p= 4401.40845070422
##$SYMM= 0
##$S_DEV= 0
##$TDeff= 0
##$TDoff= 0
##$TI= <>
##$TILT= no
##$TM1= 0
##$TM2= 0
##$TOPLEV= 0
##$USERP1= <user>
##$USERP2= <user>
##$USERP3= <user>
##$USERP4= <user>
##$USERP5= <user>
##$WDW= 1
##$XDIM= 8192
##$YMAX_p= 0
##$YMIN_p= 0
$$ End of Bruker specific parameters
$$ ---------------------------------
##NTUPLES= NMR FID
##VAR_NAME=  TIME,          FID/REAL,        FID/IMAG
##SYMBOL=    X,             R,               I
##VAR_TYPE=  INDEPENDENT,   DEPENDENT,       DEPENDENT
##VAR_FORM=  AFFN,          ASDF,            ASDF
##VAR_DIM=   8192,          8192,            8192
##UNITS=     SECONDS,       ARBITRARY UNITS, ARBITRARY UNITS
##FACTOR=    0.0002272,     1,               1
##FIRST=     0,             0,               0
##LAST=      1.8609952,     -128,            -149
##MIN=       0,             -353035,         -353035
##MAX=       1.8609952,     434956,          434956
$$ Real data points
##PAGE= N=1
##DATA TABLE= (X++(R..R)), XYDATA
0@%%%%%%%%%%%%%%%%%%%%%%%%%%%%Mk2N0o4O4o4O4o4O4p1R1j14J26j29J40j64
44h9J84j98K16k39K68k96L26l63L98m35M79n28N85o50P25q15R17j037J188j381
64g45J632j976K483l301M904j1149M3208O565j27370j61203j06083J7874J14271
77b20890J40577Q8396K3152q928J5002O8932J14698J06052L7164p4179j69869
88A20107j87557j03179J6652Q4202N4283l6181j10569r6586M096J13726J45901
99D895Q6003q707o2981l9729L4978R9542J08212N4232l9078j24310j50172j03494
111a40609j8161N3553O6190J0761o2196p9274j2421Q8468J44044J06660J262r5240
123F3037j08308l8059N6413J05301P7071o304p9773r7364o1457j095M8752N6123
$$ plain form
0 0 0 0 0 0 0 0 0 0 0 0 0 0 0 0 0 0 0 0 0 0 0 0 0 0 0 0 0 0 4 -18 32 -32 32 -32 32 -32 32 -39 52 -62 64 -65 75 -89
44 -89 95 -103 113 -126 142 -154 172 -191 207 -228 251 -277 308 -342 383 -432 485 -552 636 -745
64 -745 887 -1089 1394 -1907 2997 -8152 35056 41621 -85749 -246952 -353035 -335161 -220890
77 -220890 -80313 8083 31235 22307 37309 106241 220939 326991 364155 289976 120107
88 120107 -67450 -170629 -153977 -69775 -15492 -51673 -162242 -258828 -254732 -141006 4895
99 4895 90898 82191 19210 -20519 14459 114001 222213 276445 237367 113057 -37115 -140609
111 -140609 -158770 -105217 -39027 -28266 -90462 -169736 -182157 -93689 50355 157015 158277 63037
123 63037 -45271 -83330 -26917 78384 155455 149151 69378 -27986 -89443 -90538 -41786 14337
135A4337J3431m5305p2122m0227L8564J10601J15949L8000p0536j28994r6667
146a22969N2Q3345R0129K6266m6215p1376l5953L0612P7978O9991J3078n0196
158F4742q3717o9431j0206O0359R1410N7650k2828r3475j01059l5568N1195Q9936
170i92N5747j9908p1088n0930K7588R6600R9747M0123m0167r3573r1968m1783
182i0604K0967N6808M8455J331n3011p1639l5966L2407Q3430P4420N996o6108
194F486p7401j6764O7006J09416P9392m192q1613r9154n5904O133M3900L6660
206A3965l558m4502n5423k6763K8272P6555Q1254L0754m1697q1338n8772J3187
218f8066Q2584R2980L3419m7431q8011o3288n39N0064M7533j051n3115p0610l9969
$$ plain form
135 14337 27768 -17537 -89659 -129886 -91322 19279 135228 173228 102692 -26302 -122969
146 -122969 -122917 -39572 50557 76823 30608 -40768 -76721 -46109 31869 101860 114938 64742
158 64742 -18975 -88406 -98612 -38253 53157 110807 87979 -5496 -106555 -142123 -90928 -992
170 -992 54755 34847 -36241 -87171 -59583 37017 136764 176887 136720 43147 -48821 -90604
182 -90604 -69637 -12829 35626 36957 -16054 -87693 -123659 -91252 -7822 66598 72594 6486
194 6486 -70915 -87679 -20673 88743 168135 163943 82330 -16824 -72728 -66595 -22695 13965
206 13965 10407 -34095 -89518 -116281 -88009 -11454 69800 100554 58857 -22481 -81253 -68066
218 -68066 14518 107498 140917 93486 5475 -57813 -58352 -8288 39245 38194 -14921 -85531 -125500
231a25500J9761P2022Q1641M4804j4232o0788o5539j9903M3306P4815M9790j4679
243H5498o8249o8950j3479N1657O9530K6347m3388q6730o9984n684N7626P8352
255A2546N3035K134m1841n1097k0398K5101N4190M5940p27n3238o9964l2825L3027
268d4117P3896N8660q125p3991q6753l8827L1670P2607O0243R333l7413m4530
280b7347j4241K7518N2795M4465L182m6014o8346m8115M491N6777O8164K5240
292G8569l9360p5381n5899N175O0094O5990J9800l4386n4035k7906K2998O0940
304B6599N6242J2893l7854o6037n5573j3087L5875N6560L5718j1101n1132n2908
316f3805j0065M4531O5564L6168k1390o1309n2507o3N3917O7567L2770k1915o0339
$$ plain form
231 -125500 -105739 -33717 47924 92728 78496 17708 -47831 -67734 -24428 50387 100177 85498
243 85498 17249 -51701 -65180 -13523 56007 82354 38966 -47764 -117748 -123432 -65806 12546
255 12546 65581 67715 25874 -25223 -45621 -20520 33670 79610 78883 25645 -44319 -77144 -44117
268 -44117 29779 88439 80314 6323 -80430 -119257 -87587 -14980 45263 54596 17183 -27347
280 -27347 -41588 -14070 38725 83190 86372 40358 -27988 -76103 -71612 -14835 53329 78569
292 78569 39209 -36172 -92071 -86896 -26802 39188 58988 24602 -29433 -57339 -34341 26599
304 26599 82841 95734 57880 -8157 -63730 -76817 -40942 15618 51336 40235 -10897 -63805
316 -63805 -73870 -29339 36225 72393 51003 -10306 -62813 -62876 -8959 58608 91378 69463 9124
329I124n7637j9821K4701M5828L3025l250l8449m5092j4234L1734N9637M7951
341G3517K94n0767o4354k8739K7839O2928N0480K87n0091n9099k6312K0635M7210
354C828L6453k642l8423m5501j9885K1283N2222N2290J7173l0917n6802m3190
366e4111J853M5766N3202J7174l3647n7693l7620J0752M9664M8914R588l5089
378A8753n1983l1763J0031M6494N1324K4337j5978m3738m2127j0816K9282M5487
390B9303K5073j8195n1414m8218o036M2219N8131L0177j8338n0844m4183l967
402e6292L7709N0381K8953r224l9348m1061j4441K1524L9694K8150o603m2340
414b898m9809j9588K5979N4139M5068M156l8479m8818j9217K3736M7874L6078
$$ plain form
329 9124 -48513 -68334 -43633 2195 35220 31970 -6479 -51571 -65805 -34071 25566 73517
341 73517 73811 23044 -41310 -70049 -42210 20718 71198 71485 21394 -37705 -64017 -43382 3828
354 3828 40281 37639 -784 -46285 -66170 -44887 7335 59625 76798 45881 -10921 -54111
366 -54111 -52258 -6492 46710 63884 30237 -27456 -65076 -54324 -4660 44254 53842 18753
378 18753 -33230 -64993 -54962 -8468 42856 67193 51215 7477 -34650 -45466 -16184 29303
390 29303 54376 36181 -15233 -63451 -69487 -27268 30863 61040 42702 -8142 -52325 -56292
402 -56292 -18583 31798 60751 51527 12179 -28882 -43323 -21799 17895 46045 39442 -2898
414 -2898 -52707 -72295 -46316 7823 52891 57047 18568 -30250 -49467 -25731 22143 58221
426E8221k741l9723m6537k0714J6128L9237L3602K760l2016m4733k6006J1861
438e0661M4491M7745J8044k3497m4643l0502P099M0212M1910Q144l3619n1360
450b6637l3881O815L9331M2524J3610k2405l9653k8372M759L5619M3708K1678
462E7096j3540l9051l7243p566K9125M1895K1057j8885m7050m1996o345L4283
474b8220M7847K6409j1051l7243l3681l827K9465L9991K3972r333l6605l9895
486c2171j5846J8752L7812K9234k040l4224m1583j6162K3726M6450L6916M75l3981
499A7358m1146j6345J8659L7458K7978l841l3962m0100k0309J1820L5607L5247
511B8424J0014k2305l5482k0779J2465L9564L9821R863k7986m5053l0837L221
$$ plain form
426 58221 55480 15757 -30780 -51494 -35366 3871 37473 40233 8217 -36516 -62522 -50661
438 -50661 -6170 41575 59619 36122 -8521 -39023 -31924 8288 50198 58342 24723 -26637
450 -26637 -60518 -53703 -14372 28152 41762 19357 -20296 -48668 -43909 -8290 35418 57096
462 57096 43556 4505 -32738 -40304 -11179 30716 51773 32888 -14162 -56158 -62503 -28220
474 -28220 19627 46036 34985 -2258 -35939 -39766 -10301 29690 53662 44329 7724 -32171
486 -32171 -48017 -29265 8547 37781 35741 1517 -40066 -56228 -32502 13948 50864 51339 17358
499 17358 -23788 -40133 -21474 15984 43962 40121 6159 -33941 -54250 -42430 -6823 28424
511 28424 38438 16133 -19349 -40128 -27663 11901 51722 61585 33599 -11454 -42291 -39070
523c9070L1589L2933N711k6505l8857k4002Q658L6899M1047J8086j3557l1512
535A420k5026K165K9606L6077J5680j9560m3190l9575r938K3214L3993J6861j4039
548G688l4331k8261K651L5946M5697K6877o092l0248l0883p786J9654L0853J7323
561D9088j2555l7408l9960j6796J5185L3408K6064p28k7466l1357o821K7528M5143
574B3325L4474K845k8012l5870j7526J1027K7082J9336n729l1846l7335j9583
586e7812J0245L3010L2976Q929k0066l1338j6412J3807L6996L7122J1166k1930
598C6693l6901k4414L811K6000K4728J281k5488l6188k3305N313L1071L5411J5989
611C4001j1944k8808k3864Q44K7251L4368J5595j4672l3472k7889k110K4411L0518
$$ plain form
523 -39070 -7481 25452 31163 4658 -34199 -58201 -49543 -12644 28403 46489 32932 1420
535 1420 -23606 -21441 8165 44242 59922 40362 -2828 -42403 -52341 -29127 4866 21727 7688
548 7688 -26643 -54904 -52253 -16307 29390 56267 50175 19927 -10956 -18742 912 31765 49088
561 49088 36533 -875 -40835 -57631 -42446 -9038 17026 16298 -11168 -42525 -49346 -21818 23325
574 23325 57799 60644 32632 -3238 -20764 -9737 17345 36681 30952 -894 -38229 -57812
586 -57812 -47567 -14557 18419 27348 7282 -24056 -40468 -26661 10335 47457 58623 36693
598 36693 -208 -24622 -20811 5189 29917 31198 5710 -30478 -53783 -48470 -17399 18012 34001
611 34001 22057 -6751 -30615 -29771 -2520 31848 47443 32771 -701 -28590 -30700 -6289 24229
624B4229J2226j5903l4057k9298l160K5244L4560K0523m958k6208k7387o716J9642
637a1263L0112J8066p428k9153k9966q296J9795L3793K3360m516k9290l2475j2171
650c9432J5339L0419K3693k60k4010k8419j0529J4415K9687K2421r60k4722l1330
663b3688j5356J2013L1172K8601N578k0632l0679j8594N644K6211K5589M166k1092
676H933k9733j5877R487K8937K8265P487j9350l1039k1885K583K4882K8269J2099
689C3058j2350k6201k1158P97K3378K7261R857j5786l0311k3628L19K4590L1254
702B1080J5099j1046k8191k5380m399J7863K6212J5384o455k3403k2244k200K1426
715f254K9037J7408p635k8537k9701j0247J5600K8647J9204l591k3217k5375q834
$$ plain form
624 24229 36455 20552 -13505 -42803 -45963 -20719 13841 34364 29406 3198 -24189 -30905 -11263
637 -11263 18849 36915 29487 334 -29632 -37928 -18133 15660 39020 34504 5214 -27261 -39432
650 -39432 -24093 6326 30019 29759 5749 -22670 -33199 -18784 10903 33324 32364 7642 -23688
663 -23688 -39044 -27031 4141 32742 38320 17688 -12991 -31585 -25941 270 25859 30025 8933
676 8933 -20800 -36677 -27190 1747 30012 37499 18149 -12890 -34775 -32192 -7310 20959 33058
689 33058 20708 -5493 -26651 -25854 -2476 24785 34642 18856 -11455 -35083 -34764 -10174 21080
702 21080 36179 25133 -3058 -28438 -32837 -14974 11238 26622 20167 -3236 -25480 -27680 -6254
715 -6254 22783 40191 32556 4019 -25682 -35929 -20329 8318 27522 23931 714 -24661 -33495
728c3495J3696K6253J9160j588k1451k4475o791J5590K9347K3601J100k3699l1309
741a4061j7529N785K1906K0130J928j8076k4230j1472J1179K7784K5183M915j7880
754A5562k5746j5596O693K4996K6107O833j6932k8647k1031q83J7739K1013N940
767A6048j4020k4424j5146P349K7344L0008J3341r864k5635k2554k934J8003K3541
780B1057R290j1439k5417k1998l402J6349K3294J1825q760k3229j9758J80K1558
793a0450L0349K0183k678k2367k4664r353J0823J9589J1404p344k3473k3376n886
806c7243J5729K6329J9251j270j9813k2627q350J2574K5903K1787K542j7742k4304
819g234j2305O342J8697J5051k639k1228k5245j1130J1027K6430K4685P331j3322
$$ plain form
728 -33495 -19799 6454 25614 24026 2575 -21900 -28691 -13101 16246 39847 40947 17248 -14061
741 -14061 -31590 -25805 -3899 16231 18159 83 -24147 -35619 -24440 3344 28527 33442 15562
754 15562 -10184 -25780 -19087 5909 32016 38849 21917 -6730 -27761 -28644 -10905 10108 16048
767 16048 2028 -22396 -37542 -30193 -2849 27159 40500 30636 5001 -17553 -20487 -2484 21057
780 21057 30347 18908 -6509 -28507 -31909 -15560 7734 19559 10799 -12430 -32188 -32008 -10450
793 -10450 19899 40082 37404 15037 -9627 -18980 -8157 11432 22836 15492 -7981 -31357 -37243
806 -37243 -21514 4815 24066 22796 2983 -19644 -27994 -15420 10483 32270 34812 17070 -7234
819 -7234 -19539 -13197 5500 20551 17912 -3316 -28561 -39691 -28664 -2234 22451 29782 16460
832A6460k2377j4151M070K0220K0312M390j4958k2996j5235L828J9507K0457L963
845B3490j5555k5160j6828L140K1682K5796J2218p224k0156j6731o56J6194J9374
858A9584O153j1727k3292j8947k18J8806K3949J1905p370k1679k0582l642J4784
871a2276K2516J4193l733j7890j8027l686J3462K0694J1494p167k2602k2617o211
884c1850J3519K3746J7864j95j6278k0090q144R566J9262J4841j720j7224k0000
897a6703p962J0224K1874J7379j75j7889k3070j2069O409K0397J8927M639j2070
910I911j8219j0333N693J8433J6500J650j5481k2045j3536M671K0379K0871O440
923B4934j0941k0567j5229J181J5633J8665O938r639j8121j2836K913J7696J8979
$$ plain form
832 16460 -5917 -20068 -15998 4222 24534 28924 13966 -9030 -24265 -20437 -930 19527 23490
845 23490 7935 -17225 -34053 -30913 -9231 16565 28783 21559 1403 -15328 -15984 210 19584
858 19584 25737 14010 -9282 -28229 -28447 -9641 14308 26213 18843 -2836 -23418 -27060 -12276
871 -12276 10240 24433 20700 2810 -15217 -18903 -5441 15253 26747 19580 -3022 -25639 -31850
884 -31850 -18331 5415 23279 23084 6806 -13284 -21428 -11862 7400 22241 20521 3297 -16703
897 -16703 -24665 -14441 7433 24812 24637 6748 -16322 -28391 -21982 -1585 17342 21981 9911
910 9911 -8308 -18641 -12948 5485 21985 23635 8154 -13891 -27427 -22756 -2377 18494 24934
923 24934 13993 -6574 -21803 -20622 -4989 13676 20614 10975 -7146 -19982 -17069 627 19606
936A9606P590j0584k2218j8464k222J5367K0475J1281n216j7134j5983j810J3268
949f044J8590R245o716j8702j6541k218J4194K1342J3152m112j8462k0204o962
962b3438R138J8099J2905j805j5150j6303m162J1187J9315J3489k065j7220j9807
975a5817q176Q808J9485J6607J694j3654j9020r815N454J5870J4363L82j3471
988B710j7897q121P050J9783J7418L754j2485j9799j2746K580J5869J6984M989
1001B0089r718j7296j1770K940J5701J5893L753j0907j9333j2923K026J6531J9311
1014A4297Q669o788j7158j4599j415J2593J6224P346o995j6927j4381L07J4055
1027d772J7932Q814o880j7784j6678l558J1209J8214J1697k105j3921j4964l369
$$ plain form
936 19606 27196 16612 -5606 -24070 -26292 -10925 9550 20831 15615 -1519 -17502 -19312 -6044
949 -6044 12546 21791 15075 -3627 -20168 -22386 -8192 13150 26302 22190 3728 -16476 -23438
962 -23438 -14300 3799 16704 14899 -251 -16554 -20716 -9529 9786 23275 21210 3990 -15817
975 -15817 -23993 -15185 4300 20907 22601 8947 -10073 -19888 -14434 1436 15799 16181 2710
988 2710 -15187 -23308 -16258 3525 20943 24697 12212 -7587 -20333 -17753 -1884 15100 20089
1001 20089 10371 -6925 -18695 -15755 -54 15839 19592 8685 -10648 -23571 -21545 -5014 14297
1014 14297 22966 16178 -980 -15579 -16994 -4401 11823 19169 12174 -4753 -19134 -18827 -4772
1027 -4772 13160 21974 15094 -2690 -19368 -22926 -11717 6497 18194 16089 2168 -12796 -16165
1040a6165J0315J6430J0180m169j6752j6545m888J0083J8140J3054j123j4682
1052C878j7339p506O581J5957J3386N20j1679j5180o010Q053J6872J3824j4j3933
1066G410j8672r878M442J5800J4845L347j0153j6305r504L417J4715J4614K918
1079A6996r621j5968r630M082J6077J6144M694r290j8047j3350j19J2291J4812
1092I071O034o862j4904j1044J273J3217J6343O820o944j6340j3402o97J2521
1105d914J6679Q576m947j5360j4530l007R583J4358Q262l896j4092j3047k164
1118a8499J1149J7076J0892l040j4575j5513n683P835J5539J0689j095j2638j4195
1131a2058m975P339J4460J1445j135j2531j5150n881O369J5614J3673J269j1230
$$ plain form
1040 -16165 -5850 10580 20760 16591 -161 -16706 -21594 -11511 6629 19683 18560 3878
1052 3878 -13461 -20967 -14386 1571 14957 15477 3798 -11382 -17392 -9339 7533 21357 21343 7410
1066 7410 -11262 -21140 -16698 -898 13947 17294 7141 -9164 -18668 -15251 -536 14078 16996
1079 16996 7375 -8593 -18223 -14141 1936 18080 22774 13484 -4563 -17913 -18032 -5741 9071
1092 9071 15105 8243 -6661 -17705 -16432 -3215 13128 19948 13004 -3336 -16738 -17435 -4914
1105 -4914 11765 20341 15394 34 -14496 -17503 -7920 6438 14700 10804 -3288 -16335 -18499
1118 -18499 -7350 9726 20618 17578 3003 -12510 -18193 -10358 5181 15870 14775 2137 -12058
1131 -12058 -17033 -9694 4766 16211 15076 2545 -12605 -18486 -12117 3497 17170 18439 7209
1144G209j5885q593M184J3475J2490J825j0316j4125p224M993J4575J3886K614
1157A9108r680j5722j0472J884J2512J3760M631p707j4596j0503J447J2458J3672
1170A0792M925o973j4095j0526J946J2920J4792O576o196j5114j3017j908R101
1183f777J3579O554m989j3598j1347m03J0441J5046Q580l285j2945j2848k398
1196a4390R530J4315Q915k655j3269j3808n258P080J2908Q870k551j2116j2262
1209a4691l376Q184J5311J1529M6j0813j3197o256N222J2420J1075M60j1379j4231
1223i696p314M634J2608J0942J370j0116j3409o557M831J3941J2958L374q121
1236I445j2961q680J877J1058J1675K900q487j3960r316J559J1728J2705M684
$$ plain form
1144 7209 -8676 -17269 -13085 390 12880 14705 4389 -9736 -16960 -11967 2608 16494 19108
1157 19108 9428 -6294 -16766 -14882 -2370 11390 16021 8314 -6282 -16785 -15338 -2880 10792
1170 10792 15717 8744 -5351 -15877 -13931 -1011 13781 20357 14161 -953 -13970 -15878 -6777
1183 -6777 6802 13356 8367 -5231 -16578 -16981 -6540 8506 17086 13801 856 -11992 -14390
1196 -14390 -4860 9455 18370 15715 2446 -11362 -16620 -9540 3368 12238 9687 -2429 -14691
1209 -14691 -18067 -9883 5428 16957 17003 6190 -7007 -13263 -8041 4379 15454 15914 4535 -9696
1223 -9696 -17010 -12376 232 11174 12544 2428 -10981 -17538 -12707 1234 14192 17566 9445
1236 9445 -3516 -12196 -10319 739 12414 15314 6827 -7133 -16449 -14890 -3162 9543 14227
1249A4227o867j3083r798J521J1359J3350N454m858j2598j0368m02R864J2022
1262I823N460n516j2685j1567j471R380J3273P864l623j2313j1173j900Q088J3002
1276F642Q018k262j1721j1442k728P480J2658Q307k005j1109j2585m281O363J2457
1290C792R407j187r849j1997n106N355J2324J0424l05r387j1820n496M723J2189
1304C067J0609J254r536j2482o716L051J1148J0323J541p716j1843p352K893J1422
1318c37J1094L066o632j1765q386J914J0712J1358L784o516j2460q564K19R850
1332b663J0939M162n352j1651q770K85R554J1556N844l863j1154r999j229R191
1346c150J1331N904l709j1652r904k513P794J1460O927k772j0582r937k380O966
$$ plain form
1249 14227 7360 -5723 -15521 -14000 -2641 10709 16163 11305 -1293 -11661 -12063 -2199 9823
1262 9823 15283 9767 -2918 -14485 -15956 -6576 6697 14561 10938 -1375 -12548 -14448 -6360 6642
1276 6642 14660 12398 677 -10765 -13493 -6013 6645 14952 12947 1838 -10747 -15028 -8665 3792
1290 3792 13199 12012 2163 -9834 -14940 -9585 2739 13163 12858 3471 -8349 -13845 -9122 3067
1304 3067 13676 14930 5394 -7088 -13804 -10753 395 10718 12259 4543 -7300 -14652 -11759 -337
1318 -337 10757 13823 7191 -4574 -12960 -11046 -334 11024 14808 8292 -4168 -12732 -12513 -2663
1332 -2663 8276 12438 7086 -4565 -13335 -13050 -3496 8060 13904 10041 -1113 -11112 -12341 -3150
1346 -3150 8181 14085 10376 -1276 -11180 -13693 -5899 5561 12488 9716 -866 -10803 -13183 -6217
1360f217J1374Q152j326j0031j0971l436N892J1101Q020r98r617j1214m050N158
1374h163J1068Q662rq775j0551n101M268J0983R594N15q404j0688n793K949J0475
1389A030R596J653p572j0888o485K709J0011R811K381o491j0618p409K308R760
1403b04R931K984n947j0814p987Q84R053J0211L968m575j0453p896J25Q791R775
1418G846M822m534j0382q664n94P577J0100N575l399r760r122j344P208J0458
1432E787N964k677q805r096j903O437R934O758k424r500r911l100N420R849P416
1447A0149o81q325r477l168N240J0043P616k51q237r677m231M124R765Q040j71
1462A0759p468j0099n243K745R072Q613J153o240q963n356L152R428R150J674
$$ plain form
1360 -6217 5157 13309 11983 1952 -9019 -12455 -6563 4538 12558 11560 1943 -9271 -13321 -8163
1374 -8163 2905 11567 11558 2783 -7768 -12869 -8601 2382 11976 12491 4087 -6601 -12394 -9445 1030
1389 1030 10626 12279 4707 -6181 -12666 -9957 54 9865 12246 5755 -4863 -12272 -9964 -204
1403 -204 9727 12711 6764 -4050 -12037 -11153 -2100 8111 12079 7504 -2949 -10845 -10720 -1929 7846
1418 7846 12668 8134 -2248 -10912 -11506 -3929 6171 11746 8347 -1413 -10535 -11879 -4671 5787
1432 5787 11751 9074 269 -8827 -10730 -4293 5641 12399 9975 475 -9436 -12536 -7116 2733 10149
1447 10149 9468 1143 -8334 -11502 -6262 3781 11397 11146 2909 -6768 -10999 -6875 2890 10930 10759
1462 10759 3291 -6808 -12051 -9306 -234 8379 9532 3292 -5671 -11027 -7875 1553 10703 12377
1476A2377o555r793o583K130Q199Q485K088m926r984o770P62P966R035L284m282
1491E433r062o601J176Q115R604M159m149r368q022p92O531Q423M516l419r147
1506b603p788o20O488R091N719k771q426p645j157O148R471O156j595q512q512
1521f556k976M310Q311N689j588q133q333k473M837R299P480l99o862q524l640
1536i558L906R122O794K54o351r137m518K620P920O822M50p014q613m627K687
1551i243R145Q428K133n517p874n607J772P791P417K012n261q825n750Q35P404
1566a140P490K450m726q573o376Q15P621Q435M426l166q008o433k5O325P728L358
1582A0201l618q389p384o55N816Q305M753k610p746p251j020N495Q287N048j329
$$ plain form
1476 12377 5822 -3971 -10554 -8424 -225 8260 10348 5422 -4562 -11332 -10570 -2604 6431 9715 5433
1491 5433 -3629 -10230 -9054 -939 8665 12824 8675 -693 -8715 -9507 -2976 5447 9963 6544 -2603
1506 -2603 -10391 -11011 -4523 4568 10287 7516 -910 -8555 -9712 -3564 5907 12063 10468 1956 -6556
1521 -6556 -9532 -5222 3089 8778 7190 -943 -9276 -11749 -6912 2387 9867 9468 2606 -5918 -9558
1536 -9558 -5652 3470 10264 10518 4167 -4970 -9488 -6868 1052 7874 8324 1310 -7303 -11930 -9243
1551 -9243 -98 8330 10463 4946 -2928 -8535 -6763 1028 8445 10457 5196 -3629 -9379 -8544 -1140
1566 -1140 6350 8800 4074 -4499 -10875 -10060 -2439 5996 10422 7256 -752 -7185 -7210 -885 6843 10201
1582 10201 6583 -1806 -9190 -9845 -4029 4276 9029 6419 -1327 -8578 -9598 -4103 4184 9232 7903
1597G903o817p214j567M390P834N174j778p951p319l301L939Q253O443k8o185
1612A776p488k735L385P655O278j41o313p828l405L052P529O502L94o095p932
1627e366m451K220P375P190J262m222p569m408K191P124O315J429n047q138n371
1642i466J671O283P634K355l950p184n786Q22O515O930K841l071p187n828M35
1657f986O100P091L097l617p963o534l91M921P680M272j881o087o445m31N062
1672b112P325M403k347o774p046j710M395P261M558j345o822p070k218L583P426
1687A507N342k66n313o425j975L749P618N395n53o242p750l781K508O656N497
1702E967L26m971o440l885K465O497O611J127m355o716l802K518O622O525R61
$$ plain form
1597 7903 1086 -6128 -7695 -3305 4529 9703 7925 -26 -7345 -10646 -6707 1546 7989 7961 1776
1612 1776 -5712 -8447 -5062 2593 8871 8730 2417 -5411 -8816 -5764 1765 8267 8661 2566 -5366
1627 -5366 -9817 -7597 -222 6968 8230 4008 -3561 -7969 -5778 1346 7661 9090 4043 -4095 -9466
1642 -9466 -7795 -1512 6122 8477 4527 -2657 -8443 -7621 -1106 5824 8665 5594 -1593 -7421 -6986
1657 -6986 -886 6205 9302 5685 -2278 -8812 -9203 -4282 3398 7670 5789 -298 -6743 -7174 -2112
1672 -2112 5213 9616 7269 495 -6551 -8261 -3866 3395 7953 6608 -214 -7284 -9502 -5919 1507
1687 1507 6849 6583 1270 -5155 -7130 -3381 4237 9632 9079 2837 -4913 -8694 -6186 470 5967
1702 5967 6293 1322 -5118 -9003 -6538 -41 6570 7697 3342 -3374 -7176 -4658 1964 8489 9450
1717I450m703p549n761O73N801O117K022l631o570m190J334O231O885K991l422
1732E678o830m745J73N139O416L066l267o782o214j015M598O087L488k042o034
1747b284n088r6N276P304M251j515o546n974j812L434O655L758j776n795o263
1762f471k124L472O464M668r32n032n993j867M163O917N630l35m989o664l291
1777f384K357N418M580k92n071o216l036K409O308N553J130l969o578l248K071
1792d968N965N971J437l767o374m590J222N173M726J253l766o608m182J336N761
1807a411O207K833l164n567m681J23M672O008K780l056n894m841o33M575N994
1822C945K740k284o339n277m71M630O469M029j625n433m864j200L365N860K993
$$ plain form
1717 9450 4747 -2802 -8563 -7890 -2089 4028 6050 2419 -4151 -8341 -7007 -776 6109 9100 5678
1732 5678 -1152 -5897 -5724 -585 5831 8897 5630 -1152 -7366 -8381 -3783 2304 5792 3750 -2284
1747 -2284 -7372 -7468 -2192 5112 9363 7848 1302 -4672 -6484 -3050 3605 7363 5587 -208 -6471
1762 -6471 -8595 -5123 1341 6009 5077 45 -5948 -7815 -3652 3265 8895 8560 3571 -3093 -6384
1777 -6384 -4027 1391 5971 5679 608 -5608 -8644 -6235 73 5626 6756 2787 -3791 -7039 -4968
1792 -4968 997 6968 8405 4638 -1736 -6326 -5104 69 4795 6048 2282 -4326 -8508 -7172 -1411
1807 -1411 4796 7629 4465 -1102 -5783 -5660 -988 5020 7800 4744 -1150 -5991 -6624 -2049 3945
1822 3945 6685 4401 -1938 -7215 -7686 -3056 3413 7442 5817 384 -4480 -5680 -2315 3545 6538
1837F538j340n722n186j465L521N932M176m89n248n777k088L074O102M682j06
1852F604n207n292k361K533N476M363j80m997n424l220K351O024N182R65l813
1867C004n852l017J449M858N145R04l807o101l438J415N077N101J728l619n790
1882b943l948J200M899N592K042k423n193l913j6M189N147J928k895o054m597
1897f985J41M297N876K990k361n170m269k17L663N768L132j692m958m813q99L591
1913a906M963L318j793n245n057j693K975N894L939m54m195m942j412K839N495
1928B726L815o41m659n125j903K724N054L823j97m457n349k846J858N412L956
1943D191P47l056n008k516J556N201M593R47l860n477l036J195M771M571Q15k796
$$ plain form
1837 6538 5198 -524 -5710 -7175 -3654 2278 6454 5965 717 -5060 -7148 -4074 2028 6710 6604
1852 6604 1397 -3895 -6256 -3723 1753 6116 5936 939 -4485 -7705 -5354 670 5852 6817 3004
1867 3004 -2848 -5865 -4416 442 5587 6491 2684 -3417 -6855 -5440 -363 4738 6466 2847 -2943
1882 -2943 -6891 -5691 -792 4800 6842 4419 -774 -4687 -4703 -514 4633 6561 3666 -2388 -6985
1897 -6985 -6844 -2547 3329 6319 3958 -1212 -5481 -5698 -2035 3733 6865 5173 215 -4598 -5497 -1906
1913 -1906 3057 6375 4582 -663 -5720 -7413 -4438 1456 5395 4941 746 -4196 -5608 -2769 2726
1928 2726 6541 5900 1241 -3884 -5787 -3063 1991 5814 5617 1160 -4189 -7035 -5177 235 4191
1943 4191 4938 1882 -3126 -5642 -4086 1115 5708 6655 2795 -2682 -5718 -4523 248 4819 5634 2838
1959B838n480l230Q33M240M226J400k411m872l322Q36M320N123K154k335n128
1974h08l949j95L880N229K065k371n106l873r3L074M776K306j734m565l874o60
1990e898L392N329L292r64m181m611j501K973N229K690r08m633m579j560K669
2005c261M681L694j087m187m332j655K566N014L807K14l614m404k110J886M331
2020A543L548L68l979n148k747J860M837L880O87l455m370k660J485M538M066
2035D453J380l101m268l146Q83L757M207J104k865m673l434L10M128M690J789
2050E214k049m372l661O49L860M455J452k172m316l791o5L193M334K118j488m429
2066a068l366o75K915M568L091j167l825m328p02L001L929K953j353m645l795
$$ plain form
1959 2838 -2642 -5872 -5039 -799 3427 4827 2416 -2456 -5778 -4942 -622 4501 6655 4320 -808
1974 -808 -4757 -4952 -1072 4157 6222 3851 -1255 -5128 -5221 -2147 2629 4935 3201 -1364 -5238 -5898
1990 -5898 -2506 2823 6115 5151 970 -3641 -5142 -2169 3060 5750 4842 209 -4370 -5930 -3261
2005 -3261 1420 5114 4027 -160 -4492 -6147 -3581 1433 5240 5454 1840 -2564 -4674 -2788 1543
2020 1543 5091 5459 1480 -3668 -6415 -4555 282 4162 4849 1394 -2976 -5636 -4151 387 4453
2035 4453 5833 2732 -1536 -4682 -3799 -42 4165 5269 2404 -2269 -5703 -5393 -1265 3425 5214
2050 5214 3165 -1207 -4868 -4219 -359 4096 5548 3376 -940 -4731 -4796 -1603 2731 4849 3361 -1068
2066 -1068 -4434 -5109 -2194 2374 5465 4298 473 -3855 -4557 -1556 2373 5326 3973 -672 -4467
2081d467j274K660M411K897n35l417l606j343K324M084L384J43l245m371k117
2096d472J179M392L291O1l595n041k181J829M611L727L97k410m092j934J853L697
2112A312L541O35k814m138l026L89L482L385J373k493m512l037O20M205M378J644
2128D944k060l712l023R69L573L799J006k035m134l458m85K780L630J978j183
2143B589m129l331j7K746M565K783j204l614l149q32K845L956K153j608m040l738
2159d025r79K200L892K420l87l151l440j239K206M046L139j06k960m144j910J717
2175b721L981L308m63l063m324j700J757L663L318K77k888l560j678J284L414
2190F05L283O87k552l985k498O69L527L465J030k276l877k508Q24L695L594J202
$$ plain form
2081 -4467 -5741 -3081 1330 4227 3692 275 -3331 -4674 -2350 1734 5118 5261 2016 -2355 -4472
2096 -4472 -3293 1099 4390 4451 856 -4185 -6366 -4537 74 3801 4198 1788 -2304 -4238 -2385 1312
2112 1312 4853 5488 2674 -1464 -4490 -4101 -619 2766 4139 1646 -2866 -5903 -5283 -1078 3300 4944
2128 4944 2884 -828 -3851 -2882 691 4490 5496 3461 -673 -4131 -4616 -1836 1794 3772 2589
2143 2589 -1540 -4871 -4888 -2142 2423 5206 4002 388 -2761 -3593 -748 3208 5361 3753 -287 -4025
2159 -4025 -5004 -2804 1088 3508 3121 -30 -3470 -4709 -2503 1543 4682 4576 1616 -2528 -4438 -2721
2175 -2721 1260 4568 4105 1042 -3282 -4982 -3225 438 3756 4033 1145 -2415 -4093 -2809 605
2190 605 3888 4575 2023 -1962 -4460 -3791 -264 3201 4231 1955 -1922 -4430 -3606 89 3683 4885
2206D885k292m082k604O13K910L420J374j776l762k945l39K677M136J593r97l294
2222d83k749l66K386M189K265j513l873l386m94K367L239J908j103l096l067p20
2238d496K214L832K363l27k686l277j273K159L293K661k25l329l792j528J655
2253b756L510K699l93k786l418j516J822L733K729K82k351k854k088J154K749
2268E16L112Q02k611l923k417O48L300L428Q28k069l770k279J110L466L020R81
2284D142k109l180k272O04K860K620J272j425l023l088l04K672L094J980j317
2299B526l205k833KK033L766J852j389l311k672k09K196K983K296r39l024l008
2315b936m73J724K965K329p41k586l251r82J685L669K176n12k679l304j023J826
$$ plain form
2206 4885 2593 -1489 -4093 -3480 -570 2850 4224 2448 -1314 -4259 -4598 -1921 2215 3808 2811 -483
2222 -483 -3232 -3598 -1212 2977 5242 3729 -144 -3530 -4024 -1657 1582 3490 2387 -709 -3776 -4496
2238 -4496 -2282 1550 3913 3586 900 -2377 -3650 -1491 1802 4463 4238 909 -2883 -4411 -2756
2253 -2756 754 3453 3060 274 -3144 -4660 -2838 895 3624 3906 1555 -1299 -3387 -2233 516
2268 516 3628 4430 1819 -2104 -4521 -3873 -573 2855 3683 1614 -2156 -4435 -3325 141 3161 4142
2284 4142 2033 -1147 -3419 -2815 45 2665 3937 2512 -511 -3599 -3903 -1231 1863 3843 2526
2299 2526 -679 -3512 -3510 -1477 2289 4141 2752 -559 -3231 -3440 -1244 1739 4035 3096 72 -2936
2315 -2936 -3409 -1685 1280 3609 2868 282 -2969 -3951 -2266 1403 3579 3067 388 -2916 -3939 -2113
2331b113L529K457n59k470k906j340J199L271K119K9k249l167j622Q74L150K587
2347B789M08j686l406j919Q39L402K928O45j933l305k057R46K535K663M30j580
2363A699l394k153M05K400L064J340j471k828k583l0K801L062J717j738k694k708
2379c111m6K486L063J545j520l032k678k06K102K789J718n58k930k259o95J637
2395a695L031K178n53k540l029q40J762L310K209p13k807k962r28J427L149K023
2411C022o60k064k697p94J123K637K388L69k236k722j906J193K988K487P86k394
2427A520k996k125J178K903K124L13k113k847j521N79K714K900O00j532k601j897
2443b801N42J841L179R87j507l054k228p2K126L056J295j766k836k330L50K251
$$ plain form
2331 -2113 1416 3873 3314 844 -2062 -3402 -2203 1068 3187 3216 967 -2200 -3822 -2948 202 2789
2347 2789 3197 1511 -1895 -3814 -2975 427 3355 4000 2067 -1238 -3295 -2349 186 2849 3279 1699
2363 1699 -1695 -3848 -3443 -1043 2021 3361 1890 -938 -3521 -3551 -750 2312 4029 2291 -403 -3111
2379 -3111 -3157 -671 2392 3937 2417 -615 -3293 -3499 -1397 1392 3110 2552 -378 -2637 -3332 -1695
2395 -1695 1336 3514 2961 421 -2608 -3448 -1686 1624 3833 3120 313 -2649 -3577 -2150 999 3022
2411 3022 2362 298 -2399 -3193 -2070 567 2955 3324 1088 -1634 -3540 -2347 641 3128 3914 1520
2427 1520 -1476 -3601 -2423 480 2604 2917 804 -2043 -3564 -2985 -271 2629 3229 1697 -904 -2801
2443 -2801 -2259 -418 2761 3748 2241 -813 -3041 -3113 -987 2069 3364 1598 -1238 -3568 -3218 -967
2459i67K749J422j007k481j803l42J697K592J335p80k519k497q10J728K779K135
2475C231o66k740k540p66J783K770J975n18j994k393p84J445K595J733m01k124
2491F06k789r98R39K574K229L20j930k643j732J046K995K188M29j863k930j463
2507c022J053K562K569l59j891k388j937N63K233K577P87j288k685j551L01K258
2523b18K627P92j276k901j980N43K489K039J116j431k668k082j41K280K392J058
2539B639p67k335j753l55J924K520J607r07k318k641o62J846K468J705o12k957
2555e98k025o00J728K697J433n87k038j906n78J100L077J191n3k032k466j158
2571b815O90K509K000Q9j814k582j466J476K475K155K86j969k535j160R55K442
$$ plain form
2459 -967 1782 3204 2197 -284 -2087 -2429 -732 1860 3195 2415 -104 -2601 -3411 -1683 1096 3231
2475 3231 2565 -175 -2715 -3481 -1698 1072 3047 2529 535 -1858 -2642 -1197 1398 3131 2730 606
2491 606 -2183 -3181 -2242 332 2561 2881 951 -1692 -3424 -2378 617 2805 3234 1371 -1559 -3022
2507 -3022 -1969 593 3162 2803 912 -1476 -3413 -2850 -617 1960 2747 1459 -1226 -2777 -2476 -218
2523 -218 2409 3201 1925 -976 -2956 -2413 76 2115 3231 1800 -868 -2950 -3091 -811 1581 2639
2539 2639 1872 -463 -2216 -2571 -647 1873 3480 2573 255 -2386 -3048 -1202 1266 2971 2359 -598
2555 -598 -2623 -3223 -1495 1202 2635 2048 10 -1896 -2474 -1374 1703 2894 2841 809 -1657 -2815
2571 -2815 -2125 384 2384 2473 659 -1923 -3389 -1913 562 2717 3003 1034 -1501 -2661 -1706 736
2587G36J729K42j425k641j534N14J948K359M70j327k536j407O88K313K537Q73
2603C539j745k467j815J85K292J812Q97j415k403j695Q4J929K093R80p24k137
2619e90j700P7J709K611J222q89k364k119o21J300K855J010j048k080j923m73
2635c023J644K640J408n66j937j762m84J172K087J786m00j896k344j046R61K252
2651D92J680m42j595k493r94J684K671J725k59j406k236p97O03J959J817q9j437
2668H83k458j097L26K138K175P67j826k524j285P04J987K387P16j165k614j540
2684b426M31J963J829N22j018k313j163j23J746K193Q38q55k245j714j80J794
2700g21K182R29n40k126j992l53J699K289R16o80j742j898l90J374K198J677r00
$$ plain form
2587 736 2465 2707 1282 -1359 -2893 -2379 -431 1928 2398 1071 -1465 -2872 -2184 129 2666 3539
2603 3539 1794 -673 -2488 -2303 -11 1801 2698 1283 -1120 -2815 -2731 -802 1291 2271 1547 -590
2619 -590 -2290 -2213 -504 2107 3329 2440 76 -2043 -2664 -1364 1491 2501 1453 -627 -2550 -3023
2635 -3023 -1379 1261 2669 2103 166 -1596 -2080 -908 1179 2965 2565 669 -1675 -2721 -1760 492
2651 492 2172 1730 135 -2358 -3352 -1668 1003 2728 2469 1063 -1173 -1970 -1367 592 2409 2320 883
2668 883 -1575 -2672 -2346 -208 1967 2734 908 -1616 -2901 -2197 -210 2177 2893 1728 -886 -2426
2684 -2426 -1995 -32 1797 2319 1301 -1012 -2175 -2298 -552 1641 2479 1624 -621 -2335 -2515 -721
2700 -721 1461 2390 1850 -276 -2268 -2621 -922 1367 2283 1603 -139 -2037 -2427 -1053 1145 2822 1922
2717A922j657j653j130J306J921J310j51j917k089n53J090K282J871j59j761k166
2733a534n64Q03K187J628k52j478k428r61P19K083J552Q4j427k109r22O58K163
2750B02J900O63j140k608r16O16J685J705J20j114k282j272K52J764K051N17r10
2767A233k064j234p4J681K197J170j395j940j461l11J530K079Q55r12k301j318
2783b265k31J891K068J129r85j565j931k42J363K146Q17k29k293k035l61J427
2799a296J949J318m30j534j831m54J345K129J521p3j849k153o94J043J801J091
2815A883k05j578k153q91J004J804J958K27j165j727j147J108J607J894K47j699
2831A167j797j361L36J626J395J92j232k267j026N52J937K219O32j069j386j381
$$ plain form
2717 1922 265 -1388 -2518 -1212 709 2019 1868 -49 -2138 -2691 -1601 681 2552 2393 632 -1534
2733 -1534 -2098 -1295 892 2520 2268 790 -1638 -2599 -1880 203 1755 1839 412 -1697 -2619 -1961 202
2750 202 2102 2765 1625 -983 -1899 -1283 402 2107 2227 1113 -1169 -2441 -2189 -425 1626 2143 1233
2767 1233 -831 -2065 -2139 -458 1739 2909 1514 -426 -1887 -2198 -668 1411 2266 1354 -947 -2265
2783 -2265 -2496 -605 1463 2592 1607 42 -1889 -2131 -768 1378 2195 1966 -327 -2362 -2723 -1296
2799 -1296 653 1971 1541 7 -1824 -2278 -933 1196 2717 2644 795 -1358 -2052 -1009 792 1883
2815 1883 1678 100 -2053 -2944 -1940 -136 1822 2049 884 -843 -1990 -882 725 2619 2866 1167
2831 1167 -630 -1991 -1655 -29 1366 1558 326 -1941 -2967 -2415 -478 1741 2373 1304 -82 -1463
2847a463K49J571J665Q05j196k324j812J54J491J759R40j243j795j228P8J748
2863f01J770J262o70j275j544l19R64J892J030r04j884k114k33J204J941J165
2879A684k83j796j528l51J561J860J543o02j442j809q10J008J917R02nj627j787
2896a565q54O41K185J030O62j535k114l92O60J968J386N9j355j966j133M79K060
2913B16J474j11p87j781j317O07J538J556O84p36j696j250N6J483J785N43j120
2930A144j973j320j0J470J969O40n67j915j208j79J720J551R75r95j452j810l7
2947a997R28K109R50l64k047j471l03J114J926J049k96j539j309q39J509J589
2963A009J182l86j597j373p99O75J709J666m53j454j472q57Q21J680J489j19j232
$$ plain form
2847 -1463 -1214 357 2022 2827 1631 -693 -2505 -2351 -860 899 1839 596 -1199 -2427 -2349 -601
2863 -601 1169 2431 1761 486 -1058 -1377 -413 1479 2509 1605 -279 -2393 -2626 -1422 519 1684
2879 1684 1401 -395 -1923 -2274 -713 1147 2690 2088 646 -1163 -1973 -965 952 1854 1849 222 -1565
2896 -1565 -2419 -1778 407 1437 2099 564 -1550 -1942 -1282 686 2072 2131 776 -1190 -2323 -1844 216
2913 216 1690 1579 792 -989 -2306 -1699 -161 1395 2079 1343 -353 -1603 -1547 -64 1721 2264 1144
2930 1144 -829 -2149 -2159 -689 1280 1920 1353 -562 -1770 -1949 -229 1322 2297 1302 -150 -1960 -1997
2947 -1997 -1069 1040 1990 1626 -421 -1892 -2195 -1081 845 1894 1598 59 -1250 -2089 -580 1009
2963 1009 2191 1805 208 -1165 -1964 -1289 420 2086 1633 179 -1293 -2150 -1329 351 1840 1721 489
2980D89j700q87O18K130J171M9r89k038o98N29J547J301M99j013j898j089N84
2997a395J534J319K89r33j680j192M00J570J841L3j027j581q57J79J222J586Q79
3014B187r16j554j310j3J202J755N56p06j487j456k13J431J528J001n93j721j245
3031a554l16J092J681J120l26j530j733k60R49J887R05k39j540j526o93Q92J762
3048E71J085k4j585j135q84J018J397J601k29j281j861n42P72J441J224P6r25
3065G19j937q36O11J459J474J59q37j838r68M41J644J276N58j015j442j297M18
3082a411J407J354K95o02j785q77K36R93J736L79o78j631j227L7J254J804M15
3099A699m93j622j231R0J297J135R42m51j499j432k02J184J613J146p37j367j648
$$ plain form
2980 489 -1211 -2098 -1480 650 1821 1870 881 -1157 -1855 -1326 221 1522 2021 1008 -890 -1979 -1395
2997 -1395 139 1458 1747 814 -866 -2058 -1658 -88 1753 1786 759 -822 -1679 -1500 -278 1308 2187
3014 2187 1271 -283 -1593 -1606 -404 1351 1907 1201 -286 -1742 -1955 -524 1004 2005 1412 -309 -1554
3031 -1554 -1870 -778 903 2023 1697 167 -1566 -1826 -877 1010 1915 1676 136 -1390 -2083 -1191 571
3048 571 1656 1632 47 -1088 -1972 -954 443 2044 1815 534 -1327 -1869 -1097 344 1568 1644 719
3065 719 -1218 -2054 -1443 16 1490 1649 812 -1026 -1994 -1553 91 1367 1925 910 -532 -1829 -1411
3082 -1411 -4 1350 1645 1043 -742 -1619 -1383 -390 1346 1725 1047 -584 -1811 -1774 -520 1284 1699
3099 1699 1206 -416 -1647 -1557 -260 875 1817 1366 -133 -1565 -1767 -583 1030 2176 1439 72 -1576
3116a576p2O90J528J173m59j462j234l84Q73J429J409k69j199j321r33J151J578
3133I22Q98j7j291j713n30M89J651Q09K31j289j589n93N88J497J433M22j087j608
3151g77q94O30J292J261N50j136j820q14%J486J338L5o68j538p99J74J395J432
3169A147J012n94j493j124j60J159J296P96q26j679j379j34R71J673P42p06j321
3186f20j021k9J094J730R46n02j205j421m36O73J791R41o67j329j533l67Q27J343
3204B15J322k50j286j247m48Q46J468J040K07j399j318p43P11J277J063J18j014
3221E62j646j011R56J400J212J2r90j334o27L71J332J105K34q31j690p91M41R61
3239c34J542K47o31j600p55J07J395J365M29p39j576r89J77P57J529P00j192j122
$$ plain form
3116 -1576 -1648 -958 570 1743 1284 -178 -1412 -1796 -923 506 1915 1646 447 -874 -1807 -656 922
3133 922 1820 1803 512 -1201 -1731 -1242 409 1218 1449 160 -1429 -2022 -1434 63 1496 1918 831 -777
3151 -777 -1671 -1041 251 1512 2062 926 -894 -1708 -1708 -222 1116 1151 483 -1055 -1854 -1680 -285 1147
3169 1147 2159 1565 72 -1052 -1212 -53 1243 2039 1213 -466 -1845 -1979 -1008 665 1407 701 -620
3186 -620 -1641 -1670 -576 1154 2100 1598 393 -1028 -1464 -791 1000 1941 1274 -55 -1588 -1955 -1128 215
3204 215 1537 1287 1 -1246 -1694 -848 620 1660 1867 468 -850 -1593 -882 395 1458 1576 562
3221 562 -1084 -2095 -1139 261 1473 1485 495 -839 -1466 -1095 237 1342 1576 745 -945 -1736 -1295 -334
3239 -334 1208 1455 824 -776 -1531 -1424 -29 1336 1765 1026 -550 -1539 -1362 -605 924 1624 432 -690
3257f90r32j60J308J552O77l95j239j178j12Q86J243P39p05j239j254l46P68J694
3275F17Q12m42j189j140l15P41J549J095l45q67j443n69R21J360R02p5j517j299
3293a204o33M48J382J110J62r65j625k21M90J765P74J22p89j605o59K33J429Q16
3311A030K85r12j447q21L27J175J588N66q95j481n39k5J221J273K18n58j384j139
3329a518L2J426Q77L42k34j283j088N6J045J490L65k92j234j064k95R68J235N21
3347A349k17j388j068j22O61J382J039m66j331q37n27J220J290O73k47j268j379
3364a236m72P77J140J001l86n69j260p21O53J502R25M4r35j000q50N38R66J277
3382A394J8r77j279r06N86J123J192J50q86j155n84M62J000J118L84q30j343o07
$$ plain form
3257 -690 -1622 -1782 -474 1078 1755 1360 121 -1057 -1169 -283 960 1699 994 -245 -1499 -1845 -1077 617
3275 617 1429 987 -202 -1342 -1657 -916 633 1728 1383 516 -927 -1496 -575 785 1687 1612 95 -1204
3293 -1204 -1837 -1389 -7 1103 1265 300 -1325 -1546 -1056 709 1483 1605 816 -789 -1448 -1215 214 1030
3311 1030 1315 403 -1044 -1865 -1538 -363 1225 1791 896 -585 -1124 -1149 72 1345 1563 1005 -379 -1518
3329 -1518 -1486 -60 817 1159 925 -358 -1446 -1390 -345 1145 1510 1218 -16 -1080 -1375 -407 828 1349
3347 1349 1132 -256 -1324 -1446 -785 597 1636 1170 -161 -998 -1525 -305 985 1658 1411 143 -1236
3364 -1236 -1708 -931 209 1210 824 255 -1005 -1726 -1073 429 1354 1398 463 -537 -1387 -849 117 1394
3382 1394 1412 435 -844 -1750 -1164 -41 1151 1301 415 -740 -1324 -862 138 1256 1640 810 -533 -1140
3400a140q8J147R02O22p86j267r52J79R18J331O25o63j170r26K47O78J177P42
3418A576o95j051j196L7R49J036P56k74j422r96j93R93J110Q31m47j053j107k84
3436a430Q57J037J065k85j021j248m92Q03J121O62q8q52j053m94P42Q89R84J64
3454A361r43j247n83M92J205J148o9r54j215m56K64J251Q49J80p94j103q04N22
3472h96J043Q86K83n36j074j007L10P72J054P86j016j030n96j86J061J102L33
3489A289o00j130r41J41R82Q66Q09l90j278p53r0Q59J109L54k94q62j283J4P77
3508d21J188N38k71j281p59l20P35J058Q21k19q39j038m90Q41J296M69j75p62
3526C71j411k94M60J223M89K66p62j328k75M59J056R11M0p29j044o73O28J020
$$ plain form
3400 -1140 -1228 -81 821 1443 657 -610 -1562 -1383 -465 866 1491 828 -342 -1268 -1021 -343 834 1576
3418 1576 881 -170 -1366 -1329 -380 656 1412 1138 -284 -1280 -1473 -480 630 1461 1014 -39 -1146 -1430
3436 -1430 -573 464 1529 1244 223 -1025 -1517 -714 407 1069 981 129 -924 -1418 -676 213 1197 1361
3454 1361 418 -829 -1412 -920 285 1433 1364 410 -805 -1261 -997 254 1103 1283 489 -614 -1418 -896
3472 -896 147 1033 1316 780 -294 -1301 -991 -219 835 1621 605 -425 -1021 -1207 -146 956 1289
3489 1289 689 -441 -1382 -1241 -259 607 1416 1026 -252 -1005 -1095 -236 873 1227 933 71 -1212 -1198 -421
3508 -421 767 1305 1034 -247 -1006 -1326 -591 467 1288 1069 230 -808 -1298 -457 839 1308 1133 371
3526 371 -1040 -1334 -874 349 838 1104 342 -986 -1261 -802 254 1165 1205 476 -568 -1241 -613 407
3544D07Q37L1n51j223p85K97R51N86K18l95q68r46O70N13J269K07m51j292o81
3563a206K20R24J180J11m11j054q45J61Q07P22O13o13q75n74j57N71J241L50l39
3582H26p52j122k68R25P82N18j60o05j282j70P25P87O32J72j185o70k12M03J094
3601D38P06M8j057r06l91O07O91R21o4p64j033n78O08Q52O61L44p11p11p01L72
3621f68P58R17J89n70r73q01l7J077Q03L61o14j001l97n3Q54N50O70k02j198o76
3641a011J37O33J079K18l85r93p11O3N57J063L51m54q53o62j63O57J273O7L5q18
3661H3p44l13Q43O50O42l24m92j220m36O20J098O23J15j243o05m66L50J123Q27
3680A131k25n90q84l23L40Q75N03Jn81j013n67M17R43Q12N0n93p29n67L84O72
$$ plain form
3544 407 1244 1275 724 -499 -1284 -987 -36 550 768 373 -495 -1441 -771 -258 1011 1218 767 -525 -1206
3563 -1206 -986 -62 1118 1229 818 -236 -1081 -920 -113 609 1222 609 -266 -840 -997 -426 815 1165 826
3582 826 74 -1048 -1316 -391 391 909 749 144 -1138 -1308 -583 204 836 1008 -177 -847 -1059 -656 438
3601 438 1144 1192 135 -771 -1162 -555 136 1057 993 229 -804 -1382 -774 78 739 1083 372 -339 -1040 -668
3621 -668 90 1007 1196 626 -347 -1148 -1185 -108 695 1056 442 -559 -956 -1009 -155 395 1065 863 -335 -1011
3641 -1011 -874 -241 838 1056 671 -322 -1033 -970 -413 650 1001 547 -306 -968 -1131 -474 799 866 901 83
3661 83 -661 -974 -131 519 1161 837 345 -875 -1311 -691 407 1030 1145 -98 -703 -1169 -819 304 1131
3680 1131 906 316 -568 -891 -551 324 827 828 247 -766 -1333 -916 27 839 889 296 -433 -1000 -616 56
3700E6J105l03m54q20p47K68R26R04o0o89p97m00N6O91J046K89m45q86o69k4Q68
3721h5P76N15m78r33o99J21N89P61L88j72r36q61J30N37J003L65j68j110m63l75
3741a095Q17Q24O34j35r01j042qM02R22O29j69r64n30k78K77R93M97K07r01p70
3761e91l32L65N32R46K2o58r82k62J88J108N22j44k81q99n71L11Q32P49K40p10
3781C85q07n52J65N21R15J22m30q05n55j8J200M19M67l05q62n76q2P22P95J46
3801H65k28q69o62O4M80R99L70n09o85q00L0P53P47L56j40p16q31M4J96J263J82
3822I09l95m13q82k07N27O31M83O4o15j149O1N41M39P48n7m84q97k42M18O04P82
3843H66j67m21p79o42M92O22O07M50o03r63n52N42O41O16r2o14m76m86L93N91
$$ plain form
3700 56 1161 858 404 -416 -1163 -895 31 935 875 186 -611 -1011 -955 -264 782 1071 626 -260 -929 -953 -85
3721 -85 691 1206 728 -205 -904 -783 -194 567 955 783 -153 -1014 -884 -347 656 1021 853 -257 -720 -1095
3741 -1095 -278 546 1180 1045 144 -898 -906 -504 418 1047 878 -86 -616 -894 -617 376 873 1080 179 -591
3761 -591 -923 -558 -26 920 942 284 -698 -960 -772 336 858 714 433 -466 -1037 -726 106 855 1095 385
3781 385 -422 -974 -809 -288 627 749 319 -486 -1041 -1059 141 560 1027 722 -140 -716 -798 -76 719 865
3801 865 637 -232 -894 -830 -350 649 1019 510 -175 -975 -945 -192 555 911 771 55 -776 -732 -536 727 909
3822 909 514 101 -781 -988 -461 170 653 717 102 -1047 -986 -445 -6 742 685 201 -696 -938 -520 84 866
3843 866 699 278 -501 -1143 -651 -29 578 1028 425 -538 -1090 -548 93 709 617 3 -473 -959 -566 25
3863B5N45N02o86r40l26L99N65O26K56n04p19o98J57Q45N71K59k76o10q62M8P18
3884a05O64j13N2o84o52pL84R66K42j45p22o45k65R39M77N22m70o30m42m3K90
3905c87Q89L32k45n17p37k85M83P60M99k10l58r17k37N34Q05K68J61p55o72j04
3925f93L48K91P71Q7q82m17l16N2R06M10J27k65n76m64k97R47M83K76k66p76m79
3946g33JP63L26J93k36n76n55K1N87P43J45k62m28n91r5K75J054J47k13o03p31
3967g68m6O02P80J14j2q97l94k45L85J081J56j66k38q55l49P37N08K43M9p05o38
3988f58j24P9J068K98o9k76n52m16N4M76J015j45n83n30n06L39P18L75l4K8q83
4009c26j89K0O78N15l0m88n88k89L80K13P42M5l36q96j83k0O83M56K01j12o78
$$ plain form
3863 25 570 1072 386 -554 -880 -481 84 710 966 462 -257 -955 -798 47 618 877 601 -9 -871 -823 -105
3884 -105 559 446 498 -186 -838 -845 -461 505 747 602 -120 -765 -1030 -91 386 908 438 -192 -634 -677 -387
3905 -387 502 834 589 72 -665 -950 -467 293 792 582 224 -693 -930 -396 409 677 838 83 -589 -693
3925 -693 -345 -54 717 804 -78 -495 -811 -759 147 557 684 419 -157 -621 -918 29 512 788 522 -254 -733
3946 -733 -732 31 357 550 314 -262 -817 -796 -209 534 679 417 -11 -602 -697 -422 632 779 566 -37 -768
3967 -768 -814 -212 568 682 670 -227 -621 -866 -481 600 756 590 352 -503 -852 -115 393 636 685 -20 -658
3988 -658 -782 -703 365 663 594 318 -234 -650 -596 -120 895 750 167 -363 -869 -530 188 563 529 557 -326
4009 -326 -515 -495 183 698 668 180 -408 -697 -317 -104 638 683 347 -549 -732 -752 -69 387 588 476 -202
4030b02n40OM83N06L76k92p59m52K70L82N25L30l86j89q66K20L31R45K73o52l51
4051d2j33m56J49R49k8P2n66m75p0K44O56L34k65r6q38O4N0O83M20J59o03p11
4073e03l15M95M85M60O2p62j92l22J88M21L68K10k33p54l17L5O57N52K36m25m52
4094a06p04L45K78O95Ql71j30q28J73L40P04j3k0n11n23L51K36M53L45k82k89
4115A51q00J2M49O00O0l95R0r42K6L46R75N5l31j59n89k07L52N62N40rp01k97
4137b12l49J39N17L81k7m23m91j47J85N12L65L2k78m52l97K85O04L04O4l30n18
4158b36q3J81L03N55j87k61n49m06L02L86N19o6q2m44m53L8O03O13ql80l88m60
4180e03j13N51M51J88k66n68Ml64L60O34K57m2o11l39k08J74O97M77n80j04n95
$$ plain form
4030 -202 -742 -736 -253 253 629 337 -422 -874 -604 -222 303 633 247 58 -808 -588 -257 688 961 309 -42
4051 -42 -175 -631 -482 467 439 511 -55 -530 -600 -356 300 634 369 273 -565 -501 -451 232 652 811 208 -503
4073 -503 -818 -323 162 622 684 -78 -270 -592 -404 17 385 595 362 -392 -709 -674 -17 535 771 346 -106
4094 -106 -810 -465 -187 508 516 145 15 -813 -640 -300 404 391 371 -140 -663 -312 -76 377 722 440 151
4115 151 -649 -637 -188 412 472 77 167 -775 -749 -403 572 627 296 137 -452 -659 -307 255 795 786 85 -212
4137 -212 -561 -422 95 476 449 26 -465 -612 -427 85 450 482 204 -248 -645 -360 244 548 612 282 -236
4158 -236 -319 -138 165 720 533 272 -277 -683 -381 5 524 458 376 -68 -521 -483 120 733 725 345 -43 -503
4180 -503 -616 -65 386 574 308 -260 -256 -620 -260 374 631 589 -22 -361 -569 -395 302 779 199 95 -500
4201e00J89J91M98N9j96k97o34k6M52O89K26k07o36j28l21M96K26O40n2n88k16
4222a35m90L72K85L37j11q8o26L2J40N41L52n9m12m46l5n3O52J56Q2l60n19k80
4244f65K84N55J73J67l11m97m76K94N00N30j61k85k36k78O8L98M50j03j27m43
4264a63l10J69K52L93K95k73n85k59J1J81O07J92k27m39l68K0L64O73J63l70k87
4285C9m97q4K49M08M64k34l76k68k7J96K48J02J15l62k35j25j15N50M18Q9j07
4306D48m73l66P2N90K49k04j21n91k15J35M53L11K29m45l30k22M9N98K14l1k4
4327C26l16k61J44J73K83L94l18n12m31J95K54M42o5l45Q5p17M25K96K01K33m29
4348E7l44j96M4L75K63M12o3p62l18L03K01K21Q8m4m00l22J51r5N07M59k15l91
$$ plain form
4201 -500 -311 -120 378 437 241 -56 -690 -716 -264 425 651 444 -192 -320 -641 -145 81 721 669 81 -135
4222 -135 -625 -253 32 369 258 170 -456 -424 -284 257 609 550 138 -308 -343 -396 256 412 494 134 -385 -665
4244 -665 -381 174 347 514 203 -294 -770 -476 24 554 393 108 -128 -406 -338 60 510 407 280 -163
4264 -163 -473 -304 -52 341 636 363 -222 -481 -470 -289 318 510 283 -156 -524 -504 -140 533 696 326 39
4285 39 -458 -542 -293 115 579 345 -31 -299 -326 -130 118 220 335 -27 -262 -387 -502 48 466 555 448
4306 448 -25 -391 -319 271 520 316 195 -396 -611 -476 -23 288 517 72 -258 -480 -431 167 381 350 326
4327 326 10 -251 -107 66 349 743 425 -87 -518 -323 -69 373 308 -37 48 -669 -244 52 253 486 57
4348 57 -287 -483 -439 -64 199 611 548 -214 -532 -229 -28 193 281 237 -163 -485 -334 -429 78 537 322 -69
4370f9j59k10J7N85K11K24p17k54J51k09N05K66m4l10j62k25K17N13p2M88o00
4391A46j58l38K42J09L83J26j30m46j54nK65J78L38l47n09j57j03N23R0K80l7
4412B96l20K5k82R6N36K26k92n17k40NK27N60K54k64l13l94p3K04P70O4k7m79
4434F2j45k75M6O74L61j32n99j19l63K73K29L45J0j94j85m30J78L65K98r8K9m79
4456a49n44L43K34N43j60q5l77L0l17N47L20j05k00m30k8J56K62M3O44n77k00
4477e0nm88N13L24J01l83j41l18J4M33J75K58K6o86J39m59L80L84P5k5m07j34
4499b74J30R4K56K4q2k25j12j04r2N88J53k35k57jn18M79N2K55J2Q2n18Q9K77
4522G3O6L88J1j64p56j81K00L32J94P9k92l21K40j46M68J84J32l14j52k92J90
$$ plain form
4370 -69 -228 -438 -421 164 375 599 -118 -372 -221 -430 75 341 297 -13 -175 -400 -183 330 258 746 146
4391 146 -12 -350 -108 1 384 510 380 -66 -220 -225 40 218 556 209 -300 -457 -560 -37 53 333 296
4412 296 -24 1 -281 -185 351 577 285 -232 -472 -467 -240 320 574 310 -3 -397 -470 -266 504 568 541 62
4434 62 -83 -358 -312 362 723 591 -8 -127 -490 -217 12 357 367 173 -12 -442 -264 101 399 301 330 -149
4456 -149 -693 -350 -116 427 267 182 -195 -165 -482 65 385 280 80 -350 -378 -222 40 83 727 150 -50
4477 -50 -55 -543 -30 294 395 12 -129 -447 -433 0 175 433 459 -227 -88 -547 -167 217 292 267 -140 -274
4499 -274 -144 -50 206 230 148 -77 -189 -293 -385 203 356 121 -136 -137 -655 -176 -124 131 143 225 -293 -204 73
4522 73 139 527 538 374 -382 -563 -363 -31 163 242 -50 -371 -131 -277 191 375 507 193 41 -251 -61
4543f1J6L01M5l24k03j23K17M6M80j82j06m56O0K2K62M36m0J2n25k30J16J41M79
4566C83O2l55q7m80L82p6L87p7N4l36k46K50J32j16L69O0m12j86O5J81J39M73
4588E66k46l99j29lK03m0L09k2j30n3k63o1N23M0j10k75j73k5L1M94J66Lk46k55
4612i5o9j7J26M26j66j02o9m73L28J04K40O4k5o86K31j29L06K40p2j01j48k56
4634c43L1J91PK59n1k73j81j16K64N43j1j47j05k48q2K83J61J42k25L0m18j4J78
4657a25J20M10j14k67n5k50J78m7M62k13J03k57q6K97q3J88Q2m41P5l00K17R3
4679a3N7R8j8l76k88O61n0L87j06l18k89N7J58o3N11l46O7j90j34j4J33k8K59
4702A55k0k77j14m1J98J86L88m80o5j62N6K04J51R3k37j94q9n9J06L69K16j75
$$ plain form
4543 -61 -45 256 301 -23 -226 -349 -132 -86 394 212 106 -350 -290 -268 -6 430 390 402 -123 -353 -237 -96 383
4566 383 445 90 3 -477 -95 -171 216 139 193 -143 -389 -139 -7 -123 246 306 -106 -292 -227 -46 93 566
4588 566 320 -79 -208 -211 -8 -48 261 239 109 56 -207 -268 255 295 185 -90 -263 -288 -257 237 403 406 160 -95
4612 -95 -164 -181 -55 371 205 103 34 -439 -111 -7 233 297 272 -414 -183 -312 -6 234 162 61 -87 -343
4634 -343 -312 -121 -114 145 94 -179 -360 -476 -212 331 320 173 68 -180 -262 21 182 324 99 129 -289 -303 -125
4657 -125 -5 405 291 24 -31 -281 -103 -150 312 99 202 -55 -141 156 73 261 343 -98 -23 -323 -106 -13
4679 -13 44 142 124 -252 -540 121 71 458 352 34 -255 -198 -40 -103 408 62 129 -61 -195 -209 -76 -104 155
4702 155 135 -142 -256 -297 -99 87 475 -5 -70 -232 -176 28 179 272 35 -159 -248 -307 -201 168 384 209
4724B09k28n8k77K09o7O19j51l27j30L5J15L31j33k05J22l71R4J62n1M69k8j85
4746A54l83J82j76j28O91ql13R1k10rJ89J73j06j24J6l44L46k44K72J02k74k50
4768c53K4J63l5J43M71j97l25q5J48N8o2K69n8k88l3m2N8L00K70m09J09k41j29
4791b44J49r0M41l55K22k61q6J33J81K09l0j45j96j89ML44K50l34J7r6q5l3M22
4814B28j15j6k32j06R3Q7J88J11O3j41k64J41q5Q2K88K4k21j86j78J21N6J79J95
4837C12k93j11q8J1K1K60k2j1P3m11l9k7K61L18k28K4l52R4O8L32L26l13l05r7
4861a97j09J91L26l3k8nl76R2kJ08J62k24Q7K6k73J9M65r4l27K99l89N2J15L84
4885B69R4n5l55j87rK3K03L4JJ10l90Q5r7J97J47N3L73n61r2L4J79j03K25j02
$$ plain form
4724 209 -19 -77 -354 -145 -212 407 256 -71 -201 -166 -51 280 147 -58 64 -307 -213 -51 -102 367 339 154
4746 154 -229 -47 -223 -351 340 332 19 110 -100 -109 80 253 147 23 39 -305 41 -203 69 171 -103 -353
4768 -353 -329 -166 -201 -58 413 216 -109 -194 -46 12 -50 219 161 -127 -160 -202 -144 156 426 17 126 -115 -244
4791 -244 -95 -185 256 -99 123 -138 -224 -91 90 299 269 124 -72 -261 -257 87 337 3 20 -76 -161 -194 228
4814 228 113 97 -135 -241 -148 -61 127 238 301 160 -104 37 -48 34 322 346 125 -61 -239 -118 -62 117 312
4837 312 19 -92 -180 -169 -148 112 90 79 152 -259 -298 -325 -64 254 26 50 -302 -208 -140 192 518 205 -100 -197
4861 -197 -306 -115 211 178 150 145 -231 -139 -141 -33 129 -95 -8 18 -255 -236 229 135 -192 107 -282 -230 -115 269
4885 269 363 308 -47 -234 -243 -220 -17 17 18 128 -262 -177 -274 -77 70 123 496 -65 -157 -123 56 -47 178 76
4909G6R0l06q5L97Q3R2j70j92j79m3J42M54k75K71l78k60k5K78K60jO2j92l25
4932b26J81J33q1K43j26j49nj33J16Q9J70j13P2l62m1K58n1K05K5r9k81l42N84
4955F7mJ61m9l32L0j08m8K37J84K05j92o9k48K14K68k07l9O1k40p0J59J14J38
4978B32K1n29J67l99M48o8KK87j51j21j03K62m4J46q9J52k26j00J4L25j04r9K29
5001B52k45k36k0O9M81j45p6K14n51O8J22K36J29k45j18Mm1m0K09K10j71j10j63
5024a67j54L65N7j7l7o9j18j68K11Q6L22r0m66K23k34J91N8K50Rm6m00R4m1K21
5048H0N4O7o3k44M7j09L46j3J68k93J28m78L12L3O4R5J0l14J15k77K83J71j51
5071C1L29n11n7J69kK66J0k75j18k49K61K0KK88n5k1j56o9j38M60J46l07k05m8
$$ plain form
4909 76 166 -140 -225 172 255 347 177 -15 -194 -237 -95 359 84 355 -23 -283 -308 -30 230 229 291 99 -226
4932 -226 -45 88 7 250 124 -25 -30 -163 -47 42 212 99 171 -191 -232 26 -25 180 205 106 -175 -517 67
4955 67 63 224 175 -157 -127 -235 -283 -46 138 343 151 82 -166 48 316 109 70 131 -109 -179 -20 94 232
4978 232 253 -276 -109 -508 -60 -128 -126 161 10 -111 -214 48 4 150 61 213 -13 -113 -99 226 122 23 252
5001 252 7 -229 -249 -180 301 156 80 294 -257 -189 -67 169 298 53 -65 -61 -102 -142 67 277 106 -4 -167
5024 -167 -321 44 101 84 47 -22 -140 -308 -97 -11 311 221 -245 -22 -256 -65 -7 243 252 206 -194 -100 -141 80
5048 80 134 201 138 -106 -59 -168 178 165 333 40 168 -310 2 35 99 194 204 -110 5 -272 11 182 31
5071 31 360 -151 -208 -39 -41 225 235 -40 -158 -407 -146 -126 -124 164 109 88 -68 -137 -275 185 331 24 -181 -229
5095b29R5k3R2J69K22l81K94m03j99O52j41K6j76R4j62r9K16L67l23n9k50l7J53
5118a02J90%n1O2j61L1o2k8K99M0k63o9Pl9m0M93k17J95j39j01L8m5K94k59j75
5143a02M4N8l86L57K33J06k16Oj47K3O3P6R7o3j36j37P6l9K58k59K38j24M6l61
5167b89R0K07P0L01l28j02j49L23J29k9j4M4n7l72j92M05J46p3r6p3j43k2J82
5190d2L39n9m75L05l71Q8L07J85m99N22k28j59N7r0K97j01K06k94l9r0j39M48
5212A68j31J72m07K25R8k4k52K88K53k02n35Q7K24j82J45K15l12q4j55K64PK16
5234G8j06r9l5J74J09j94n1J50j79k9j08K48M0J83J9j16k48m5k23N50J62l16J5
5257b1j3o9j57L10K61l53O0J53m62K40M5J00Oj88L3j18Q1j5O5R5M20n80J5n8J5
$$ plain form
5095 -229 -134 -157 -65 104 326 -55 239 -164 -363 289 148 174 -2 92 -70 -169 47 414 91 32 -218 -255 -102
5118 -102 88 88 37 99 -62 -31 -93 -121 178 218 -45 -114 -107 -146 -186 307 90 285 146 45 83 38 332 73 -102
5143 -102 -58 0 -386 -29 204 310 94 100 -47 -24 39 115 212 149 13 -124 -48 -87 171 -88 150 26 72 -289
5167 -289 -199 8 78 379 51 -51 -200 123 252 223 209 253 196 -176 -368 37 183 110 14 -59 -202 -224 -42
5190 -42 297 238 -237 68 -303 -215 92 277 -222 300 72 -87 -30 -120 177 76 282 -12 -51 -141 -280 168
5212 168 37 209 -198 27 125 101 -151 137 390 188 -347 -260 -36 -218 -73 142 -170 -254 -409 -145 -138 78
5234 78 -28 -127 -162 12 121 -73 -124 26 -153 -182 -290 -42 -2 181 200 84 -164 -209 -432 118 280 -36 -21
5257 -21 -34 -103 -260 50 311 -42 18 171 -291 -51 -6 94 100 -88 -55 -173 -92 -107 -42 53 473 -107 -92 -150 -135
5282a35p5L39Q3n7j96m5Q4M9K20j18k42n0j34K41J13l4No2k01l2M24k03J26L0
5306A30Ol37r4K09Q1J62l3k01J44k95K12O9l5K73k77K2m46J07K70L00q2J5l44
5329a44q8J69k4L79k20q3j65n1qK14J13k0J7Q9j93j58o9K85K1J45m18P6j28M00
5353A39J83j24P8r0k01k39j2M19p5J77m06j79J41j09L06K75J11l17j28k78K00
5374a29J96R4k31K88n00O8K2Q1j3J40R0j53j48RJ03L14k25K04n4m86K97j80K49
5397C6J80j15k53j70K72J49O2o9J84k18j69O4MJ2N2M4j60J1J54j95K85L0j39J72
5421B23l21M6j0L18j89l7j09q6J1q4L43q8L00k72k14o7M9J01L06P6k40o7j66n6
5445b33J66K31j10K23m73l88M18j6K32n0K64m67J35j7J50M3J51k12r6k00K19N8
$$ plain form
5282 -135 -210 129 212 155 -41 -86 -2 47 267 149 -93 -143 -277 -36 77 43 48 -14 -215 -247 177 -26 100 130
5306 130 136 -201 -295 -86 -5 157 124 -77 67 -228 -16 53 18 291 14 36 -410 -303 -33 267 185 200 -144
5329 -144 -232 -63 -87 292 72 -11 -176 -227 -235 -21 92 72 89 178 -15 -173 -242 43 64 209 -209 -133 -261 139
5353 139 322 198 276 186 -15 -254 -266 153 78 255 -151 -330 -189 -298 8 283 394 77 -51 -329 -129
5374 -129 67 161 -70 218 -282 -214 -192 -111 -124 16 106 -47 -195 -186 -83 231 6 210 156 -330 -33 -213 36
5397 36 216 101 -152 -322 -50 99 161 92 276 58 -111 -47 -43 -31 21 65 -95 -84 70 -125 160 190 51 223
5421 223 -98 -52 -62 256 67 30 -79 -165 -154 -238 105 17 317 45 -169 -236 -187 -86 220 296 56 -11 -177 -233
5445 -233 -67 164 54 277 -196 -584 -166 -182 50 0 264 -203 -68 -85 65 108 259 47 -49 -249 -30 28
5467B8J29L22m69j42p8k9L70J51k16J37l97k7r4L57L20k31j56Ll11L69k87L30
5489G9j28q2k97K17J72j32L38k27J37m67K47j90R8J71J89l71K91j54j56J14J23
5510b8K54k3m83M4r4K68JK14Q4l60K8L1P5j4K86n2j57k76J62J35J49mJ13j9m52
5535a18KQ3J77P4o5ol45qJ77P8K13j63n0k42o0q7N15o5J97j3j48k18j50J29J94
5560A01K72m54Q1k40J29N5k10M26k2p8j11q5K86p0L58l65m3j98K22j24qK21j42
5583Aj68J40j51R2J61j2QJk79j61L49J41q2R5j6l95K08K80j61J36k17J90m00k49
5607d89N67N2K23l79J34k6L2l30L26J98Nk45l6j86j11J32K01J12r6k63r2P0K94
5630I3j28P5K25l63jo6O0M09j28j62P0l85k6K66K61k31J25km06J26P1N34k94k4
$$ plain form
5467 28 157 479 10 -132 -210 -239 131 282 66 203 -194 -221 -315 42 362 131 -25 -22 -333 36 -251 79
5489 79 -49 -131 -428 -211 -39 -171 167 -60 77 -390 -143 -333 -235 -64 125 -246 45 -109 -265 -151 -28
5510 -28 226 203 -280 -236 -330 -62 -61 153 237 -123 -95 -64 11 -3 283 231 74 -202 -40 95 244 240 353 334 -118
5535 -118 -116 -33 144 218 153 147 -198 -206 -29 49 262 99 49 -193 -253 -340 175 110 307 294 146 -72 -222 -93 101
5560 101 373 -81 0 -240 -111 -56 -266 160 138 60 -51 -136 150 80 438 73 30 -168 54 -70 -78 143 1
5583 1 -167 -27 -178 -86 75 63 71 72 -207 -368 -19 122 40 135 119 -276 -68 212 51 187 -30 160 -240 -489
5607 -489 78 130 353 -26 108 82 114 -216 110 308 313 68 32 -154 -265 -133 68 180 84 -179 -271 -201 93
5630 93 -35 40 265 -98 -99 -165 -105 304 176 14 84 -301 -327 -61 200 -31 94 92 -314 -188 -117 417 123 99
5654I9j45n8r8NM20j00j04J23j44Q3j40K94jL4l65M2j59rL78K8K9k42j14j31R5
5679a80L34j98K87p1k06j64o5J79K36L93k83l89J6K04j30J91J49l99Oj24K71K4
5701H1k3M7k0l48J59j37K24J26K02j92q2L4m47J13L26L16l06j23k29M8L01K1M63
5724E54j44k97m71kK15K04Q8j86M0n5o7M7o8L52N4k86p4KL5L19r6R4k28k33J21
5749h2o1M22l69L80k38l2k17L41r0J33L6r0q4j90r7L93J60k89J12j88k08L24j59
5772i3J1K80Q6m69j69J54j9J94J95j65k08K40k17K29O1J05j42j83n5J31j44L43
5794A65J35j96k07J5P1K0K84M9l78j17m6J37j56M2N33l87P5p3M9m4Q2L02k38m3
5818G4L8m7j64M39k78m6Q0j00l66J32K29L8j5N7k45N5j36L26l3KO4R1m67R8L30
$$ plain form
5654 99 -46 -104 -202 -197 223 123 19 142 -2 81 -59 235 234 268 -97 -55 -214 -223 155 183 212 -30 -144 -275 -180
5679 -180 154 -44 243 172 -34 -198 -263 -84 152 545 262 -127 -111 93 -37 154 303 -96 -90 -214 57 81
5701 81 58 105 85 -263 -104 -241 -17 109 311 119 37 71 -376 -263 63 379 73 -50 -279 -231 70 91 554
5724 554 410 113 -358 -360 -145 59 147 -39 1 -54 -121 -74 -142 210 264 -22 -96 -94 -59 260 164 258 30 -203 -82
5749 -82 -143 279 -90 290 52 20 -197 144 54 187 223 133 49 -141 -238 155 315 26 138 -50 -258 66 -93
5772 -93 -82 198 284 -185 -354 -200 -219 -25 170 5 -203 37 -180 49 110 215 73 -110 -165 -34 -178 165
5794 165 300 104 -103 -88 -17 3 287 336 -42 -159 -205 -68 -224 -182 351 -36 39 -34 15 -29 53 355 117 74
5818 74 112 65 -99 340 62 16 96 -4 -370 -238 -9 29 14 71 -174 -119 -255 71 38 40 104 195 -272 -174 156
5843A56k71j16M10j28j24P6r9K86k73K25j14k8k14L52J93l69J96k40j73K17P7
5864C9j3J95k33l87M20j12K42j16r4J26r8ok17L79r3Q9J02j85k50O4k4L22k75
5887a25L28Lj21k51J35K46j16m9N4n4m29M68P3p9k41M14m09%J59p1J29Q4l22j17
5911b91K40Ml2L25j74q4J40q6m41K50K97l22K50j52R9q1Q7K81p9j23nj25J1j47
5935a58K91Q0k46K7j84l2L50r0J5K1k46R5m5MM6K28j3j77J84j55m61M43J92K1
5959A90j27l80J69l6J12M21j76n0k06j15j26M15o6K07j96p0k28n4M08R8n4j77
5981d1k0k11J82J47J37n8m2r5K2k6J26j92O1J62l04j07J34J84l5J6K72l65Qj7
6005f2k18L45J44k0k79l07J86J2K16J91K40n79K7Q5j79L13j98L10k62k21k31N93
$$ plain form
5843 156 -115 -231 179 51 -73 3 -96 190 -83 142 28 0 -214 138 331 -38 158 -82 -255 -38 39
5864 39 26 221 -12 -399 21 -91 151 35 -59 67 -31 -37 -254 125 32 121 223 38 -212 -148 -172 150 -125
5887 -125 203 206 85 -166 -31 215 99 50 104 50 -379 89 162 83 -158 256 -153 -153 6 -65 64 148 -174 -291
5911 -291 -51 -47 -79 246 72 -12 128 42 -399 -149 148 -174 76 -76 23 -58 29 310 231 108 103 -22 -11 -158
5935 -158 133 213 -33 -6 -190 -222 128 38 53 74 -172 -77 -122 -118 -72 156 143 -34 150 -5 -466 -23 169 190
5959 190 63 -317 -148 -184 -72 349 173 123 -83 -198 -324 91 25 232 36 -34 -262 -316 92 190 136 -41
5981 -41 -61 -272 -90 57 194 136 94 -1 21 -5 121 -71 -10 152 -152 -259 -125 59 24 40 312 -53 -45 -62
6005 -62 -280 65 209 189 -90 -397 -211 -199 17 208 448 -131 -104 -19 -198 115 -83 227 -35 -256 -487 106
6027A06j35N3K40j11r9k62K08R3J62j58j3p2m16L09N9J04P8K69o14J25M9K85j62
6050I8M3P3l56o2R5J38P4o0j42k68kK24J57o9K78K3k63r1K36N1j66K23j16k47
6074a29K13J3J1j46K14l06K75p8k84J26Q9K27m03N5J70q5P9K33k36J56m15J79
6096d2k13K28K93l11K22j19k44k3L52j98L90m65n6J15J15k06K49o0J03k23j20
6117b13K43K1j66L26j17J6j80k24M09q3K18k39k2J61k43J20J44K18k42K1j75j73
6139a80J77j92L57Q7j10j62k09J25K77Q3j40m1j13J50r6J3K7N7J73k03k28j88
6161c36L22J23Q3q2k37K08l74N12j55K52k84J1r7R3k27K94R6J52n44J11k65N6
6183b88P32k06R9m61J74k91L86k43J38J93j18k54k03J86L32M0k22j65N1k2k7K75
$$ plain form
6027 106 -29 24 264 153 54 -208 0 93 255 97 84 12 -404 -95 -36 68 146 415 -199 -74 -25 260 98
6050 98 141 214 -142 -204 -109 29 103 43 -99 -367 -369 -145 12 -57 221 244 -19 -110 126 177 11 234 118 -129
6074 -129 84 97 108 -38 176 -130 145 67 -217 -91 -2 225 -178 -123 47 -38 41 274 38 194 -221 -42
6096 -42 -255 -27 266 -45 177 58 -186 -209 143 -55 335 -130 -186 -71 44 -162 87 27 130 -93 -213
6117 -213 30 51 -115 211 94 110 -70 -294 115 32 250 11 -11 150 -93 27 171 389 147 168 -7 -180
6139 -180 -3 -195 162 249 139 -23 -232 -107 170 253 113 72 -41 109 13 26 53 110 283 80 -148 -336
6161 -336 -14 109 192 110 -127 81 -293 219 64 316 32 43 -54 39 -188 106 202 354 -190 -79 -344 -288
6183 -288 444 238 337 -124 50 -241 145 -98 40 233 115 -139 -342 -156 176 216 -6 -171 -120 -142 -169 106
6205A06J6n2j46q0o7L2K79j71L1J01j2q3r4J59k06L75r5q0j32N1j1J71o4p2j06
6230a50M6rJ04R0L73k17j72k11O8K5O3J37K7j5j60k5j92J60K99l30k01L66l19
6253b43J11K38J82j74l71K42LJ38j98l3L99k68k00k4j06J51L82k12k5j93q5M48
6275A62k86J18Q5K5k8j73L5K26L48o73J50j58O6K24j03R4O0j10l87K53K27q4q
6298F3k08K83j31j04j5k2k3K29k7k62RJK87J09r9n3j27Q5j34l6K07J43k53M5j63
6323a96J00R2M5qj37m9J39m0J00K92l18L21m87p1K11j22M00j70N9%j45j72K62
6346A06j24l1L8Ko3Q3m3Q9K29j34j91o9O4K03k85K75n1o7j58L1J76k24N03o7j46
6371A46l21nK96j52K92jk54j16K49j0j42R1j1k73N21o00O8K02N2K71k07k88j83
$$ plain form
6205 106 122 70 -76 -156 -223 -191 88 -83 -52 49 37 -46 -140 19 -187 188 93 13 -119 -68 -79 92 28 -44 -150
6230 -150 -104 -113 -9 81 454 237 65 -146 -78 -53 10 147 174 159 -1 -26 -218 -58 241 -89 -290 76 -243
6253 -243 -132 106 288 114 -257 -15 -12 126 -72 -105 294 26 -174 -198 -304 -153 229 17 -8 -201 -286 162
6275 162 -124 -6 79 104 76 -97 -62 164 512 -161 -11 -169 -103 121 18 112 172 62 -325 -72 155 71 63
6298 63 -145 138 7 -97 -112 -134 -157 72 45 -217 -208 -207 80 189 90 37 -90 -5 -139 -175 32 175 -78 -33 -196
6323 -196 -96 -4 41 33 -104 -153 -14 -54 46 338 20 341 -146 -217 -6 -128 272 102 161 161 16 -156 106
6346 106 -18 -49 -11 -9 -72 11 -32 57 286 152 -39 -108 -44 159 -126 149 98 31 -127 -96 80 -144 359 292 146
6371 146 -175 -180 116 -36 256 255 1 -115 134 124 -18 73 62 -211 310 -290 -222 -20 32 303 96 -192 -375
6394c75L47OQ8J12q3r8k7J0j18J70p2J04j03k59K2J26O9J48K26k95j35L2K46p7
6418F4k01j14L84m18K34L3K24O2k15o8M6j84K57Q8l43K57q5j2o1Q4J89K1j32J04
6442B14l98K80k03K89j14P9j85p6L5J18J08N2k20j28K00j80K46q3J54j12M4j16
6464Dl6O9Q5l42L69O6k19m4K7L27j54j48M1j46J67k48kJ89j3j07M9q3r8pJ59L69
6490B74l73K45k26J20m1J6j37J05K2m2k2j15MK5J39J72k73O3R4k19K24K09k47
6513A7j44q6K01J9J02j11j0k45L25j89J36m7J57o9k28L1P6Q0o0J48k91K7k7L12
6537A24l04K92k1l41L15j56K60m2j14kL3j82k5j02M15p6P6J37m94P9r8L65q1P3
6561A31k01r3J01l25M51J14p3j16k6J61k44j64K89o4J53k90J24J48k4l3j06K49
$$ plain form
6394 -375 -28 -22 66 178 95 -3 -30 -20 -138 32 -40 64 -39 -298 -276 -150 -81 67 293 -2 -137 -105 141 64
6418 64 -137 -251 133 -285 -51 -18 206 268 53 -15 31 -153 104 192 -151 106 21 9 -52 32 221 242 110 214
6442 214 -184 96 -107 182 68 147 -38 -114 -79 39 147 199 -21 -149 51 -129 117 34 188 76 120 4
6464 4 -32 37 122 -220 149 215 -4 -48 -21 306 152 4 45 -101 66 -182 -184 5 -8 -115 -66 -149 -247 -254 -95 274
6490 274 -99 146 -80 40 -1 15 -122 -17 5 -37 -59 -174 -170 -145 -6 166 -107 -44 50 -169 55 264 17
6513 17 -127 -213 -12 7 109 -2 -12 -257 68 -121 15 -32 125 56 -172 -141 -65 15 -45 103 -188 -161 -188 124
6537 124 -180 112 91 -250 65 -91 169 127 13 11 44 -138 -163 -265 150 74 150 287 -207 -128 -226 139 58 131
6561 131 -70 -163 -62 -387 64 178 105 -11 -37 124 -120 -284 5 -59 94 -196 -72 76 52 19 -87 162
6583A62l8j53kp8L48k70J20j49l1R9J56KJ39j90j99J13k19P3M4L36k8j44k7Qk48
6608a76O4K6N5o1J37l68M67j71K52n3j76q6M0o7K80Qk9k37k4K17j97R2J41J29
6632B63l97K74l12j11M66l02L54k25k71K36k78K03q2K29J91l36R6j76j14L54J8
6653H0k69J68j03j37J86q9K27j55L17j53l7k32K94J48m13K08j40l7K07j19l3r6
6675a78M11k83Q5Q0J78j66P8j76j53M6Nl8M48l12j12J09k03J19K09N1j22k78R0
6698a12K29j52J49r0L6j35J59m20O3J82Rj06J51n7j23K15K12k24O2l42J84l9K25
6721G6j14L01l42j63R4M6M9p9L51j74N8j80j49k3J94Kl1J09l5p7k43L55o2n7K73
6746A79k19N9l2L1p1K32l10L95n15K18K86l56J71R3m54OK27J13J85rl16j4j3K18
$$ plain form
6583 162 124 -29 -31 -109 239 -31 89 -60 -91 8 164 166 305 115 -84 29 -190 -117 -73 263 235 91 64 72 -176
6608 -176 -112 -86 -31 -92 45 -323 144 -27 225 172 -4 -90 -50 -117 163 171 142 -95 -119 98 -99 -7 134 263
6632 263 -134 140 -172 -283 183 -119 235 10 -261 -25 -303 -100 -182 47 238 -98 -2 -178 -292 62 80
6653 80 -189 -21 -124 -261 -75 -164 63 -92 225 72 35 -197 97 245 -168 40 -100 -137 70 -49 -82 -178
6675 -178 233 -50 35 115 293 127 205 29 -124 -78 -73 -111 337 25 -87 22 -181 -62 147 198 76 -202 -112
6698 -112 117 -35 114 24 60 -75 84 -336 -273 -91 -82 -188 -37 -94 -217 -2 210 -14 48 -294 -110 -149 76
6721 76 -38 263 -79 -242 -148 -102 -53 -132 219 45 103 -77 -226 -249 -55 -53 -84 25 -10 -87 -330 25 -37 -94 179
6746 179 -40 19 -13 18 -53 179 -131 264 -251 -33 253 -103 68 161 -293 -287 -60 53 238 229 -87 -101 -114 104
6770A04m99M06K35j08j47p1J45o2l0Q0R4k01KJ48m2n6n7K00j36n3N3l46M37j55
6794e9K36J4l90L93m00J97J8P9j5k9K62n16J53Q2j13J22m9O3k04J69R8j15J58
6817A54n74K43Q1J29J13n7k4l84L11J43m37K93q0J00J22j69J25j08o5R6M9j19
6839e8P1p8J37j00j45RK92k79K57M6m8K15m57L26l86J14K41j95J70j66K20k20
6861c4J20k70J17L51l60J06o7o9j71K97jJ16j25o5N5m4J29j42J42r6J29k98J62
6884a8M5j80K57j68n3j40J52R4K41l04J39j30L11j18J7m3j40K09k61l4j15L24
6906H5O6j3j16j50O4L4o2J80j30O4k02mK19l11L68q7nl00J66J46N0o9j50o2L48
6931A29J3k79J77Q4L6j66j9J5Q5N3k65J32P7o2j54J34l71L54J58r1K5j52J05O6
$$ plain form
6770 104 -395 11 246 138 -9 -80 65 3 -27 53 147 -54 -52 96 54 -2 -59 141 5 -48 5 -341 96 -59
6794 -59 177 191 -199 194 -206 -9 9 88 73 44 306 -210 -57 25 -88 34 -15 48 -156 13 111 -4 154
6817 154 -420 -177 -96 33 146 89 65 -319 -8 135 -302 -9 -89 11 133 -36 89 -19 -84 12 61 -58
6839 -58 13 -65 72 -28 -173 -164 128 -151 106 152 104 319 -138 188 -198 -84 157 -38 132 -34 186 -34
6861 -34 86 -184 -67 284 -76 30 -37 -106 -277 20 19 135 10 -55 0 -44 85 -57 85 -11 118 -180 -18
6884 -18 27 -153 104 -64 -117 -257 -105 -11 230 -74 65 -65 246 128 145 102 -38 171 -90 -124 -239 85
6906 85 151 138 22 -128 -64 -30 -92 88 -42 22 -180 -184 35 -276 92 5 0 -300 -134 12 62 -7 -157 -219 129
6931 129 142 -137 40 124 160 -6 -25 -10 75 128 -137 -5 72 10 -144 -10 -381 -27 131 40 65 -87 18 84
6955H4l9J59q0P1l43l3j25K94K70n80M69k44P4M6o4K64k7k85P9r8j39L9N7J79
6979B8p5J2j07Q4O8K5K93j81l88J83K04n6j93J16J58k05q1N3J34j07M06j70l64
7002a63K04N3K7j46j77K72j32P9K04m61K70q8R7k72O6k6K14J59k56P8N3q1k43
7025b69J14L15P1K8k73Q0j13N0r0K81j4k97J87k85M21j78M5j72L7L8J9M4P3mO3
7050A71j80mk4J7J58K05l80mJ66k09L2k91N31l58R0k37J79Q2J50R1j35q8J26k92
7074b04R1n2L19l5l11R6P0K21l26K04Rk1j4k89J75k3M1j43K77r9lM4l04M65j11
7099G7j12j25R3K54j17r5l5L8N8l0o4p3J61k4j88L65k02j22J48PL3Ok65K42j61
7124a31P0J14n1K63m01L9K91j04k70J73M6J46k16k08J30J47r4j47R1J79J21l09
$$ plain form
6955 84 45 204 124 195 -148 -181 -306 -12 258 -322 147 -97 -23 23 -41 223 196 -89 -10 -108 -247 -208 -151 28
6979 28 -47 -35 -142 -58 10 35 328 147 -241 -58 146 90 -103 13 171 -34 -115 -62 72 -35 371 201 -163
7002 -163 41 94 121 -25 -202 70 -62 17 221 -240 30 -58 39 -233 -167 -193 21 180 -76 2 55 -26 -269
7025 -269 -155 160 231 259 -14 66 -47 3 -87 194 180 -117 70 -215 206 28 73 -99 -62 -24 -5 39 112 108 171
7050 171 -9 -13 -37 -20 138 343 -37 -41 125 -84 -52 -343 188 -170 -80 -317 -138 -56 94 185 50 -38 88 -204
7074 -204 -113 -165 154 119 -192 -96 -26 195 -131 73 82 61 47 -242 -67 -90 -49 -192 85 -14 -17 27 -277 188 77
7099 77 -35 -160 -67 187 70 -25 -60 -22 36 6 -58 -131 30 6 -182 183 -19 -141 7 14 47 53 -212 30 -131
7124 -131 -61 53 2 265 -136 -97 194 90 -180 -7 39 185 -31 -239 -109 38 -56 -203 -112 67 188 -121
7146a21l8M06k88p0Q3Lo7K34k24K65k16M3lj91J24N1J60j62J6M6o4K3Q3k28n0
7171a85K27Rk69n8K87J36j89J02j22L5K6K8O0L0j89J13q6k7P3J33j59J57k71J0
7195a29K2R6J10rJ36l19q2L20n3o3J88N6l81J78r6N2j0q6l1o2J18k51J15J19K22
7220A60l58K85j63R1M0j5j4l2n6M6j13R2J70k18K37q1K3l96J61K40o5o0j73L13
7244A14j92j32M02j53K30m29j12L07j2J50j37j67J29ok06K35K13j04K4j26k43
7265b15J80J84l04K94j90J95q2k34K77p5o9j26MJK28j85K21j68L87m11Q4J05N4
7288A55n3J68l12Q8j59n8p2o2L27J42l29J46P8p2j63J30J81k90Q6l1o1Q8K49r6
7312H0N2k3k70J80j46N09k23j0m89K68l0J33K8Q8k60N9j1L09p5k79J93%n5r6J20
$$ plain form
7146 -121 -159 247 -41 -111 -28 -25 -92 142 -82 183 -33 10 7 -184 -60 -9 151 -11 5 51 -13 10 93 -135 -185
7171 -185 42 51 -218 -276 11 147 -42 60 -62 -27 -1 27 87 117 -72 41 -45 -72 1 134 -25 132 -139 -129
7195 -129 -107 -11 99 90 226 -93 -175 145 92 29 217 273 -108 70 -26 26 16 -70 -101 -163 -45 -296 -181 -62 160
7220 160 -198 87 -76 15 55 40 26 -6 -62 -16 -129 -37 133 -85 152 71 94 -302 -141 99 34 -26 -199 114
7244 114 -78 -210 192 39 269 -160 -272 35 23 173 36 -131 -2 -8 -214 21 234 130 154 28 -215
7265 -215 -35 149 -155 139 -51 144 62 -172 105 30 -39 -165 -161 -160 68 -117 104 -64 323 -88 -4 101 155
7288 155 102 270 -42 46 -113 -171 -243 -305 22 164 -165 -19 59 -13 -176 -46 135 -155 -69 -100 -161 -73 176 80
7312 80 132 109 -161 19 -127 382 159 149 -340 -72 -102 31 59 147 -113 -54 -65 244 169 -110 83 83 28 -68 52
7337E2o8L0J37L9k53K26l67L32j21R9n3M2j65l0J06K19l31Q0r8J75l5K0J51M3
7361B30l39j27K4K48K98l75n8L4K10m27K46N0K52l39K36k35m8r1l1L88N5k79P
7384g1ok32M07j27J12Q8j31J6o5n2r5K06j87K35j98J76j23k5J93p6K47m48R7K17
7408A58j58o3K5K78n99K03K57j46K39Pj27k94R4oN2J23J41k59J40j40L6j06L83
7431B38l96J22k9J42oj21N4J24O1n1j13j67k4L16q5N5l56J17J74m3j34J67l07
7454b62L49p0j27m3n5K18nM2k43J51Q3l4j10J81o8j65L9J02k70K09L61l59j11
7477a87J55k37J49J07L25m75l8O2N2p5J25K5J99l48NJ41L8J47l70J45L6j28J72
7500B5j93K57oQ2l16O7n0o4L18m5L4l10K32r5M2p2J80J08l54L17J03l13J48LK25
$$ plain form
7337 52 -16 14 151 190 -63 163 -204 128 7 106 53 95 -70 -100 6 225 -106 -26 -124 51 16 36 187 230
7361 230 -109 -236 -212 36 334 -41 -99 -65 145 -282 -36 14 266 -73 163 -72 -120 -211 -242 146 201 -78 -71
7384 -71 -77 -309 98 -29 83 171 40 56 -9 -61 -156 50 -137 98 -100 76 -47 -72 121 45 292 -156 -59 158
7408 158 0 -63 -38 240 -359 -156 101 -45 194 201 74 -220 -126 -132 -80 43 184 -75 65 -75 -39 -145 238
7431 238 -158 -36 -65 77 71 -50 4 128 189 138 25 -142 -166 150 65 120 -236 -119 55 12 -122 45 -262
7454 -262 87 17 -110 -153 -208 10 5 47 -196 -45 38 4 -106 75 7 -158 -119 -17 -287 -78 283 -76 -187
7477 -187 -32 -269 -120 -13 312 -163 -201 -139 -87 -162 -37 -12 187 -161 -156 -15 23 170 -200 -55 -19 -147 25
7500 25 -168 89 83 165 -151 -84 -134 -198 120 75 109 -201 31 -64 -22 -94 86 194 -160 157 260 -53 95 98 323
7525C23k79j81J6J31J02j13j6O8k22J56Q3L2k79J36Q9J22l47O8K29NN8j09j00
7548b8m2NRJK27m73K09m9K3P2L31m5j80kq1M1L3j13K98r9l00J75n2j4n5J11J83
7575A85j41q2j55M2L19l41m4J55k03J86L7K76j37k10q0j89N79j24K12k38j41K16
7597A22k18Q3j58J16J94j88k82J72K04P6o3K6l2k51J3J06K0L34j11Kj03j46J24
7620D0q6n2J88k9J69m98K10O2j51K55j56R9l05KK09%K30j57j88k47O2J50mL09
7644A12l8j21l4J57m52L74j08J97J91m24K09j22R6l5J25Q7l03l3P0j1m2J62K6
7667H3J6lk28R8L32l12M0M2j67J85j51L39l36K48k00n0j24J31n6J51j53J81m0
7690B6j5l23L86j01R8J1l2O5j06n3q3L00j56k7K08j11r3k35L58j59K7j98K22J27
$$ plain form
7525 323 44 -137 -121 10 112 -1 -17 51 -171 -15 68 100 -179 -43 46 168 -179 -111 118 123 181 72 -28
7548 -28 -70 -65 -56 -55 172 -301 -92 -141 -118 -46 285 240 60 58 -23 18 51 -62 236 137 -163 12 -40 -54 -109 2 185
7575 185 44 -38 -193 -151 168 -173 -217 -62 -265 -79 -42 234 97 -113 -193 -382 197 73 285 47 -94 122
7597 122 -96 -13 -171 -55 139 -49 -331 -159 45 121 58 84 52 -199 -186 -80 -60 274 163 165 62 -84 40
7620 40 -46 -98 90 61 230 -268 -58 4 -147 108 -48 51 -254 -252 -43 -43 187 30 -158 -405 -343 -193 -197 112
7644 112 74 -47 -81 76 -376 -2 -110 87 278 -146 63 -59 37 2 127 214 -89 -122 -52 -63 -105 57 83
7667 83 99 96 -132 -34 298 -14 26 68 -99 86 -65 274 -62 186 -14 -64 -188 -57 -113 38 -115 66 26
7690 26 11 -312 74 -27 71 82 50 115 9 -44 -127 173 17 -10 198 87 -6 -241 117 -42 -15 -213 9 136
7714A36n1j7r8k5L9j52L5l1M92n02J21J45k32l3K13J95j76j97j17K03K72j73J07
7737A54k41k0K33l36K49K11j52k55K66j25l22N45j91l7P5j22J9J44j77J46O2p
7759A19k64J59m7N3J53K5m47j1K65j83L88j82J03q6j01J6J90j71J05L5J8n3r4
7782a0M3R1r1M5m05K86p9q4J0J15J71rJ14k17m8j11R4n3J75O6k64J85Rl8Q1j5
7808F1o8q1J24j34K27k23K34Lj72J79j82M2K6L46n49K38j86M42j96k3J17l04R0
7831A1JN6j46J84J44m1m06L25j10j12L02k89J83m06K22J24P9qk2j15r3l17K02
7854b32L16M2rk7l34K41j98K45J36j17n3k93J18J09M4r3j4jL60l94O5J52k35L93
7878B21l27L6oo1m7r5L58o7j62jR2k71K25N3R9ok92M7R3J11j24j10K39j38J32
$$ plain form
7714 136 85 68 -30 -55 -16 -168 -133 -164 328 -174 -53 92 -140 -173 40 235 59 -138 -255 -52 220 47 154
7737 154 -87 -107 126 -210 39 250 98 -157 109 -16 -338 207 16 -21 54 -68 -49 95 -82 64 126 119
7759 119 -145 14 -33 20 173 198 -249 -260 5 -178 210 28 131 45 -56 -40 150 -21 84 119 137 84 -10
7782 -10 33 124 33 78 -327 -41 -120 -204 -194 -79 92 83 197 -20 -68 -179 -85 -138 37 103 -161 24 33 -5 76 61
7808 61 -7 -88 36 -98 129 -94 140 143 -29 150 -32 10 36 382 -167 71 -115 327 131 108 225 -79 11
7831 11 12 68 -78 106 250 209 -197 128 18 -94 208 -81 102 -304 -82 42 121 113 91 -24 -117 -434 -232
7854 -232 84 126 117 90 -244 -3 -201 44 180 63 10 -283 -165 -56 -12 -105 -119 -120 240 -154 -89 63 -172 221
7878 221 -106 -70 -76 -137 -184 -279 79 12 -150 -151 -59 -330 -105 -52 47 41 -251 -204 -111 0 -124 -234 5 -133 -1
7903aK6J21m7j85K22R3m13J10R7j06N41m09Q4j43j52L51j38J34j68N3k55J16j7
7926h6J25j44K18j31l8J51k49R5J36q6J4k2J75j76k58L32l9J70k39j1q1K33K8
7949A17J18k64j7J1k0o5K41pm3O4j52j34M1L2J62l03m7K90k09J33J01K0O9K01
7973C39l68l8J19l9R6j66k40J90k28K80J51k1j88j23J48J81j44J33K08j72j14
7994DP0n1j43R3J52j31L0L23k84j67M8L63m04j08J15k15J99J39J32k08%J25k61
8017a79P2r3K35R9j03k43N18k60n7k11j6M07k82nJ08j54J78j47J91p3k49L84J7
8040A37j52Q1n8j03K78k46M13l15k3J48k06J76j55j8J23L4r6n1Q6J28j08j27q6
8063a40K51k17L70m25M2Q0K64j82l54N8L13Po9L9k11K97j90n4J4r4L23Q0k76J92
$$ plain form
7903 -1 25 146 99 -86 136 229 -184 -74 23 -83 458 49 133 -10 -162 189 51 185 17 70 -185 -69 -86
7926 -86 39 -105 113 -18 -56 95 -154 -59 77 -9 5 -17 158 -18 -276 56 17 187 -52 -63 -144 89 117
7949 117 235 -29 -46 -35 -55 -120 121 114 71 135 -17 -151 -110 -78 84 -219 -266 24 -185 -52 49 69 138 339
7973 339 -29 -67 52 13 109 -57 -297 -107 -335 -55 96 75 -113 -236 -88 93 -51 82 290 118 4
7994 4 74 23 -120 -27 125 -6 24 347 63 -104 -56 307 -97 -205 -90 -305 -106 33 165 -43 -43 82 -179
8017 -179 -107 -200 35 134 31 -212 306 46 -11 -222 -238 169 -113 -118 -10 -164 14 -133 58 -15 -264 120 137
8040 137 -15 66 8 -95 183 -63 350 35 12 160 -46 130 -25 -43 80 114 18 -33 53 181 73 -54 -140
8063 -140 111 -106 264 -161 -119 -39 225 43 -311 -253 60 67 -2 37 -174 123 -67 -121 -107 -201 122 202 -74 118
8087A18l94lM16k9r4L2j91O4J29n0J3j54J48r6K44k53J43j55K79Ml09K13j34N1
8111hn9K11o3l2m06M51k19P4K54o7k72o3J04j13K37J36j55q1L5o0J15P0N1k76
8135a36Q8K8j02K05J02l8p0k13J20l3K45k89J29j7k04K18n8L5Qn4J91l30M49l50
8159g6n1K81m22K49j7L1J7KK4j62LK24k67r1L88j99J70K5j02m2M1R2m4n8j30K01
8185H7J48j44l15M01m3k62
$$ plain form
8087 118 -276 -279 137 108 14 46 -145 -81 48 -2 11 -143 5 -91 153 -100 43 -112 167 171 -138 75 -59 -8
8111 -8 -67 144 81 49 -357 94 -125 -51 203 136 -136 -199 -95 -208 29 165 10 -71 -36 -96 19 89 140 -136
8135 -136 -48 -20 -122 83 185 147 77 -136 -16 -49 196 -93 36 19 -185 33 -25 10 18 -36 155 -175 274 -76
8159 -76 -127 154 -268 -19 -36 -5 12 14 38 -124 -121 103 -164 -255 133 -66 104 129 27 -15 26 118 74 16 -114 87
8185 87 235 91 -224 177 134 -128
8191a28
$$ Imaginary data points
##PAGE= N=2
##DATA TABLE= (X++(I..I)), XYDATA
0@%%%%%%%%%%%%%%%L2o4O4o4O4o5R7j28J29j61J93k25K57k90L36l68M18m83N48
34B90o17P13q04R00j009J114j243J393j546J712j902K097k312K550k810L097l411
51a788L759m144M573n047N583o194O889p694Q637r766J1143j2854J5063j8045
65i885K2299k8932M0815o8778K65170K14267k72002j52033j25332K6227K2336
76f5848J4457q6277r4945p6906K7281R3372J41953R9050L8953m0951n3049j1063
88a3973R2882J47802J16231j2456j29459j80968j21888j6965N5161K6427n3222
99i0428j10464q0961J3335J16452J55945J19907L5171m3684p8814m7352K3335
110A2442Q1409Q2161K1678o9301j26623j02573j2369O6863O8232m521r1101j13755
$$ plain form
0 0 0 0 0 0 0 0 0 0 0 0 0 0 0 0 0 32 -32 32 -32 32 -33 64 -64 65 -96 97 -128 129 -161 175 -193 225 -258 290
34 290 -327 386 -418 482 -527 587 -656 737 -809 903 -999 1098 -1214 1336 -1474 1623 -1788
51 -1788 1971 -2173 2400 -2647 2936 -3258 3631 -4063 4574 -5192 5951 -6903 8160 -9885
65 -9885 12414 -16518 24297 -44481 220689 434956 162954 10921 -114411 -88184 -65848
76 -65848 -51391 -137668 -232613 -309519 -282238 -188866 -46913 52137 91090 50139 -2910 -13973
88 -13973 78909 226711 342942 330486 201027 20059 -101829 -118794 -63633 -37206 -90428
99 -90428 -200892 -281853 -268518 -152066 3879 123786 158957 115273 36459 -10893 12442
110 12442 93851 176012 197690 128389 1766 -100807 -113176 -46313 21919 17398 -73703 -187458
122a87458m2856P2090J47251J35399N0629m5863q9629o2874k252M4455N1270J4605
134H4767m3717q1576o3536K073P3358R8985N1608m3570j13643r9102j0578Q7818
146e7113J19433O2384l3358q9551p1479o506N3453O4734K0893m1393p2383n2787
158a03673M824P0071J04188P8882K900p7362j06091o4820J7911P4710N9256j3007
170D7789q0219q5460k0572O5750J00919N9520j9029p2747o9575j5823N2134R0074
182E2761P6959K0845m3590q1458o8394j4277L8993M8156K539o3925r2573m7361
194a71325M3861J10801J02801L1545n1531q4946m8747K3719P2456O7239J9378
205A15251l7896o6358n0312p014L5002M6650J4901m4762q6373o9740n00P6898
$$ plain form
122 -187458 -230314 -158224 -10973 124426 175055 129192 39563 -23311 -25563 18892 70162 84767
134 84767 41050 -40526 -104062 -101989 -28631 70354 121962 78392 -35251 -134353 -144931 -57113
146 -57113 62320 124704 91346 1795 -69684 -76190 -22737 41997 62890 21497 -50886 -103673
158 -103673 -98849 -28778 75410 154292 157192 79830 -26261 -91081 -73170 1540 60796 47789
170 47789 -32430 -117890 -138462 -72712 28207 87727 68698 -4049 -73624 -89447 -37313 52761
182 52761 129720 150565 106975 25517 -42877 -57154 -18161 29995 32534 -31391 -123964 -171325
194 -171325 -127464 -16663 86138 117683 66152 -18794 -67541 -43822 28634 95873 115251
205 115251 77355 10997 -39315 -46329 -11327 35323 50224 5462 -80911 -150651 -151151 -74253
217g4253J09967P1864j1101p1913o5208m861N5920O9515K6323l9054p4199n6407
229f3407l124M7662O2403L0743k7990p0864p3611l1843L3891Q0640P3296J8405
241G6201m2680o0991k4386M0309P6526M9179k1579p9246q0668k5876M3535P5242
253B5566M9807p217n5517o7951l9077J3350N2583N4892K1214k5779n0950l1384
265f0463K5020P2365P0144J3843n8669r2400o0098J1844O6271O4563J4605m3488
277B3537o5526l8203J4009M8806M8605J7214k5730m9632l6305Q889N6575P3038
289G5277M0540k4779p6147p3705k1626M0443O3606L2148k8116o2984m6160P113
301g4390N4648O3122K8712k4189n5966m7163p087L8970O2271M5523k831m9585
$$ plain form
217 -74253 35714 107578 96477 24564 -40644 -45505 10415 79930 106253 67199 -7000 -63407
229 -63407 -66531 -18869 43534 74277 46287 -24577 -98188 -130031 -96140 -15500 57796 76201
241 76201 33521 -27470 -51856 -11547 64979 114158 92579 13333 -67335 -93211 -49676 25566
253 25566 75373 68156 12639 -55312 -94389 -81039 -28456 26436 47650 21871 -29079 -60463
265 -60463 -35443 36922 107066 120909 62240 -30160 -90258 -78414 -12143 52420 67025 23537
277 23537 -41989 -80192 -66183 -17377 31228 48442 22712 -26920 -63225 -54336 2239 75277
289 75277 115817 91038 14891 -58814 -80440 -39997 23609 55757 27641 -35343 -81503 -74390
301 -74390 -19742 43380 72092 47903 -8063 -55226 -62313 -23343 38928 84451 81620 32035
313C2035o2721l4680J8095N3759M1098r303n5175n8491j4621M6167P5303N1572
325H3038o892n2781n8593k4272K4654N2168M0865K828l6014n1248l1258J1592
337d5913M5501M4097O882l9480o1236l6686K0055O5446O5184K0542l5486o1655
349a2749l8943J1335M7185M3220O720l5382n2358l1666J0089M3058M6391J9859
361E6759k3711n2786m5484l763M2537O1455L7202j5129n2564m6702l860M0101
373e945N1080J9850k9862n8053m3491j279M0018N2019K9006j1594m1620m2003
385d1874j3564K5354M9097L8295j115l9974m8461j9983K7449N3105L6370j2580
397E2119n3436n5422j9290K8886N3880L9022k11l3400l9917j7346J9399M3239
$$ plain form
313 32035 -30686 -65366 -47271 6488 47586 38283 -16892 -75383 -90004 -43837 31466 83038
325 83038 76146 23365 -35228 -59500 -34846 17322 58187 61015 25001 -26247 -57505 -45913
337 -45913 -412 43685 50567 11087 -50149 -86835 -66780 -1334 63850 84392 48906 -12749
349 -12749 -51692 -40357 6828 50048 56768 21386 -30972 -62638 -52549 -9491 36900 56759
361 56759 33048 -19738 -65222 -68985 -26448 35007 72209 57080 4516 -42186 -46046 -5945
373 -5945 45135 64985 35123 -22930 -66421 -67700 -27682 24337 53343 41749 129 -41874
385 -41874 -55438 -30084 19013 57308 56193 16219 -32242 -52225 -24776 28329 64699 52119
397 52119 -1317 -56739 -76029 -47143 6737 45759 45548 12148 -27769 -45115 -25716 17523
409A7523L5649L754l2436m8110k9933J1328M4862M3225Q291l5281n5293l3957
421g0378J3342M8451M7625J3555k6851m3381k4333J4326M0942L8121R026k7987
433C2458m8415l6495q39L2816M2799K1648j7429m4150l7234n03L8127N0194K6838
446E9815j6197m4706l6517n61L4938M3734J8629k1710m6843m0396q963K6526M1253
459I002K6924n935l2613l4655r382K5748M6081L4299m420l9553m5215j8388K2157
472b5950M4038L0055q450m0276m3203j5476K2479M3375L2327J331k7552l5234
484b2536j7130J6291L8342L3112M201k9813m5569k9431Q683L8589L7877Q180k7868
497A2928m2879k2835J5528M2668L9282J0015k4924l9541k5468M934L0268L1254
$$ plain form
409 17523 53172 56926 24490 -23620 -53553 -42225 2637 45862 54153 18872 -36421 -70378
421 -70378 -57036 -8585 39040 52595 25744 -17637 -41970 -27644 13298 51419 60445 32458
433 32458 -15957 -52452 -53291 -20475 22324 43972 26543 -17607 -54841 -55344 -17217 32977 59815
446 59815 43618 -1088 -37605 -38166 -3228 40506 59135 37425 -9418 -49814 -58777 -32251 9002
459 9002 35926 29991 -2622 -37277 -46659 -20911 25170 59469 55049 15496 -29719 -48107 -25950
472 -25950 18088 48143 39693 -583 -43786 -59262 -36783 6592 38919 40250 12698 -22536
484 -22536 -39666 -23375 14967 48079 52280 22467 -23102 -52533 -43850 -5261 32616 40796 12928
497 12928 -29951 -52786 -37258 5410 44692 54707 29783 -9758 -35226 -30292 -24 31230
509C1230R263k2026m1186l1661Q12L2557M2256K2083j3315l6602k9002L265L4210
522A884M1693J8502j9412m2492l5948o208K2703L2198J5155j5150l5840l0858
534e3773k691K8951M3471L1295o77k8818l1719r973K1595L7084K2841j1947l9814
547E825m2657j7952J5590L5108K4752n631l0077l1243q085K3993M3644L5644P260
560E6171k2179l2688j8180J0314K8828K3319l573l3207m4183k7222Q478L5489
572a8633L3963P847k0241l2403j6037J6234L8710L6569J1494j8546l3467k3186
584a7696K573K3254K5082M983k4394m1484l0895K11K9721L7835K0195j0183k9757
597a0555k3091N058L0990L6259J5185j5176l4711k7973l590K1190K9316J3868
$$ plain form
509 31230 40493 18467 -22719 -54380 -53568 -21011 21245 43328 30013 -6589 -35591 -32326 1884
522 1884 43577 62079 42667 175 -35773 -41981 -19278 12920 28075 12925 -22915 -53773
534 -53773 -56464 -27513 15958 47253 46576 17758 -13961 -23934 -2339 34745 57586 45639 5825
547 5825 -36832 -54784 -39194 -4086 20666 15035 -15042 -46285 -54370 -30377 13267 48911 56171
560 56171 33992 1304 -16876 -6562 22266 45585 42012 8805 -35378 -62600 -54122 -18633
572 -18633 15330 23177 2936 -29467 -45504 -29270 9440 46009 57503 38957 5490 -17696
584 -17696 -15123 8131 33213 38196 13802 -27682 -58577 -58366 -28645 9190 29385 19202 -10555
597 -10555 -33646 -28588 2402 38661 53846 38670 3959 -24014 -27604 -6414 22902 36770
609C6770j4731l4771l1344q170K0803L5857K5461k368k6264k6525m947K2488L4507
622B6766K0419r039l2158l3247j1801J7860L2777K2643l342k6402l0695j4385
634d0604J3632L1066K4676O54k2657k8873j2910J4239L2457K7048J098k5508l5577
647b1259j9199J0431L0486K7653O197j9120k9855j7902Q185K7263K4990M389k0224
660A2035l1296j9542O780K8835L0876J1673j6081l1747k3208R76K3092K8906J2595
673C3894j3631k9512k1356K850K5046K8438J1273j5097l1412k5803k117K1923
685a5504L1191J7618p249k5740k4409n581J7502K7849J6255q938k7348k5121m325
698c3800K0627L2073K0599o034k7756k9444j0524J3929K6767J9258k148k1468
$$ plain form
609 36770 22039 -12732 -44076 -52246 -31443 4414 29875 27507 1243 -25282 -30229 -7741 26766
622 26766 47185 38146 5988 -27259 -39060 -21200 11577 34220 30878 4476 -26219 -40604
634 -40604 -26972 4094 28770 29424 6767 -22106 -35016 -20777 11680 38728 39826 14318 -21259
647 -21259 -40458 -30027 459 28112 34309 15189 -14666 -32568 -24383 2880 27870 32259 12035
660 12035 -19261 -38803 -32023 -3188 27688 39361 23280 -8467 -31675 -30699 -7607 21299 33894
673 33894 20263 -9249 -30605 -27755 -2709 25729 37002 21905 -9507 -35310 -37427 -15504
685 -15504 15687 33305 26056 316 -24093 -29674 -12172 15677 31932 22994 -4354 -29475 -33800
698 -33800 -13173 18900 39499 33465 5709 -23735 -34259 -20330 6437 25695 23547 2079
710B079k4911r689J3833K8274K0529j886k2933k7990j2860J3625L0970K6416L521
723C8978k0902k8546j6650O042K1931J9330R67j9150k7461j3582J0925K8268K6723
736B6873P748j5773k7954j8735N089K4577K5797Q801j3850k7067k0614Q24J8873
749e411K1432O067j6586k7969j8827M649K5469L1199J7381p456k4285k1118k249
762a7704J6762K3038J0626j1557k6412k2879m320J7188K4973J2977q806k4376
774a0490k3378l839J9078L1163K2073q41j9394k1348p499J1229K1132J1963q620
787B1229k5605k6541r804J3592K6871K1237J378j7822k3678j0516J1675K6388
799H404K1726K635j6358k3090j1564P888K0907J6275k565k2038k8376j5941P064
$$ plain form
710 2079 -22832 -32521 -18688 9586 30115 28229 5296 -22694 -35554 -21929 9041 35457 38978
723 38978 18076 -10470 -27120 -21078 853 20183 21150 2000 -25461 -39043 -28118 150 26873
736 26873 34621 18848 -9106 -27841 -22752 1825 27622 36423 22573 -4494 -25108 -24284 -5411
749 -5411 16021 22088 5502 -22467 -41294 -36645 -11176 20023 37404 29948 5663 -15455 -17704
762 -17704 -942 22096 32722 21165 -5247 -28126 -32446 -15258 9715 22692 13886 -10490
774 -10490 -33868 -37707 -18629 12534 34607 33766 14372 -6976 -14475 -3246 17886 29849 21229
787 21229 -4376 -30917 -40721 -27129 -258 20979 22357 4535 -19143 -29659 -17984 8404
799 8404 30130 32765 16407 -6683 -18247 -10359 10548 26823 24258 2220 -26156 -42097 -35033
812c5033K4790K5467R774j0629k1015j3603O485K0922K0428M905j4873k5759j6996
825b5137L515K0431K1213O142j4799k5660k0029K73J9095K5134J3800o179j8538
838g39j4947J438J7718K1420Q303j2430k6638k1715l290J6425K3851J4417n478
851A8335k0684k0033m783J3870K2943J3864m296j8024j8199l541J4759K3497J3909
864C1617o527k2844k4477r752J0001K2371J8101Q50j4900j9214p148J0482K1076
877I636J5632j531j8036k2574j0351J0109K3135J8667J700j5992k3195j3997N028
890b1769J8560J8272M564j1883j9399j0211P173K0364J8987L982j5094k4508j6129
903b7091K989J8113K0985Q307r625j9874j4387J523J5540J8528O998j0290k0212
$$ plain form
812 -35033 -10243 15224 24998 14369 -6646 -20249 -13764 7158 27586 32491 17618 -8141 -25137
825 -25137 -21622 -1191 20022 26164 11365 -14295 -34324 -34051 -14956 10178 23978 17799 -739
838 -739 -15686 -14248 3470 24890 33193 20763 -5875 -27590 -30880 -14455 9396 23813 18335
851 18335 -2349 -22382 -27165 -13295 9648 23512 19216 1192 -17007 -20548 -5789 17708 31617
864 31617 25090 2246 -22231 -31983 -21982 389 18490 19340 4440 -14774 -21922 -11440 9636
877 9636 25268 23737 5701 -16873 -27224 -17115 6020 24687 26387 10395 -12800 -26797 -21769
890 -21769 -3209 15063 19627 7744 -11655 -21866 -14693 5671 24658 28640 13546 -10962 -27091
903 -27091 -24102 -5989 14996 23303 13678 -6196 -20583 -19060 -3520 15008 22006 11716 -8496
916h496j4421J644J8162K2256J0179r024k2100j9052l829J2637J9715J1481n445
929A3707j7364j4926j500J4303K0239J0773o626j9942j9011n004J3295K2158J4559
942B4661k439j6877j9147p532Q659J7958J1986k725j6003j7017n752J1711K1533
955I016J5717l97j6122k1058j0520O770J8788J6051K483j2797j8447r622O795
968a3343J6723J4383R53j4307j9712j0805O644J9469J9124O027j0700j9101j3800
981a8445K129J4960J6175M834j0663j7955j1836L466J6052J7722O013j0534j9860
994g942j4936K18J4638J9682J0025n469j6640j4421p10J2463J6839P161p982j8138
1008e212j5485j324J3424J9479J1099m685j6751j7082m970R719J7923J1932k928
$$ plain form
916 -8496 -22917 -21273 -3111 19145 29324 20300 -1800 -20852 -24681 -12044 7671 19152 13707
929 13707 -3657 -18583 -20083 -5780 14459 25232 18606 -1336 -20347 -25351 -12056 10102 24661
942 24661 22222 5345 -13802 -21334 -12675 5283 17269 14544 -1459 -18476 -24228 -12517 9016
955 9016 24733 24336 8214 -12844 -23364 -16594 2194 18245 20728 7931 -10516 -20138 -13343
968 -13343 3380 17763 18716 4409 -15303 -26108 -19464 5 19129 25156 14456 -4645 -18445
981 -18445 -16316 -1356 14819 19653 8990 -8965 -20801 -17335 -1283 16439 22452 11918 -7942
994 -7942 -22878 -22660 -8022 11660 21685 16216 -424 -14845 -15555 -3092 13747 20908 12926 -5212
1008 -5212 -20697 -22021 -8597 10882 21981 17296 545 -16537 -21507 -11788 6135 18067 15139
1021A5139j4150j5071l555J1088J8054J1085m015j6562j8176p010Q572J8434J3977
1034A7810K51j3073j6503p914O363J6137J3248j07j2794j6439p117P852J8301
1047F015J4839K196j2736j9079j1234L261J4730J4761L559r838j6132r278M154
1060a4782J5191J5070L877j0384j7824j0968L247J5107J7413O987q159j6887j3649
1073a5761n17J1445J4595N669p448j6205j1479P78J3744J7840Q666o502j6354
1086a529j4134k246J1258J7039R441m485j4533j4027l544R003J5323Q673m551
1099A1688j5035j4703l293J0876J8198J2297j441j3414j5349o235P118J5014J0485
1112A6206j493j2230j4783o077O970J5523J2378l7j2662j6468p623O315J5821
$$ plain form
1021 15139 989 -14082 -17637 -6549 11505 22590 18575 2013 -16163 -23173 -14601 3833 17810
1034 17810 18061 4988 -11515 -19429 -13066 3071 16319 16212 3418 -13021 -20138 -12286 6015
1047 6015 20854 23050 10314 -8765 -19999 -16738 -2008 12753 16312 6474 -9658 -18936 -14782
1060 -14782 409 15479 19356 8972 -8852 -19820 -16573 -1466 15947 22934 14775 -2112 -15761
1073 -15761 -16278 -4833 9762 15431 7983 -8222 -19701 -18923 -5179 12661 21327 14825 -1529
1086 -1529 -15663 -17909 -6651 10388 19829 15344 811 -13216 -16760 -7757 7566 16239 11688
1099 11688 -3347 -18050 -21343 -10467 7731 20028 18587 5173 -10176 -16411 -9293 5721 16206
1112 16206 14713 2483 -12300 -18377 -11407 4116 16494 16457 3795 -12673 -20296 -13981 1840
1125A840J3818K684r867j5342q744L979J3432J2099J774j0457j5608r056M510
1138a4938J4831J4817M571q769j5687j0971J291J2490J4355M872p957j4701j0459
1151a6255J423J2157J4482N547p599j5129j1481K11J2120J5589Q228m831j4313
1164A49j2707k112R315J3427O858n365j3994j2356j826J0517J6390R053k887j2863
1178A599j3623l453Q586J4754J0077k291j2683j3516n237P188J2891Q823j952
1191A1163j2016j4010n337P662J5910J2297J292r779j3605o853N414J2963J0722
1204A5823M44j1048j4756p581M377J2651J1474J900r720j4332p745M174J3305
1217a034J3499N052p055j3323r121K409J1424J2069K595q767j4808r983J289J0870
$$ plain form
1125 1840 15658 18342 8475 -6867 -15611 -11632 1800 13899 15673 5216 -10392 -19448 -14938
1138 -14938 -107 14710 19281 10512 -5175 -16146 -14855 -2365 11990 16862 8905 -5796 -16255
1151 -16255 -14832 -2675 11807 17354 9755 -5374 -16855 -16644 -4524 11065 19293 14462 149
1164 149 -12558 -14670 -5355 8072 14930 9565 -4429 -16785 -18611 -8094 8296 17349 14462 1599
1178 1599 -12024 -15477 -6891 7863 17940 15649 2966 -10550 -15787 -8599 4292 13115 11163
1191 11163 -853 -14863 -20200 -12538 3372 15669 16961 7182 -6423 -13276 -7862 5101 15823
1204 15823 16267 5219 -9537 -17118 -12741 -90 11384 13284 3564 -10768 -18513 -14339 -1034
1217 -1034 12465 17517 10462 -2861 -11982 -9573 1851 13920 16515 7748 -7060 -17043 -15754 -4884
1231d884J3571N426o404j2914r828N73J0493J3806O959m727j2607j0537p15R307
1245b481J3015O261n784j3416j2534k220Q785J3613P957k672j1241j1315k666
1258a4698Q207J3189Q661k167j1264j1921m022P056J3144R133j840j1370j2965
1271a0857n218O067J2284R931N8r623j2231n700N921J2795R727O87r141j2403
1285g703o629M371J1915J1166J744q769j2732p472K972J0871J0938K815q188j2691
1299g392p574K546J1167J1990M050o774j2517q512J289J0723J1842M096o195j1985
1313c246r011k47R154J1678M991n300j1932r558n31Q840J2809O901m067j1402
1327i21j0106j197Q172J1895O542l488j1088j0725k744P114J1803P152k826r640
$$ plain form
1231 -4884 8687 14113 7709 -5205 -15033 -14460 -3967 9839 16798 12071 -536 -11073 -11788 -2481
1245 -2481 10534 16795 11011 -2405 -14939 -17159 -8374 5239 13196 10524 -717 -12032 -14698
1258 -14698 -6491 6698 15359 13192 1928 -9993 -14015 -6959 6185 15318 13478 2108 -10857
1271 -10857 -16075 -10008 2276 12207 12265 2642 -9589 -15289 -9368 3427 13154 13841 4700 -7703
1285 -7703 -14332 -9961 1954 13120 14864 6095 -6637 -14109 -11137 -266 10672 13487 5299 -7392
1299 -7392 -14966 -12420 -1253 10737 14787 8013 -4504 -13016 -11727 -1004 10838 14934 8739 -3246
1313 -3246 -12257 -12504 -3350 8328 13319 8019 -3913 -13471 -14002 -5162 7647 14548 10481 -921
1327 -921 -11027 -12224 -4052 7843 14385 10897 -191 -10916 -13660 -6546 5257 12409 9583 -57
1341e7j0741l946P102J2518Q439j314r524j1007m040N966J1486Q152p43r589j1601
1356h899n074N201J0596Q921R61q357j1513n429M433J1162R404J650p679j1566
1370f189o449L039J0671R758K271q052j1161o710K249R583J0509K971o285j0943
1384d738p496J872Q917J0858L898n657j0992q310M43Q397J0656M599m919j0498
1398b970q331l84Q439J0863N511m306j0522q851j175P216J0751O184l381r862
1412h18r355k067P067J0538O420k194r063r756k944O831J0852O910j841q884j0095
1427h399m172N294J0272P631r50q333r638l766M922R909Q355M25p979r989m854
1442a1272L680R958Q137J220p273j0763o021L195R276Q402J429o472r853n259
$$ plain form
1341 -57 -10798 -14744 -7642 4876 13315 12001 2477 -8530 -12570 -6604 4882 13034 12291 2702 -8899
1356 -8899 -13973 -8772 1824 10745 11706 3349 -8164 -13593 -9160 2002 11406 13056 5377 -6189
1370 -6189 -12638 -9599 1072 10830 13101 5049 -6112 -12822 -10573 -990 9519 12490 6205 -4738
1384 -4738 -12234 -10362 -1445 9413 13311 7654 -3338 -11648 -11205 -2808 7848 12447 7528 -2970
1398 -2970 -11301 -11685 -3246 7617 13128 8822 -1700 -10551 -11726 -4510 6241 12425 9044 -818
1412 -818 -10173 -12240 -5173 5365 11785 9591 528 -9228 -12172 -5341 5511 12421 10580 1696 -8399
1427 -8399 -12571 -7277 2995 10626 9676 1343 -8295 -12061 -7139 2770 11125 11550 3571 -6418 -11272
1442 -11272 -7592 2366 10503 11723 4450 -6313 -12334 -9139 137 8539 9968 3496 -6357 -11616
1456a1616K835R522R273K821o106j0171o647R88Q103R159L004n406j0068o902
1470a1211P87P744R220L845m608q917p416O41P888J0242M379l720q776q286j800
1485i988O282R457M638l589r186p943j378O161J0162N565k221q316q082j929N716
1500d651R967O382j158p981q971l242M544Q566N896j607p813r051l288M647R661
1515A901P143P31o553q826m063L639Q816P319Q38o464r203m916K680Q188P177
1530H407R16o841r551n056K426Q545Q293K870m781q325n376J838P283Q109K526
1545A1283n507r112o278M62P152Q515K885m442q895o777K59O959Q878M429l070
1560F741p304o715o2O299Q487L995l526q908q006j619N642Q623M744j777p604
$$ plain form
1456 -11616 -8781 741 10014 12835 6729 -3442 -10089 -9101 -998 8161 11165 5759 -4309 -11211
1470 -11211 -10424 -2680 6540 10385 5777 -3140 -10556 -9915 -2027 8215 12594 8874 98 -8188 -9988
1485 -9988 -3706 5751 10389 6800 -2386 -10329 -11707 -5546 4616 10181 7960 -356 -8438 -10367 -4651
1500 -4651 5316 11698 10540 2559 -6412 -9654 -5110 3456 9352 7745 -68 -9119 -12407 -7760 1901
1515 1901 9044 9775 3222 -5604 -9667 -6028 2788 10107 10945 4481 -4722 -9638 -6958 1230 8407
1530 8407 9323 2482 -7069 -12125 -9699 -1154 7139 10009 5228 -3097 -8473 -6635 648 8757 11283
1545 11283 5776 -3336 -9614 -9152 -2000 6515 9400 4958 -3937 -10714 -10455 -3496 5382 9811 6741
1560 6741 -563 -7278 -7340 -1041 7446 11441 7915 -993 -8999 -10618 -4976 3647 8391 6614 -990
1575i90p614j391N200Q608N510j347o798p596j984M983Q471N399j517p172q714
1590f952l906L796P772O511J5n714p652l047L869P974O427J83n875q355m113K988
1606f079P533O939Q79n729q381m873J701P122P101J889m766p653m133K033P081
1621F64P477K200m892q392n907O57O484P293L070l879p423n816K65O365P394L171
1637H731l298p430n752j41O116P836L606k728p435p080j667N048P296M291j799
1652E594o435o254p78N132P696M821k012o614p248k329M332P184N211r63o506
1667H31p419k785L655P273N260l62n512o759k487L909P653O359J44o174p427m330
$$ plain form
1575 -990 -8604 -9995 -4795 3813 9323 7976 1178 -6418 -8402 -3419 5052 10451 8934 1762 -6952
1590 -6952 -10858 -7062 710 7221 7236 1522 -6130 -9177 -5308 2666 9093 9276 3401 -4954 -9067 -6079
1606 -6079 1454 8393 9272 3543 -4838 -9711 -8010 -888 6213 8102 3336 -4317 -8450 -6417 664
1621 664 8141 10341 5449 -2943 -8850 -8193 -1709 5584 8654 4775 -2648 -8464 -8199 -1834 5560 8731
1637 8731 5433 -1997 -7749 -7890 -1774 6062 9668 6940 -495 -7575 -9242 -4194 3102 7393 5594
1652 5594 -841 -7095 -7873 -2741 4955 9776 7764 1150 -6098 -8427 -4095 3089 8300 7337 831
1667 831 -6588 -9373 -5718 1555 6815 6453 941 -5818 -8305 -4396 3257 9616 9760 3586 -3841 -8171
$$ [...]
8191a49
##END NTUPLES=NMR FID
##END=
