##TITLE=1H ikalashn
112-2024
19.12.2024
##JCAMPDX= 6.0         $$ Bruker NMR JCAMP-DX V2.0
##DATA TYPE= NMR FID
##DATA CLASS= NTUPLES
##ORIGIN= UXNMR, Bruker Analytische Messtechnik GmbH
##OWNER= root
$$ TOPSPIN		Version 1.3
$$ 2024-12-19 14:00:47.812 +0400  Irina@DPX200
$$ Compression mode = diff/dup
##.OBSERVE FREQUENCY= 200.131300845
##.OBSERVE NUCLEUS= ^1H
##.DELAY= (6, 6)
##.ACQUISITION MODE= SIMULTANEOUS
##.ACQUISITION SCHEME= undefined
##.AVERAGES= 32
##.DIGITISER RES= 18
##SPECTROMETER/DATA SYSTEM= spect
##.PULSE SEQUENCE= zg
##.SOLVENT NAME= CDCl3
##.SHIFT REFERENCE= INTERNAL, CDCl3, 1, 17.49637
##AUDIT TRAIL= $$ (NUMBER, WHEN, WHO, WHERE, WHAT)
$$ ##TITLE= Audit trail, TOPSPIN		Version 1.3
$$ ##JCAMPDX= 5.01
$$ ##ORIGIN= Bruker BioSpin GmbH
$$ ##OWNER= Irina
$$ $$ F:/spectra/data/iren/nmr/1H/4/audita.txt
$$ ##AUDIT TRAIL=  $$ (NUMBER, WHEN, WHO, WHERE, VERSION, WHAT)
(   1,<2024-12-19 13:58:50.921 +0400>,<Irina>,<DPX200>,<TOPSPIN 1.3>,
      <created by zg
	started at 2024-12-19 13:56:38.500 +0400,
	POWCHK disabled, PULCHK disabled
       configuration hash MD5:
       BE 6D 3F 07 2A EA 11 49 91 17 2B D3 AF B3 58 0D
       data hash MD5: 16K
       77 D5 88 40 D0 EC C9 EA D8 1A 75 8B 75 65 0B A0>)
$$ ##END=
$$ 
$$ $$ hash MD5
$$ $$ 3B 35 1F A8 08 2A BA 97 81 55 E2 7B 71 3D 5C 83
##$RELAX= 
##$RELAX= 
##$RELAX= 
##$RELAX= 
##$RELAX= 
##$RELAX= 
##$RELAX= 
##$RELAX= 
##$RELAX= 
$$ Bruker specific parameters
$$ --------------------------
##$DU= <F:/spectra>
##$EXPNO= 4
##$NAME= <1H>
##$PROCNO= 1
##$TYPE= <nmr>
##$USER= <iren>
##$AMP= (0..31)
100 100 100 100 100 100 100 100 100 100 100 100 100 100 100 100 100 100 
100 100 100 100 100 100 100 100 100 100 100 100 100 100 
##$ANAVPT= -1
##$AQSEQ= 0
##$AQ_mod= 1
##$AUNM= <au_zg>
##$AUTOPOS= <>
##$BF1= 200.13
##$BF2= 200.13
##$BF3= 200.13
##$BF4= 200.13
##$BF5= 200.13
##$BF6= 200.13
##$BF7= 200.13
##$BF8= 200.13
##$BYTORDA= 1
##$CFDGTYP= 0
##$CFRGTYP= 5
##$CHEMSTR= <none>
##$CNST= (0..63)
1 1 145 1 1 1 1 1 1 1 1 1 1 1 1 1 1 1 1 1 1 1 1 1 1 1 1 1 1 1 1 1 1 1 
1 1 1 1 1 1 1 1 1 1 1 1 1 1 1 1 1 1 1 1 1 1 1 1 1 1 1 1 1 1 
##$CPDPRG= <>
##$CPDPRG1= <>
##$CPDPRG2= <>
##$CPDPRG3= <>
##$CPDPRG4= <mlev>
##$CPDPRG5= <mlev>
##$CPDPRG6= <mlev>
##$CPDPRG7= <mlev>
##$CPDPRG8= <mlev>
##$CPDPRGB= <>
##$CPDPRGT= <>
##$D= (0..63)
0 2 0 0 0 0 0 0 0 0.06 0 0.03 0 0 0 0 0.0002 0 0 0 0 0 0 0 0 0 0 0 0 0 
0 0 0 0 0 0 0 0 0 0 0 0 0 0 0 0 0 0 0 0 0 0 0 0 0 0 0 0 0 0 0 0 0 0 
##$DATE= 1734602325
##$DBL= (0..7)
120 120 120 120 120 120 120 120 
##$DBP= (0..7)
150 150 150 150 150 150 150 150 
##$DBP07= 0
##$DBPNAM0= <>
##$DBPNAM1= <>
##$DBPNAM2= <>
##$DBPNAM3= <>
##$DBPNAM4= <>
##$DBPNAM5= <>
##$DBPNAM6= <>
##$DBPNAM7= <>
##$DBPOAL= (0..7)
0.5 0.5 0.5 0.5 0.5 0.5 0.5 0.5 
##$DBPOFFS= (0..7)
0 0 0 0 0 0 0 0 
##$DE= 6
##$DECBNUC= <off>
##$DECIM= 32
##$DECNUC= <off>
##$DECSTAT= 4
##$DIGMOD= 1
##$DIGTYP= 9
##$DL= (0..7)
0 120 120 120 120 120 120 120 
##$DP= (0..7)
150 150 150 150 150 150 150 150 
##$DP07= 0
##$DPNAME0= <>
$$ [...]
##$SW= 21.9926040160658
##$SWIBOX= (0..15)
0 0 2 0 0 0 0 0 0 0 0 0 0 0 0 0 
##$SW_h= 4401.40845070422
##$TD= 16384
##$TD0= 1
##$TE= 300
##$TE2= 300
##$TE3= 300
##$TEG= 300
##$TL= (0..7)
0 120 120 120 120 120 120 120 
##$TP= (0..7)
150 150 150 150 150 150 150 150 
##$TP07= 0
##$TPNAME0= <>
##$TPNAME1= <>
##$TPNAME2= <>
##$TPNAME3= <>
##$TPNAME4= <>
##$TPNAME5= <>
##$TPNAME6= <>
##$TPNAME7= <>
##$TPOAL= (0..7)
0.5 0.5 0.5 0.5 0.5 0.5 0.5 0.5 
##$TPOFFS= (0..7)
0 0 0 0 0 0 0 0 
##$TUNHIN= 0
##$TUNHOUT= 0
##$TUNXOUT= 0
##$USERA1= <user>
##$USERA2= <user>
##$USERA3= <user>
##$USERA4= <user>
##$USERA5= <user>
##$V9= 5
##$VALIST= <valist>
##$VCLIST= <CCCCCCCCCCCCCCC>
##$VD= 0
##$VDLIST= <DDDDDDDDDDDDDDD>
##$VPLIST= <PPPPPPPPPPPPPPP>
##$VTLIST= <TTTTTTTTTTTTTTT>
##$WBST= 1024
##$WBSW= 25
##$XGAIN= (0..3)
0 0 0 0 
##$XL= 0
##$YL= 0
##$YMAX_a= 437899
##$YMIN_a= -363275
##$ZGOPTNS= <>
##$ZL1= 120
##$ZL2= 120
##$ZL3= 120
##$ZL4= 120
##$ABSF1= 10
##$ABSF2= 0
##$ABSG= 5
##$ABSL= 3
##$ALPHA= 0
##$AQORDER= 0
##$ASSFAC= 0
##$ASSFACI= 0
##$ASSFACX= 0
##$ASSWID= 0
##$AUNMP= <proc_1d>
##$AXLEFT= 0
##$AXRIGHT= 0
##$AXTYPE= 0
##$AXUNIT= <>
##$AZFE= 0.1
##$AZFW= 0.1
##$BCFW= 1
##$BC_mod= 2
##$BYTORDP= 1
##$COROFFS= 0
##$CY= 7568.61572265625
##$DATMOD= 1
##$DC= 2
##$DFILT= <>
##$DTYPP= 0
##$F1P= 17.9538593292236
##$F2P= -4.03888763876832
##$FCOR= 0.5
##$FTSIZE= 32768
##$FT_mod= 4
##$GAMMA= 1
##$GB= 1
##$INTBC= 1
##$INTSCL= 1
##$ISEN= 128
##$LB= 0.02
##$LEV0= 0
##$LPBIN= 0
##$MAXI= 945.577
##$MC2= 0
##$MEAN= 0
##$ME_mod= 0
##$MI= -402.1523
##$NCOEF= 0
##$NC_proc= 0
##$NLEV= 6
##$NOISF1= 8.587773
##$NOISF2= 6.764455
##$NSP= 1
##$NTH_PI= 0
##$NZP= 0
##$OFFSET= 17.49637
##$PC= 1
##$PHC0= 91.05585
##$PHC1= 1.918411
##$PH_mod= 0
##$PKNL= yes
##$PPARMOD= 0
##$PPDIAG= 0
##$PPIPTYP= 0
##$PPMPNUM= 100
##$PPRESOL= 1
##$PSCAL= 0
##$PSIGN= 0
##$REVERSE= no
##$SF= 200.13
##$SI= 32768
##$SIGF1= 18.5376
##$SIGF2= -6.396296
##$SINO= 400
##$SIOLD= 32768
##$SREGLST= <1H.CDCl3>
##$SSB= 3
##$STSI= 0
##$STSR= 0
##$SW_p= 4401.40845070422
##$SYMM= 0
##$S_DEV= 0
##$TDeff= 0
##$TDoff= 0
##$TI= <>
##$TILT= no
##$TM1= 0
##$TM2= 0
##$TOPLEV= 0
##$USERP1= <user>
##$USERP2= <user>
##$USERP3= <user>
##$USERP4= <user>
##$USERP5= <user>
##$WDW= 1
##$XDIM= 8192
##$YMAX_p= 0
##$YMIN_p= 0
$$ End of Bruker specific parameters
$$ ---------------------------------
##NTUPLES= NMR FID
##VAR_NAME=  TIME,          FID/REAL,        FID/IMAG
##SYMBOL=    X,             R,               I
##VAR_TYPE=  INDEPENDENT,   DEPENDENT,       DEPENDENT
##VAR_FORM=  AFFN,          ASDF,            ASDF
##VAR_DIM=   8192,          8192,            8192
##UNITS=     SECONDS,       ARBITRARY UNITS, ARBITRARY UNITS
##FACTOR=    0.0002272,     1,               1
##FIRST=     0,             0,               0
##LAST=      1.8609952,     303,             -145
##MIN=       0,             -363275,         -363275
##MAX=       1.8609952,     437899,          437899
$$ Real data points
##PAGE= N=1
##DATA TABLE= (X++(R..R)), XYDATA
$$ [...]
$$ plain form
2207 -1171 -1647 -785 694 1847 1555 416 -1243 -1764 -1416 23 975 1149 492 -933 -1456 -1352 353
2224 353 1655 1852 1346 -486 -1523 -1620 129 1499 1646 464 -1387 -1954 -1500 -211 1199 1266 763 -776
2242 -776 -1374 -1149 26 1349 1666 1060 -115 -1270 -1423 -566 859 1361 661 -687 -1871 -2028 -475
2259 -475 988 1664 762 -482 -1288 -1045 -354 1021 1485 1067 -10 -1053 -1175 -525 353 969 1193 -239
2277 -239 -1195 -1739 -997 570 1661 1460 172 -972 -1234 -437 719 1604 1039 -124 -861 -1296 -558 250
2295 250 891 1045 397 -746 -1640 -932 38 1006 1358 685 -792 -1320 -1199 264 1458 1208 543 -678
2313 -678 -1003 -814 400 779 1016 404 -379 -980 -979 -371 862 1085 634 -639 -1479 -1200 -380 962 1067
2332 1067 853 -498 -1043 -810 132 1044 1067 523 -219 -881 -1114 -515 351 1029 596 -353 -803 -1192 -664 201
$$ packed form
2207a171m76Q62J479J153k92j139j659n21L48J439R52J74o57j425n23J04J705
2224C53J302J97n06j832j037r7J749J370J47j182j851n67M54J289J410O7n03j539
2242g76n98K25J175J323L17o06j175j155j53Q57J425N02p00j348j184j57J553
2259d75J463O76r02j244q06K43O91J375M64m18j077j043j22O50Q78O16K24j432
2277b39r56n44P42J567J091k01j288j144k62P97J156Q85n65j163p37m35P38Q08
2295B50O41J54o48j143q94P08R70R68L52o73j477n28J21J463J194k50o65j221
2313f78l25J89J214L79K37o12p83o01JO08J233K23m51j273q40K79Q20J342J05
2332A067k14j351n45K33R42R12K3n44p42o62k33N99Q66O78m33r49m50l89N28Q65
$$ plain form
2352 201 1141 819 83 -810 -1074 -264 907 1239 823 -288 -796 -896 -566 270 857 606 -70 -711 -876
2371 -876 -512 70 792 832 440 -474 -1039 -589 61 1013 1047 148 -884 -1400 -610 251 850 601 29 -820
2391 -820 -1021 -539 76 536 790 344 -486 -885 -783 -125 527 978 478 -204 -956 -641 331 676 919 257
2411 257 -533 -992 -762 -87 683 1054 127 -470 -919 -550 -23 428 805 810 139 -500 -577 -138 687 894 537
2432 537 -192 -980 -1012 -183 579 834 375 -183 -639 -410 35 512 454 604 37 -243 -784 -233 347 553 447
2453 447 101 -913 -1016 -500 -91 846 579 152 -269 -604 49 603 668 324 245 -381 -524 -124 -68 505 497
2474 497 162 -299 -785 -672 60 511 653 61 -189 -591 -644 220 842 679 243 -382 -602 -432 152 431
2494 431 437 -163 131 -595 -281 -350 254 909 319 -50 -494 -349 -191 392 709 688 -261 -508 -605 -40 418 418
$$ packed form
2352B01R40l22p36q93k64Q10J171L32m16j111n08j00L30Q36N87k51o76o41j65
2371h76L64N82P22M0l92r14n65M50O50R52L4q99j032n16P90Q61N99k49n72q49
2391h20k01M82O15M60K54m46q30l99J02O58O52M51n00o82p52L15R72L45K43o62
2411B57p90m59K30O75P70L71r27n97m49L69N27M51L77No71o39p7M39Q25K07l57
2432E37p29p88l2Q29P62K55m59n58m56K29M45M77n8J50n67k80n41N51N80K06j06
2453D47l46j014j03N16M09R37k67m27m21l35O53N54O5l44p9o26j43M00N6N73q
2474D97l35m61m86J13P32M51J42n92k50m02n3Q64O22j63m36o25k20J70N84K79
2494D31Oo00K94p26L14o9O04O55n90l69m44J45J58N83L17k1r49k47r7N65M58%
$$ plain form
2516 418 174 -219 -343 -547 -209 464 697 276 13 -180 -532 -239 230 554 561 -74 -548 -733 -322 404 514
2537 514 249 -147 -681 -341 141 257 488 437 120 -128 -171 -84 -84 359 264 -206 -331 -281 -346 96 396 311 -158
2560 -158 -267 -487 -56 408 171 348 179 -173 -185 -100 47 128 206 104 -213 -505 -357 -23 354 278 283 -200
2582 -200 -451 -262 47 315 383 65 22 -399 -279 8 91 51 -21 -128 -389 -454 -118 111 159 203 -205 -218 -364
2605 -364 96 299 90 79 -59 -430 -124 -143 87 87 -37 -301 -273 -442 48 336 277 255 280 -160 -14 11 230
2628 230 271 359 279 -171 -280 -255 -26 248 429 179 -315 -124 103 250 -7 158 178 -33 -289 7 148 -21
2650 -21 83 -17 -178 -505 -4 -226 -83 -37 -4 -303 -193 99 156 137 127 307 53 -141 -162 -64 114 15 -93
2673 -93 -147 -143 -157 29 385 28 184 -244 -375 -42 190 10 54 81 -31 31 69 -15 81 9 23 -131 -262 247
$$ packed form
2516D18k44l93j24k04L38O73K33m21k63j93l52K93M69L24Po35m74j85M11P26J10
2537E14k65l96n34L40M82J16K31n1l17k48m3Q7%M43r5m70j25N0o5M42L00q5m69
2560a58j09k20M31M64k37J77j69l52j2Q5J47Q1P8j02l17k92J48L34L77p6Nm83
2582b00k51J89L09K68O8l18m3m21J20K87Q3m0p2j07k61o5L36K29M8M4m08j3j46
2605c64M60K03k09j1j38l71L06j9K30%j24k64K8j69M90K88n9k2K5m40J46K5K19
2628B30M1Q8q0m50j09K5K29K74J81k50m94J91K27J47k57J65K0k11k56K96J41j69
2650b1J04j00j61l27N01k22J43M6L3k99J10K92N7j9j0J80k54j94k1R8J78r9j08
2673i3n4Mj4J86L56l57J56m28j31L33K32j80M4K7j12O2L8q4R6p2J4j54j31N09
$$ plain form
2697 247 76 8 158 -16 -94 -37 -174 64 -107 -139 144 -184 -30 34 117 -20 91 31 121 29 14 268 274 156
2721 156 11 126 -168 -85 72 17 -14 80 184 -63 -140 98 246 155 -90 -276 -95 -6 402 205 -48 -235
2743 -235 90 25 -419 236 -115 -179 -118 -155 31 143 129 112 163 -42 2 -170 -133 145 133 -52 -313 -275 -235 -215
2767 -215 -84 42 161 27 -239 -116 114 68 90 41 -172 -193 -189 -133 -4 254 58 265 -249 -64 -172 -10
2789 -10 112 316 -43 -53 -332 142 -45 281 22 20 -424 -319 108 200 57 -110 -1 59 -250 -59 31 263
2811 263 125 -328 -292 -326 21 95 74 25 -203 -264 8 120 115 138 169 -93 -165 -284 114 361 175 197 -117 -16
2835 -16 -230 -146 -57 486 169 14 -180 -316 -90 30 526 263 221 -53 -224 -52 27 248 431 -83 -106 -562
2857 -562 -219 -23 410 286 55 -176 -273 -380 6 278 449 -42 -104 -137 -211 155 -20 68 199 -133 -265 -286
$$ packed form
2697B47j71o8J50j74p8N7j37K38j71l2K83l28J54O4Q3j37J11o0R0r2j5K54Oj18
2721A56j45J15k94Q3J57n5l1R4J04k47p7K38J48r1k45j86J81Q9M08j97k53j87
2743b35L25o5m44O55l51o4O1l7J86J12j4j7N1k05M4j72L7K78j2j85k61L8M0K0
2767b15J31J26J19j34k66J23K30m6K2m9k13k1MN6J29K58j96K07n14J85j08J62
2789a0J22K04l59j0k79M74j87L26k59km44J05M27R2j43j67J09O0l09J91R0K32
2811B63j38m53L6l4L47P4k1m9k28o1K72J12nK3L1k62p2j19L98K47j86K2l14J01
2835a6k14Q4Q9N43l17j55j94j36K26J20M96k63m2k74j71J72P9K21J83n14k3m56
2857e62L43J96M33j24k31k31r7j07L86K72J71m91o2l3p4L66j75Q8J31l32j32k1
$$ plain form
2879 -286 12 208 376 350 -217 -322 -519 30 233 343 346 54 -306 -350 -58 252 382 44 -352 -559 -342
2900 -342 69 52 258 242 -334 -512 -361 -168 146 183 -123 -354 -314 -391 -103 261 306 228 -256 -328 -137 -193 245
2923 245 275 193 -85 -393 -404 -66 360 235 141 -93 -227 -359 63 207 266 284 -203 -59 -491 -76 388 625
2945 625 267 -70 -488 -490 -170 292 530 283 288 -428 -393 -286 131 455 400 224 -224 -158 -255 336 369 503 82
2968 82 -377 -578 -66 -81 264 307 327 -51 -430 -346 -49 403 345 314 -18 -630 -58 150 276 421 247 -104
2990 -104 -296 -379 -79 392 354 219 -40 -383 -188 33 428 462 330 -74 -644 -468 66 258 495 384 50
3011 50 -383 -290 -230 378 665 342 -299 -656 -310 -108 280 562 57 9 -165 -149 -260 118 526 343 106 -245
3033 -245 -301 64 229 612 524 220 -369 -501 16 232 482 250 124 -304 -545 -161 49 556 197 166 -144
$$ packed form
2879b86K98J96J68k6n67j05j97N49K03J10Lk92l60m4K92L10J30l38l96k07K17
2900c42M11j7K06j6n76j78J51J93L14L7l06k31M0p7K88L64M5p8m84p2J91n6M38
2923B45L0q2k78l08j1L38M26j25r4k34j34j32M22J44N9J8m87J44m32M15M64K37
2945F25l58l37m18kL20M62K38k47Np16L5J07M17L24n5j76m48O6r7N91L3J34m21
2968H2m59k01N12j5L45M3K0l78l79Q4K97M52n8l1l32o12N72K08J26J45j74l51
2990a04j92q3L00M71l8j35k59l43J95K21L95L4j32m04n70J76N34J92K37j11l34
3011E0m33R3O0O08K87l23o41l57L46K02L88K82n05m8j74J6j11L78M08j83k37l51
3033b45n6L65J65L83q8l04n89j32N17K16K50k32j26m28k41L84K10N07l59l1l10
$$ plain form
3054 -144 -244 -290 54 685 432 123 -334 -358 -256 211 415 574 -58 -297 -677 -601 112 563 619 160 -69
3075 -69 -423 -329 159 359 328 298 -387 -655 -397 227 176 503 260 -285 -467 -484 65 422 635 260 -118 -546
3097 -546 -212 -210 379 564 225 54 -600 -741 -102 410 555 226 -316 -416 -376 -278 210 462 199 -127 -560
3118 -560 -682 -287 338 654 151 220 -551 -532 -495 -30 623 377 -78 -611 -489 -369 353 431 520 69 -597 -371
3140 -371 -405 324 527 559 173 -207 -588 -438 15 308 656 211 -530 -549 -509 146 327 648 10 -339 -515
3161 -515 -438 -106 357 377 -28 -304 -529 -433 -200 458 632 195 -229 -659 -651 -270 505 463 385 -85 -354 -142
3183 -142 -209 676 314 396 45 -515 -736 -108 297 540 354 46 -376 -591 -242 279 706 295 -146 -326 -491
3204 -491 42 72 580 269 47 -668 -568 129 323 590 280 -81 -331 -735 -381 287 438 582 -43 -600
$$ packed form
3054a44j00m6L44O31k53l09m57k4J02M67K04J59o32k39l80P6P13M51N6m59k29
3075f9l54R4M88K00l1l0o85k68K58O24n1L27k43n45j82j7N49L57K13l75l78m28
3097e46L34KN89J85l39j71o54j41O39N12J45l29n42j00M0R8M88K52k63l26m33
3118e60j22L95O25L16n03O9p71J9L7M65O53k46m55n33J22J20P22P8Q9m51o66K26
3140c71l4P29K03L2l86l80l81J50M53K93L48m45p41j9M0O55J81L21o38l49j76
3161e15P7L32M63K0m05k76k25R6K33O58J74m37m24m30QL81P75m2p8m70k69K12
3183a42o7Q85l62Q2l51n60k21O28M05K43j86l08m22k15L49N21M27m11m41j80j65
3204d91N33L0N08l11k22p15J00O97J94K67l10l61k50m04L54O68J51J44o25n57
$$ plain form
3224 -600 -554 -295 439 620 633 131 -398 -552 -251 -125 508 583 276 -365 -682 -606 108 545 564 147 -333 -599
3246 -599 -427 -265 597 676 76 -293 -634 -363 54 640 622 197 -358 -671 -543 -188 452 622 186 -340 -820
3267 -820 -500 -49 510 585 66 31 -498 -601 80 480 677 452 -119 -750 -552 -215 284 929 398 -246 -540
3288 -540 -677 -238 422 823 421 70 -448 -466 -139 257 501 695 96 -521 -550 -432 228 414 433 -2 -469
3309 -469 -543 -664 152 566 442 53 -254 -522 -191 96 549 636 -3 -526 -911 -151 393 536 679 251 -286
3330 -286 -679 -439 -64 404 571 275 -427 -415 -317 -75 412 674 352 -313 -759 -560 56 641 834 527 39
3351 39 -627 -538 254 514 546 29 -266 -575 -511 25 634 796 189 27 -856 -492 -119 526 441 318 -28 -647
3373 -647 -691 -126 248 728 730 -146 -717 -801 -263 252 655 509 20 -612 -689 -91 379 611 581 380 -426 -685
$$ packed form
3224f00M6K59P34J81J3n02n29j54L01J26O33P5l07o41l17P6P14M37J9m17m80k66
3246e99J72J62Q62P9o00l69l41K71M17N86j8m25n55l13J28L55O40J70m36n26m80
3267h20L20M51N59P5n19l5n29j03O81M00J97k25n71o31J98L37M99O45n31o44k94
3288e40j37M39O60M01m02l51n18j8L27L96K44J94n99o17k9J18O60J86J9m35m67
3309d69p4j21Q16M14j24l89l07k68L31K87M53Q7o39n23l85P60N44J43J43m28n37
3330b86l93K40L75M68J67k96p02J2R8K42M87K62l22o65m46J99O16N85J93l07m88
3351C9o66Q9P92K60L2n17k95l09O4N36O09J62o07j62q83L64L73O45q5j23l46o19
3373f47m4N65L74M80Kq76n71q4N38N15M03j46m89o32p7N98M70K32l0k01q06k59
$$ plain form
3395 -685 -280 192 646 677 303 -756 -806 -307 210 517 635 35 -367 -601 -321 44 533 548 140 -280 -708
3416 -708 -467 -20 519 781 378 -691 -517 -655 114 438 530 -56 -242 -545 -496 -161 322 574 245 -252
3436 -252 -748 -580 104 410 552 482 -196 -501 -601 -201 555 830 408 -150 -669 -747 -58 445 653 616 -122
3457 -122 -618 -552 -178 354 739 463 -96 -618 -718 -233 422 792 599 143 -537 -459 -343 298 646 600 55
3478 55 -720 -816 -313 131 466 702 94 -587 -773 -432 227 611 753 229 -467 -516 -445 -3 539 607 27 -363
3500 -363 -653 -532 147 572 871 167 -343 -709 -485 119 416 633 250 -191 -846 -488 -130 332 697 418
3520 418 -290 -865 -750 -102 656 667 264 -136 -840 -726 -204 568 855 630 -242 -734 -656 -275 224 916 621
3541 621 -127 -907 -740 -143 317 878 689 -295 -680 -686 -400 388 915 568 -93 -537 -695 -275 433 1003 503
$$ packed form
3395f85M05M72M54L1l74j059n0M99N17L07J18o00m02k34K80L65M89J5m08m20m28
3416g08K41M47N39K62m03j069J74j38P69L24R2n86j86l03M9L35M83K52l29m97
3436b52m96J68O84L06J42p0o78l05j00M00P56K75m22n58n19p8O89N03K08l7p38
3457a22m96O6L74N32L85k76n59n22j00M85O55L70j93m56o80P8J16O41L48m6n45
3478E5p75r6N03M44L35K36o08o81j86L41O59L84J42n24o96m9P1M42N42O8n80l90
3500c63k90J21O79M25K99p04n10l66K24O04K97K17l83m41o55L58L58M62L65k79
3520D18p08n75J15O48P58J1m03m00p04J14N22P72K87k25q72m92P8L81M99O92k95
3541F21p48p80J67N97M60N61j89r84l85oK86P88N27l47o61m44j58M20P08N70n00
$$ plain form
3562 503 220 -727 -693 -284 349 792 688 172 -455 -784 -373 199 896 601 38 -646 -1041 -670 265 730
3582 730 852 129 -422 -769 -815 160 597 919 343 -310 -691 -426 198 998 865 187 -451 -675 -555 65
3602 65 656 349 404 -145 -874 -501 -16 887 886 553 -400 -878 -631 -337 104 715 499 -279 -877 -721 -321
3623 -321 378 725 458 -98 -947 -645 -235 403 689 547 -87 -509 -627 -244 518 688 766 -137 -735 -585
3643 -585 -449 296 1003 475 -81 -559 -930 -417 264 1013 823 163 -547 -595 -429 306 707 764 108 -434 -752
3664 -752 -482 -5 623 956 71 -477 -809 -541 49 767 716 200 -299 -614 -781 31 659 694 191 -506 -773
3685 -773 -477 -244 625 776 171 -297 -776 -601 -57 686 882 443 -177 -966 -735 -247 578 938 279 -202
3705 -202 -1041 -722 -198 838 999 508 -105 -599 -712 -269 491 607 502 -239 -671 -957 -224 307 846 706
$$ packed form
3562E03k83r47L4M09O33M43j04n16o27l29M11N72O97k95n63o84l95L71R35M65
3582G30J22p23n51l47m6R75M37L22n76o53l81K65O24Q00j33o78o38k24J20O20
3602F5N91l07N5n49p29L73M85R03jl33r53m78K47K94M41O11k16p78n98J56M00
3623c21O99L47k67n56q49L02M10O38K86j42o34m22j18L83P62J70P8r03n98J50
3643e85J36P45P07n28n56m78l71N13O81P49j90o60p10m8J66P35M01N7o56n42l18
3664g52K70M77O28L33q85n48l32K68N90P18n1n16m99l15j67Q12O28L5n03o97k67
3685g73K96K33Q69J51o05m68m79J75N44P43J96m39o20p89K31M88Q25L60o59m81
3705b02q39L19N24J036J61m91o13m94j13M43P60J16j05p41m32k86P33N31N39j40
$$ plain form
3725 706 19 -503 -563 -294 286 721 515 -26 -451 -847 -347 156 849 542 196 -372 -603 -90 304 837
3745 837 730 381 -310 -595 -410 237 909 580 300 -547 -866 -441 290 460 613 86 -436 -925 -519 96
3765 96 644 872 583 -265 -615 -783 -179 565 763 378 -478 -933 -832 -219 264 840 304 -365 -656 -590 -133
3786 -133 615 790 368 -312 -617 -747 -319 520 833 416 -2 -887 -622 -384 478 706 562 254 -613 -731
3806 -731 -93 370 721 756 94 -721 -953 -546 503 880 508 -83 -592 -777 -587 163 641 686 384 -407
3826 -407 -848 -584 266 781 527 26 -687 -767 -486 177 889 656 380 -667 -733 -747 195 701 601 17 -432
3847 -432 -777 -524 -50 627 758 273 -435 -560 -570 124 746 1031 336 -293 -903 -529 145 438 968 158
3867 158 -425 -550 -587 -61 411 846 406 11 -612 -872 -144 407 490 645 -138 -777 -866 -275 235 536 384
$$ packed form
3725G06o87n22o0K69N80M35k06n41m25l96N00N03O93l07l46n68k31N13L94N33
3745H37j07l49o91k85J85O47O72l29k80q47l19M25P31J70J53n27n22m89M06O15
3765I6N48K28k89q48l50j68O04P44J98l85q56m55J01O13M83N76n36o69k91O6M57
3786a33P48J75m22o80l05j30M28Q39L13m17m18q85K65K38Q62K28j44l08q67j18
3806g31O38M63L51L5o62q15k32M07J049L77l72n91n09j85J90P50M78M5l02p91
3826d07m41K64Q50N15k54n01p13q0K81O63P12k33k76j047o6j4R42N06j00n84m49
3847d32l45K53M74O77J31m85p08j25j0O94O22K85o95o29o10L74O74K93N30q10
3867A58n83j25l7N26M72M35m40l95o23k60P28N51Q3J55p83o39q9N91N10L01j52
$$ plain form
3888 384 -162 -573 -776 -245 393 390 543 144 -462 -833 -289 303 501 681 221 -782 -791 -357 206 812 525
3909 525 236 -372 -693 -377 203 832 873 238 -416 -762 -585 70 664 935 369 -649 -867 -499 88 534
3929 534 989 247 -374 -980 -641 -78 560 777 403 -265 -739 -740 -216 437 636 343 -211 -762 -449 -179 609
3950 609 758 305 -432 -731 -522 56 636 799 593 -287 -856 -625 -98 463 850 733 -205 -856 -700 -564
3970 -564 428 973 693 -145 -737 -892 -63 397 412 430 -102 -832 -742 -172 274 878 589 73 -672 -807 -161
3991 -161 255 860 631 132 -680 -916 -376 161 730 526 -97 -402 -658 -319 231 357 769 420 -392 -573
4011 -573 -459 84 720 608 275 -251 -786 -606 -55 732 864 316 -158 -804 -448 -70 693 721 376 -301
4031 -301 -667 -566 -150 601 1015 31 -324 -629 -605 -121 588 953 412 -342 -569 -654 -395 684 822 669
$$ packed form
3888C84n46m11k03N31O38lJ53l99o06l71N44N92J98J80m60j003rM34N63O06k87
3909E25k89o08l21L16N80O29M1o35o54l46J77O55N94K71n66j018k18L68N87M46
3929E34M55p42o21o06L39N63O38K17l74o68m74jN24O53J99k93n54n51L13K70P88
3950F09J49m53p37k99K09N78N80J63k06q80n69K31N27N61L87j17r38o51J56J36
3970e64R92N45k80q38n92j55Q29M60J5J8n32p30R0N70M46O04k89n16p45j35O46
3991a61M16O05k29m99q12k36N40N37N69k04o23l05k56L39N50J26M12l49q12j81
4011e73J14N43O36j12l33n26n35J80N51P87J32n48m74o46L56L78P63K8l45o77
4031c01l66J01M16P51M14r84l55l05K4M84P09L65n41p54k27q5K59J079J38j53
$$ plain form
4051 669 110 -788 -686 -147 462 707 562 -149 -529 -765 -164 310 939 739 -85 -532 -828 -534 468 888
4071 888 659 -24 -636 -738 -539 411 875 584 136 -523 -928 -437 146 744 542 237 -396 -888 -447 -81
4091 -81 717 758 367 -552 -821 -791 -195 516 738 353 -123 -635 -727 166 725 911 511 -310 -818 -619 -132
4112 -132 569 705 407 -204 -591 -630 94 641 636 374 -268 -756 -374 -63 642 766 728 -392 -436 -496 -187 379
4134 379 410 382 -300 -775 -862 -249 147 772 602 -65 -657 -532 -28 191 785 681 322 -595 -1087 -222 113
4155 113 784 638 89 -645 -797 -270 303 675 517 197 -390 -706 -292 307 733 572 245 -660 -543 -337
4175 -337 309 539 686 97 -569 -539 -336 -94 399 854 293 -466 -621 -599 2 623 953 417 -407 -621 -558
4196 -558 129 512 562 436 -333 -877 -890 -97 575 812 303 -119 -614 -670 -236 477 637 311 -32 -611 -755
$$ packed form
4051F69n59q98J02N39O09K45j45p11l80k36O01M74O29k00q24m47k96K94J002M20
4071H88k29o83o12j02J99R50M64k91m48o59m05M91N83N98k02l05o33m92M41L66
4091h1P98M1l91r19k69L0N96P11K22l85m76n12r2Q93N59J86m00q21n08J99M87
4112a32P01J36k98o11l87l9P24N47nk62o42m88L82L11P05J24l8j120m4o0L09N66
4134C79L1k8o82m75q7O13L96O25j70o67n92J25N04K19N94j04l59r17m92Q65L35
4155A13O71j46n49p34j52N27N73L72j58l20n87l16M14N99M26j61l27r05J17K06
4175c37O46K30J47n89o66L0K03K42M93M55n61p59j55K2O01O21L30n36q24k14O3
4196e58O87L83N0j26p69n44j3P93O72K37n09m22m95n6M34P13J60l26l43n79j44
$$ plain form
4217 -755 60 521 530 544 -6 -658 -745 -154 487 700 415 -369 -528 -735 -494 372 768 605 51 -672 -959
4238 -959 -286 306 931 720 189 -566 -874 -487 346 728 766 99 -385 -786 -485 -15 666 808 46 -522
4258 -522 -812 -515 -15 898 605 178 -476 -577 -581 260 361 536 236 -337 -442 -280 -152 794 993 269 -489
4279 -489 -654 -696 -75 517 723 605 -260 -568 -615 -135 432 837 510 1 -542 -813 -286 538 674 436 -335
4300 -335 -812 -708 -349 405 611 681 -128 -648 -685 -253 329 776 770 -11 -496 -534 -109 449 685 522 -413 -863
4322 -863 -874 -315 210 611 510 356 -425 -619 -354 337 623 438 37 -650 -781 -616 224 951 936 37 -381
4343 -381 -541 -489 45 711 488 219 -270 -689 -479 -42 369 498 218 -438 -533 -443 30 639 714 263 -459
4364 -459 -889 -590 -106 617 680 360 -6 -430 -441 -9 655 700 293 -94 -545 -573 -8 717 638 774 22 -624
$$ packed form
4217g55Q15M61RJ4n50o52q7N91O41K13k85p84j59k07K41Q66L96j63n54p23k87
4238i59O73N92O25k11n31p55l08L87Q33L82L8o67m84m01L01M70O81J42p62n68
4258e22k90K97N00R13k93m27o54j01mQ41J01J75l00n73j05J62J28R46J99p24p58
4279d89j65m2O21N92K06j18q65l08m7M80N67M05l27n09n43k71N27Q24J36k38p71
4300c35m77J04L59P54K06P0q09n20l7M32N82M47op81m85l8M25N58K36j63r35m50
4322h63j1N59N25M01j01j54p81j94K65O91K86j85m01o87j31J65Q40P27j5q99m18
4343c81j60N2N34O66k23k69m89m19K10M37M11J29k80o56r5R0M73O09P5m51p22
4364d59m30K99M84P23O3l20l66m24j1M32O64M5m07l87m51k8N65P25p9J36p52o46
$$ plain form
4386 -624 -541 -241 502 624 385 -5 -487 -849 -214 296 737 789 -144 -646 -607 -215 411 768 793 25 -519
4407 -519 -535 -364 306 730 450 361 -668 -716 -346 218 625 477 40 -605 -784 -502 -54 647 588 168 -501
4428 -501 -568 -300 82 540 713 24 -252 -710 -612 76 623 763 286 -393 -889 -391 254 900 485 370 -237
4449 -237 -851 -532 2 481 454 263 -230 -559 -522 -316 634 457 298 -231 -668 -566 27 655 958 689 -78
4470 -78 -432 -629 -25 468 499 180 -58 -557 -1045 -376 485 702 384 13 -603 -621 -327 426 699 491 -38
4491 -38 -368 -537 -324 145 615 346 142 -599 -848 -411 264 596 407 35 -531 -838 -439 110 636 757
4511 757 61 -615 -720 -80 202 877 842 -123 -568 -706 -422 79 441 377 78 -180 -462 -577 -114 875 763
4532 763 372 -80 -658 -474 -50 671 564 387 -50 -820 -333 -142 460 594 305 -241 -664 -568 78 695
$$ packed form
4386f24Q3L00P43J22k39l90m82l62O35N10M41N2r33n02L9L92O26L57K5p68n44
4407e19j6J71O70M24k80q9j029m8L70N64M07j48m37o45j79K82M48P01n9m20o69
4428e01o7K68L82M58J73o89k76m58R8O88N47J40m77o79m96M98O45O46m15j15o07
4449b37o14L19N34M79k7j91m93l29L7K06R50j77j59n29m37J02N93O28L03k69p67
4470g8l54j97O04M93L1l19k38m99m88O69Q61K17l18l71o16j8K94P53K73k08n29
4491c8l30j69K13M69M70k69k04p41k49M37O75L32j89l72n66l07L99N49N26J21
4511G57o96o76j05O40K82O75l5r65m45j38K84N01L62o4k99k58k82j15M63R89j12
4532G63l91m52n78J84M24P21j07j77m37p70M87J91O02J34k89n46m23R6O46O17
$$ plain form
4552 695 649 405 -204 -805 -550 -112 61 753 524 17 -427 -955 -446 323 698 327 -34 -720 -936 -403
4572 -403 270 602 550 -165 -437 -674 -406 321 785 675 145 -622 -540 -366 378 665 529 98 -289 -594 -491
4593 -491 457 507 676 -62 -667 -662 -401 32 523 570 -130 -374 -1050 -437 -71 466 581 267 -118 -517 -453 5
4615 5 594 445 441 -262 -810 -411 -191 527 758 188 -346 -732 -685 -115 518 467 60 -120 -651 -513 -82 485
4637 485 641 526 -53 -560 -524 -31 75 563 389 -221 -571 -375 71 417 574 253 -133 -319 -756 -214
4657 -214 441 526 389 171 -394 -471 -320 332 626 575 -133 -352 -820 -448 245 474 480 59 -479 -448 -374 257
4679 257 703 435 197 -403 -557 -487 145 462 681 115 -272 -653 -474 -29 600 725 322 -564 -772 -564
4699 -564 73 503 899 111 -332 -844 -187 270 583 525 413 40 -401 -483 -179 327 376 501 -287 -811 -672
$$ packed form
4552F95m6k44o09o01K55M38J73O92k29n07m44n28N09P69L75l71l61o86k16N33
4572d03O73L32n2p15k72k37K68P27M64j10n30p67Q2J74P44K87j36m31l87l05J03
4593d91R48N0J69p38o05NK61M33M91M7p00k44o76O13L66N37J15l14l85l99O4M58
4615EN89j49mp03n48L99K20P18K31n70n34l86M7N70O33n1m07j80n31J38M31N67
4637D85J56j15n79n07L6M93J06M88j74o10l50J96M46L46J57l21l86j86m37N42
4657b14O55Q5j37k18n65p7J51O52K94n1p08k19m68L72O93K29Om21n38L1P4O31
4679B57M46k68k38o00j54P0O32L17K19n66l87l81J79M45O29J25m03q86k08K08
4699e64O37M30L96p88m43n12O57M57L13n8j12l73m41q2L04N06M9J25p88n24J39
$$ plain form
4720 -672 -172 206 715 526 -104 -746 -557 -166 563 702 368 -166 -531 -481 -203 154 447 398 57 -379 -552
4741 -552 -364 463 504 501 13 -619 -559 -320 165 546 632 6 -256 -653 -450 194 481 376 117 -413 -624 -404
4763 -404 -164 513 446 79 -151 -777 -237 275 514 417 24 -376 -468 -422 488 478 464 166 -229 -419 -505 -67
4785 -67 419 474 221 -201 -625 -648 11 510 654 486 -265 -761 -625 -6 394 416 233 -132 -511 -401 -203
4806 -203 25 572 105 -46 -397 -614 -155 525 728 381 -58 -691 -691 -6 355 447 784 -190 -347 -689 -550
4827 -550 327 624 285 -81 -401 -551 -449 138 597 160 262 -249 -663 -224 246 535 590 201 -218 -516
4847 -516 -428 103 387 372 -187 -435 -477 -257 134 312 401 141 -241 -388 -555 132 684 608 295 -259 -742 -602
4869 -602 367 584 418 254 -326 -130 -525 442 346 570 452 -308 -514 -451 -98 302 637 252 -268 -673 -422
$$ packed form
4720f72N00L78N09j89o30o42J89L91P29J39l34n34l65N0K78L57K93m9l41m36j73
4741e52J88Q27M1lm88o32O0K39M85L81Q6o26k62l97K03O44K87j05k59n30k11K20
4763d04K40O77o7l67k30o26N40N12K39r7l93m00r2M6R10j0j4k98l95j90q6M38
4785f7M86N5k53m22m24k3O59M99J44j68p51m96J36O19M00K2j83l65l79J10J98
4806b03K28N47m67j51l51k17M59O80K03l47m39o33%O85L61R2L37r74j57l42J39
4827e50Q77K97l39l66l20j50J02N87M59m37J02n11m14M39M70K89N5l89m19k98
4847e16Q8N31K84j5n59k48m2K20L91J78Q9k60l82j47j67O87N52p6l13n54m83J40
4869f02R69K17j66j64n80J96l95R67r6K24j18p60k06O3L53M00L35l85n20m05K51
$$ plain form
4890 -422 -289 217 581 122 -130 -757 -465 -336 393 869 369 -33 -620 -629 -77 240 537 495 -132 -667 -409
4911 -409 -176 47 740 560 -118 -599 -544 -95 495 367 567 212 -364 -594 -135 186 712 372 -177 -547
4931 -547 -558 -295 205 429 322 27 -337 -584 -582 276 452 672 282 -254 -499 -277 465 393 354 285 -163 -522
4953 -522 -354 -135 371 634 -22 -186 -643 -256 -30 275 812 182 -231 -431 -539 -30 223 548 236 -25
4973 -25 -527 -490 32 299 466 23 -213 -525 -411 -35 373 477 264 29 -315 -752 -89 425 691 266 -16
4994 -16 -474 -548 -320 149 646 405 -119 -512 -434 -204 164 620 222 -21 -296 -496 -292 254 472 340 207
5015 207 -519 -466 -273 413 495 768 70 -340 -323 -149 236 579 522 209 -266 -488 -279 -137 424 437 176 -171
5037 -171 -597 -201 59 424 418 370 -57 -680 -508 112 549 415 492 -435 -441 -380 -37 351 496 168 -90 -332
$$ packed form
4890d22J33N06L64m59k52o27K92J29P29M76n00m02n87rN52L17K97m2o27n35K58
4911d09K33K23O93j80o78m81N5M49N90j28K00l55n76k30M59L21N26l40n49l70
4931e47j1K63N00K24j07k95l64k47KQ58J76K20l90n36k45K22P42p2l9o9m48l59
4953e22J68K19N06K63o56j64m57L87K26L05N37o30m13k00j08N09K53L25l12k61
4973b5n02L7N22K67J67m43k36l12J14L76M08J04k13k35l44m37O63N14K66m25k82
4994a6m58p4K28M69M97k41n24l93P8K30L68M56l98k43k75k00K04N46K18j32j33
5015B07p26N3J93O86Q2K73o98m10J7J74L85L43n7l13m75k22K09J42N61J3k61l47
5037a71m26L96K60L65om8m27o23J72O20M37j34P7r27oO1L43L88J45l28k58k42
$$ plain form
5059 -332 -525 -173 181 677 289 -36 -263 -393 22 288 410 229 -477 -578 -373 -135 435 757 231 45
5079 45 -257 -322 -278 210 500 761 -62 -375 -291 -157 338 640 195 -12 -284 -553 -186 267 678 257 264 -344
5101 -344 -606 -253 187 438 318 31 -323 -774 -335 -119 587 574 67 -286 -399 -609 48 530 438 97 -381
5122 -381 -698 -311 198 338 680 38 -207 -742 -501 134 508 315 272 -132 -392 -311 99 329 620 400 -239
5143 -239 -428 -440 -118 370 609 294 -223 -297 -537 22 212 589 429 116 -376 -261 -206 250 441 452 -114
5164 -114 -559 -581 -21 452 75 308 116 -568 -564 -320 218 285 445 100 -307 -341 -215 226 366 359 256 -268
5186 -268 -546 -229 365 576 527 -76 -438 -493 -449 -68 281 475 132 -23 -242 -377 163 172 162 333 -275 -421
5208 -421 -382 49 495 162 82 -340 -461 -397 -45 263 506 346 -491 -174 -151 -299 218 320 129 -19 -389
$$ packed form
5059c32j93L52L54M96l88l25k27j30M15K66J22j81p06j01K05K38N70L22n26j86
5079D5l02o5M4M88K90K61q23l13Q4J34M95L02m45k07k72k69L67M53M11m21Po08
5101c44k62L53M40K51j20k87l54m51M39K16P06j3n07l53j13k10O57M82r2l41m78
5122c81l17L87N09J40L42o42k45n35K41O35L74j93m3m04k60Q1M10K30K91k20o39
5143b39j89j2L22M88K39l15n17p4k40N59J90L77j60l13m92J15N5M56J91J1n66
5164a14m45k2N60M73l77K33j92o84MK44N38O7J60l45m07l4J26M41J40pj03n24
5186b68k78L17N94K11m9o03l62n5M4L81L49J94l43j55k19j35N40Rj0J71o08j46
5208d21L9M31M46l33q0m22j21O4L52L08K43j60q37L17K3j48N17J02j91j48l70
$$ plain form
5229 -389 -458 -63 264 300 341 -252 -432 -393 24 266 373 149 72 -461 -212 -78 185 325 144 200 -177 -525
5251 -525 92 266 610 378 -66 -157 -317 -215 369 502 283 73 -440 -358 -194 262 637 321 230 -394 -322
5272 -322 -109 -64 486 231 95 -333 -259 -295 74 372 264 52 -130 -241 -272 -27 228 196 32 -23 -429 -483
5294 -483 -180 464 439 165 76 -292 -139 139 541 354 271 -118 -344 -207 -27 474 360 64 -72 -275 -458
5315 -458 -147 200 313 -58 -98 -578 -375 -143 368 594 237 -88 -364 -488 -169 -7 197 177 68 -503 -372
5336 -372 -299 115 433 291 47 -193 -243 -86 297 219 264 18 -356 -492 -116 -136 359 344 163 -451 -308 -158
5358 -158 210 362 361 2 -185 -239 -66 -39 403 164 201 -485 -375 -115 121 130 401 67 -300 -106 -404 -13
5380 -13 147 429 90 -229 -381 -230 -106 362 277 201 -336 -461 -207 -155 275 394 439 -33 -404 -431 101 437
$$ packed form
5229c89o9L95L27L6M1n93j80L9M17K42J07k24p7n33K49J34K63J40j81N6l77l48
5251e25O17J74L44k32m44r1j60J02N84J33k19k10n13Q2J64M56L75l16r1o24P2
5272c22K13M5N50k55j36m28P4l6L69K98j08k12j82j11l1K45K55l2j64n5m06n4
5294d83L03O44k5k74q9l68J53K78M02j87q3l89k26J37J80N01j14k96j36k03j83
5315d58L11L47J13l71m0m80K03K32N11K26l57l25k76j24L19J62K04k0j09n71J31
5336c72P3M14L18j42k44k40n0J57L83p8M5k46l74j36L76k0M95j5j81o14J43J50
5358a58L68J52jl59j87n4J73K7M42k39L7o86J10K60K36RK71l34l67J94k98L91
5380a3J60K82l39l19j52J51J24M68q5p6n37j25K54N2M30J19M5m72l71k7N32L36
$$ plain form
5402 437 166 109 -98 -565 -305 -249 189 162 222 157 -317 -589 -212 236 391 405 -274 -54 -391 -179 240 220
5424 220 461 -27 -536 -304 -60 -42 255 121 -122 -91 -486 -177 153 575 479 72 -72 -469 -98 -234 262
5445 262 252 -59 -350 -614 -241 1 257 400 -95 -132 -533 -332 90 579 287 182 -74 -294 -514 181 332
5466 332 364 323 -195 -355 -213 62 223 132 208 -146 -650 -507 181 392 457 -20 -318 -208 -405 -11 146 287
5488 287 -111 -18 -586 -168 -52 370 305 276 220 -345 -325 -153 172 263 115 -61 -357 -226 -1 171 423 318
5510 318 -21 -143 -433 -174 212 305 329 157 -38 -269 -176 139 321 277 206 -150 -276 -111 302 457 355 -148
5532 -148 -21 -270 -181 32 259 209 21 -157 -453 -46 51 412 383 248 -203 -424 8 290 297 281 263 -231 -280
5555 -280 -272 154 487 351 106 -28 -513 -312 -97 279 119 142 78 -269 -340 -60 224 484 304 -180 -1 -202
$$ packed form
5402D37k71n7k07m67K60N6M38k7O0o5m74k72L77M48J55J4o79K20l37K12M19k0
5424B20K41m88n09K32K44J8K97j34k43L1l95L09L30M22r6m07j44l97L71j36M96
5445B62j0l11k91k64L73K42K56J43m95l7m01K01M22M89k92j05k56k20k20O95J51
5466C32L2m1n18j60J42K75J61r1P6l54n04J43O88K11O5m77k98J10j97L94J57J41
5488B87l98R3n68M18J16M22o5k9n6n65K0J72L25R1j48j76k96J31K25J72K52j05
5510C18l39j22k90K59L86R3K4j72j95k31R3L15J82m4p1l56j26J65M13J55j02n03
5532a48J27k49Q9K13K27n0j88j78k96M07R7L61k9j35m51k21M32K82Pj6j8m94m9
5555b80QM26L33j36k45j34m85K01K15L76j60K3o4l47p1K80K84K60j80m84J79k01
$$ plain form
5577 -202 -145 514 329 21 -102 -289 -483 -159 166 -113 188 91 -19 -190 -153 186 417 538 88 -172 -358
5598 -358 -343 166 225 436 94 -390 -252 -114 98 422 334 -6 -125 -289 -139 47 251 427 179 -34 -253
5619 -253 -168 114 84 308 88 -290 -231 -199 -4 167 449 241 -117 -333 -229 -177 306 68 -113 -140 -336 -235
5641 -235 52 272 374 149 -86 -241 -216 -22 234 205 137 -165 -572 -291 -12 188 208 22 82 -520 -121 40
5663 40 330 325 -5 51 -359 -200 -184 194 284 180 -39 -177 -277 37 137 244 200 -230 -75 -200 -53 82
5685 82 86 402 -9 -277 -197 -153 184 116 80 -113 -392 -128 -338 -8 284 545 110 -430 -282 -488 -20 386
5707 386 101 -2 -194 -397 -159 161 265 188 79 -273 -574 -290 47 202 325 54 -149 -375 13 21 213
5728 213 369 206 80 -519 -316 -62 -58 482 181 -154 -442 -35 -81 83 379 118 -27 -286 29 -106 173
$$ packed form
5577b02N7O59j85l08j23j87j94L24L25k79L01r7j10j71L7L39K31J21m50k60j86
5598c58J5N09N9K11l42m84J38J38K12L24q8l40j19j64J50J86K04J76k48k13k19
5619b53Q5K82l0K24k20l78N9L2J95J71K82k08l58k16J04N2M83k38j81k7j96J01
5641b35K87K20J02k25k35j55K5J94K56k9o8l02m07K81K79K00K0j86O0o02L99J61
5663D0K90nl30N6m10J59J6L78R0j04k19j38j00L14J00J07m4m30J55j25J47J35
5685H2ML16m11k68Q0M4L37o8l6j93k79K64k10L30K92K61m35n40J48k06M68M06
5707C86k85j03j92k03K38L20J04p7j09l52l01K84L37J55J23k71k03k26L88QJ92
5728B13J56j63j26n99K03K54MN40l01l35k88M07m6J64K96k61j45k59L15j35K79
$$ plain form
5749 173 401 321 -104 -431 94 -139 41 266 394 -56 -388 -409 -105 288 45 170 -151 -269 -273 -130 217
5770 217 241 313 -75 -183 -180 -83 -138 355 280 -18 -150 -350 -29 -78 551 16 145 79 -386 -215 64 315 267
5793 267 192 -88 -175 -212 109 212 306 118 66 -294 -338 111 22 432 -175 -201 -65 -71 201 259 139 197 201 -391 -139
5818 -139 -171 168 469 -84 -127 -90 -168 -69 362 294 131 -316 -510 -142 276 107 139 315 76 -174 15 -292
5840 -292 344 291 354 -144 -279 -96 -236 150 136 170 99 -13 -81 193 108 51 315 -57 -245 -369 -243 188 139
5863 139 366 -166 -171 -185 -118 145 366 221 -86 -70 -323 -224 132 104 377 14 -282 -327 -238 198 141 133 271 -261
5887 -261 -257 -206 20 29 344 236 -210 -271 -171 -13 210 -1 56 198 -12 -137 71 218 149 8 -351 -265 -243
5910 -243 116 218 231 -52 144 -233 -221 -21 142 319 317 -196 -151 -195 -4 124 231 95 17 -114 10 -54 136
$$ packed form
5749A73K28q0m25l27N25k33J80K25J28m50l32k1L04L93k43J25l21j18mJ43L47
5770B17K4P2l88j08LR7n5M93p5k98j32k00L21m9O29n35J29o6m65J71K79K51m8
5793B67p5k80q7l7L21J03R4j88n2l60m4M49q9M10o07k6J36oK72N8j20N8Mn92K52
5818a39l2L39L01n53m3L7p8R9M31o8j63m47j94L68M18j69L2J76k39k50J89l07
5840b92O36n3O3m98j35J83j40L86j4L4p1j12o8K74q5n7K64l72j88j24J26M31m9
5863A39K27n32nj4O7K63K21j45l07J6k53R9L56k8K73l63k96m5Q9M36n7qJ38n32
5887b61MN1K26RL15j08m46o1J00J58K23k11N7J42k10j25K08J47o9j41l59Q6K2
5910b43L59J02J3k83J96l77J2K00J63J77kn13M5m4J91J28J07j36p8j31J24o4J90
$$ plain form
5933 136 267 248 -228 -300 -250 -38 54 130 398 181 -108 -124 -148 -143 207 132 9 -261 -17 -336 -42 328 31
5956 31 20 7 -109 -200 -65 307 296 -38 -69 -145 -255 165 -68 162 58 -115 -138 -236 51 272 205 -12 -153
5979 -153 -258 -188 -206 168 359 92 -94 39 -311 103 -113 376 242 -142 -362 147 -49 222 -17 -28 -82
6000 -82 -148 -171 -245 169 308 559 128 -363 -198 -97 390 252 74 233 -295 -297 -192 367 128 -24 -262 -185
6022 -185 20 39 308 141 203 -50 -204 -128 -55 140 455 246 -163 100 -156 -42 6 189 132 45 -343 -65
6044 -65 -37 65 67 -50 -111 18 -218 -78 140 338 132 67 -117 -289 -226 -177 -128 -20 -164 -296 -82 -32 144
6067 144 160 258 -159 -139 -254 -47 118 199 158 271 -111 -109 -268 135 230 53 -8 -219 -85 -244 133 -11 191
6090 191 -94 -292 -139 -284 -200 189 224 106 -187 -156 -138 50 118 205 153 -13 -243 -118 -59 -40 230 -61 249
$$ packed form
5933A36J31j9m76p2N0K12R2P6K68k17k89j6k4NL50p5j23k70K44l19K94L70k97
5956C1j1j3j16r1J35L72j1l34l1p6j10M20k33K30j04j73k3r8K87K21o7k17j41
5979a53j05P0j8L74J91k67j86J33l50M14k16M89j34l84k20N09j96K71k39j1n4
6000h2o6k3p4M14J39K51m31m91J65J01M87j38j78J59n28kJ05N59k39j52k38P7
6022a85K05J9K69j67O2k53j54P6P3J95L15k09m09K63k56J14M8J83n7q7l88K78
6044f5K8J02Kj17o1J29k36J40K18J98k06o5j84j72O3M9M9J08j44j32K14N0J76
6067A44J6R8m17K0j15K07J65Q1m1J13l82Kj59M03R5j77o1k11J34j59L77j44K02
6090A91k85j98J53j45Q4L89L5j18k93L1J8J88O8Q7n2j66k30J25N9J9K70k91L10
$$ plain form
6113 249 -127 -389 130 -43 461 118 -58 -110 -141 184 133 151 84 -200 -261 337 17 93 328 -141 -8 38 -250
6136 -250 -90 149 -111 164 41 -181 -46 -141 37 97 167 80 -145 -145 74 -93 320 269 86 -80 -34 -55 115
6159 115 244 60 318 7 -282 -249 -45 90 413 318 -137 -365 36 -19 -43 329 -5 -45 -149 -239 -99 126
6181 126 173 83 -25 -65 -42 -239 278 -45 -47 -105 -224 4 -9 174 -19 139 157 -71 -237 -152 -121 227 82 -69
6205 -69 -243 -256 43 174 277 208 4 -109 -189 -54 -8 102 34 -143 17 -253 -19 -118 192 18 -76 -147 -174
6228 -174 190 197 335 278 -56 125 -78 -295 149 31 254 67 -99 -223 -56 -16 106 129 -78 -199 -21 -155
6250 -155 185 -48 57 -30 -61 -154 25 10 27 106 66 -15 -76 -91 -15 -117 119 -31 -260 -364 106 5 286 90
6274 90 117 -99 -123 -217 -8 173 297 -231 111 -135 -94 179 28 242 75 -269 -3 -136 -55 15 112 171 -168
$$ packed form
6113B49l76k62N19j73N04l43j76n2l1L25n1J8o7k84o1N98l20P6K35m69J33M6k88
6136b50J60K39k60K75j23k22J35r5J78O0P0q7k25%K19j67M13n1j83j66M6k1J70
6159A15J29j84K58l11k89L3K04J35L23r5m55k28M01n5k4L72l34m0j04r0J40K25
6181A26M7r0j08m0K3j97N17l23kn8j19K28j3J83j93J58J8k28j66Q5L1L48j45j51
6205f9j74j3K99J31J03o9k04j13q0J35M6J10o8j77J60k70K34r9L10j74r4p1k7
6228a74L64PJ38n7l34J81k03k17M44j18K23j87j66j24J67M0J22K3k07j21J78j34
6250a55L40k33J05q7l1r3J79j5J7P9m0q1o1j5P6j02K36j50k29j04M70j01K81j96
6274I0K7k16k4r4K09J81J24n28L42k46M1K73j51K14j67l44K66j33Q1P0R7N9l39
$$ plain form
6297 -168 -124 -118 -81 -6 202 281 -8 -167 -432 -206 6 41 -14 -74 -19 -135 51 -145 155 157 40 -67 -265 -266 143
6322 143 139 -29 128 53 -459 -104 -171 376 190 -38 21 74 -336 210 -60 192 133 -210 -44 -51 -25 -151 124
6345 124 -26 -97 -436 -181 2 306 15 -201 -32 -320 -111 -89 -85 108 80 -469 -120 -286 -24 31 -46 278
6367 278 -205 65 83 -109 -33 229 297 148 -27 -43 -15 4 231 163 -39 -89 -218 -215 188 157 174 145 -16 -177
6391 -177 -332 -100 395 321 -46 -160 -149 -16 44 -89 -141 -138 -264 24 -257 236 -233 14 -42 -225 -164 -147 -15
6414 -15 96 84 -198 -283 -231 -22 114 86 45 138 -430 -284 -106 27 -303 217 206 -196 -315 -33 156 44 107
6437 107 93 -115 -39 -200 215 245 -175 153 -187 -103 -83 -126 -178 193 172 114 -189 58 -69 -197 107 299 20
6460 20 51 -286 -301 -70 290 -155 -63 -71 -76 -15 192 57 205 127 -181 105 -65 332 -93 41 40 -174 -95 -111 129
$$ packed form
6297a68M4OL7P5K08P9k89j59k65K26K12L5n5o0N5j16J86j96L00Kj17j07j98jM09
6322A43mj68J57p5n12L55o7N47j86k28N9N3m10N46k70K52n9l43J66pK6j26K75
6345A24j50p1l39K55J83L04k91k16J69k88K09K2MJ93k8n49L49j66K62N5p7L24
6367B78m83K70J8j92P6K62O8j49j75j6K8J9K27o8k02n0j29LM03l1J7k9j61j61
6391a77j55K32M95p4l67j14J1J33O0j33n2Lj26K88k81M93m69K47n6j83O1J7J32
6414a5J11j2k82q5N2K09J36k8m1R3n68J46J78J33l30N20j1m02j19K82J89j12O3
6437A07j4k08P6j61M15L0m20L28l40Q4K0m3n2L71k1n8l03K47j27j28L04J92k79
6460B0L1l37j5K31L60m45R2qnO1K07j35J48p8l08K86j70L97m25J34jk14P9j6K40
$$ plain form
6485 129 75 155 104 -30 -89 -201 -206 -24 66 -58 -166 -124 14 191 68 -72 -115 -21 -256 -21 -72 342 264 -265
6509 -265 -196 -101 -124 83 330 84 -148 -42 -242 122 100 -111 167 -15 79 -156 24 -13 107 18 -10 -192 -225
6532 -225 -231 -96 159 82 -72 -25 -139 -135 -209 79 14 103 -143 -257 30 10 133 -13 -102 72 88 -384 -48 -61
6556 -61 177 88 7 -278 54 108 -202 127 59 117 7 -529 -218 -122 63 247 119 -47 138 -236 79 21 347
6579 347 4 -113 12 64 -167 87 176 165 120 -146 -38 -43 -19 225 -41 -56 -273 -161 124 126 103 168 12 -173
6603 -173 6 190 51 83 172 -293 140 -311 -92 200 -155 103 -128 -135 -265 39 214 79 136 145 13 -116
6625 -116 48 365 112 241 -165 12 -125 143 189 110 269 -151 37 -79 -9 33 123 147 -68 -208 -161 188
6647 188 6 39 -10 269 -92 -132 -85 -263 -27 85 -13 44 82 259 49 109 8 265 -6 -183 74 -111 93
$$ packed form
6485A29n4Q0n1j34n9j12nJ82R0j24j08M2J38J77j23j40m3R4k35K35n1M14p8n29
6509b65O9R5k3K07K47k46k32J06k00L64k2k11K78j82R4k35J80l7J20q9k8j82l3
6532b25oJ35K55p7j54M7j14Mp4K88o5Q9k46j14K87k0J23j46q9J74J6m72L36j3
6556f1K38q9q1k85L32N4l10L29o8N8j10n36L11R6J85J84j28j66J85l74L15n8L26
6579C47l43j17J25N2k31K54Q9j1m5k66J08nK4K44k66j5k17J12K85Kk3O5j56j85
6603a73J79J84j39L2Q9m65M33m51K19K92l55K58k31pj30L04J75j35N7Rj32j29
6625a16J64L17k53J29m06J77j37K68M6p9J59m20J88j16P0M2R0K4k15j40M7L49
6647A88j82L3m9K79l61m0M7j78K36J12r8N7L8J77k10O0j01K57k71j77K57j85K04
$$ plain form
6670 93 159 8 91 -108 57 13 -57 33 174 -114 -66 250 13 228 294 14 83 22 -178 57 155 -49 97 67
6694 67 34 41 238 -15 293 234 -168 -99 -27 82 98 32 -196 -56 6 28 -78 137 149 -150 -120 148 -263 -313 209
6719 209 66 -17 -194 100 194 237 67 96 337 -105 -111 -146 -57 66 -49 111 -115 -103 -73 92 127 -54 -2 -71
6743 -71 -41 -124 48 56 401 126 -202 122 -140 -213 8 211 297 88 9 -263 -38 15 144 99 218 -62 -347
6766 -347 40 -92 -14 90 22 -79 8 -4 -119 -87 -27 -139 39 15 -2 330 20 96 -4 -4 -326 53 4 203
6790 203 209 -7 -84 -279 -288 -173 47 97 -90 -73 159 -91 -96 -164 19 -55 -158 96 92 4 129 65 -23 139 -143
6815 -143 -103 -43 129 -58 -72 -363 -67 -201 76 144 99 121 -161 -111 -56 -100 -20 129 188 -208 -77 -178 -93 172
6839 172 -109 -157 82 -25 -54 -298 267 289 104 -17 -311 -227 64 303 118 17 71 135 4 -185 15 21 -229
$$ packed form
6670I3O6j51Q3j99J65m4p0R0J41k88M8L16k37K15O6k80O9o1k00K35R8k04J46l0
6694F7l3PJ97k53L08n9m02O9P2J09J6o6k28J40O2K2j06K15J2k99L0K68m11n0N22
6719B09j43q3j77K94R4M3j70K9K41m42ol5Q9J23j15J60k26J2L0J65L5j81N2o9
6743g1L0q3J72QL45k75l28L24k62p3K21K03Q6k09p9k72K25N3J29m5J19k80k85
6766c47L87j32P8J04o8j01Q7j2j15L2O0j12J78k4j7L32l10P6j00%l22L79m9J99
6790B03Ok16p7j95rJ15K20N0j87J7K32k50no8J83p4j03K54mq8J25o4q8J62k82
6815a43M0O0J72j87j4k91K96j34K77O8m5K2k82N0N5m4Q0J49N9l96J31j01Q5K65
6839A72k81m8K39j07k9k44N65K2j85j21k94Q4K91K39j85j01N4O4j31j89K00Ok50
$$ plain form
6862 -229 -158 259 -72 -47 -354 93 79 -81 -36 -297 32 52 95 146 -10 -239 -79 -198 -40 169 9 39 -134
6885 -134 -28 -325 -106 32 70 1 43 -59 -37 170 -72 84 -21 -5 -278 -4 127 184 159 -73 -195 -39
6907 -39 -198 13 87 36 -62 -157 -28 96 -29 -27 201 -42 -84 267 38 -106 74 269 108 -32 -243 88 -188
6930 -188 -168 -116 51 185 -63 33 -170 -55 70 93 1 138 -187 -81 17 95 -8 -55 -93 -386 -254 99 266
6953 266 49 172 -206 -133 -92 10 -137 -75 -2 -66 -83 23 -53 126 -24 -167 -69 -133 -70 26 -84 123 69 -208
6977 -208 119 -355 302 86 9 190 100 2 -18 114 151 207 28 -161 -123 52 -98 -86 346 219 90 -42 -131
7000 -131 -116 30 22 56 81 -165 -271 10 -40 185 -3 44 -92 11 -43 142 -40 295 -84 -108 211 -160 52
7023 52 15 -150 121 68 -10 -107 -121 50 -349 -30 -54 -364 -128 -82 -54 36 -151 -21 -187 -139 128 -136 235 -3
$$ packed form
6862b29P1M17l31K5l07M47j4j60M5k61L29K0M3N1j56k29J60j19J58K09j60L0j73
6885a34J06k97K19J38L8o9M2j02K2K07k42J56j05J6k73K74J31N7k5k32j22J56
6907c9j59K11P4n1r8r5J29J24j25KK28k43m2L51k29j44J80J95j61j40k11L31k76
6930a88K0N2J67J34k48R6k03J15J25K3r2J37l25J06R8P8j03m7l8k93J32L53J67
6953B66k17J23l78P3M1J02j47O2P3o4j7J06p6J79j50j43R8o4O3R6j10K07n4k77
6977b08L27m74O57k16p7J81r0r8k0J32L7N6j79j89L8J75j50J2M32j27j29j32q9
7000a31J5J46qL4K5k46j06K81n0K25j88M7j36J03n4J85j82L35l79k4L19l71K12
7023E2l7j65K71n3p8r7j4J71l99L19k4l10K36M6K8R0j87J30j66M8K67k64L71k38
$$ plain form
7047 -3 -132 205 -161 231 93 214 -103 -111 123 95 21 68 28 188 -92 127 -57 -215 -78 -37 32 218 -89
7070 -89 -214 -102 55 50 357 -215 226 -187 -189 -122 37 -8 -106 47 87 -69 122 -111 20 -182 -236 -42 -77 503
7094 503 24 -35 76 -146 80 -42 -40 75 46 144 -57 -139 84 39 146 236 86 -96 53 -42 35 212 -72
7117 -72 21 -40 -252 -152 -103 7 53 -115 50 -65 -37 169 117 198 -206 -99 -238 70 33 53 156 75 -86 109
7141 109 241 51 381 -10 -53 140 -119 -173 -185 -37 154 -43 68 -198 -7 -59 124 -61 46 128 -207 -195
7163 -195 -1 100 -27 141 15 128 37 -167 -218 -74 33 144 72 -45 196 306 174 108 61 -211 -129 58
7185 58 123 -265 -186 -80 -48 101 -157 -20 -11 100 -95 -234 -273 165 226 119 147 -33 -223 175 -34 -285 82
7208 82 169 20 40 -47 -149 -2 211 -238 3 -154 -147 111 -135 269 4 257 -63 24 -24 -111 277 154 358
$$ packed form
7047cj29L37l66L92j38J21l17qK34k8p4M7m0J60k80K19j84j58J37M1O9J86l07
7070h9j25J12J57nL07n72M41m13kO7J59m5r8J53M0j56J91k33J31k02n4J94l5N80
7094E03m79n9J11k22K26j22KJ15k9R8k01q2K23m5J07R0j50j82J49r5P7J77k84
7117g2R3o1k12J00M9J10M6j68J65j15K8K06n2Q1m04J07j39L08l7K0J03q1j61J95
7141A09J32j90L30l91m3J93k59n4j2J48J91j97J11k66J91n2J83j85J07Q2l35J2
7163a95J94J01j27J68j26J13r1k04n1J44J07J11p2j17K41J10j32o6m7k72Q2J87
7185E8O5l88P9J06L2J49k58J37RJ11j95j39l9M38O1j07K8j80j90L98k09k51L67
7208H2Q7j49K0q7j02J47K13m49K41j57PK58k46M04k65K53l20Q7m8q7L88j23K04
$$ plain form
7231 358 131 19 57 -293 216 -93 -31 -24 -70 83 62 -288 271 136 -56 -103 -92 181 101 87 103 -56 38 67
7255 67 -152 -99 -96 -42 152 32 75 -198 186 -34 -49 21 -124 -157 5 -111 -88 -142 -147 -301 86 -123 111 -59
7279 -59 3 98 18 -63 -170 -80 359 6 6 108 43 129 18 -61 -62 6 313 222 -146 -16 4 -22 -238 17 -154 -23
7305 -23 65 17 306 90 209 -161 -226 131 -155 -177 80 -36 -102 -120 83 373 119 59 70 -5 -95 -107 123 55
7329 55 -117 266 69 35 109 97 37 -60 -225 110 20 46 -137 -204 -124 -107 -227 54 40 -218 -27 -99 -27 -73 -128
7354 -128 -7 -186 -218 47 89 -185 107 -38 96 80 -72 -195 -1 -235 83 215 -18 128 165 -160 60
7375 60 118 -34 60 -53 152 -7 -220 158 63 -31 -79 -92 -79 -148 6 -32 -146 162 -29 -117 -52 -170 176 134
7399 134 -18 158 -111 27 -13 0 -82 25 74 222 365 7 -53 55 -53 -48 -77 -49 61 199 -48 -20 185
$$ packed form
7231C58k27j12L8l50N09l09O2Pm6J53k1l50N59j35j92m7J1K73q0j4J6j59R4K9
7255F7k19N3LN4J94j20M3k73L84k20j5P0j45l3J62j16K3n4nj54L87k09K34j70
7279e9O2R5q0q1j07R0M39l53%J02o5Q6j11p9jO8L07r1l68J30K0k6k16K55j71J31
7305b3Q8m8K89k16J19l70o5L57k86k2K57j16o6j8K03K90k54o0J1p5r0j2K30o8
7329E5j72L83j97l4P4j2o0r7j65L35r0K6j83o7Q0J7j20K81j4k58J91p2P2m6n5
7354a28J21j79l2K65M2k74K92j45J34j6j52j23J94k34L18J32k33J46L7l25K20
7375F0N8j52R4j13K05j59k13L78r5r4m8j3J3o9J54l8j14L08j91q8O5j18L46m2
7399A34j52J76k69J38m0J3q2J07M9J48J43l58o0J08j08Nk9K8J10J38k47K8K05
$$ plain form
7422 185 -164 -249 -164 57 67 -47 185 151 90 228 -12 -23 156 2 -200 20 105 200 23 269 -302 -36 -43
7445 -43 69 -51 -36 4 -195 -95 -65 -120 -69 151 127 -123 -55 205 -10 -66 50 107 115 69 260 -50 70 -252
7469 -252 -30 92 -41 -201 -129 134 103 61 122 -117 -40 -73 85 173 327 165 -236 123 28 -6 14 -96 -54 285
7493 285 -183 -67 163 219 -63 141 -238 -180 73 262 -35 -57 -174 63 -42 -118 138 -30 -216 -87 -120 -7
7515 -7 -15 -2 87 21 -42 84 -125 -212 253 53 -58 -29 -63 -103 -88 -87 49 165 -82 -42 -135 -146 -175 -223 -69 -106 -206
7542 -206 -112 114 -145 -90 -4 144 1 164 135 -74 -30 203 200 -77 131 -98 136 19 -15 32 -136 131 -148
7565 -148 -278 -120 -19 -12 -46 -60 13 -226 -302 124 -115 -18 42 -204 -72 145 -6 -63 -6 -313 -144 -184 -135 14
7589 14 119 -30 146 11 -56 -161 -50 53 1 -206 -178 48 -4 143 78 115 -87 135 3 -47 63 92 132
$$ packed form
7422A85l49q5Q5K21J0j14K32l4o1J38k40j1J79j54k02K20Q5R5j77K46n71K66p
7445d3J12j20J5M0j99J00L0n5N1K20k4k50O8K60k15n6J16N7Qm6J91l10J20l22
7469b52K22J22j33j60P2K63l1m2O1k39P7l3J58Q8J54j62m01L59r5l4K0j10M2L39
7493B85m68J16K30N6k82K04l79N8K53J89k97k2j17K37j05p6K56j68j86J29l3J13
7515gqJ3Q9o6o3J26k09q7M65k00j11K9l4m0J5JJ36J16k47M0r3j1k9m8J54l7j00
7542b06R4K26k59N5Q6J48j43J63k9k09M4K33lk77K08k29K34j17l4M7j68K67k79
7565a48j30J58J01Pl4j4P3k39p6M26k39R7O0k46J32K17j51n7N7l07J69m0M9J49
7589A4J05j49J76j35o7j05J11J03n2k07K8K26n2J47o5L7k02K22j32n0J10K9M0
$$ plain form
7612 132 45 -216 -68 -133 77 168 77 85 95 -84 -292 28 -145 374 161 123 -2 -273 -71 64 -206 -103 -167
7635 -167 9 119 234 171 -225 -158 -128 -118 111 57 -28 32 38 293 -276 -129 120 152 17 -34 -42 59 -257 -63
7659 -63 181 137 308 -6 3 45 -91 -134 0 33 90 208 -123 -32 1 -143 -2 52 114 -26 79 140 -171 151
7683 151 -154 -160 25 6 -3 -159 154 -201 85 -152 -29 -133 145 9 20 -134 -268 -257 -43 183 261 -226 -316
7706 -316 0 -126 157 36 317 106 -209 171 197 -176 123 -20 202 -107 1 99 60 160 138 46 -169 70
7728 70 -116 247 -74 -19 222 26 -37 -95 263 12 179 20 -336 -262 -266 21 -18 305 -53 -11 36 30 -1 76 -6
7753 -6 132 -234 -33 -134 77 131 49 16 -199 94 -118 65 62 160 14 -181 115 -104 -89 -16 25 -129 -49 -227
7777 -227 11 1 -137 -20 33 121 61 52 -99 112 18 -157 28 88 8 221 -7 34 178 -253 93 160 -155 -46
$$ packed form
7612A32q7k61J48o5K10R1r1QJ0j79k08L20j73N19k13l8j25k71K02J35k70J03o4
7635a67J76J10J15o3l96O7L0J0K29n4q5O0OK55n69J47K49L2j35n1qJ01l16J94
7659f3K44m4J71l14RM2j36m3J34L3N7J18l31R1L3j44J41N4O2j40J05O1l11L22
7683A51l05oJ85j9rj56L13l55K86k37J23j04K78j36J1j54j34J1K14K26P8m87r0
7706c16L16j26K83j21K81k11l15L80K6l73K99j43K22l09J08R8l9J00k2r2k15K39
7728G0j86L63l21N5K41j96o3n8L58k51J67j59l56P4mK87l9L23l58M2M7ol1P7q2
7753fJ38l66K01j01K11N4q2l3k15K93k12J83lR8j46j95K96k19J5P3M1j54Q0j78
7777b27K38j0j38J17N3Q8o0rj51K11r4j75J85O0q0K13k28M1J44m31L46O7l15J09
$$ plain form
7801 -46 -30 19 -311 67 82 47 48 94 80 61 159 -243 -70 75 178 23 158 -134 -15 328 -219 136 239 3
7825 3 -129 -17 75 76 62 59 -64 -25 1 32 -34 -161 14 127 -7 58 19 -29 86 39 56 -181 64 -33 -82 -8 104
7852 104 130 -127 89 -179 119 118 93 178 342 -68 -37 -51 -182 -26 101 139 123 113 -110 -98 -7 99 -77 161
7876 161 15 -180 232 -66 -327 -19 -146 7 -221 -17 -72 -28 131 -87 11 -197 -96 17 -63 -347 -143
7897 -143 23 33 -277 125 -198 209 10 147 154 -198 182 -241 208 235 -70 20 24 -62 -85 112 -34 -178 107
7920 107 -222 159 -119 -332 -89 164 356 -127 33 37 164 -355 -5 -98 117 187 59 -229 -75 95 -63
7941 -63 -11 80 -247 -98 -8 60 -79 -205 69 179 -265 42 -4 44 -82 -49 52 19 1 -7 79 -226 -139 196 -68
7966 -68 -86 121 -171 -57 52 11 76 -116 118 -23 -9 -126 23 13 190 138 229 -67 140 37 -157 -143 -58
$$ packed form
7801d6J6M9l30L78J5l5JM6j4j9R8m02J73J45J03j55J35k92J19L43n47L55J03k36
7825Cj32J12R2Jj4lj23L9K6L1o6j27J75J13j34O5l9m8J15m7J7k37K45r7m9P4J12
7852A04K6k57K16k68K98jk5Q5J64m10L1j4j31J56J27L8j6j0k23J2R1J06j76K38
7876A61j46j95M12k98k61L08j27J53k28K04n5M4J59k18R8k08J01J13q0k84K04
7897a43J66J0l10M02l23M07j99J37Pl52L80m23M49K7l05R0Mq6k3J97j46j44K85
7920A07l29L81k78k13K43K53J92m83J60MJ27n19L50r3K15P0j28k88J54J70j58
7941f3N2R1l27J49R0O8j39j26K74J10m44L07m6M8j26L3J01l3j8qQ6l05Q7L35k64
7966f8j8K07k92J14J09m1O5j92K34j41J4j17J49j0J77n2R1k96K07j03j94J4Q5
$$ plain form
7989 -58 -157 -73 35 -34 239 47 -111 112 -47 128 -55 -137 -57 -164 -45 -58 105 132 -78 -142 -105 136 -147
8012 -147 -137 -106 197 -66 83 -199 78 231 183 126 14 -29 -48 -17 -91 82 103 305 99 160 -84 35 -119
8035 -119 -6 -171 23 23 -71 -79 12 -154 255 -204 9 98 -216 -69 -58 -190 -93 -36 -223 247 -103 80 -15 43
8059 43 110 -38 196 -65 -87 29 110 13 -7 -246 43 209 -173 0 -151 37 36 53 -54 -40 -113 73 -1 -131
8083 -131 2 296 194 14 -106 15 -295 129 163 -166 -98 -24 -207 -197 -82 156 184 11 70 -190 138 134 150
8106 150 13 -148 -83 -58 -189 -65 160 26 96 -126 86 190 -216 62 -124 14 -110 -108 -355 -20 95 248
8128 248 63 -11 -191 -1 -245 100 -301 21 59 73 95 55 198 -97 -6 -373 209 -171 235 -84 90 -49
8150 -49 23 105 47 20 80 -55 -128 -122 144 31 -41 263 79 98 -49 49 22 -109 -136 324 -60 36 -383 -74 101
$$ packed form
7989e8r9Q4J08o9K73j92j58K23j59J75j83q2Q0j07J19j3J63K7k10o4L7K41k83
8012a47J0L1L03k63J49k82K77J53m8n7j12m3j9L1p4J73K1K02k06O1k44J19j54
8035a19J13j65J94%r4qR1j66M09m59K13Q9l14J47J1j32R7N7j87M70l50J83r5N8
8059D3O7j48K34k61k2J16Q1r7k0k39K89J66l82J73j51J88jJ7j07J4p3J86p4j30
8083a31J33K94j02j80j20J21l10M24L4l29O8P4j83J0J15K38K8j73N9k60L28mJ6
8106A50j37j61O5K5j31J24K25j34P0k22K12J04m06K78j86J38j24Kk47L35J15J53
8128B48j85p4j80J90k44L45m01L22L8J4K2m0J43k95R1l67N82l80M06l19J74j39
8150d9P2Q2n8k7O0j35p3OK66j13p2L04j84J9j47R8k7j31k7M60l84R6m19L09J75
$$ plain form
8175 101 -73 -181 63 11 41 0 -238 -197 15 -44 -53 93 27 94 75 303
$$ packed form
8175A01j74j08K44n2L0m1k38M1K12n9rJ46o6O7j9K28
8191C03
$$ Imaginary data points
##PAGE= N=2
##DATA TABLE= (X++(I..I)), XYDATA
$$ plain form
0 0 0 0 0 0 0 0 0 0 0 0 0 0 0 0 0 32 -32 32 -32 32 -33 64 -64 65 -96 97 -128 129 -161 192 -200 225 -257 303
34 303 -352 386 -433 482 -546 610 -675 747 -832 924 -1022 1123 -1244 1371 -1510 1662 -1831
51 -1831 2020 -2225 2455 -2714 3006 -3337 3720 -4160 4686 -5319 6091 -7071 8357 -10116
65 -10116 12707 -16902 24845 -45454 226677 437899 154771 2965 -110181 -67384 -42328
76 -42328 -42825 -145645 -241072 -306717 -270995 -184079 -55337 35185 77459 45417 -1910 -16176
88 -16176 71917 222216 347534 340048 202592 11981 -106861 -110338 -45100 -23194 -90316 -211564
100 -211564 -290410 -265334 -138788 12817 117617 141085 100639 34584 -4842 15869 92065
111 92065 173984 199652 132570 3415 -103154 -115499 -43568 30678 23458 -79400 -202422
$$ packed form
0@%%%%%%%%%%%%%%%L2o4O4o4O4o5R7j28J29j61J93k25K57k90L53l92M25m82N60
34C03o55P38q19R15j028J156j285J422j579J756j946K145k367K615k881L172l493
51a831L851m245M680n169N720o343P057p880Q846j0005J1410j3162J5428j8473
65a0116K2823k9609M1747p0299K72131K11222k83128j51806j13146M2797K5056
76d2328m97j02820r5427o5645L5722Q6916J28742R0522M2274l2042m7327j4266
88a6176Q8093J50299J25318p486j37456j90611j18842l477O5238K1906o7122j21248
100b11564p8846K5076J26546J51605J04800K3468m0446o6055l9426K0711P6196
111I2065Q1919K5668o7082j29155j06569j2345P1931P4246p220j02858j23022
$$ plain form
122 -202422 -240108 -151388 6587 134902 168844 113195 28278 -21616 -14660 27968 69829 77298
134 77298 35919 -37543 -97930 -99473 -29922 70625 123996 77267 -43485 -144884 -147862 -48120
146 -48120 77681 134571 86976 -12412 -79517 -70734 -7371 50702 55741 5534 -60640 -101179
158 -101179 -89010 -21521 75497 149978 152989 78065 -28603 -94422 -72685 10804 74343 54377
170 54377 -38760 -129389 -141702 -62924 41719 90564 55343 -24608 -85406 -85140 -23589 62604
182 62604 126949 141491 100985 26258 -39257 -53897 -14660 34845 37198 -30549 -129120 -176876
194 -176876 -125297 -5595 97224 115753 49034 -38836 -74404 -33982 43990 102929 108893 65363
206 65363 5382 -34536 -35550 -3381 36384 46660 1038 -83749 -152700 -150375 -68474 44580
$$ packed form
122b02422l7686Q8720J57975J28315L3942n5649q4917m9894O956M2628M1861P469
134G7298m1379p3462o0387j543O9551J00547N3371m6729j20752j01399k978R9742
146d8120J25801N6890m7595r9388o7105Q783O3363N8073N039n0207o6174m0539
158a01179J2169O7489R7018P4481L011p4924j06668o5819K1737Q3489O3539j9966
170E4377r3137r0629j2313P8778J04643M8845l5221p9951o0798K66O1551Q6193
182F2604O4345J4542m0506p4727o5515j4640L9237M9505K353o7747r8571m7756
194a76876N1579J19702J02819J8529o6719q7870l5568M0422P7972N8939N964m3530
206F5363n9981l9918j014L2169L9765J0276m5622q4787o8951K325Q1901J13054
$$ plain form
218 44580 111550 90041 9772 -53572 -47061 21324 93320 108677 55458 -21173 -65999 -54216
230 -54216 -2201 52163 69857 35726 -33096 -99607 -125515 -90215 -11167 59898 74122 27114
242 27114 -36537 -56987 -7309 75669 121229 87210 -1273 -78681 -90628 -33408 43561 81059
254 81059 58461 -3095 -63061 -89120 -69779 -21587 24876 41322 16176 -32693 -60797 -32355
266 -32355 43354 112423 119922 52517 -43461 -96864 -70363 6029 66525 65629 8889 -55845 -80947
279 -80947 -54366 -4486 34000 39458 9796 -34550 -61300 -46223 10344 78981 114692 84326
291 84326 5537 -65793 -78940 -28885 37815 61663 20427 -49553 -89181 -67840 -4282 54300
303 54300 67722 31635 -23410 -58496 -53156 -10397 46009 82606 74312 24262 -34763 -63799
$$ packed form
218D4580O6970k1509q0269o3344O511O8385P1996J5357n3219p6631m4826J1783
230e4216N2015N4364J7694l4131o8822o6511k5908L5300P9048P1065J4224m7008
242B7114o3651k0450M9678Q2978M5560l4019q8483p7408j1947N7220P6969L7498
254H1059k2598o1556n9966k6059J9341M8192M6463J6446k5146m8869k8104K8442
266c2355P5709O9069P499o7405r5978n3403K6501P6392O0496q96n6740o4734k5102
279h0947K6581M9880L8486N458k9662m4346k6750J5077N6567O8637L5711l0366
291H4326p8789p1330j3147N0055O6700K3848m1236o9980l9628K1341O3558N8582
303E4300J3422l6087n5045l5086N340M2759N6406L6597q294n0050n9025k9036
$$ plain form
315 -63799 -40027 15203 52586 35009 -27119 -84836 -89494 -32358 45925 87200 66119 5505
327 5505 -47229 -56765 -20406 30269 60664 52429 13589 -30973 -53044 -36137 7740 45535 46094
340 46094 2173 -58231 -88762 -60197 10515 72854 81976 35474 -27869 -56502 -31136 22303
352 22303 58487 51616 7552 -41174 -60434 -40132 3491 41574 50432 21462 -28873 -66566
364 -66566 -63366 -16904 42195 72358 49228 -7262 -49398 -42305 6876 57082 65612 23178 -37732
377 -37732 -71453 -57372 -10531 34999 50572 28651 -12524 -45144 -49532 -20540 25750 57062
389 57062 48972 6771 -38270 -49712 -15202 39941 69039 45036 -14828 -66674 -73608 -32399
401 -32399 21956 49210 35173 -3727 -36752 -41225 -13449 27410 53722 48096 13313 -29185
$$ packed form
315f3799K3772N5230L7383j7577o2128n7717m658N7136P8283M1275k1081o0614
327E505n2734r536L6359N0675L0395q235l8840m4562k2071J6907M3877L7795N59
340D6094m3921o0404l0531K8565P0712O2339R122m6502o3343k8633K5366N3439
352B2303L6184o871m4064m8726j9260K0302M3623L8083Q858k8970n0335l7693
364f6566L200M6462N9099L0163k3130n6490m2136P093M9181N0206Q530m2434o0910
377c7732l3721J4081M6841M5530J5573k1921m1175l2620m388K8992M6290L1312
389E7062q090m2201m5041j1442L4510N5143K9098k4003n9864n1846o934M1209
401c2399N4355K7254j4037l8900l3025m473K7776M0859K6312n626l4783m2498
$$ plain form
413 -29185 -50515 -32649 13504 51645 50733 7805 -47212 -72477 -48170 5296 46720 47401 11295
426 11295 -30354 -43149 -17167 27047 56974 53216 18351 -25881 -51007 -42383 -7225 29291
438 29291 40898 16705 -27656 -57801 -49237 -6433 41343 58374 32357 -14747 -43761 -31188
450 -31188 11457 51166 57507 24697 -23214 -53520 -49406 -17669 18414 34007 19137 -14402
462 -14402 -41531 -41508 -10462 33432 59231 46047 3373 -37033 -44776 -13800 30814 51797 31357
475 31357 -14612 -52363 -54843 -22421 19399 40754 29472 -1880 -29801 -35083 -12096 24675
487 24675 49773 44904 10831 -30451 -50872 -33516 6885 38316 35649 -41 -40620 -53475
499 -53475 -26972 19136 50583 47277 15408 -20695 -34291 -18217 13173 36458 34926 6520
$$ packed form
413b9185k1330J7866M6153L8141r12m2928n5017k5265K4307N3466M1424O81l6106
426A1295m1649j2795K5982M4214K9927l758l4865m4232k5126Q624L5158L6516
438B9291J1607k4193m4361l0145Q564M2804M7776J7031k6017m7104k9014J2573
450c1188M2645L9709O341l2810m7911l0306M114L1737L6083J5593j4870l3539
462a4402k7129K3L1046M3894K5799j3184m2674m0406p743L0976M4614K0983k0440
475C1357m5969l7751k480L2422M1820K1355j1282l1352k7921n282K2987L6771
487B4675K5098m869l4073m1282k0421J7356M0401L1431k667l5690m0579j2855
499e3475K6503M6108L1447l306l1869l6103j3596J6074L1390K3285j532k8406
$$ plain form
511 6520 -31534 -53820 -44075 -9133 27257 39462 18094 -19031 -39879 -25887 14635 52422
523 52422 59470 30482 -12370 -38460 -32281 -3744 22970 26272 1182 -34937 -56268 -48563 -15337
536 -15337 23614 44030 33996 4155 -20231 -19101 9196 44473 58450 37144 -5648 -41894
548 -41894 -48099 -23857 9003 22533 5144 -29005 -53936 -50118 -18155 23405 48260 44089 19139
561 19139 -6674 -13229 4700 33574 48778 35326 -1772 -41393 -57857 -40585 -4532 20624
573 20624 16623 -11927 -41109 -45935 -19211 21325 49049 48613 23831 -5026 -16598 -3821 21585
586 21585 38707 32652 2234 -35801 -56609 -47182 -15154 16628 25497 6273 -23622 -37302 -21020
599 -21020 14395 45091 49242 24980 -8368 -25769 -17314 8604 31741 33803 10630 -23622 -46210
$$ packed form
511F520l8054k2286R745L4942L6390J2205k1368l7125k0848J3992M0522L7787
523E2422P048k8988m2852k6090O179K8537K6714L302k5090l6119k1331P705L3226
536a5337L8951K0416j0034k9841k4386J130K8297L5277J3977k1306m2792l6246
548d1894o205K4242L2860J3530j7389l4149k4931L818L1963M1560K4855m171k4950
561A9139k5813o555J7929K8874J5204j3452l7098l9621j6464J7272L6053K5156
573B0624m001k8550k9182m826K6724M0536K7724m36k4782k8857j1572J2777K5406
586B1585J7122o055l0418l8035k0808R427L2028L1782Q869j9224k9895j3680J6282
599b1020L5415L0696M151k4262l3348j7401Q455K5918K3137K062k3173l4252k2588
$$ plain form
612 -46210 -43701 -17967 13548 27994 16130 -11173 -30531 -24747 3708 35714 46363 26679
624 26679 -7982 -32650 -31505 -6443 23090 34962 20702 -9026 -32547 -35036 -14482 14164
636 14164 29251 20237 -5421 -28242 -30533 -8569 23227 40138 30307 210 -29380 -37212 -17886
649 -17886 13148 32194 26849 1941 -23928 -30416 -13194 14454 31196 24221 -1200 -27818 -36642
662 -36642 -19964 10238 32609 32325 9947 -19000 -32740 -21565 4770 27453 28871 7954 -18940
675 -18940 -30719 -17734 10063 32068 31857 8551 -21620 -36640 -27316 -1123 23584 30156 14341
688 14341 -11420 -27107 -22540 -507 23039 29094 11869 -15640 -32795 -25595 1044 29018 37839
701 37839 21164 -8091 -28789 -27483 -7075 16629 25844 13472 -9920 -27613 -26633 -6594 18322
$$ packed form
612d6210K509K5734L1515J4446j1864k7303j9358N784K8455L2006J0649j9684
624B6679l4661k4668J145K5062K9533J1872j4260k9728k3521k489K0554K8646
636A4164J5087r014k5658k2821k291K1964L1796J6911r831l0097k9590p832J9326
649a7886L1034J9046n345k4908k5869o488J7222K7648J6742o975k5421k6618q824
662c6642J6678L0202K2371k84k2378k8947j3740J1175K6335K2683J418k0917k6894
675a8940j1779J2985K7797K2005k11k3306l0171j5020R324K6193K4707O572j5815
688A4341k5761j5687M567K2033K3546O055j7225k7509j7155P200K6639K7974Q821
701C7839j6675k9255k0698J306K0408K3704R215j2372k3392j7693R80K0039K4916
$$ plain form
714 18322 29324 17714 -8267 -29650 -30055 -8557 21204 37448 29456 4975 -18499 -24085 -9452
727 -9452 12813 22793 13116 -10539 -31461 -34600 -15785 11620 29060 25295 3882 -19358 -26820
740 -26820 -12015 13794 32502 30471 10184 -14078 -23953 -13195 7643 21187 15881 -6822 -31539
753 -31539 -40143 -25618 2753 26236 31520 15620 -6960 -18035 -9829 11082 28829 28754 10182
766 10182 -14754 -28283 -21986 -1214 17264 19715 1745 -23097 -37360 -29896 -5224 20999 31934
779 31934 21755 1537 -12090 -8703 9281 26488 28616 11165 -15640 -33185 -31533 -12246 10720
792 10720 20826 11248 -9764 -26750 -25996 -6656 18185 30346 23220 3615 -12796 -13744 2327
805 2327 21828 28122 15055 -10640 -32521 -36913 -21125 2977 18853 17017 885 -16233 -19342
$$ packed form
714A8322J1002j1610k5981k1383m05K1498K9761J6244p992k4481k3474n586J4633
727i452K2265R980r677k3655k0922l139J8815K7405J7440l765k1413k3240p462
740b6820J4805K5809J8708k031k0287k4262r875J0758K0838J3544n306k2703k4717
753c1539q604J4525K8371K3483N284j5900k2580j1075Q206K0911J7747p5j8572
766A0182k4936j3529O297K0772J8478K451j7970k4842j4263P464K4672K6223J0935
779C1934j0179k0218j3627L387J7984J7207K128j7451k6805j7545J652J9287K2966
792A0720J0106r578k1012j6986P54J9340K4841J2161p126j9605j6411r48J6071
805B327J9501O294j3067k5695k1881m392J5788K4102J5876j836j6132j7118l109
$$ plain form
818 -19342 -4606 17175 29801 24658 4403 -16251 -21719 -8875 12094 24996 19581 -1469 -24286
831 -24286 -33413 -23300 -1782 16018 18860 5744 -11445 -17096 -5776 14953 29559 27437 7521
844 7521 -16256 -27504 -19721 291 18331 20745 6216 -13981 -25254 -19599 -1470 16352 20707
857 20707 8122 -10118 -19427 -12497 7171 25947 28761 13409 -10496 -26321 -24906 -7786 11288
870 11288 18329 9710 -7468 -19312 -16900 -452 18185 24015 13219 -7038 -21983 -20795 -3664
883 -3664 17157 26022 17130 -2867 -20366 -23097 -10023 8140 17130 11400 -4235 -18149 -18194 -3256
897 -3256 16494 26345 19338 -452 -19625 -24707 -12335 7494 19837 17135 1590 -15174 -19955
910 -19955 -9447 7631 18756 15368 -540 -17298 -21505 -10022 9922 24290 23396 6973 -13206
$$ packed form
818a9342J4736K1781J2626n143k0255k0654n468J2844K0969J2902n415k1050k2817
831b4286r127J0113K1518J7800K842j3116j7189n651J1320K0729J4606k122j9916
844G521k3777j1248P783K0012J8040K414j4529k0197j1273N655J8129J7822M355
857B0707j2585j8240r309O930J9668J8776K814j5352k3905j5825J415J7120J9074
870A1288P041q619j7178j1844K412J6448J8637N830j0796k0257j4945J188J7131
883c664K0821Q865q892j9997j7499k731J3074J8163Q990n730j5635j3914m5J4938
897c256J9750R851p007j9790j9173n082J2372J9829J2343k702j5545j6764m781
910a9955J0508J7078J1125l388j5908j6758m207J1483J9944J4368q94j6423k0179
$$ plain form
923 -13206 -22345 -15469 1003 15101 15643 2583 -13419 -19572 -11651 5991 20263 20333 5884 -12966
937 -12966 -22481 -16451 1599 18850 22486 11320 -6724 -17908 -14943 -551 13345 15749 4471
950 4471 -12268 -21550 -16939 685 17908 22895 12882 -5338 -18967 -18168 -4047 13010 19267
963 19267 12151 -3723 -16102 -15157 -1850 13257 18124 9397 -8025 -21515 -21008 -6985 11438
976 11438 21247 16709 1233 -13671 -16368 -5856 9756 17569 12722 -2702 -16194 -17887 -5814
989 -5814 10402 19588 14973 -1075 -17473 -21784 -12419 4555 17101 16323 4045 -10261 -15143 -7012
1003 -7012 8037 18385 15631 1125 -14659 -20109 -11801 4681 17727 17912 5289 -11115 -18954
1016 -18954 -14040 237 13045 14977 4443 -9148 -16343 -9831 5219 18232 19181 7129 -9889
$$ packed form
923a3206r139O876J6472J4098N42j3060j6002o153P921J7642J4272P0j4449j8850
937a2966r515O030J8050J7251L636j1166j8044j1184K965J4392J3896K404j1278
950D471j6739r282M611J7624J7223M987j0013j8220j3629P99J4121J7057O257
963A9267p116j5874j2379R45J3307J5107M867q727j7422j3490N07J4023J8423
976A1438R809m538j5476j4904k697J0512J5612P813m847j5424j3492j693J2073
989e814J6216R186m615j6048j6398m311R365J6974J2546p78j2278j4306m882Q131
1003g012J5049J0348k754j4506j5784n450Q308J6482J3046J85j2623j6404p839
1016a8954M914J4277J2808J932j0534j3591p195O512J5050J3013R49j2052j7018
$$ plain form
1029 -9889 -19325 -15687 -1240 13211 16738 8522 -6189 -15772 -13916 -1589 11643 15011 6512 -8018
1043 -8018 -17615 -14775 -59 15551 20726 13000 -2726 -15439 -15863 -4891 8989 14947 8978 -4363
1057 -4363 -15546 -15391 -4037 10027 16548 10493 -3844 -16341 -16964 -5476 10217 19076 15702 2526
1071 2526 -10974 -14151 -6247 6252 13791 10103 -3012 -15630 -17941 -8336 6558 16839 14855
1084 14855 1863 -11838 -16208 -8742 5495 15808 15700 4180 -8681 -14095 -8125 4324 13690
1097 13690 12515 592 -13166 -19081 -12507 2060 14549 16400 6775 -6959 -14219 -10241 2580
1110 2580 13177 14516 5172 -7889 -14803 -11192 1123 12825 14859 6051 -8038 -17102 -14767 -1861
1124 -1861 11404 16045 9204 -3572 -12396 -10857 -277 10993 14068 6965 -6251 -15532 -14382 -2824
$$ packed form
1029i889r436L638J4447J4451L527q216j4711r583J856J2327J3232L368q499j4530
1043h018r597K840J4716J5610N175p726j5726j2713m24J0972J3880N958n969j3341
1057d363j1183J55J1354J4064O521o055j4337j2497o23J1488J5693Q859l374j3176
1071B526j3500l177P904J2499P539l688j3115j2618k311R605J4894J0281j984
1084A4855j2992j3701m370P466J4237J0313j08j1520j2861n414N970J2449R366
1097A3690j175j1923j3758n915O574J4567J2489J851r625j3734p260L978J2821
1110B580J0597J339r344j3061o914L611J2315J1702K034q808j4089r064K335J2906
1124a861J3265M641o841j2776q824J539J0580J1270L075p103j3216r281J150J1558
$$ plain form
1138 -2824 10020 15893 10946 -1762 -12898 -13844 -4709 7915 14306 10052 -2317 -12959 -13420 -4256
1152 -4256 8171 14411 9994 -2434 -13533 -15326 -6427 6744 15178 13319 2455 -8680 -12213
1165 -12213 -5937 5490 13071 10085 -1574 -12746 -16344 -8784 3877 13440 12548 2335 -8962
1178 -8962 -13533 -7828 4548 14516 14196 5079 -6863 -12374 -7976 2562 11621 10874 1345 -10849
1192 -10849 -17196 -12793 -558 10845 13492 6280 -4435 -11015 -8002 2646 12700 14857 7099
1205 7099 -4973 -13004 -10856 -742 9565 11634 4450 -7634 -15585 -13826 -3602 8145 13221
1218 13221 9192 -1243 -9498 -8679 152 10838 14921 9061 -2967 -13069 -13505 -4553 6225 11331
1232 11331 7428 -3579 -12314 -13240 -5004 6140 12621 10114 672 -8379 -9964 -3278 7764 14216
$$ packed form
1138b824J2844N873m947j2708j1136r46R135J2624O391m254j2369j0642m61R164
1152d256J2427O240m417j2428j1099j793Q899J3171Q434j859j0864j1135l533
1165a2213O276J1427P581k986j1659j1172l598P560J2661R563q92j0213j1297
1178h962m571N705J2376R968l20r117j1942n511M398J0538R059p47r529j2194
1192a0849o347M403J2235J1403K647p212j0715o580L013J0648J0054K157p758
1205G099j2072q031K148J0114J0307K069p184j2084p951J759J0224J1747N076
1218A3221m029j0435q255Q19Q831J0686M083n860j2028j0102m36Q952J0778N106
1232A1331l903j1007q735r26Q236J1144O481k507r442r051j585O686J1042O452
$$ plain form
1246 14216 11111 243 -10717 -13799 -7827 3351 10755 9152 -226 -9492 -12728 -6797 4295 11744
1260 11744 10757 2174 -7583 -11321 -6506 4314 12291 12216 3642 -7202 -12517 -8882 1506 9997 10472
1275 10472 3260 -7235 -12367 -8955 1349 10147 11601 4627 -5676 -11816 -9184 729 10322 12366
1289 12366 6101 -3957 -10712 -9032 -237 8533 11069 4981 -4663 -12101 -11006 -2171 7695 11269
1303 11269 6588 -3230 -10865 -9908 -1798 7927 12185 8047 -1566 -9233 -9508 -2712 6370 11187 7154
1318 7154 -2259 -10586 -11620 -5007 4704 10730 8378 -362 -8624 -10202 -4164 6051 11971 9594 667
1333 667 -8028 -10413 -4953 4001 10241 8309 247 -8482 -11686 -6762 2251 9620 9492 2211 -6319
1348 -6319 -10155 -5977 3326 10788 10422 2897 -6147 -10826 -6977 1667 8904 9042 2572 -6329 -10840
$$ packed form
1246A4216l105j0868j0960l082N972J1178P404j603r378r266l236N931J1092P449
1260A1744r87q583r757l738M815J0820P977p5q574j0844n315L635J0388Q491M75
1275A0472p212j0495n132L412J0304Q798J454o974j0303o140K632R913R593K044
1289A2366o265j0058o755J680Q795Q770K536o088r644p438J095Q835R866L574
1303A1269m681r818p635R57Q110R725M258m138r613p667k75O796R082M817m033
1318G154r413q327j034O613R711O026k352q740q262j578O038J0215N920k377q927
1333F67q695k385N460Q954O240j932q062q729l204M924R013P369j28p281q530
1348f319l836M178R303P462l66p525r044m679L849Q644P237J38o470q901m511
$$ plain form
1363 -10840 -7915 679 8451 10090 4550 -4095 -10021 -7567 487 8676 10328 4819 -4260 -10440 -8656
1378 -8656 -683 7359 9801 4995 -3971 -9575 -8353 -1042 7105 10432 6171 -2644 -8899 -8710 -2207
1393 -2207 6127 9872 5991 -2301 -9182 -9057 -2852 5584 10155 6966 -1157 -8370 -9645 -3362 4964
1408 4964 9937 7539 -861 -8145 -9606 -4137 4035 9119 7241 179 -7316 -9137 -4220 3976 9701
1423 9701 8722 1517 -6553 -9618 -5519 2501 8286 7601 722 -6607 -9958 -5771 2340 8485 8416 2403
1439 2403 -5093 -8689 -5470 2186 8596 9015 3724 -4474 -9139 -6909 105 6730 7769 2393 -5429
1454 -5429 -9815 -7252 436 7517 9316 4829 -2997 -7833 -6522 150 6602 8731 4601 -3166 -8597
1469 -8597 -7839 -1561 5305 7992 4487 -3344 -9046 -8187 -1506 6021 9623 6449 -392 -6391 -6795 -1552
$$ packed form
1363a0840K925Q594P772J639n540q645n926K454Q054Q189J652n509r079o180J784
1378h656P973Q042K442m806q966n604J222P311Q147L327m261q815o255J89O503
1393b207Q334L745l881q292o881J25O205Q436M571l189q123p213j275O283Q326
1408D964M973k398q400p284j461N469Q172N084j878p062p495j821M917Q196N725
1423I701r79p205q070l065M099Q020N785o85o879p329l351M187Q111O145o9o013
1439B403p496l596L219P656O410M19n291q198m665K230P014O625J039n376p822
1454e429m386K563P688P081J799m487p826m836J311O672O452K129m130p767n431
1469h597P58O278O866K687l505p831n702Q59O681P527L602l174o841n999m04N243
$$ plain form
1485 -1552 4965 8406 5701 -1784 -7775 -8364 -3773 3593 7777 5358 -1068 -7349 -8377 -3639 4251
1500 4251 8863 7412 1403 -5047 -6702 -2923 3664 7938 6589 -94 -7128 -9280 -5762 1536 7177
1515 7177 6643 1260 -5278 -7961 -4418 2654 7789 7743 2802 -3810 -6881 -4497 2066 7265 7652 1868
1531 1868 -5511 -9581 -7214 -726 5490 7031 2758 -3603 -6964 -4787 1066 6982 8526 4396 -2345
1546 -2345 -6830 -5744 -487 5757 7530 3553 -3607 -8296 -7810 -2595 4107 6836 4178 -1652 -5994
1561 -5994 -5429 22 6073 8763 5764 -1005 -6449 -6969 -2682 3661 6866 4588 -1569 -6932 -7678 -3405
1577 -3405 3048 6894 4816 -437 -5311 -6119 -2130 4752 8405 6469 969 -5322 -7269 -4309 1744
1592 1744 5751 4836 -200 -5392 -7154 -3713 2298 6684 6195 1504 -4132 -6650 -4046 2174 6862
$$ packed form
1485a552O517L441k705p485n991n89M591P366M184k419o426o281j028M738P890
1500D251M612j451o009o450j655L779O587M274j349o683p034k152L518P298N641
1515G177n34n383o538k683L543P072N135m6m941o612l071K384O563N199L87n784
1531A868p379m070K367O488O216J541m273o361l361K177N853N916J544m130o741
1546b345m485J086N257O244J773l977p160m689M86N215O702K729k658n830m342
1561e994N65N451O051K690k999o769n444n20M287O343L205k278o157n363p46M273
1577c405O453L846k078n253m874q08L989O882L653j936n500o291j947K960O053
1592A744M007r15n036n192j762L441O011M386m89m691n636k518K604O220M688
$$ plain form
1607 6862 6943 2289 -3832 -7094 -5145 427 4945 5631 1577 -3964 -6822 -4402 1535 6516 7286 3223
1623 3223 -2964 -6535 -5133 -281 4809 6365 2973 -2510 -6186 -5421 -820 4436 6402 3294 -2503
1638 -2503 -6241 -5266 -343 5230 7262 4573 -1106 -5774 -5836 -2148 3055 5713 3112 -1876 -5897 -5888
1654 -5888 -1491 3911 6942 4869 -484 -4918 -5333 -1780 3629 6424 4741 -243 -4868 -6478 -3454
1669 -3454 1849 4914 3811 -790 -5313 -6187 -2447 3210 7039 6307 1928 -3367 -5303 -3229 1603
1684 1603 4983 4689 692 -4441 -6701 -4326 587 4788 4670 947 -3682 -5948 -3603 1846 6024
1699 6024 7054 3587 -1724 -4741 -3713 499 4127 4444 1188 -3736 -6961 -5493 -779 4117 5319
1714 5319 3186 -1920 -5035 -4005 378 5099 6555 4267 -651 -4339 -4423 -1054 3091 4735 1743
$$ packed form
1607F862Q1m654o121l262J949N572M518O86m054n541k858K420N937M981P70m063
1623C223o187l571J402M852N090J556l392n483l676P65M601N256J966l108n797
1638b503l738R75M923N573K032k689n679m668o2L688N203K658k601m988m021R
1654e888M397N402L031k073n353m434m15L553N409K795j683m984m625j610L024
1669c454N303L065j103m601m523q74L740N657L829p32m379n295j936K074M832
1684A603L380k94l997n133k260K375M913M201j18l723m629k266K345N449M178
1699F024J030l467n311l017J028M212L628L17l256m924l225J468M714M896J202
1714E319k133n106l115J030M383M721J456k288m918l688q4L369M145J644k992
$$ plain form
1729 1743 -3120 -6468 -6050 -2196 3038 5618 4049 114 -3371 -3901 -645 3929 6053 4070 -410
1744 -410 -4567 -4980 -2135 2014 4169 2943 -1236 -5379 -6329 -3125 1670 5279 5065 1366 -2553 -3778
1760 -3778 -1150 2640 5255 4683 473 -3979 -6018 -3779 407 3769 3753 412 -3666 -5729 -3436 764
1776 764 4691 5400 2267 -1691 -3870 -2205 1506 4886 4905 1160 -3150 -5854 -4905 -646 2725 4194
1792 4194 1771 -2206 -4514 -3421 418 4283 5502 3043 -1000 -3712 -2971 -39 4075 4613 2344
1807 2344 -2037 -5208 -5057 -1854 2200 3927 2449 -1139 -3680 -3429 -493 3625 5264 3365 -339
1822 -339 -3937 -4376 -1689 2366 4366 3121 -650 -4062 -4574 -2042 1976 3886 3317 -133 -3347 -4180
1838 -4180 -1187 2625 4713 3708 436 -3208 -4619 -2765 984 3545 3569 790 -2710 -4115 -2056
$$ packed form
1729A743m863l348M18L854N234K580j569l935l485n30L256M574K124j983m480
1744d10m157m13K845M149K155j226m179m143r50L204M795L609k14l699l919j225
1760c778K628L790K615n72m210m452k039K239M186L362j6l341m078k063K293M200
1776G64L927P09l133l958k179J665L711L380J9l745m310k704R49M259L371J469
1792D194k423l977k308J093L839L865J219k459m043k712P41K932M114N38k269
1807B344m381l171J51L203M054J727j478l588k541K51K936M118J639j899l704
1822c39l598m39K687M055K000j245l771l412n12K532M018J910n69l450l214q33
1838d180K993L812K088j005l272l644j411J854L749K561K4k779l500j405K059
$$ plain form
1853 -2056 1381 4091 4173 930 -2632 -4390 -2453 982 3939 4166 1398 -2476 -4232 -3219 -87 3004
1869 3004 3647 1464 -1972 -3727 -2554 297 3883 4535 1886 -1816 -4109 -3543 -723 2767 3548 1720
1885 1720 -1738 -3923 -3316 -241 2951 4086 2269 -940 -3305 -3058 -284 3136 4362 3164 -740
1900 -740 -3582 -4200 -1650 1704 3214 2051 -765 -3465 -3522 -1099 2339 3974 3198 -32 -2681 -3083
1916 -3083 -1289 2062 3778 3159 237 -2766 -3969 -2581 1026 2809 2467 -91 -3116 -3865 -1990 1783
1932 1783 3691 3713 879 -1815 -3320 -1775 656 3174 3330 732 -2157 -3492 -2341 253 2453 2931
1948 2931 708 -2128 -3594 -2976 300 3108 4010 1675 -1273 -3146 -2275 523 2677 3200 1470 -1774
1964 -1774 -2969 -2888 -420 2219 2917 1366 -1424 -3424 -3117 -1054 1958 3367 2442 -554 -2561 -2507 -294
$$ packed form
1853b056L437K710Q2l243l562j758J937L435K957K27k768l874j756J013L132L091
1869C004O43k183l436j755J173K851L586O52k649l702k293N66K820L490P81j828
1885A720l458k185O07L075L192J135j817l209k365K47K774L420J226j198l904
1900g40k842o18K550L354J510j163k816k700n7K423L438J635p76l230k649m02
1916c083J794L351J716o19k922l003j203J388L607J783l42k558l025p49J875L773
1932A783J908K2k834k694j505J545K431K518J56k598k889j335J151K594K200M78
1948B931k223k836j466O18L276K808R02k335k948j873Q71K798K154N23j730l244
1964a774j195Q1K468K639O98j551k790k000L07K063L012J409r25k996k007N4K213
$$ plain form
1981 -294 2564 3585 2035 -840 -3214 -3036 -1039 1617 2902 1751 -584 -2747 -3322 -1381 1103 2653
1997 2653 2397 102 -2022 -2710 -1124 1908 3634 2878 488 -2740 -3190 -1495 926 2327 2127 -136
2013 -136 -2391 -3209 -1815 628 2494 2576 665 -1746 -2515 -1488 914 2949 3323 1113 -2114 -3439
2029 -3439 -2528 156 2131 2237 362 -1911 -2986 -2070 493 2567 2743 1163 -1153 -2388 -1873 223
2045 223 2240 2673 1328 -1042 -2830 -2662 -587 1836 2798 1321 -978 -2405 -2530 -75 2221 3031
2061 3031 1884 -714 -2463 -2131 -616 1274 2159 1213 -619 -2449 -2446 -758 1496 2939 2253 60 -2048
2078 -2048 -2414 -835 1493 2938 2001 29 -2158 -2886 -1214 827 2049 1360 -123 -1918 -2195 -1380
2094 -1380 1171 2511 2550 865 -1205 -2400 -1402 628 2218 2280 94 -2074 -3056 -1980 118 2007
$$ packed form
1981b94K858J021j550k875k374J78J997K656J285j151k335k163n75J941K484J550
1997B653k56k295k124o88J586L032J726p56k390l228m50J695K421J401k00k263
2013a36k255q18J394K443J866Q2j911k411p69J027K402K035L74k210l227j325
2029c439R11K684J975J06j875k273j075R16K563K074J76j580k316j235N15K096
2045B23K017M33j345k370j788J68K075K423R62j477k299j427j25K455K296Q10
2061C031j147k598j749L32J515J890Q85r46j832j830LJ688K254J443o86k193k108
2078b048l66J579K328J445r37j972k187p28J672K041J222o89j483j795k77Q15
2094a380K551J340L9j685k070j195R98K030J590O2k186k168r82J076K098J889
$$ plain form
2110 2007 1759 -56 -1618 -2136 -1315 959 2569 2617 1101 -393 -1827 -1599 -36 1711 1797 174 -1477
2127 -1477 -2891 -2437 -613 1666 2085 897 -1051 -1878 -1422 642 2258 2613 1538 -108 -1830 -1744 -438
2144 -438 916 1890 749 -812 -2424 -2470 -1012 1157 2056 1851 -25 -1650 -1667 -208 1890 2489 1926
2161 1926 -118 -1869 -1928 -597 863 1575 1084 -262 -1593 -2009 -1034 773 1803 1892 310 -1385 -2069
2178 -2069 -1134 505 2227 1689 -34 -1894 -2068 -1130 439 1553 1360 130 -1237 -1729 -1145 344 1983
2195 1983 1688 627 -671 -1919 -1429 -246 1712 1644 780 -804 -1901 -1406 284 1783 2317 810 -804
2212 -804 -1304 -876 441 1502 1487 609 -711 -1821 -1805 -512 820 1360 713 -404 -1535 -1570 -286 1617
2230 1617 2082 1495 -166 -1664 -1495 -369 1285 1450 740 -516 -1779 -1577 -641 608 1116 952 -86
$$ packed form
2110B007k48j815j562n18Q21K274J610M8j516j494j434K28J563J747Q6j623j651
2127a477j414M54J824K279M19j188j948q27M56K064J616L55j075j646j722Q6J306
2144d38J354R74j141j561j612m6J458K169Q99k05j876j625j7J459K098N99n63
2161A926k044j751n9J331J460P12m91j346j331m16R75J807J030Q9j582j695o84
2178b069R35J639J722n38j723j860j74R38J569J114j93j230j367m92N84J489J639
2195A983k95j061j298j248M90J183J958o8q64j584j097M95J690J499N34j507j614
2212h04n00M28J317J061j5q78j320j110J6J293J332N40o47j117j131l5J284J903
2230A617M65n87j661j498J69J126J654J65p10j256j263K02R36J249N08j64j038
$$ plain form
2247 -86 -1055 -1362 -387 809 1847 1793 314 -1183 -1410 -561 660 1481 1021 -288 -1684 -1689 -920 464 1501
2266 1501 992 114 -735 -966 -732 469 1603 1592 678 -540 -1393 -1065 162 955 1321 173 -1071 -1777
2284 -1777 -1320 111 1318 1474 159 -756 -1270 -585 314 1376 1225 488 -215 -1074 -980 -435 877 1202
2302 1202 718 -509 -1482 -1224 -199 1205 1470 886 -652 -1486 -1157 -47 992 1267 708 -185 -863 -933
2320 -933 -366 753 1381 741 -111 -1029 -1467 -488 656 1225 811 -131 -1363 -1248 -238 842 1033 874
2338 874 -108 -802 -1177 -123 697 954 900 -46 -813 -1066 -701 190 921 1014 15 -730 -1217 -698 270 1261
2358 1261 1431 86 -953 -1176 -457 542 1273 878 264 -737 -1126 -794 -50 748 863 136 -558 -1140 -692
2377 -692 124 843 1095 573 -581 -989 -755 234 877 942 453 -413 -770 -689 303 475 615 445 -202 -884
$$ packed form
2247h6r69l07R75J196J038n4j479j497k27Q49J221Q21m60j309j396nP69J384J037
2266A501n09q78q49k31K34J201J134j1r14j218q53L28J227P93L66j148j244p06
2284a777M57J431J207J56j315r15n14O85Q99J062j51p37p03q59R4N45J312L25
2302A202m84j227r73K58J025J404K65n84j538q34L29J110J039K75n59q93o78p0
2320i33N67J119O28o40q52r18m38R79J144N69m14r42j232J15J010J080J91j59
2338H74r82o94l75J054Q20K57n4r46p67k53L65Q91P31R3r99p45m87N19R68R91
2358A261J70j345j039k23P19R99P31l95o14j001l89L32P44P98J15p27o94n82M48
2377f92Q16P19K52n22j154m08K34R89O43O5m89q66l57Q1R92J72J40j70o47o82
$$ plain form
2397 -884 -718 -193 402 851 550 -46 -855 -843 -412 523 1010 764 -242 -799 -718 20 514 838 600 -277
2417 -277 -962 -831 -510 76 733 757 52 -684 -726 -307 90 1103 831 -232 -481 -677 -275 289 767 706
2437 706 -218 -688 -862 -646 162 841 383 -25 -310 -680 -148 366 677 975 292 -285 -641 -596 90 522
2457 522 798 -22 -853 -856 -761 -16 597 634 126 -471 -486 -510 270 701 889 349 12 -417 -795 -308 387 418
2479 418 277 -443 -753 -637 -341 371 545 388 -316 -577 -400 -162 331 811 406 45 -455 -674 -356 186
2499 186 359 257 -298 -295 -706 -425 204 753 733 -85 -400 -369 192 369 1008 429 77 -254 -413 -288 -70
2520 -70 328 325 13 -456 -589 -316 67 447 615 210 -366 -525 -249 317 818 378 -135 -512 -604 -211 42
2541 42 274 148 -41 -313 -224 16 115 293 517 220 18 -194 -36 122 486 387 256 -250 -810 -235 141
$$ packed form
2397h84J66N25N95M49l01n96q09J2M31R35M87k46j006n57Q1P38M94L24k38q77
2417b77o85J31L21N86O57K4p05p36m2M19L97J013k72j063k49j96M02N64M78o1
2437G06r24m70j74K16Q08O79m58m08k85l70N32N14L11K98o83n77l56M5O86M32
2457E22K76q20q31lR5P45O13L7n08n97j5k4P80M31J88n40l37m29l78M87O95L1
2479D18j41p20l10J16K96P12J74j57p04k61J77K38M93M80m05l61n00k19L18N42
2499A86J73j02n55Lm11K81O29N49k0q18l15L1N61J77O39n79l52l31j59J25K18
2520g0L98ll12m69j33K73L83L80J68m05n76j59K76N66N01m40n13l77r2L93K53
2541D2K32j26j89k72Q9K40R9J78K24k97k02k12J58J58L64r9j31n06n60N75L76
$$ plain form
2562 141 400 532 -76 -262 -379 -189 223 214 327 419 -15 -547 -389 104 526 318 309 -166 -470 -217 -159 351
2584 351 436 218 -23 -208 -444 339 260 453 265 -185 -209 -460 -142 159 83 326 -15 -258 -558 -303 311
2605 311 415 435 119 -182 -407 -117 351 484 95 -93 -475 -349 12 -67 358 -85 -338 -74 -298 -151 161
2626 161 344 229 222 95 -110 -65 91 280 364 -162 -73 -368 -385 -146 142 -25 -272 -64 0 209 66 194
2648 194 252 86 -11 -258 -210 58 180 249 79 -263 -173 -29 107 73 55 43 -246 2 -110 114 230 257 192
2671 192 -74 -92 93 7 322 238 24 22 -92 -110 -7 111 -47 28 -328 125 -39 -94 294 489 -27 94 -316
2694 -316 -194 -66 -21 199 -84 -57 -31 9 -187 138 -95 187 164 -103 -156 357 281 105 -15 -266 -5 -84 8
2717 8 165 59 -46 -127 -57 18 284 48 -32 167 -78 -245 -257 93 85 225 -23 -184 -39 119 172 115 70 -12
$$ packed form
2562A41K59J32o08j86j17J90M12rJ13R2m34n32J58M93M22k08rm75l04K53N8N10
2584C51Q5k18k41j85k36P83p9J93j88m50k4k51L18L01p6K43l41k43l00K55O14
2605C11J04K0l16l01k25K90M68J33l89j88l82J26L61p9M25m43k53K64k24J47L12
2626A61J83j15pj27k05M5J56J89Q4n26Q9k95j7K39K88j67k47K08O4K09j43J28
2648A94N8j66r7k47M8K68J22O9j70l42R0J44J36l4j8j2k89K48j12K24J16K7o5
2671A92k66j8J85q6L15q4k14kj14j8J03J18j58P5l56M53j64n5L88J95n16J21m10
2694c16J22J28M5K20k83K7K6M0j96L25k33K82k3k67n3N13p6j76j20k51K61p9R2
2717HJ57j06j05q1P0P5K66k36q0J99k45j67j2L50qJ40k48j61J45J58N3n7m5q2
$$ plain form
2741 -12 -94 -115 -278 138 -23 -47 11 50 65 -102 -289 141 110 -229 -304 -86 136 316 226 125 199 -58 -317 41
2765 41 86 241 5 -55 118 -143 107 37 428 163 -53 -237 60 -103 66 71 105 246 -318 -125 -89 301 -27
2788 -27 18 20 -127 192 -99 201 542 238 92 -58 -180 43 -57 174 39 148 -163 -278 16 52 141 34
2810 34 -100 -58 111 -48 383 367 124 -23 -106 -233 -86 120 174 166 66 -13 -509 -402 82 168 52 27 -157
2833 -157 -192 -240 79 97 106 -230 -308 -417 -516 250 283 98 91 -273 -194 -231 -59 260 271 159 -70 -428 -488 170 177
2858 177 422 159 -100 -257 12 -67 129 82 414 -186 -153 -202 -23 453 334 -84 -165 -310 -198 -136 273 144
2880 144 233 -47 -504 -122 -79 -31 284 19 -160 -280 -255 -43 -45 249 -146 11 -542 -321 -373 327 290 127 -255
2903 -255 -187 -223 94 64 451 339 -144 -173 -160 -183 -20 88 450 -11 -320 -407 70 106 268 103 76 -332 -304
$$ packed form
2741a2q2k1j63M16j61k4N8L9J5j67j87M30l1l39p5K18K22J80r0j01P4k57k59L58
2765D1M5J55k36o0J73k61K50p0L91k65k16j84K97j63J69NL4J41n64J93L6L90l28
2788b7M5Kj47L19k91L00L41l04j46j50j22K23j00K31j35J09l11j15K94L6Q9j07
2810C4j34M2J69j59M31j6k43j47q3j27J47K06N4qj00p9m96J07M84Q6j16k5j84
2833a57l5m8L19J8Rl36p8j09r9P66L3j85pl64P9l7J72L19J1j12k29l58o0O58P
2858A77K45k63k59j57K69p9J96m7L32o00L3m9J79M76j19m18q1j45J12O2M09j29
2880A44Q9k80m57L82M3M8L15k65j79j20K5K12kK94l95J57n53K21n2P00l7j63l82
2903b55O8l6L17l0L87j12m83k9J3k3J63J08L62m61l09q7M77L6J62j65k7m08K8
$$ plain form
2926 -304 -66 122 541 347 31 -314 -515 -225 400 307 -5 19 -107 -357 -31 106 323 210 213 -229 -92
2947 -92 -161 -36 312 489 173 -287 -355 -411 37 603 285 -49 -202 -425 -327 14 339 355 102 -287 -118 -407
2969 -407 168 364 203 527 -168 -284 -177 56 498 306 280 -48 -382 -397 -179 378 461 306 0 -391 -284
2990 -284 -208 397 524 303 -10 -624 -511 -104 210 363 285 -30 -240 -594 128 326 502 322 -142 -159 -382
3011 -382 46 -10 281 440 -26 -527 -369 -85 237 646 570 37 -239 -288 -569 439 520 208 87 -89 -459
3032 -459 -155 150 282 475 273 -515 -438 -349 42 477 405 226 -357 -423 -336 127 336 473 418 -226 -327 -286
3054 -286 26 530 586 232 -163 -678 -325 207 291 559 295 -199 -175 -197 220 287 412 379 -167 -469 -438 -56
3076 -56 340 514 146 -318 -468 -542 -181 651 582 142 56 -341 -617 -84 335 691 -81 -142 -496 -781 -351 272
$$ packed form
2926c04K38J88M19j94l16l45k01K90O25r3l12K4j26k50L26J37K17j13Lm42J37
2947i2o9J25L48J77l16m60o8n6M48N66l18l34j53k23R8L41L25J6k53l89J69k89
2969d07N75J96j61L24o95j16J07K33M42j92k6l28l34j5K18N57Q3j55l06l91J07
2990b84P6O05J27k21l13o14J13M07L14J53p8l15k10l54P22J98J76j80m64j7k23
3011c82M28n6K91J59m66n01J58K84L22M09p6n33k76m9k81J008Q1l12j21j76l70
3032d59L04L05J32J93k02p88P7Q9L91M35p2j79n83o6Q7M63K09J37n5o44j01M1
3054b86L12N04N6l54l95n15L53N32Q4K68k64m94K4k2M17O7J25l3n46l02L1L82
3076e6L96J74l68m64j50p4L61Q32o9m40q6l97k76N33M19L56p72o1l54k85M30O23
$$ plain form
3098 272 574 348 173 -612 -619 -92 298 421 530 -87 -525 -666 -256 11 559 421 -271 -108 -607 -280 144
3119 144 681 572 -38 -388 -444 -335 30 558 551 167 -541 -616 -195 71 429 472 135 -211 -691 -380 193 524
3141 524 859 476 -386 -401 -366 219 616 784 313 -309 -466 -346 45 187 588 321 -53 -536 -580 -54 259
3162 259 441 161 -21 -337 -580 -132 217 593 540 -333 -659 -587 -168 465 383 306 -150 -660 -557 18 471
3183 471 782 705 -235 -523 -604 -518 382 357 441 -103 -609 -683 -234 340 678 284 -107 -386 -805 -136 201 729
3205 729 715 48 -164 -601 -123 401 323 418 83 -460 -699 -508 71 403 566 190 -317 -465 -276 150 476
3226 476 852 273 -123 -517 -584 126 676 353 -11 -284 -671 -410 -105 472 699 33 -264 -578 -552 -109 277
3247 277 681 225 -182 -671 -706 -186 176 594 574 -216 -587 -255 8 531 324 346 -290 -540 -638 -306 201
$$ packed form
3098B72L02k26j75p85pN27L90J23J09o17m38j41M10K67N48j38o92J63m99L27M24
3119A44N37j09o10l50n6J09L65N28pl84p08p5M21K66L58M3l37l46m80L11N73L31
3141E24L35l83q62j5L5N85L97J68m71o22j57J20L91J42M01k67l74m83m4N26L13
3162B59J82k80j82l16k43M48L49L76n3q73l26P2M19O33q2p7m56n10J03N75M53
3183D71L11p7r40k88q1Q6R00k5Q4n44n06p4M49N74L38l94l91k79m19O69L37N28
3205G29j4o67k12m37M78N24p8R5l35n43k39J91N79L32J63l76n07j48J89M26L26
3226D76L76n79l96l94o7P10N50l23l64k73l87K61L05N77K27o66k97l14K6M43L86
3247B77M04m56m07m89l5N20L62M18k0p90l71L32K63N23k07K2o36k50r8L32N07
$$ plain form
3268 201 681 428 -182 -565 -736 -488 366 657 527 31 -382 -457 -227 447 727 552 262 -515 -1003 -436
3288 -436 185 504 560 -81 -548 -593 -461 437 595 529 133 -311 -552 -248 24 440 327 -161 -570 -977 -651
3309 -651 -9 577 445 261 -197 -681 -709 34 781 784 552 -377 -573 -553 -175 346 713 224 -219 -614 -841
3330 -841 171 584 763 417 -282 -543 -701 -89 831 760 305 -238 -532 -497 -275 302 781 299 42 -687
3350 -687 -651 -43 506 852 473 -29 -488 -561 -304 665 635 332 19 -581 -967 -232 439 457 340 111 -442
3371 -442 -520 -184 146 976 726 71 -258 -614 -517 245 584 479 193 -403 -636 -549 -48 618 517 340 -612
3392 -612 -645 -399 92 538 836 259 -189 -579 -541 3 647 668 322 -482 -668 -368 18 683 756 168 -243
3413 -243 -824 -459 47 627 683 106 -277 -887 -776 -162 473 687 430 -451 -755 -560 214 545 925 487
$$ packed form
3268B01M80k53o10l83j71K48Q54K91j30m96m13p5K30O74K80j75k90p77m88N67
3288d36O21L19N6o41m67m5J32Q98J58o6l96m44k41L04K72M16j13m88m09m07L26
3309f51O42N86j32j84m58m84k8P43P47Lk32r29j96K0L78N21L67m89m43l95k27
3330h41J012M13J79l46o99k61j58O12R20p1m55n43k94L5K22N77M79m82k57p29
3350f87L6O08N49L46l79n02m59p3K57R69l0l03l13o00l86P35O71J8j17k29n53
3371d42p8L36L30Q30k50o55l29l56R7P62L39j05k86n96k33Q7N01O66j01j77r52
3392f12l3K46M91M46K98n77m48l90L8N44O44K1l46q04j86L00L86O65P3n88m11
3413b43n81L65N06N80N6n77l83o10J11O14O35K14k57q81l04J95P74L31L80m38
$$ plain form
3433 487 -299 -479 -624 -75 411 832 456 -130 -627 -700 -24 623 939 647 -85 -682 -742 -354 367 654 659
3454 659 17 -444 -701 -283 188 480 632 26 -661 -761 -444 121 645 692 86 -775 -648 -354 -88 917
3474 917 570 114 -539 -486 -447 127 631 628 170 -304 -685 -440 10 606 607 142 -246 -865 -669 17 449 708
3496 708 310 -430 -517 -730 41 556 744 343 -258 -607 -608 -275 446 712 371 -348 -655 -717 -252 415 823
3517 823 433 37 -388 -644 -102 421 1010 596 -42 -538 -889 -582 273 823 494 -173 -698 -795 -188 313
3537 313 868 721 -69 -394 -884 -260 312 858 411 101 -549 -947 -271 88 535 733 280 -487 -641 -345
3557 -345 282 813 877 316 -407 -680 -610 25 669 755 261 -445 -655 -450 178 734 781 311 -61 -729 -270
3578 -270 145 632 488 444 -352 -714 -740 -259 640 655 257 -466 -688 -721 3 496 943 531 -131 -768 -394
$$ packed form
3433D87p86j80j45N49M86M21l76n86m97p3O76O47L16k92p32n97o0L88P21K87N
3454F59o42m61k57M18M71K92J52o06o87j00L17N65N24M7o06q61J27K94K66J005
3474I17l47m56o53N3L9N74N04lm58m74l81K45M50N96Jm65l88o19J96O86M32K59
3496G08l98p40q7k13P71N15J88m01o01l49jL33P21K66l41p19l07o2M65O67M08
3517H23l90l96m25k56N42N23N89m14o38m96l51L07Q55N50l29o67n25r7O07N01
3537C13N55j47p90l25m90O24N72N46m47l10o50l98O76L59M47J98m53p67j54K96
3557c45O27N31O4n61p23k73P0O35O44Q6m94p06k10K05O28N56M7m70l72o68M59
3578b70M15M87j44m4p96l62k6M81Q99J5l98p23k22l3P24M93M47m12o62o37L74
$$ plain form
3599 -394 -127 528 655 441 -131 -503 -750 -92 441 586 536 -307 -589 -828 -127 555 709 578 123 -517
3619 -517 -800 -366 415 605 432 -205 -470 -632 -286 186 676 756 -26 -467 -975 -536 541 692 832 281
3639 281 -482 -690 -411 288 724 633 16 -832 -931 -448 -55 785 625 199 -391 -820 -690 172 708 795 279
3660 279 -42 -693 -611 119 656 774 401 -262 -1019 -740 -164 423 699 557 -245 -680 -373 -96 710 609
3680 609 511 -351 -745 -725 -397 402 895 212 -234 -712 -1085 -75 425 795 530 111 -589 -478 -271 781
3700 781 840 478 264 -669 -950 -386 237 626 445 25 -567 -803 -541 181 916 847 123 -536 -992 -456 249
3721 249 944 722 415 -844 -670 -508 166 695 820 507 -543 -613 -571 226 720 832 272 -221 -814 -442
3741 -442 315 896 848 466 -582 -774 -761 -73 817 933 473 -320 -480 -454 -3 709 774 126 -303 -774 -877
$$ packed form
3599c94K67O55J27k14n72l72k47O58N33J45n0q43k82k39P01O82J54j31m55o40
3619e17k83M34P81J90j73o37k65j62L46M72M90Q0p82m41n08M39J077J51J40n51
3639B81p63k08K79O99M36r1o17q48r9M83L93Q40j60m26n90m29J30Q62N36Q7n16
3660B79l21o51Q2P30N37J18l73o63p57K79N76N87K76j42q02m35L07K77Q06j01
3680F09r8q62l94K0L28P99M93o83m46m78l73J010N00L70k65m19p00J11K07J052
3700G81N9l62k14r33k81N64O23L89j81m20n92k36K62P22P35o9p24o59m56N36P05
3721B49O95k22l07j259J74J62O74N29J25l13j050p0M2P97M94J12n60m93n93L72
3741d42P57N81m8l82j048j92J3O88Q90J16m60p93j60K6M51P12O5o48m29m71j03
$$ plain form
3762 -877 -49 498 758 292 -185 -740 -840 -25 359 993 339 -197 -934 -707 -212 523 852 676 -74 -769
3782 -769 -729 -212 132 880 727 60 -559 -699 -231 502 999 472 -118 -456 -657 -451 412 651 845 107
3802 107 -685 -693 -306 306 666 923 408 -504 -876 -563 455 703 722 8 -550 -1033 -696 199 694 611 326
3823 326 -31 -979 -670 31 723 1053 277 -509 -682 -362 126 517 929 482 -467 -752 -420 -33 823 695
3843 695 328 -145 -565 -691 27 665 751 557 -189 -794 -577 -218 191 748 369 9 -579 -691 -248 447
3863 447 933 494 -25 -767 -726 -343 490 763 486 247 -669 -634 -211 515 742 521 -34 -696 -676 -380 274
3884 274 443 732 83 -767 -799 -391 350 744 746 27 -740 -886 -357 280 793 931 303 -296 -806 -535 218
3905 218 708 623 253 -671 -899 -661 114 753 545 764 -286 -734 -814 69 581 880 405 -266 -763 -592
$$ packed form
3762h77Q28N47K60m66m77n55j00Q15L84O34o54n36p37K27M95P35L29j76p50o95
3782g69M0N17L44P48j53o67o19j40M68P33M97n27n90l38k01K06Q63K39J94p38
3802A07p92qL87O12L60K57n15r12l72L13J018K48J9p14n58m83L37Q95M95q3k85
3823C26l57r48L09P01O92L30p76p86j73L20M88L91M12m47r49k85L32L87Q56j28
3843F95l67m73m20j26P18O38Q6j94p46o05K17L59M09N57l79l60n88j12M43O95
3863D47M86m39n19p42M1L83Q33K73k77k39r16L5M23P26K27k21n55o62K0K96O54
3884B74J69K89o49q50l2M08P41L94Kp19p67j46N29O37N13J38o28n99n10K71P53
3905B18M90q5l70r24k28K38P75O39k08K19j050m48q0Q83N12K99m75o71m97J71
$$ plain form
3925 -592 -287 417 782 314 -459 -781 -657 -201 513 797 678 -473 -645 -718 -300 650 715 400 -98 -619
3945 -619 -659 -389 522 720 489 16 -747 -970 -443 568 749 603 -231 -536 -719 -291 342 631 503 36
3965 36 -923 -738 -550 356 693 566 310 -515 -615 -445 380 778 562 -99 -272 -894 -490 157 907 661
3985 661 194 -475 -826 -505 295 868 654 329 -316 -754 -641 301 610 535 166 -180 -660 -537 -259 496
4005 496 823 336 -120 -958 -700 -10 511 815 389 -122 -757 -421 -123 676 708 723 87 -685 -532 -277 674
4026 674 684 431 -140 -742 -724 -146 585 894 515 -41 -614 -629 -396 482 756 530 -2 -750 -735 -620 373
4047 373 696 784 -161 -629 -825 -314 547 596 535 106 -522 -530 -263 256 643 773 349 -267 -634 -446 225 590
4069 590 610 168 -341 -741 -764 168 738 644 193 -421 -815 -530 119 823 777 245 -396 -644 -430 192 742
$$ packed form
3925e92L05P04L65m68p73l22J24M56P14K84j19j151j72p3M18R50O5l15m98n21
3945f19m0K70R11J98k31m73p63k23N27J011J81j46q34l05j83M28O33K89j28m67
3965C6r59J85J88R06L37j27k56q25j00J70Q25L98k16o61j73o22M04O47P50k46
3985F61m67o69l51L21Q00N73k14l25o45m38J13R42L09p5l69l46m80J23K78P55
4005D96L27m87m56q38K58O90N21L04m26n11o35L36K98P99L2J5o36p72J53K55R51
4026F74J0k53n71o02J8N78P31L09l79n56n73j5K33Q78K74k26n32p48J5J15R93
4047C73L23Q8r45m68j96N11Q61M9o1m29o28qK67N19L87J30m24o16l67J88O71L65
4069E90K0m42n09m00k3R32N70r4m51o14l94K85O49P04m6n32o41k48K14O22N50
$$ plain form
4090 742 736 463 -213 -679 -692 14 509 825 76 -398 -778 -690 -119 418 690 352 36 -597 -854 -176 734
4111 734 770 828 10 -458 -559 -234 661 624 551 -290 -555 -924 -354 297 941 431 89 -408 -793 -443 461
4132 461 956 513 107 -514 -890 -539 195 655 449 51 -613 -797 -363 72 879 570 388 -443 -591 -241
4152 -241 129 650 847 291 -312 -776 -605 -44 592 835 -11 -365 -747 -483 -46 700 853 153 -350 -480
4172 -480 -478 320 521 686 348 -231 -710 -813 -177 453 832 135 -212 -746 -578 -541 505 905 503 -208 -817
4193 -817 -549 91 372 654 687 -232 -633 -761 -262 230 676 471 -110 -740 -769 -232 351 780 571 -120 -559
4214 -559 -937 -368 390 888 556 207 -659 -791 -393 516 715 787 200 -463 -953 -354 208 622 803 48
4234 48 -392 -684 -598 114 524 525 71 -487 -943 -706 180 632 761 345 -397 -851 -403 71 534 580 403 -224
$$ packed form
4090G42ok73o76m66j3P06M95L16p49m74l80Q8N71N37K72l38l16o33k57O78R10
4111G34L6N8q18m68j01L25Q95l7p3q41k65l69N70O51O44n10l42m97l85L50R04
4132D61M95m43m06o21l76L51P34M60k06l98o64j84M34M35Q07l09j82q31j48L50
4152b41L70N21J97n56o03m64J71N61O36K43q46l54l82K64M37P46J53p00n03j30
4172d80KP98K01J65l38n79m79j03O36O30L79o97l47n34J68L7J046M00m02p11o09
4193h17K68O40K81K82L3r19m01j28M99M92M46k05n81o30k9N37N83M29k09o91m39
4214e59l78N69P58M98l32l49q66j32L98R09J99P2n87o63m90N99N62M14J81p55
4234D8m40k92Q6P12M10Jm54n58m56K37Q86M52J29m16p42m54M48M74M63M6j77o27
$$ plain form
4256 -224 -454 -559 203 423 707 192 -184 -698 -654 66 422 658 284 -332 -832 -397 -251 558 579 317 143
4277 143 -608 -862 -52 409 528 799 12 -650 -903 -121 592 719 374 -105 -461 -661 -177 556 729 707
4297 707 60 -350 -640 -410 553 619 143 1 -512 -614 -436 218 598 413 197 -522 -822 -374 -40 615
4317 615 702 113 -459 -770 -687 202 808 561 26 -297 -645 -433 152 674 815 119 -336 -978 -588 -81 623
4338 623 500 225 -241 -911 -675 -60 497 673 477 -266 -549 -463 108 752 661 175 -107 -821 -599 -74 445
4359 445 531 338 131 -283 -685 -119 448 751 544 -1 -615 -547 -233 544 801 547 -197 -570 -521 -449 38
4380 38 617 470 -138 -693 -662 -158 319 698 527 189 -365 -695 -344 381 675 563 -42 -385 -679 -591 -34
4401 -34 482 401 79 -455 -687 -435 191 769 781 457 -174 -846 -264 187 609 931 172 -423 -593 -525 56
$$ packed form
4256b24k30j05P62K20K84n15l76n14M4P20L56K36l74o16n00M35J46Q09K1k62j74
4277A43p51k54Q10M61J19K71p87o62k53P82P13J27l45m79l56k00M84P33J73k2
4297G07o47m10k90K30R63O6m76j42n13j02J78O54L80j85k16p19l00M48L34O55
4317F15Q7n89n72l11Q3Q89O06k47n35l23l48K12N85N22J41o96m55o42L90N07P04
4338F23j23k75m66o70K36O15N57J76j96p43k83Q6N71O44r1m86k82p14K22N25N19
4359D45Q6j93k07m14m02N66N67L03k07n45o14O8L14P77K57k54p44l73M9P2M87
4380C8N79j47o08n55L1N04M77L79j71l38n54l30L51P25K94j12o05l43k94Q8N57
4401c4N16q1l22n34k32K52O26N78J2l24o31o72N82M51M22L22p59n95j70O8N81
$$ plain form
4422 56 384 650 86 -482 -680 -462 69 558 779 407 -122 -632 -521 -102 503 860 192 -58 -719 -566
4442 -566 -16 394 630 500 33 -633 -440 29 479 679 478 -247 -473 -694 -36 229 593 427 14 -607
4462 -607 -873 -371 475 482 419 47 -500 -730 -274 566 692 493 287 -586 -676 -244 293 659 406 181 -723
4483 -723 -459 -357 57 522 589 198 -472 -796 -248 41 618 784 331 -389 -831 -174 134 425 724 286
4503 286 -402 -620 -446 -2 708 587 306 -413 -742 -706 -25 594 785 400 -279 -525 -449 -181 715 709 532
4524 532 -358 -597 -595 -102 541 436 405 -411 -737 -609 -239 357 582 582 -71 -393 -697 -295 110 694 506 -236
4546 -236 -645 -607 -303 263 595 332 3 -531 -649 -290 235 668 457 263 -665 -562 -275 104 663 400
4566 400 98 -303 -1022 -358 500 553 836 266 -409 -692 -506 185 536 453 466 -168 -445 -485 23 611 545 205
$$ packed form
4422E6L28K66n64n68j98K18N31M89K21l72n29n10J11M19O05L57o68k50o61J53
4442e66N50M10K36j30m67o66J93M69M50K00k01p25k26k21O58K65L64j66m13o21
4462f07k66N02Q46Po3l72n47k30M56Q40J26j99k06q73r0M32N37L66k53k25r04
4483g23K64J02M14M65O7l91o70l24N48K89N77J66m53p20m42O57L08K91K99m38
4503B86o88k18J74M44P10j21k81p19l29L6O81O19J91l85o79k46P6K68Q96oj77
4524E32q90k39KM93O43j05l1q16l26J28L70N96K25%o53l22l04M02M05N84j88p42
4546b36m09L8L04N66L32k63l29n34j18L59N25M33k11j94r28J03K87L79N59k63
4566D00l02m01p19O64Q58N3K83n70o75k83J86O91L51q3J3o34k77m0N08N88o6l40
$$ plain form
4588 205 -306 -719 -449 334 495 698 82 -170 -574 -508 78 348 653 134 -231 -606 -626 -231 422 587 263
4609 263 33 -608 -384 -192 340 647 555 -51 -584 -389 -191 592 727 425 -186 -400 -457 -8 410 770 455
4630 455 159 -546 -482 -391 357 688 623 -28 -634 -693 -286 109 708 502 8 -565 -595 -258 67 706 626 5
4652 5 -287 -655 -400 237 390 479 65 -493 -758 -240 559 641 686 207 -366 -715 -340 186 435 682 210 -487
4674 -487 -538 -520 -161 522 316 285 -498 -572 -351 104 573 527 308 -177 -460 -393 -19 302 529 451 -17 -551
4696 -551 -523 -1 342 666 433 -218 -398 -476 -117 369 472 218 -168 -629 -753 -147 233 433 401 -57 -316
4717 -316 -604 -188 388 473 492 92 -445 -903 -233 212 492 372 112 -499 -551 -411 12 831 428 159 -148
4738 -148 -474 -165 222 714 443 64 -546 -478 -569 238 745 321 334 -498 -721 -356 -51 604 858 199 -304
$$ packed form
4588B05n11m13K70P83J61K03o16k52m04O6N86K70L05n19l65l75k0L95O53J65l24
4609B63k30o41K24J92N32L07r2o06n33J95J98P83J35l02o11k14n7M49M18L60l15
4630D55k96p05O4R1P48L31o5o51o06n9M07L95N99k06m94n73l0L37L25O39q0o21
4652Ek92l68K55O37J53Q9m14n58k65N18P99Q2M5m79n73l49L75N26K49K47m72o97
4674d87n1J8L59O83k06l1p83p4K21M55M69m6k19m85k83O7L74L21K27p8m68n34
4696e51K8N22L43L24k33o51j80p8L59M86J03k54l86m61j24O06L80K00l2m58k59
4717c16k88M16N76Q5J9m00n37m58O70M45K80j20k60o11n2J40M23Q19m03k69l07
4738a48l26L09L87M92k71l79o10O8r1Q07N07m24J3q32k23L65L05O55K54o59n03
$$ plain form
4759 -304 -730 -237 -81 481 594 -89 -78 -638 -435 -164 368 513 22 -276 -737 -527 -79 593 556 541 -109
4780 -109 -726 -407 239 341 529 248 -274 -399 -402 59 256 302 305 -208 -508 -428 20 551 580 260 49 -411
4802 -411 -534 -100 345 640 595 -119 -530 -414 -469 196 447 517 -7 -444 -435 -50 240 366 728 -115 -333 -702
4824 -702 -82 291 699 553 244 -195 -479 -270 185 284 601 249 -412 -617 -392 203 529 682 138 -119
4844 -119 -525 -427 212 672 470 225 -487 -468 -744 -207 516 387 42 -303 -374 -425 -181 679 468 529 -299 -658
4866 -658 -277 56 357 639 301 -216 -400 -309 -130 487 723 360 -246 -380 -245 -76 208 478 345 -161
4886 -161 -368 -544 -264 212 516 420 -86 -474 -287 -254 318 488 548 -28 -542 -728 -372 383 335 585 308
4907 308 -414 -340 -363 151 291 347 58 -295 -587 -484 94 662 389 86 -338 -599 -278 166 729 515 194
$$ packed form
4759c04m26M93J56N62J13o83J1n60K03K71N32J45m91k98m61K10M48O72l7j5o50
4780a09o17L19O46J02J88k81n22j25lM61J97M6Ln13l00Q0M48N31K9l20k11m60
4802d11j23M34M45K95m5p14m11J16n5O65K51P0n24m37RL85K90J26L62q43k18l69
4824g02O20L73M08j46l09m39k84K09M55R9L17l52o61k05K25N95L26J53n44k57
4844a19m06R8O39M60k02k45p12J9k76N37P23j29l45l45p1n1K44Q60k11O1q28l59
4866f58L81L33L01K82l38n17j84R1J79O17K36l63o06j34J35J69K84K70j33n06
4886a61k07j76K80M76L04r6n06l88J87L3N72J70O0n76n14j86L56P55m8K50k77
4907C08p22P4k3N14J40N6k89l53k92J03N78N68k73l03m24k61L21M44N63k14l21
$$ plain form
4928 194 -50 -550 -225 276 645 557 257 -224 -548 -515 -156 336 589 211 -211 -514 -701 269 729 498 279
4949 279 -83 -265 -572 204 142 299 319 -199 -569 -335 -315 282 714 392 -341 -241 -449 -140 312 740 446
$$ packed form
4928A94k44n00L25N01L69q8l00m81l24L3L59M92K53l78m22l03j87R70M60k31k19
4949B79l62j82l07P76o2J57K0n18l70K34K0N97M32l22p33J00k08L09M52M28k94
$$ [...]
8191a45
##END NTUPLES=NMR FID
##END=
