##TITLE=1H ikalashn
111-2024
18.12.2024
##JCAMPDX= 6.0         $$ Bruker NMR JCAMP-DX V2.0
##DATA TYPE= NMR FID
##DATA CLASS= NTUPLES
##ORIGIN= UXNMR, Bruker Analytische Messtechnik GmbH
##OWNER= root
$$ TOPSPIN		Version 1.3
$$ 2024-12-18 10:43:07.640 +0400  Irina@DPX200
$$ Compression mode = diff/dup
##.OBSERVE FREQUENCY= 200.131300845
##.OBSERVE NUCLEUS= ^1H
##.DELAY= (6, 6)
##.ACQUISITION MODE= SIMULTANEOUS
##.ACQUISITION SCHEME= undefined
##.AVERAGES= 16
##.DIGITISER RES= 18
##SPECTROMETER/DATA SYSTEM= spect
##.PULSE SEQUENCE= zg
##.SOLVENT NAME= CDCl3
##.SHIFT REFERENCE= INTERNAL, CDCl3, 1, 17.49637
##AUDIT TRAIL= $$ (NUMBER, WHEN, WHO, WHERE, WHAT)
$$ ##TITLE= Audit trail, TOPSPIN		Version 1.3
$$ ##JCAMPDX= 5.01
$$ ##ORIGIN= Bruker BioSpin GmbH
$$ ##OWNER= Irina
$$ $$ F:/spectra/data/iren/nmr/1H/4/audita.txt
$$ ##AUDIT TRAIL=  $$ (NUMBER, WHEN, WHO, WHERE, VERSION, WHAT)
(   1,<2024-12-18 10:42:41.281 +0400>,<Irina>,<DPX200>,<TOPSPIN 1.3>,
      <created by zg
	started at 2024-12-18 10:41:33.437 +0400,
	POWCHK disabled, PULCHK disabled
       terminated by command 'halt'
       configuration hash MD5:
       BE 6D 3F 07 2A EA 11 49 91 17 2B D3 AF B3 58 0D
       data hash MD5: 16K
       47 24 8A BB B0 7F B0 AB 3A C7 9D 67 56 EA F5 E5>)
$$ ##END=
$$ 
$$ $$ hash MD5
$$ $$ 16 D4 FD E6 E1 3B 4C 00 5E 7D 49 71 B6 A2 3A B8
##$RELAX= 
##$RELAX= 
##$RELAX= 
##$RELAX= 
##$RELAX= 
##$RELAX= 
##$RELAX= 
##$RELAX= 
##$RELAX= 
$$ Bruker specific parameters
$$ --------------------------
##$DU= <F:/spectra>
##$EXPNO= 4
##$NAME= <1H>
##$PROCNO= 1
##$TYPE= <nmr>
##$USER= <iren>
##$AMP= (0..31)
100 100 100 100 100 100 100 100 100 100 100 100 100 100 100 100 100 100 
100 100 100 100 100 100 100 100 100 100 100 100 100 100 
##$ANAVPT= -1
##$AQSEQ= 0
##$AQ_mod= 1
##$AUNM= <au_zg>
##$AUTOPOS= <>
##$BF1= 200.13
##$BF2= 200.13
##$BF3= 200.13
##$BF4= 200.13
##$BF5= 200.13
##$BF6= 200.13
##$BF7= 200.13
##$BF8= 200.13
##$BYTORDA= 1
##$CFDGTYP= 0
##$CFRGTYP= 5
##$CHEMSTR= <none>
##$CNST= (0..63)
1 1 145 1 1 1 1 1 1 1 1 1 1 1 1 1 1 1 1 1 1 1 1 1 1 1 1 1 1 1 1 1 1 1 
1 1 1 1 1 1 1 1 1 1 1 1 1 1 1 1 1 1 1 1 1 1 1 1 1 1 1 1 1 1 
##$CPDPRG= <>
##$CPDPRG1= <>
##$CPDPRG2= <>
##$CPDPRG3= <>
##$CPDPRG4= <mlev>
##$CPDPRG5= <mlev>
##$CPDPRG6= <mlev>
##$CPDPRG7= <mlev>
##$CPDPRG8= <mlev>
##$CPDPRGB= <>
##$CPDPRGT= <>
##$D= (0..63)
0 2 0 0 0 0 0 0 0 0.06 0 0.03 0 0 0 0 0.0002 0 0 0 0 0 0 0 0 0 0 0 0 0 
0 0 0 0 0 0 0 0 0 0 0 0 0 0 0 0 0 0 0 0 0 0 0 0 0 0 0 0 0 0 0 0 0 0 
##$DATE= 1734504158
##$DBL= (0..7)
120 120 120 120 120 120 120 120 
##$DBP= (0..7)
150 150 150 150 150 150 150 150 
##$DBP07= 0
##$DBPNAM0= <>
##$DBPNAM1= <>
##$DBPNAM2= <>
##$DBPNAM3= <>
##$DBPNAM4= <>
##$DBPNAM5= <>
##$DBPNAM6= <>
##$DBPNAM7= <>
##$DBPOAL= (0..7)
0.5 0.5 0.5 0.5 0.5 0.5 0.5 0.5 
##$DBPOFFS= (0..7)
0 0 0 0 0 0 0 0 
##$DE= 6
##$DECBNUC= <off>
##$DECIM= 32
##$DECNUC= <off>
##$DECSTAT= 4
##$DIGMOD= 1
##$DIGTYP= 9
##$DL= (0..7)
0 120 120 120 120 120 120 120 
##$DP= (0..7)
$$ [...]
##$SW= 21.9926040160658
##$SWIBOX= (0..15)
0 0 2 0 0 0 0 0 0 0 0 0 0 0 0 0 
##$SW_h= 4401.40845070422
##$TD= 16384
##$TD0= 1
##$TE= 300
##$TE2= 300
##$TE3= 300
##$TEG= 300
##$TL= (0..7)
0 120 120 120 120 120 120 120 
##$TP= (0..7)
150 150 150 150 150 150 150 150 
##$TP07= 0
##$TPNAME0= <>
##$TPNAME1= <>
##$TPNAME2= <>
##$TPNAME3= <>
##$TPNAME4= <>
##$TPNAME5= <>
##$TPNAME6= <>
##$TPNAME7= <>
##$TPOAL= (0..7)
0.5 0.5 0.5 0.5 0.5 0.5 0.5 0.5 
##$TPOFFS= (0..7)
0 0 0 0 0 0 0 0 
##$TUNHIN= 0
##$TUNHOUT= 0
##$TUNXOUT= 0
##$USERA1= <user>
##$USERA2= <user>
##$USERA3= <user>
##$USERA4= <user>
##$USERA5= <user>
##$V9= 5
##$VALIST= <valist>
##$VCLIST= <CCCCCCCCCCCCCCC>
##$VD= 0
##$VDLIST= <DDDDDDDDDDDDDDD>
##$VPLIST= <PPPPPPPPPPPPPPP>
##$VTLIST= <TTTTTTTTTTTTTTT>
##$WBST= 1024
##$WBSW= 25
##$XGAIN= (0..3)
0 0 0 0 
##$XL= 0
##$YL= 0
##$YMAX_a= 458395
##$YMIN_a= -303606
##$ZGOPTNS= <>
##$ZL1= 120
##$ZL2= 120
##$ZL3= 120
##$ZL4= 120
##$ABSF1= 10
##$ABSF2= 0
##$ABSG= 5
##$ABSL= 3
##$ALPHA= 0
##$AQORDER= 0
##$ASSFAC= 0
##$ASSFACI= 0
##$ASSFACX= 0
##$ASSWID= 0
##$AUNMP= <proc_1d>
##$AXLEFT= 0
##$AXRIGHT= 0
##$AXTYPE= 0
##$AXUNIT= <>
##$AZFE= 0.1
##$AZFW= 0.1
##$BCFW= 1
##$BC_mod= 2
##$BYTORDP= 1
##$COROFFS= 0
##$CY= 7568.61572265625
##$DATMOD= 1
##$DC= 2
##$DFILT= <>
##$DTYPP= 0
##$F1P= 17.9538593292236
##$F2P= -4.03888763876832
##$FCOR= 0.5
##$FTSIZE= 32768
##$FT_mod= 4
##$GAMMA= 1
##$GB= 1
##$INTBC= 1
##$INTSCL= 1
##$ISEN= 128
##$LB= 0.02
##$LEV0= 0
##$LPBIN= 0
##$MAXI= 945.577
##$MC2= 0
##$MEAN= 0
##$ME_mod= 0
##$MI= -402.1523
##$NCOEF= 0
##$NC_proc= 0
##$NLEV= 6
##$NOISF1= 8.587773
##$NOISF2= 6.764455
##$NSP= 1
##$NTH_PI= 0
##$NZP= 0
##$OFFSET= 17.49637
##$PC= 1
##$PHC0= 84.75195
##$PHC1= 15.68913
##$PH_mod= 0
##$PKNL= yes
##$PPARMOD= 0
##$PPDIAG= 0
##$PPIPTYP= 0
##$PPMPNUM= 100
##$PPRESOL= 1
##$PSCAL= 0
##$PSIGN= 0
##$REVERSE= no
##$SF= 200.13
##$SI= 32768
##$SIGF1= 18.5376
##$SIGF2= -6.396296
##$SINO= 400
##$SIOLD= 32768
##$SREGLST= <1H.CDCl3>
##$SSB= 3
##$STSI= 0
##$STSR= 0
##$SW_p= 4401.40845070422
##$SYMM= 0
##$S_DEV= 0
##$TDeff= 0
##$TDoff= 0
##$TI= <>
##$TILT= no
##$TM1= 0
##$TM2= 0
##$TOPLEV= 0
##$USERP1= <user>
##$USERP2= <user>
##$USERP3= <user>
##$USERP4= <user>
##$USERP5= <user>
##$WDW= 1
##$XDIM= 8192
##$YMAX_p= 0
##$YMIN_p= 0
$$ End of Bruker specific parameters
$$ ---------------------------------
##NTUPLES= NMR FID
##VAR_NAME=  TIME,          FID/REAL,        FID/IMAG
##SYMBOL=    X,             R,               I
##VAR_TYPE=  INDEPENDENT,   DEPENDENT,       DEPENDENT
##VAR_FORM=  AFFN,          ASDF,            ASDF
##VAR_DIM=   8192,          8192,            8192
##UNITS=     SECONDS,       ARBITRARY UNITS, ARBITRARY UNITS
##FACTOR=    0.0002272,     1,               1
##FIRST=     0,             0,               0
##LAST=      1.8609952,     4,               -13
##MIN=       0,             -303606,         -303606
##MAX=       1.8609952,     458395,          458395
$$ Real data points
##PAGE= N=1
##DATA TABLE= (X++(R..R)), XYDATA
$$ [...]
$$ plain form
719 1168 672 -739 -2147 -2737 -2983 -3377 -2872 -1953 -1271 -442 275 369 546 1151 1709 1805 2089 2351 1932 1479
739 1479 1427 1089 424 318 321 193 -355 -877 -1961 -2794 -2927 -2962 -2870 -1972 -842 -187 408 1138 1276 957 1231
760 1231 1787 2056 2487 2819 2438 1862 1334 172 -1056 -1564 -1554 -1803 -1675 -1290 -1461 -2014 -2154 -2118 -2118 -1387 -376
781 -376 523 1836 2819 2996 2528 2198 1866 1129 800 950 515 183 -178 -708 -1515 -1953 -2098 -2339 -1963 -1170
801 -1170 -1034 -1021 -588 -294 -293 255 1179 1661 2271 2778 2722 1948 1098 248 -794 -1134 -811 -720 -623 -119 -130 -703
823 -703 -1279 -1499 -1930 -1795 -892 -233 415 1205 1631 1292 1136 1171 703 554 837 868 393 252 -69 -674 -1065
844 -1065 -938 -831 -715 -253 -101 -246 -545 -652 -994 -1010 -388 301 745 1285 1686 1174 777 383 -250 -467
864 -467 -357 15 224 508 527 -62 -620 -767 -1080 -1197 -652 -131 -67 159 368 66 -186 33 -21 211 861
$$ packed form
719A168m96j411j408n90k46l94N05R19O82Q29P17R4J77O05N58R6K84K62m19m53
739A479n2l38o65j06Lj28n48n22j084q33j33l5R2Q98J130O55N95P30J38l19K74
760A231N56K69M31L32l81n76n28j162j228n08J0k49J28L85j71n53j40L6%P31J011
781c76Q99J313R83J77m68l30l32p37l29J50m35l32l61n30q07m38j45k41L76P93
801a170J36J3M33K94JN48R24M82O10N07n6p74q50q50j042l40L23R1R7N04j1n73
823g03n76k20m31J35R03O59O48P90M26l39j56L5m68j49K83L1m75j41l21o05l91
844a065J27J07J16M62J52j45k99j07l42j6O22O89M44N40M01n12l97l94o33k17
864d67J10L72K09K84J9n89n58j47l13j17N45N21O4K26K09l02k52K19n4K32O50
$$ plain form
885 861 1295 1075 876 735 -65 -628 -712 -548 -531 -302 86 -127 -362 -417 -800 -1069 -534 -104 79 477 996
906 996 776 358 591 423 199 483 848 574 427 110 -634 -1172 -1358 -1285 -1303 -656 107 431 436 497 162 -207
928 -207 -226 -109 217 601 1413 1499 1212 971 353 -410 -759 -894 -1180 -1076 -867 -734 -818 -562 -442 -226 143
949 143 701 791 757 1049 705 281 204 429 283 503 852 678 354 -159 -817 -1642 -1962 -1758 -1601 -864 122
970 122 668 883 1177 1193 514 251 335 178 409 745 790 609 553 245 -220 -607 -645 -855 -1125 -953 -926 -949 -654
993 -654 -224 100 581 1207 1296 1205 970 590 -130 -514 -540 -549 -265 303 522 288 153 -116 -734 -1178 -1043 -959
1015 -959 -673 150 816 797 1050 1085 666 209 41 -121 -394 -384 -214 -504 -447 -293 -272 -124 247 293 204 211 265
1038 265 -59 -154 -1 143 200 659 980 538 224 20 -670 -1177 -1175 -1206 -987 -335 149 355 530 711 464 287
$$ packed form
885H61M34k20j99j41q00n63q4J64J7K29L88k13k35n5l83k69N35M30J83L98N19
906I96k20m18K33j68k24K84L65k74j47l17p44n38j86P3j8O47P63L24NO1l35l69
928b07j9J17L26L84Q12Q6k87k41o18p63l49j35k86J04K09J33q4K56J20K16L69
949A43N58R0l4K92l44m24p7K25j46K20L49j74l24n13o58q25l20K04J57P37R86
970A22N46K15K94J6o79k63Q4j57K31L36M5j81n6l08m65l87l8k10k70J72K7k3K95
993f54M30L24M81O26Q9r1k35l80p20l84k6rK84N68K19k34j35k69o18m44J35Q4
1015i59K86Q23O66j9K53L5m19m57j68j62k73J0J70k90N7J54K1J48L71M6q9PN4
1038B65l24r5J53J44N7M59L21m42l14k04o90n07Kl1K19O52M84K06J75J81k47j77
$$ plain form
1060 287 447 452 218 509 687 542 186 146 -226 -596 -626 -665 -824 -909 -750 -850 -808 -419 -208 115 682 1330
1082 1330 1327 1271 1266 830 428 193 68 -244 -164 -137 -327 -554 -612 -878 -1330 -1160 -973 -844 -371 68 414 478 936
1105 936 958 850 864 1025 745 555 557 83 -400 -641 -798 -946 -932 -742 -578 -443 -230 -275 -487 -248 102 155
1127 155 439 830 882 877 985 812 408 93 -115 -398 -491 -468 -514 -660 -488 -316 -432 -357 22 99 144 440 442 230
1151 230 250 190 59 18 257 137 60 -38 -85 -421 -600 -545 -659 -561 -112 237 363 475 724 568 335 430 70
1174 70 -9 98 16 -221 -327 -226 -524 -578 -272 -472 -455 -268 -52 -90 28 244 367 607 935 992 770 824 641
1197 641 171 -280 -331 -707 -990 -741 -594 -556 -537 -414 -587 -490 -216 -144 -130 348 601 756 972 1287 995 821
1219 821 708 365 19 -278 -471 -725 -883 -842 -955 -1069 -720 -435 -393 -305 29 66 48 447 623 624 910 1038
$$ packed form
1060B87J60Nk34K91J78j45l56m0l72l70l0l9j59q5J59j00M2L89K11L23N67O48
1082A330ln6nm36m02k35j25l12Q0K7j90k27n8k66m52J70J87J29M73M39L46O4M58
1105I36K2j08J4J61k80j90Km74m83k41j57j48J4J90J64J35K13m5k12K39L50N3
1127A55K84L91N2nJ08j73m04l15k08k83r3K3m6j46J72J72j16P5L79P7M5K96Kk12
1151B30K0o0j31m1K39j20p7r8m7l36j79N5j14R8M49L49J26J12K49j56k33R5l60
1174G0p9J07q2k37j06J01k98n4L06k00J7J87K16l8J18K16J23K40L28N7k22N4j83
1197F41m70m51n1l76k83K49J47L8J9J23j73R7K74P2J4M78K53J55K16L15k92j74
1219H21j13l43l46k97j93k54j58M1j13j14L49K85M2Q8L34L7j8L99J76JK86J28
$$ plain form
1241 1038 1069 1004 904 346 14 -264 -537 -861 -943 -821 -885 -697 -524 -478 -468 -329 -185 -75 159 395 397 593
1263 593 862 1002 664 602 729 401 158 61 -174 -526 -522 -650 -736 -642 -460 -614 -505 -220 -147 -107 -42 107 147
1286 147 423 665 743 640 762 712 445 248 183 -96 -197 -97 -330 -476 -447 -464 -550 -508 -471 -470 -466 -241 -177 -14
1310 -14 213 290 316 540 740 490 455 605 543 249 98 55 -164 -309 -230 -309 -521 -468 -524 -590 -504 -288 -323 -223
1334 -223 7 303 314 475 605 486 519 620 428 236 288 159 28 -1 -206 -474 -560 -488 -416 -584 -610 -379 -323
1357 -323 -228 6 70 183 312 408 405 544 661 347 352 339 177 1 20 -154 -332 -392 -324 -515 -607 -412 -240 -300
1381 -300 -62 109 -62 104 330 371 312 348 376 351 343 405 90 15 79 -61 -257 -273 -266 -513 -304 -206 -226 -237 -62
1406 -62 43 52 124 178 98 151 373 184 188 329 115 10 73 137 -48 -235 -120 -188 -175 -200 -116 -286 -59 46 -40
$$ packed form
1241A038L1o5j00n58l32k78k73l24q2J22o4J88J73M6J0J39J44J10K34K36KJ96
1263E93K69J40l38o2J27l28k43r7k35l52Mj28q6R4J82j54J09K85P3M0O5J49M0
1286A47K76K42P8j03J22n0k67j97o5k79j01J00k33j46K9j7q6M2L7JMK25O4J63
1310a4K27P7K6K24K00k50l5J50o2k94j51m3k19j45P9p9k12N3n6o6Q6K16l5J00
1334b23K30K96J1J61J30j19L3J01j92j92N2j29j31k9k05k68q6P2P2j68k6K31N6
1357c23R5K34O4J13J29R6lJ39J17l14Nj3j62j76J9j74j78o0O8j91r2J95J72o0
1381c00K38J71j71J66K26M1n9L6K8k5qO2l15p5O4j40j96j6Pk47K09R8k0j1J75
1406f2J05RP2N4q0N3K22j89MJ41k14j05O3O4j85j87J15o8J3k5Q4j70K27J05q6
$$ plain form
1431 -40 -24 127 32 33 190 298 25 97 65 172 -50 69 84 -22 -109 -31 -93 -75 7 -112 -123 -30 33 -153 -74 48
1457 48 -31 -141 104 36 26 1 92 53 41 87 39 -54 -55 -33 -91 -11 -10 29 -89 77 16 -52 -66 53 -139 -58 30 -3
1485 -3 -29 98 79 -40 47 21 -78 -55 3 -141 -159 68 -16 -116 -5 34 35 -74 143 -7 47 125 34 20 2 81 51
1512 51 9 28 -12 -91 -120 -121 -80 -150 -35 -76 -44 7 76 3 -56 189 48 43 147 135 4 101 168 70 0 7 -135 -189 45
1541 45 -136 -184 -137 21 -77 -56 113 80 72 122 196 17 21 144 82 -97 205 57 -48 15 -60 -87 -167 -178 -153 -166 -159
1568 -159 -96 -133 -42 63 47 118 228 75 20 137 172 83 11 200 68 -63 108 80 -6 -57 4 -166 -188 -144 -121
1593 -121 -147 -106 12 39 49 121 97 148 228 197 -4 38 89 -42 55 53 -89 -32 -31 -28 -122 -143 -122 -219 -155 -58 -72 -66 75
1622 75 158 42 91 113 101 -18 115 119 2 98 184 49 -2 136 50 -116 -26 -55 -277 -154 -99 -88 -61 30 61 -13
$$ packed form
1431d0J6J51r5JJ57J08k73P2l2J07k22J19J5j06q7P8o2J8Q2j19j1R3O3j86P9J22
1457D8p9j10K45o8j0k5R1l9j2M6m8r3jK2n8Q0JL9j18J66o1o8j4J19j92Q1Q8l3
1485ck6J27j9j19Q7k6r9K3N8j44j8K27q4j00J11L9Jj09K17j50N4P8r1j4j8P9l0
1512E1m2J9m0p9k9jM1p0J15m1L2N1O9p3n9K45j41nJ04j2j31R7O7r8p0Pj42n4K34
1541D5j81m8M7J58r8K1J69l3qN0P4j79MJ23o2j79L02j48j05O3p5k7q0j1K5j3P
1568a59O3l7R1J05j6P1J10j53n5J17L5q9p2J89j32j31J71k8q6n1O1j70k2M4K3
1593a21k6M1J18K7J0P2k4N1Q0l1k01M2N1j31R7kj42N7JLr4k1K1r7O4R7j4OJ41
1622G5Q3j16M9K2j2j19J33Mj17R6Q6j35n1J38q6j66R0k9k22J23N5J1K7R1L1p4
$$ plain form
1648 -13 128 185 -1 133 78 77 3 50 179 18 112 88 98 -37 69 -76 -199 -216 -67 -170 -128 13 70 41 105
1673 105 199 56 60 72 18 -46 153 107 67 195 154 24 -24 50 -99 -162 -166 -192 -125 -163 -105 11 60 106 90 82 100 212
1701 212 167 -14 160 -4 64 42 40 -43 53 -38 -176 -95 -128 -246 -264 -93 -14 15 141 238 103 58 29 17 -88 -79
1727 -79 -46 -82 5 62 -22 -70 42 -62 -64 -68 -61 -109 -26 71 32 -103 69 183 -73 161 156 -32 -73 -12 33 -47 -136 -87
1755 -87 -38 -15 22 64 -93 -39 -62 -72 23 45 -82 122 185 92 33 86 54 -135 -143 -101 -147 -99 -68 26 -116 22 98 -59
1783 -59 8 60 54 -37 97 70 92 144 158 20 57 170 39 9 -53 -60 -214 -119 -63 -112 -54 50 53 -2 -29 -64 -52 -54 98
1812 98 107 63 123 123 83 -50 -25 43 -141 14 -120 -202 -170 -122 -152 -53 -69 -10 -52 14 148 28 30 -22 6 -19 144 250
1840 250 -48 162 105 -16 -48 -33 -4 -116 5 -54 -82 -90 -48 -101 -113 -18 -108 50 19 58 125 31 92 -4 96 160 95
$$ packed form
1648a3J41N7j86J34n5jp4M7J29j61R4k4J0j35J06j45j23j7J49j03M2J41N7k9O4
1673A05R4j43MJ2n4o4J99m6m0J28m1j30m8P4j49o3mk6O7l8N8J16M9M6j6qJ8J12
1701B12m5j81J74j64O8k2kq3R6r1j38Q1l3j18j8J71P9K9J26R7j35m5k9j2j05R
1727g9L3l6Q7N7q4m8J12j04kmPm8Q3R7l9j35J72J14k56K34nj88m1O1M5q0q9M9
1755h7M9K3L7M2j57N4k3j0R5K2j27K04O3r3n9N3l2j89qM2m6M8L1R4j42J38P6j57
1783e9O7N2or1J34k7K2N2J4j38L7J13j31l0o2pj54R5N6m9N8J04Ln5k7l5J2kJ52
1812I8Rm4O0%m0j33K5O8j84J55j34q2L2M8l0R9j6N9m2O6J34j20Kn2K8k5J63J06
1840B50k98K10n7j21l2J5K9j12J21n9k8qM2n3j2R5r0J58l1L9O7r4O1r6J00O4o5
$$ plain form
1867 95 -19 -3 4 6 -84 -65 -155 -176 -58 -148 -121 -10 28 -120 -67 23 -2 -43 -13 8 40 171 267 51 45 143 30 56
1895 56 -47 1 -126 -123 89 -22 -116 -102 -38 -116 5 24 -12 40 34 44 112 144 203 -13 99 132 54 27 49 -5 -133
1922 -133 3 -150 -184 -45 -41 -167 -50 -63 -64 -113 -62 38 112 1 94 200 186 195 146 21 65 80 11 65 -32 -112 -94
1949 -94 -50 -40 -154 -150 5 -51 -21 -1 -54 -7 9 120 64 122 136 96 -24 22 -19 -113 -81 -36 11 -29 7 34 -101 -151
1977 -151 43 -63 -41 12 56 25 -1 16 -3 -25 29 91 -6 76 44 57 88 157 -11 -97 -14 -15 -88 -48 -46 -106 -7 -41 -106
2006 -106 -100 9 -21 45 156 114 -30 -13 -47 8 -12 116 -34 -59 105 56 9 -18 -75 -159 -83 -23 -114 -60 -86 -5 -47
2033 -47 27 28 -85 47 -65 143 -19 39 2 96 44 115 14 1 25 92 -34 0 -101 -73 -61 105 107 25 29 -9 41
2060 41 84 23 -23 15 12 128 111 122 30 33 -98 -66 -73 -161 -141 -163 -107 -44 18 -45 -80 126 116 29 -19 -16 111 -6 56 10
$$ packed form
1867I5j14J6PKr0J9r0k1J18r0K7J11L8j48N3R0k5m1L0K1L2J31R6k16oR8j13K6
1895E6j03M8j27LK12j11r4J4O4p8J21J9l6N2oJ0O8L2N9k16J12L3p8k7K2n4j28
1922a33J36j53l4J39Mj26J17j3jm9N1J00P4j11R3J06j4Rm9j25M4J5o9N4r7q0J8
1949i4M4J0j14MJ55n6L0K0n3M7J6J11n6N8J4m0j20M6m1r4L2M5M7m0L6K7j35n0
1977a51J94j06K2N3M4l1k6J7j9k2N4O2r7Q2l2J3L1O9j68q6Q3jp3M0Ko0R9l4o5
2006a06OJ09l0O6J11m2j44J7l4N5k0J28j50k5J64m9m7k7n7q4P6O0r1N4k6Q1m2
2033d7P4Jj13J32j12K08j62N8l7R4n2P1j01j3K4O7j26L4j01K8J2J66Kq2Ml8N0
2060D1M3o1m6L8lJ16j7J1r2Lj31L2pq8K0k2N6O3O2o3l5K06j0q7m8LJ27j17O2m6
$$ plain form
2090 10 -87 -77 127 41 37 22 6 -41 -20 -8 -114 21 39 87 119 156 85 29 -19 81 -31 -73 45 -71 35 116 16
2117 16 -42 -68 -5 -18 -140 37 -44 -118 43 69 8 -67 105 126 149 69 -54 -120 -142 -33 -115 -163 14 -18 -13 194 193
2144 193 40 -13 -50 42 -64 69 -1 -99 34 88 168 90 -29 -109 -24 9 51 -79 -65 -143 2 56 11 50 -25 113
2170 113 55 62 -22 -32 -128 18 45 70 -53 14 22 60 -4 -96 -188 -150 -91 23 29 -48 -15 9 87 102 -32 -21 26 76 -39
2199 -39 53 5 -19 -68 88 2 -51 -50 -129 -2 -4 -36 -39 -9 60 154 114 194 4 -50 10 -19 -49 -196 -132 -56 27 85 13 -18
2229 -18 -74 66 94 -113 22 9 33 86 39 7 -63 83 51 68 24 -3 -128 -64 -25 -23 -86 -65 -51 3 66 179 3
2256 3 -55 32 62 -51 33 -20 60 60 136 128 -3 -39 0 9 -32 -34 -87 -127 15 67 -57 90 -55 -116 -23 22 7 -89 -29 23
2286 23 30 79 58 -96 -80 58 -18 -90 -26 -68 -46 51 78 -84 -94 42 52 55 65 13 -45 -9 84 93 29 4 -17 107 65
$$ packed form
2090A0r7J0K04q6mj5j6m7K1J2j06J35J8M8L2L7p1n6m8J00j12m2J18j16J06Q1j00
2117A6n8k6O3j3j22J77q1p4J61K6o1p5J72K1K3q0j23o6k2J09q2m8J77l2NK07j
2144A93j53n3l7R2j06J33p0r8J33N4Q0p8j19q0Q5L3M2j30J4p8J45N4m5L9p5J38
2170A13n8Pq4j0r6J46K7K5j23O7QL8o4r2r2L8N9J14Op7L3K4P8J5j34J1M7N0j15
2199c9R2m8k4m9J56q6n3Jp9J27kl2lL0O9R4m0Q0j90n4O0k9l0j47O4P6Q3N8p2l1
2229a8n6J40K8k07J35j3K4N3m7l2p0J46l2J7m4k7j25O4L9Ko3K1J4N4O3J13j76
2256Cn8Q7L0j13Q4n3Q0%P6qj31l6L9Rm1kn3m0J42N2j24J47j45o1R3M5j5r6O0N2
2286B3PM9k1j54J6J38p6p2O4m2K2R7K7j62j0J36J0LJ0n2n8L6R3Ro4k5k1J24m2
$$ plain form
2315 65 71 -75 -61 -15 35 15 -20 -114 -91 22 96 49 -49 48 -40 -75 13 -55 -119 -101 6 19 120 -20 -82 42 75 72
2343 72 -22 -39 -21 5 -20 84 52 -50 8 75 48 34 -98 -31 4 84 1 -107 -11 -15 27 100 47 -83 0 -35 67 77
2371 77 -17 12 -26 31 15 27 -52 -24 54 128 59 -84 -108 -41 2 -31 9 -57 -73 -91 29 40 -31 2 -25 13 151 45
2399 45 31 22 -22 159 14 36 -39 22 41 28 10 9 -44 101 137 102 -22 -38 -17 -44 36 38 -60 -44 7 90 56 -44 2
2428 2 -65 -6 -4 -5 -30 -43 -27 103 55 62 -91 -28 38 39 -12 -45 -17 12 42 60 -14 -101 -62 38 94 49 73 -84 7 130
2458 130 197 -31 5 -37 -42 3 51 54 -43 -3 -38 78 113 -34 -54 26 124 -58 13 -37 -138 60 5 -31 -118 -36 15 42
2486 42 46 -14 -2 36 105 59 -10 -60 13 13 66 117 17 -89 -36 28 20 56 61 -103 0 72 69 -31 -112 -30 -11 128 -3
2515 -3 -22 53 9 73 25 -2 -11 -63 -1 96 -29 13 25 84 39 73 117 8 2 -58 94 9 -44 -96 -102 25 116 36 -73 86
$$ packed form
2315F5Oj46J4M6N0k0l5r4K3J13P4m7r8R7q8l5Q8o8o4J8J07J3J01j40o2J24L3l
2343G2r4j7J8K6k5J04l2j02N8O7k7j4j32O7L5Q0q3j08R6mM2P3n3j30Q3l5J02J0
2371G7r4K9l8N7j6J2p9K8P8P4o9j43k4O7M3l3M0o6j6j8J20J1p1L3k7L8J38j06
2399D5j4rm4J81j45K2p5O1J9j3j8jn3J45L6l5j24j6K1k7Q0Kr8J6N1Q3l4j00M6
2428Bo7N9Kjk5j3J6J30m8Pj53O3O6Jn1l3K8K9L0J8p4q7L9J00N6m5K4j57R1J23
2458A30O7k28L6m2nM5M8Lr7M0l5J16L5j47k0Q0R8j82P1n0j01J98n5l6q7Q2N1K7
2486D2Mo0J2L8O9m6o9n0P3%N3N1j00j06N3O4qL6Nj64J03P2lj00q1Q2J9J39j31
2515cj9P5m4O4m8k7rn2O2R7j25M2J2N9m5L4M4j09oo0J52q5n3n2oJ27R1q0j09J59
$$ plain form
2545 86 47 -13 -51 -151 -10 -39 -62 72 -62 -2 -50 16 54 39 28 -25 -67 8 86 39 16 -80 68 -18 -2 38 -8 -16
2573 -16 34 48 30 -80 19 86 66 -61 -7 -75 -68 -73 20 -73 -10 -15 -16 14 17 23 -44 -20 32 -9 -109 55 44 -42 21 -63 7
2604 7 -59 -108 60 7 39 -70 -21 -16 95 118 5 90 29 23 47 42 7 -69 25 91 0 2 -21 -52 34 92 70 -62 -3 -39
2634 -39 16 -49 -22 -73 -35 38 20 -16 12 1 -57 -5 136 28 -9 -60 3 -10 -42 -89 -68 66 63 -12 0 -46 57 -3 90
2663 90 113 -65 64 66 -23 -32 -68 9 -27 31 -21 111 14 -2 85 -11 49 27 -42 -57 11 -49 26 34 71 -5 70 71 -4 -65 19
2694 19 -12 -5 -22 -54 -40 -59 71 126 -43 -68 -72 -5 66 -10 -29 3 -4 35 22 -25 36 -65 -106 2 55 -56 -55 17 -17 88
2724 88 34 34 46 66 4 34 -122 -49 -75 -1 74 -17 27 -18 68 39 -45 -4 -51 -43 69 -21 43 -2 -26 114 28 -41 72
2753 72 -12 -73 -11 -31 57 115 21 44 -35 -38 -75 -18 48 51 51 54 -92 24 95 29 19 -2 56 -80 4 58 45 10 31 26 -27
$$ packed form
2545H6l9o0l8j00J41k9k3J34j34O0m8O6L8j5j1n3m2P5P8m7k3r6J48q6J6M0m6q
2573a6N0J4j8j10R9O7k0j27N4o8PnR3r3O3njL0LOo7K4N2m1j00J64j1q6O3q4P0
2604Go6m9J68n3L2j09M9NJ11K3j13Q5o1oK4nl5p6R4O6r1Kk3l1Q6N8k2j32N9l6
2634c9N5o5K7n1L8P3j8l6K8j1n8N2J41j08l7n1O3j3l2m7K1J34lp5J2m6J03o0R3
2663I0K3j78J29Kq9rl6P7l6N8n2J32r7j6Q7r6O0k2o9j5O8o0P5QL7p6P5Jp5o1Q4
2694A9l1Pj7l2J4j9J30N5j69k5mO7P1p6j9L2pL9j3m7O1j01m1J08N3j11JP2l4J05
2724H8n4%J2K0o2L0j56P3k6P4P5r1M4m5Q6k9q4M1m7QJ12r0O4m5k4J40q6o9J13
2753G2q4o1O2k0Q8N8r4K3p9ll7N7O6L%Lj46J16P1o6j0k1N8j36Q4N4j3l5K1nn3
$$ plain form
2784 -27 86 -42 -10 -48 75 95 -19 -41 -63 -99 -97 -2 -35 -63 10 -73 -22 -24 -10 -13 41 57 31 -5 13 31 10 54 13 -3
2814 -3 -1 7 8 -40 37 57 -31 55 75 66 -34 54 66 -14 30 82 -14 16 54 119 41 -53 -14 -43 -61 -105 -59 -9 -101 -6 -68 -7
2846 -7 35 -111 -139 -1 -32 -120 36 -28 -45 8 -68 65 40 67 34 -13 -23 93 -57 115 8 57 -13 -22 -1 -24 6
2873 6 11 -117 -35 10 -28 -41 33 -29 -19 40 -38 20 -40 -6 30 -8 -32 32 -4 18 52 -38 -90 57 -64 3 47 15 -108
2902 -108 -41 39 -25 28 -14 23 33 35 6 -15 -3 -48 -60 -5 45 142 107 41 0 22 60 59 16 -68 48 -13 -38 -53 76 -46
2932 -46 0 83 16 -68 55 -55 14 -10 29 -25 -74 -122 50 -26 -13 17 11 -14 -47 4 -47 12 -84 33 44 -15 62 -50
2960 -50 -23 4 16 -92 33 19 51 8 38 -30 98 62 -10 85 41 -52 0 4 66 16 42 25 -29 42 -30 -30 -72 -20 -61 -3
2990 -3 8 24 -8 -48 -60 67 -69 53 -20 -44 32 -92 -13 -26 -2 -4 -1 38 -67 3 -42 -27 22 -23 45 -10 -32 61 4
$$ packed form
2784b7J13j28L2l8J23K0j14k2k2l6KR5l3k8P3q3N1kJ4lN4J6k6l6J8J8k1M4m1j6
2814cKQJm8P7K0q8Q6K0rj00Q8J2q0M4N2r6L0L8O5p8r4L9k9j8m4M6N0r2R5o2O1
2846gM2j46k8J38l1q8J56o4j7N3p6J33k5K7l3m7j0J16j50J72j07M9p0rK1k3L0
2873FNj28Q2M5l8j3P4o2J0N9p8N8o0L4L6l8k4O4l6K2L4r0n2J47j21O7M4l2j23
2902a08O7Q0o4N3m2L7J0Kk9k1J2m5j2N5N0R7l5o6m1K2L8jm3q4J16o1k5j5J29j22
2932d6M6Q3o7q4J23j10O9k4L9n4m9m8J72p6J3L0ok5l3N1n1N9r6J17J1n9P7j12
2960e0K7K7J2j08J25j4L2m3L0o8J28l6p2R5m4r3N2MO2n0K6j7n4P1p2%m2N2m1N8
2990cJ1J6l2m0j2J27j36J22p3k4P6j24P9j3K4kLL9j05P0m5J5M9m5O8n5k2R3n7
$$ plain form
3019 4 60 31 22 -64 74 -12 169 46 -21 9 8 -22 -11 -46 -17 9 59 71 163 -30 -33 -45 -37 -29 9 -45 8 31 38 -54 -53 -83
3051 -83 -59 15 6 -29 12 66 5 2 -21 -32 49 87 21 80 1 76 1 -45 37 -3 -1 106 19 -34 3 35 -102 -12 25 -44 -1
3082 -1 98 47 -73 39 31 -21 -43 5 13 -15 -58 -23 -111 24 -52 -23 95 44 17 -42 -7 -10 -8 -5 -43 -12 -66 50 70 3 -31
3113 -31 8 -82 -76 66 -5 -17 24 36 58 -10 -38 -15 55 101 9 29 27 -66 26 23 61 -17 72 -29 -42 2 -9 -61 -19 -29 -74
3144 -74 32 0 0 -4 -29 45 -47 -29 -20 -16 22 -48 -29 -76 -13 -30 -25 -1 -35 -34 45 -74 12 -51 26 96 -36 -13 59 9 5 48
3176 48 88 -16 -29 -28 67 -95 -44 12 21 -81 -37 -30 -86 64 -52 -159 -21 32 15 -67 26 -20 -15 -118 -12 -23 -56 19
3204 19 2 -104 8 -49 58 -27 57 -32 -13 -21 114 34 95 -12 -46 39 68 -21 -47 83 4 56 36 40 -79 29 60
3231 60 -21 62 107 -3 -33 23 -58 94 -82 -3 31 -16 13 -34 44 32 -16 -10 6 -112 -135 66 -25 -76 -28 -63 -1 -26
$$ packed form
3019DN6k9rq6J38q6J81j23o7L0jl0J1l5K9K6N0J2R2j93lj2QQL8n4N3K3Pr2Jl0
3051h3K4P4rl5M1N4o1lk3j1Q1L8o6N9p9P5p5m6Q2m0KJ07q7n3L7L2j37R0L7o9M3
3082aR9n1j20J12qn2k2M8Qk8m3L5q8J35p6K9J18n1k7n9L5lKLl8L1n4J16K0o7l4
3113c1L9r0OJ42p1j2M1J2K2o8k8K3P0M6r2K0kr3R2lL8p8Q9j01j3M4j1n2M2j0m5
3144g4J06l2%mk5P4r2J8RML8p0J9m7O3j7NK4l4JP9j19Q6o3P7P0j32K3P2n0mM3
3176D8M0j04j3JR5j62N1N6Rj02M4Pn6J50j16j07J38N3j7q2R3m6Nj03J06j1l3P5
3204A9j7j06J12n7J07q5Q4q9J9qJ35q0O1j07l4Q5K9q9k6J30p9N2k0Mj19J08L1
3231F0q1Q3M5j10l0N6q1J52j76P9L4m7K9m7P8j2m8OJ6j18k3K01r1n1M8l5O2k5
$$ plain form
3259 -26 -79 -14 -39 7 22 -34 13 4 126 24 62 19 15 4 -82 -62 52 -12 -24 -8 76 62 38 -38 -132 31 -20 -43 -12
3288 -12 -8 51 76 -2 -29 -47 45 -41 -62 -125 -67 -58 7 -36 -50 -3 -22 46 19 -35 -22 -82 -56 -95 31 -77 -9 103 11 -36
3318 -36 11 11 -54 -13 -9 3 15 0 -51 -11 -38 49 41 -8 -12 -101 -28 5 -3 23 26 -47 21 27 -37 11 26 113 42 -5 -78 -3 -28 -16
3352 -16 -31 46 -8 -54 11 19 16 35 49 -24 42 21 -1 -32 33 -4 5 21 53 43 -15 -1 8 -35 71 34 1 36 6 36 -35 46
3384 46 47 30 -27 0 34 40 -47 41 62 -73 -76 19 69 104 -36 3 -62 -26 59 -20 9 11 -4 -70 35 48 -67 -25 53 -30
3414 -30 36 -16 -24 81 -4 -40 -2 24 108 37 -64 -24 -20 55 -93 61 51 69 6 0 2 11 103 62 -5 -10 63 -19 16 -83 8
3445 8 -89 -79 -126 45 -41 -33 14 -15 -86 -49 -44 -89 -48 -30 -44 -65 42 -53 -86 -83 37 -67 23 62 2 6 37 2 56 84 46
3476 46 -51 -15 41 4 -78 -40 81 9 13 20 -12 67 78 4 77 -65 -33 -21 -27 -64 5 3 -21 27 21 -2 -17 -28 -34 -22 29 -3
$$ packed form
3259b6n3O5k5M6J5n6M7rJ22j02L8m3mj1q6K0J14o4j2J6Q4j4k4p6r4J63n1k3L1
3288a2MN9K5p8k7j8R2q6k1o3N8RO5m3j4M7j9O8k7n4J3o0K6l9J26j08O8J12r2m7
3318c6M7%o5M1MJ2J2j5n1M0k7Q7qm9mq9P3L3qK6Lp3O8Oo4M8J5Q7p1m7p3P5k5J2
3352a6j5P7n4m6O5QlJ9J4p3O6k1k2l1O5l7RJ6L2j0n8J4Rm3J06l7l3L5l0L0p1Q1
3384D6Jj7n7K7L4Oq7Q8K1j35lR5N0L5j40L9o5L6Q5p9K9Kj5o6J05J3j15M2P8q3
3414c0O6n2qJ05q5l6L8K6Q4p1j01M0MP5j48J54j0J8o3oKRR2m1o7nP3q2L5r9R1
3445Hr7J0m7J71q6QM7k9p1L7Nm5M1J8j4k1J07r5l3LJ20j04R0L9o0ML1l5N4K8l8
3476D6r7L6N6l7q2L8J21p2MPl2P9J1p4P3j42L2J2ol7O9kk4M8ok3j5j1oJ2N1l2
$$ plain form
3508 -3 -21 -22 -55 0 -10 -5 36 -20 -60 -63 22 -18 -46 -33 -18 98 9 28 48 -31 -37 -16 0 -13 7 18 1 -41 -65 42 -13 62
3540 62 22 51 -14 -10 -115 -38 -16 59 13 -13 -22 -22 13 7 -4 68 -18 33 -22 -34 90 -106 -63 -6 -69 48 6 -76 -1 75
3570 75 8 -97 -37 23 25 25 -36 -40 68 73 40 7 11 33 -66 52 -67 -37 -24 29 -23 -11 31 -2 7 18 53 12 -15 -34 -43 -41
3602 -41 -76 13 -70 -5 -12 13 61 -56 44 32 10 -54 -60 11 26 -15 15 -15 -41 111 25 -121 40 16 -25 60 -3 57 49
3631 49 62 -27 50 4 -3 56 14 -12 -19 27 57 107 46 -7 24 33 63 -27 51 22 -44 -26 -18 -4 99 25 75 -75 35 66 -85
3662 -85 -17 -37 -42 -61 19 1 30 9 -33 -29 -23 -60 47 3 -48 -20 16 30 31 -95 39 1 21 14 10 52 74 22 -22 -30 57 -14
3694 -14 -19 -9 46 66 -36 -4 57 27 81 -33 -67 -47 -76 19 37 -49 -62 -16 -95 11 -34 22 55 6 22 -24 -81 -10 27
3723 27 63 1 1 22 53 36 30 -31 35 113 52 -11 85 31 -26 -48 88 -27 7 19 70 51 -46 -16 30 17 -6 44 5 46
$$ packed form
3508cj8jl3N5j0NM1n6m0lQ5m0k8J3J5J16q9J9K0p9oK1J6j3K0J1j7m2k4J07n5P5
3540F2m0K9o5Mj05P7K2P5m6k6r%L5oj1P2q6N1n5j2J24j96M3N7o3J17m2q2P5P6
3570G5o7j05O0O0K%o1mJ08Nl3l3MK2r9J18j19L0J3N3n2J2M2l3RJ1L5m1k7j9rK
3602d1l5Q9q3O5pK5M8j17J00j2k2o4oP1J5m1L0l0k6J52q6j46J61k4m1Q5o3O0q
3631D9J3q9P7m6pN9m2k6pM6L0N0o1n3L1RL0r0P8k9o6J8QJ4J03p4N0j50J10L1j51
3662h5O8k0nj9Q0j8K9k1m2MOl7J07m4n1K8L6J4Jj26J34l8K0pmM2K2n2m4qQ7p1
3694a4nJ0N5K0j02L2O1l0N4j14l4K0k9R5J8q6j3M6p9J06m5N6L3m9J6m6n7P1L7
3723B7L6o2%K1L1j7oo1O6P8o1o3R6n4n7k2J36j15L4J2N1j9r7L0M6j3k3N0l9M1
$$ plain form
3753 46 40 -46 -18 -32 -47 -29 35 2 -46 -54 5 -98 4 25 36 29 30 -71 -82 55 23 -152 -41 -5 130 73 -86 73
3781 73 62 -8 -5 -18 -14 22 -87 42 -14 3 48 -12 81 40 -6 7 7 -24 10 12 -52 39 -26 -14 28 5 48 -12 -11 -69 -76 33
3813 33 43 0 -99 -62 -18 5 -20 -27 30 -39 59 -75 67 1 -17 70 -32 39 79 56 110 17 60 -64 49 -33 39 59
3841 59 -9 -128 76 -17 -16 71 59 -55 99 58 -29 27 -47 23 -22 9 24 -51 -24 36 2 19 -18 -35 18 -17 11 5 -59
3870 -59 -17 -51 -38 25 -85 11 28 -3 35 -86 7 -27 33 1 23 71 82 18 72 -28 -114 -26 7 17 -14 -54 42 -9 42
3899 42 14 63 16 -20 -36 -5 37 -23 -34 -32 15 75 60 -30 -59 71 39 1 -118 -8 -55 -8 -41 18 -70 -5 -32 21 -111
3928 -111 79 -3 20 3 -10 52 30 57 91 32 41 12 -83 88 45 1 33 12 -9 56 -30 12 12 46 -32 60 -9 9 46 -36
3958 -36 -73 -45 -21 -112 -6 -62 -89 87 33 45 -46 4 -26 1 48 -21 -76 -30 -74 -99 0 10 43 -71 21 9 -5 34 -7
$$ packed form
3753D6oq6K8j4j5J8O4l3m8qN9j03J02K1J1pJj01j1J37l2j75J11L6J35n7j59J59
3781G3j1p0Lj3ML6j09J29n6J7M5o0R3m1m6J3%l1L4Ko4R1o5J2M2k3M3o0Jn8pJ09
3813C3J0m3r9L7M4K3k5pN7o9R8j34J42o6j8Q7j02P1M0k3N4r3M3j24J13q2P2K0
3841E9o8j19K04r3JQ7j2j14J54m1q7N6p4P0m5L1J5p5K7O0l4J7l7j7N3l5K8oo4
3870e9M2l4J3O3j10R6J7l1L8j21R3l4O0l2K2M8J1o4N4j00q6Q8L3J0l1m0R6n1N1
3899D2k8M9m7l6j6L1M2o0j1KM7O0j5r0k9J30l2l8j19J10m7M7l3N9q8O5k7N3j32
3928a11J90q2K3j7j3O2k2K7L4n9Rk9r5J71m3m4L2k1k1O5q6M2%L4p8R2o9J8L7q2
3958c6l7K8K4r1J06n6k7J76n4J2r1N0l0K7M7o9n5M6m4k5R9J0L3j14R2j2j4L9m1
$$ plain form
3987 -7 22 -13 -62 40 0 119 -4 22 -13 33 -20 15 -1 43 33 -63 10 37 -99 -39 67 22 28 -30 -9 36 26 51 43
4016 43 -7 -75 -15 -100 64 -64 21 88 -48 -45 -63 -2 -23 -6 -57 49 99 6 38 27 -52 73 29 23 113 32 -11 25 18
4045 18 -35 28 -16 36 54 -43 -73 42 -27 3 -16 27 55 -7 -44 14 -46 -88 -79 -54 -38 53 25 24 60 -1 12 1 -48 -5 42
4076 42 -56 -11 58 -18 51 -1 2 34 66 -6 50 49 -51 -28 34 -16 67 65 126 10 68 -9 13 -9 58 50 16 29 10 -16 -3
4107 -3 -10 21 -40 -10 -8 -42 -25 -31 33 16 -42 -19 22 25 84 11 -34 -45 -62 -17 -96 -80 -56 -74 82 7 -28 6 -113 21 -68
4138 -68 -26 -21 -4 78 55 8 -24 81 101 -5 28 -136 -3 -18 85 10 131 81 -20 28 -73 17 -58 -11 -65 -52 -14
4165 -14 -6 -28 -67 51 39 -77 32 1 10 16 7 -45 27 -15 0 47 84 -11 9 16 25 -11 -12 -20 5 70 44 94 46 80 -24 -11
4197 -11 -12 -74 73 41 86 1 -10 17 22 -25 -60 -83 44 -109 -53 28 -1 6 -8 27 -86 55 -13 16 10 -86 11 13 54 -39
$$ packed form
3987gK9l5m9J02m0J19j23K6l5M6n3L5j6M4j0r6P3K7j36O0J06m5On8K1M5j0K5q
4016D3n0o8O0q5J64j28Q5O7j36Lj8O1k1J7n1J06N0r3L2j1p9J25m4oR0q1m3L6p
4045A8n3O3m4N2J8r7l0J15o9L0j9M3K8o2l7N8o0m2RK5J6R1k8jL6o1J3j1m9M3M7
4076D2r8M5O9p6O9n2LL2L2p2N6jj00K3O2n0Q3kO1j16N8p7K2k2O7ql4J3j9k6J3
4107cpL1o1L0Kl4J7oO4j7n8K3M1LN9p3m5j1j7M5p9J6K4j8J56p5l5L4j19J34q9
4138f8M2NJ7Q2k3m7l2J05K0j06L3j64J33j5J03p5J21n0j01M8j01R0p5M7n4J3L8
4165a4Qk2l9J18j2j16J09l1ROrn2P2m2J5M7L7r5K0PRl6jqK5O5k6N0m8L4j04J3
4197a1jo2J47l2M5q5j1K7Nm7l5k3J27j53N6Q1k9Pj4L5j13J41o8K9or6R7KM1r3
$$ plain form
4227 -39 -89 -76 -33 35 -8 17 -85 -56 -8 37 75 -37 62 -55 79 16 45 45 21 -31 57 7 14 3 -56 26 -16 -28 53
4256 53 13 -69 148 80 -6 -60 -52 68 6 51 -92 -45 75 -25 -67 -40 18 -39 -29 27 28 -54 19 -8 57 -71 18 -60
4284 -60 77 -101 -9 -5 -9 -60 -62 120 72 -23 68 23 51 92 66 65 6 -49 -109 13 124 99 -69 -1 -19 68 -54 -73 16
4313 16 10 9 -20 26 47 105 -10 -26 68 34 -43 12 -35 57 -29 -21 95 -66 -21 42 -14 -130 4 -51 -45 -35 83 -24 -57
4342 -57 -46 28 63 -54 28 37 84 83 -76 40 50 -15 -21 41 124 38 -47 -5 -81 12 12 37 50 -57 -106 17 -52 -53 -41 -31
4372 -31 22 -21 15 102 -56 -73 -30 -13 -25 -14 26 -73 -62 112 4 -66 165 -54 39 -23 -41 33 46 -13 -50 27 1 -50
4400 -50 62 -24 -31 -43 -48 54 72 -26 -10 -29 28 31 44 63 100 79 1 81 -26 -46 18 -27 -57 43 50 2 -27 2 -6 -28 8
4431 8 -28 3 49 7 15 -68 12 -78 57 -21 11 15 20 -12 -65 -7 23 -22 30 -9 -45 21 -17 95 -70 5 109 17 55 23
$$ packed form
4227c9n0J3M3O8m3K5j02K9M8M5L8j12R9j17J34o3K9%k4n2Q8n0Pj1n9Q2m2j2Q1
4256E3m0q2K17o8q6n4QJ20o2M5j43M7J20j00m2K7N8n7J0N6Jq2P3k7O5j28Q9p8
4284f0J37j78R2Mmn1kJ82m8r5R1m5K8M1k6jn9n5o0J22J11k5j68O8j8Q7j22j9Q9
4313A6ojk9M6K1N8j15j6R4l4p7N5m7R2q6QJ16j61M5O3n6j16J34n5OJ0J18j07l3
4342e7J1P4L5j17Q2RM7jj59J16J0o5oO2Q3q6q5M2p6R3%K5J3j07m9J23o9jJ2J0
4372c1N3m3L6Q7j58j7M3J7j2J1M0r9J1J74j08p0K31k19R3o2j8P4J3n9l7P7k6n1
4400e0J12q6pj2nJ02J8r8J6j9N7LJ3J9L7k1p8Q0j07k0O4m5l0J00Pm8k9K9qk2L6
4431Hl6L1M6m2Qq3Q0r0J35p8L2MNl2n3N8L0m5N2l9l6O6l8J12j65P5J04r2L8l2
$$ plain form
4461 23 38 34 49 67 45 18 12 -25 5 37 -57 -8 -48 -22 53 -13 -21 -7 34 -12 -49 9 -43 -97 2 28 -20 -2 38 52 -84
4492 -84 -31 -7 14 66 5 19 52 57 4 31 90 -34 35 74 38 -59 77 15 38 -69 11 -89 -15 46 -35 39 -21 24 32
4521 32 24 -55 -81 -16 -25 -36 -42 -55 -11 -63 -14 -74 52 -8 -30 -45 -8 -8 52 16 58 -10 -7 -22 67 0 -39 59 -11 29 -111 37
4553 37 -7 -19 -97 14 -16 79 10 -17 -60 -49 25 -43 -45 -118 22 -45 117 -49 45 -153 -58 -19 -8 4 94 -76 -29 88
4581 88 3 4 -36 22 -1 -11 -32 -66 -35 -30 -14 -44 29 18 33 -4 78 -33 27 10 -93 56 -3 8 -3 -53 -66 -12 -35 73
4611 73 70 -2 23 -41 21 -20 -36 -5 12 -50 -4 35 -38 37 13 -15 -67 42 -21 -16 44 -27 4 -32 78 -4 -3 -68 12 -51 0
4642 0 35 52 -53 -31 93 41 -61 16 43 115 24 -8 14 89 63 -9 14 14 96 45 22 -17 83 -62 10 -57 62 -50
4670 -50 56 111 14 -88 -57 -71 69 25 -35 -15 -19 -27 26 -87 -6 -10 -108 -36 -22 33 -12 55 -74 -69 -73 2 51 -111 63
$$ packed form
4461B3J5mJ5J8k2k7ol7L0L2r4M9m0K6P5o6qJ4M1m6l7N8n2n4R9K6m8J8M0J4j36
4492h4N3K4K1N2o1J4L3Nn3K7N9j24O9L9l6r7J36o2K3j07Q0j00P4O1q1P4o0M5Q
4521C2qp9k6O5rj1oj3M4n2M9o0J26o0k2j5L7%O0l6M2o8Lj5Q9o7l9R8p0M0j40J48
4553C7m4j2p8J11l0R5o9k7m3J1P4o8kp3J40o7J62j66R4j98R5L9J1J2R0j70M7J17
4581H8q5Jm0N8k3j0k1l4L1NJ6l0P3j1J5l7Q2j11O0j7j03J49n9J1j1n0j3N4k3J08
4611G3lp2K5o4O2m1j6L1J7o2M6L9p3P5k4k8n2J09o3NO0p1L1l6J10q2Jo5Q0o3N1
4642@L5J7j05K2J24n2j02P7K7P2r1l2K2P5k6p2K3%Q2n1k3l9J00j45P2o7J19j12
4670e0J06N5r7j02L1j4J40m4o0K0mqN3j13Q1mr8P2J4N5m5O7j29NmP5M9j62J74
$$ plain form
4699 63 -39 88 29 29 67 -77 -48 65 19 -31 -26 50 33 3 12 95 1 5 -4 54 -76 22 -20 61 -40 -116 -50 -15 -81 -48
4729 -48 -82 -39 51 -38 -44 -30 48 7 2 -17 0 28 -30 -35 38 68 -10 8 68 55 20 -63 6 54 69 22 -4 36 28 -17 24 -12
4761 -12 45 29 47 47 -5 47 39 15 39 1 -42 48 -25 81 -38 -49 53 -85 39 -7 54 16 -16 -35 -75 -45 37 0 -68
4790 -68 38 61 -63 33 17 -20 -83 -14 -73 -31 51 -95 75 60 -6 -3 73 -6 55 24 1 18 -19 45 -34 -44 -1 -57 62
4819 62 -43 -13 62 -9 -32 -44 4 -24 -26 -21 -8 -36 -72 -81 -17 80 -93 -97 1 -31 19 75 21 -37 84 2 20 -3 -10 16 -37
4850 -37 -9 13 -16 -21 27 -69 -53 -37 35 -16 -41 22 109 45 48 -24 -1 -6 -101 26 -84 3 -21 103 -76 7 -18 -35 -11 -59
4880 -59 -26 -8 1 -69 33 68 -98 -35 68 -21 42 -59 38 81 -35 33 -15 -41 30 -44 -45 33 -26 -5 -37 -34 -53 71 81
4909 81 105 86 74 64 -7 71 157 14 -1 88 36 -2 -25 -7 -56 8 -6 -7 51 -58 -45 23 -22 -3 -101 -1 -37 -12 -44
$$ packed form
4699F3j02J27n9%L8j44K9J13m6n0NP6j7l0RQ3r4MrN8j30R8m2Q1j01p6O6L5o6L3
4729d8l4M3R0q9oJ4P8m1nj9J7K8n8nP3L0p8J8O0j3l5q3O9M8J5m7k6M0qm5M1l6
4761a2N7j6J8%n2N2qk4K4l8m3R0p3J06j19j1J02j38J24m6O1l8l2j9m0L0Q2l7o8
4790f8J06K3j24R6j6l7o3O9n9M2Q2j46J70j5o6LP6p9O1l1k3J7l7O4p9j0M3n6J19
4819F2j05L0P5p1k3j2M8k8kNJ3k8l6rO4R7j73mR8l2N0N6n4n8J21q2J8k3pK6n3
4850c7K8K2k9nM8r6J6J6P2n1k5O3Q7o4Lp2K3nr5J27j10Q7k4J24j79Q3k5j7K4m8
4880e9L3J8Rp0J02L5j66O3J03q9O3j01R7M3j16O8m8k6P1p4jP8n9K1l2Lj9J24J0
4909H1K4j9j2j0p1P8Q6j43j5Q9n2l8k3J8m9O4j4jN8j09J3O8m5J9r8J00l6K5l2
$$ plain form
4938 -44 -85 -24 42 16 8 -3 -106 -34 -29 60 29 4 -65 5 -5 31 -24 51 17 2 16 -5 -25 -95 27 84 9 110 72 -24
4968 -24 20 6 19 52 -33 17 12 24 66 17 -57 4 73 -54 -68 -24 -105 -99 -26 -37 -84 -32 20 -1 -5 86 38 23 -10 0 7 26
5000 26 38 -59 -95 -27 10 37 -48 -40 28 -60 -50 31 51 30 25 -71 -3 2 71 37 29 -14 -59 10 77 -57 6 -16 -11 21 -76 16
5032 16 -21 37 -68 22 -39 0 0 18 13 -27 -32 60 -35 -7 -22 -33 77 -92 -52 -24 -4 38 68 32 -101 16 11 1 28 85
5062 85 103 73 -55 -83 74 72 24 -70 22 -136 -58 49 20 38 -65 22 32 -22 16 -42 -23 43 -18 3 -35 8 -65 -2
5090 -2 -63 30 9 -7 -15 -16 16 -22 23 -43 5 -79 54 -70 30 16 52 41 -23 -8 128 -7 -21 -22 -107 -4 28 24 -52 27
5120 27 22 88 -26 -7 68 -29 -24 11 57 77 7 -17 -20 -58 13 18 -45 9 42 -33 -63 -49 71 -98 13 -21 -48 -5 -84 -42
5150 -42 -107 14 92 58 -34 -32 23 8 -6 9 -59 0 35 34 15 137 92 10 71 10 -18 -33 -46 -14 83 -1 -27 -3 -62 -11
$$ packed form
4938d4m1O1O6k6qj1j03P2NQ9l1k5o9P0j0L6n5P5l4j5J4k1k0p0J22N7p5J01l8r6
4968b4M4j4J3L3q5N0nJ2M2m9p4O1O9j27j4M4q1OP3j1m7N2N2k1mR1m8j5l3J0PJ9
5000B6J2r7l6O8L7K7q5QO8q8J0Q1K0k1nr6O8NO9l4qm3m5O9O7j34O3k2NL2r7R2
5032A6l7N8j05R0o1L9%J8nm0nR2r5K8j5j1J10j69M0K8K0M2L0l6j33J17nj0K7N7
5062H5J8l0j28k8J57km8r4R2j58P8J07k9J8j03Q7J0n4L8n8J9O6o1K1l8M3p3O3
5090bo1R3k1j6qjL2l8M5o6M8q4J33j24J00j4L6j1o4J5J36j35j4jq5J03L2mp6P9
5120B7nO6j14J9P5r7NL5M6K0p0k4ll8P1No3N4L3p5l0J4J20j69J11l4k7M3p9M2
5150d2o5J21P8l4r2KN5j5j4J5o8N9L5jj9J22m5q2O1o1k8j5j3L2R7q4k6K4n9N1
$$ plain form
5180 -11 68 6 -62 71 -23 47 -29 -6 19 10 -71 -74 -98 -5 -26 -79 7 9 3 46 39 44 -69 24 -28 -31 7 -2 -11 14 44 -7 -63 -16
5214 -16 19 -20 -1 33 83 80 52 29 -22 97 30 48 100 48 61 -38 40 -35 -29 2 -19 30 -30 62 22 -39 25 9 46 -73
5244 -73 -70 33 37 -17 25 17 -3 -42 65 7 30 -5 59 -14 -39 75 -39 47 14 -63 -68 -40 108 9 67 115 12 146 -10
5273 -10 -1 -16 92 75 -50 -29 29 69 -16 -16 -34 77 5 24 43 13 109 -87 -91 -47 -81 29 63 -64 -72 -41 -68 -36 49
5302 49 17 11 11 60 -64 -2 -81 -58 -10 46 21 -20 31 45 43 45 39 75 61 3 68 -19 -47 48 32 24 33 -73 8 31 -31 26 50
5335 50 -4 -30 -3 -53 -25 -9 30 -33 54 -4 -26 21 19 -7 0 0 -34 14 11 4 1 -75 87 22 -3 34 52 49 0 34 39 -43 31 -24
5369 -24 139 2 -12 65 58 36 62 82 25 -41 -62 -9 -28 -16 53 -20 -75 -47 -9 32 62 -19 -76 22 -101 -22 -24 -22 -39 -4
5399 -4 -63 19 26 53 68 80 22 -29 -10 25 37 -45 -39 20 -81 6 48 -2 59 -31 10 32 50 46 4 17 -39 59 -7 98 67
$$ packed form
5180a1P9o2o8J33r4P0p6K3K5rq1lk4R3k1n3Q6KoM3pNj13R3n2lL8rrK5L0n1n6M7
5214a6L5l9J9L4N0lk8k3n1J19o7J8N2n2J3r9P8p5OL1k1M9o0R2m0o1O4j6L7j19
5244g3LJ03Mn4M2qk0l9J07n8K3l5O4p3k5J14j14Q6l3p7nK8J48r9N8M8j03J34j56
5273a0Rj5J08j7j25K1N8M0q5%j8J11p2J9J9l0R6j96mM4l4J10L4j27qL1k7L2Q5
5302D9l2o%M9j24O2p9K3M8N6k5m1N1J4kKoL6j4n8O5q7k8R5j6qRj06Q1K3o2N7K4
5335E0n4k6K7n0K8J6L9o3Q7n8k2M7kk6P%l4M8lplp6J62o5k5L7J8lm9L4Nq2P4n5
5369b4J63j37j4P7pk2K6K0n7o6k1N3j9J2O9p3n5K8L8M1L0q1n7R8j23P9kKj7L5
5399dn9Q2PK7J5J2n8n1J9L5J2q2ON9j01Q7M2n0O1r0M1K2J8mm2J3n6R8o6J05l1
$$ plain form
5430 67 22 -18 44 -42 -41 -10 -4 4 61 -18 -44 -40 -14 4 -69 -10 -70 -27 -48 15 -33 -58 -41 10 -111 -42 33 6 -31 0 73 55
5462 55 19 37 -46 67 17 95 26 51 -69 18 35 8 51 34 6 -3 0 37 -30 62 -10 68 -44 95 42 -10 -42 -60 28
5491 28 49 -109 52 -42 19 -84 -58 -66 -98 -24 -63 34 -67 55 4 -33 44 50 70 48 -6 -13 17 -64 30 3 40 -42 -11
5520 -11 14 -34 87 -5 107 12 39 -2 -4 9 63 49 -6 -34 83 -24 27 8 -12 30 -33 8 -3 42 1 -33 -15 -5 -6
5549 -6 -71 -23 -1 -109 43 40 13 -63 -26 -26 -6 70 49 48 74 128 69 -12 -63 52 -57 8 -18 55 -2 -24 46 12 3 14 -48
5580 -48 -9 -2 -2 -30 119 -8 62 -28 40 38 -29 14 1 45 22 31 -14 71 -10 -30 -34 -63 21 69 58 -23 -86 1 -7 -47 -74 -41
5612 -41 -1 -33 -29 -6 10 42 119 -59 -10 -12 -60 29 57 52 51 103 -45 -26 10 -64 -77 29 25 38 -18 -29 6 -29 23 3 -24
5643 -24 9 -51 -6 45 -58 21 -34 -33 -15 65 41 -8 -39 15 -44 -95 -12 2 6 -21 -68 -34 -41 70 20 -36 25 -23 49 -76
$$ packed form
5430F7m5m0O2q6JL1OQN7p9k6MK6J8p3N9o0M3k1O3m8k5J7N1j21O9P5k7l7L1P3j8
5462E5l6J8q3J13n0P8o9K5j20Q7J7k7M3j7k8rLL7o7R2p2P8j12J39n3n2l2j8Q8
5491B8K1j58J61r4O1j03K6ql2P4l9R7j01J22n1l7P7OK0k2n4pL0q1R4k7L7q2L1
5520a1K5m8J21r2J12r5K7m1kJ3N4j4n5k8J17j07N1j9k0M2o3M1j1M5m1l4J8J0j
5549fo5M8K2j08J52lk7p6L7%K0P6k1jK6N4n9q1n1J15j09O5k6P3n7k2P0l4rJ1o2
5580d8L9P%k8J49j27P0r0O8ko7M3j3M4k3Rm5Q5q1k0mk9Q4M8j1q1o3Q7qm0k7L3
5612d1M0l2MK3J6L2P7j78M9km8Q9K8njN2j48J9L6p4j3J06mJ3n6j1L5l5N2k0k7
5643b4L3o0M5N1j03P9n5JJ8Q0k4m9l1N4n9n1Q3J4Mk7m7L4pJ11n0n6O1m8P2j25
$$ plain form
5673 -76 -15 -4 36 12 -41 19 13 39 -12 16 98 -75 -28 130 45 -14 -36 -96 15 12 15 102 31 2 -14 -20 -17 -14 -62 16 26 45
5705 45 -23 -93 3 -2 -32 48 -23 -77 -37 5 30 68 20 -11 -9 -12 32 -25 14 -7 -73 -14 9 48 -49 -40 47 -48 -64 154 93 -36
5737 -36 55 22 -44 -2 -6 58 33 29 -18 -27 -18 -23 11 20 1 -58 -19 -22 -3 -36 -20 -77 -35 27 -20 -3 -30 13 51 -18 -88 18 -133
5770 -133 -11 118 -60 -13 -1 64 15 55 76 -23 12 -13 19 -50 82 -26 -21 81 -55 9 -22 10 20 74 32 -35 -9
5797 -9 34 22 -1 33 -2 21 -37 50 -27 54 37 -11 8 -15 71 37 -22 -40 6 43 34 25 31 21 66 39 118 174 6 40 44 -39
5829 -39 44 -28 -82 -7 28 -49 -25 -30 4 95 7 -72 94 18 -35 41 -1 -52 31 69 78 -15 6 -61 -69 -69 19 -23 16 -64 -43 -6
5861 -6 3 -23 -73 40 31 22 -39 20 53 -64 122 99 -78 50 29 46 48 -9 67 -3 -57 97 42 36 37 30 -3 54 21 54 -22
5892 -22 19 99 111 11 48 -42 -25 -10 -23 5 -17 -12 22 -17 -14 51 -78 -59 -53 -17 -40 36 15 -43 31 -29 -37 58 -10 -109 -100 59
$$ packed form
5673g6O1J1M0k4n3O0oK6n1K8Q2j73M7J58q5n9k2o0J11lLQ7p1k9j6oLLm8P8J0J9
5705D5o8p0R6nl0Q0p1n4M0M2K5L8m8l1KlM4n7L9k1o6N9K3L9r7RQ7r5j6K18o1j29
5737c6R1l3o6M2mO4k5mm7rRnL4Rj9n9L9lJ9l3J6n7M2O2m7J7k7M3L8o9p0J06j51
5770a33J22J29j78M7J2O5m9M0K1r9L5k5L2o9J32j08NJ02j36O4l1L2J0N4m2o7K6
5797iM3j2k3L4l5K3n8Q7p7Q1j7m8J9k3Q6l4n9j8M6L7rrOj0M5k7P9N6j68L4Mq3
5829c9Q3p2n4P5L5p7K4nL4R1q8p9J66p6n3P6m2n1Q3L8Rr3K1o7q%Q8m2L9q0K1L7
5861fRk6n0J13rro1N9L3j17J86k3j77J28k1J7Kn7P6p0n4J54n5oJpl3N7l3L3p6
5892b2M1Q0J2j00L7r0J7J5j3K8k2NL4l9LO5j29J9OL6k3P6k1n8P4o0qR5o8r9RJ59
$$ plain form
5924 59 -22 -98 54 -14 -15 -1 41 -36 71 -21 -56 -33 20 9 63 68 38 63 20 26 131 -60 -50 31 5 95 43 -25 9 -7
5954 -7 54 -30 -100 -130 32 -9 -35 -86 6 45 30 -23 4 -6 -88 20 -16 -69 13 11 -84 102 -21 24 -26 47 3 -61 10
5983 10 40 -21 38 5 -1 17 -51 24 22 -96 53 -31 -30 -50 -18 25 -8 -7 -83 37 8 -30 -10 2 -66 -73 59 -55 -89 -30
6013 -30 -122 -4 49 3 30 98 7 6 -5 125 -11 -62 -15 -9 -32 32 15 -48 -49 18 -24 35 77 25 10 26 37 135 8 11
6043 11 30 -31 35 64 0 13 -60 39 18 -77 -46 66 -46 31 66 9 -42 -40 -64 -43 -70 -50 -14 -54 -25 -78 -36 46 52 76
6073 76 30 39 -60 -41 -5 1 31 31 -60 -42 88 -117 12 -54 -5 -29 -46 -63 -53 72 25 62 37 21 20 -5 50 -67 -83 82
6103 82 68 40 -66 -12 -34 -3 -6 24 69 -68 -59 -46 -44 -30 64 71 -17 -38 -24 -78 30 -33 6 -16 55 39 -74 83 -47
6132 -47 46 44 -44 -37 104 32 -43 24 -78 99 77 32 -39 6 23 8 19 52 18 9 54 27 -30 -41 -84 23 -10 -52 -82 -95
$$ packed form
5924E9q1p6J52o8jJ4M2p7J07r2l5K3N3j1N4Nl0K5m3OJ05j91J0Q1k6R0n2o8L4j6
5954gO1q4p0l0J62m1k6n1R2L9j5n3K7j0q2J08l6n3Q2kr5J86j23M5n0P3m4o4P1
5983A0L0o1N9l3oJ8o8P5kj18J49q4Jk0L2M3l3Jp6J20k9l8K0J2o8pJ32j14l4N9
6013c0r2J18N3m6K7O8r1jj1J30j36n1M7Ok3O4j7o3jO7m2N9M2n2j5J6J1R8j27L
6043A1J9o1O6K9o4J3p3R9k1r5L1J12j12P7L5n7n1Kk4K1k7K0L6m0K9n3M2Q2OK4
6073G6m6Rr9J9L6OL0%r1J8J30k05J29o6M9k4j7j7J0J25m7L7k5j6jk5N5j17j6J65
6103H2j4k8j06N4k2L1lL0M5j37RJ3KJ4R4Pq8k1J4n4J08o3L9k2P1j6j13J57j30
6132d7R3kq8PJ41p2p5O7j02J77k2m5p1M5J7j5J1L3l4rM5k7n7j1m3J07l3m2l0j3
$$ plain form
6162 -95 -4 -26 -10 -16 57 -11 31 2 -47 -68 -14 -28 11 37 2 -54 -68 11 12 -56 101 28 -37 114 -76 -32 19 -39 -10 -27
6192 -27 61 51 67 43 -35 20 110 55 45 6 -19 23 0 12 44 -17 -74 -71 61 -9 12 51 -84 -57 -4 -45 -49 79 19 -23
6222 -23 31 31 -18 -17 39 -46 73 8 7 -68 -20 -11 41 92 25 0 23 -32 59 44 66 -48 5 53 28 -1 36 11 127 76 21
6253 21 80 -26 -16 -20 -40 -9 -46 53 48 -30 23 -63 33 34 -39 57 16 -6 66 -38 -122 -15 -3 33 -30 18 -28 -4 19 -2
6283 -2 -103 3 17 1 -9 88 14 -39 62 14 5 54 52 15 -85 41 -33 -22 7 -93 2 35 53 16 -13 96 10 -30
6311 -30 -41 -30 -1 -35 -52 -39 -20 -33 -15 -17 64 -59 -2 -13 -2 -10 30 -52 -40 -27 -37 58 16 -80 4 -17 67 18 60 36 71
6342 71 41 -80 34 75 -22 78 45 -4 18 13 43 -19 38 21 34 -36 -35 30 37 -41 28 16 -17 -30 -39 -54 50 17 -101 30
6372 30 -24 -10 -54 58 13 17 -34 -29 -12 -48 0 -58 36 -28 13 -34 -35 7 -39 20 -6 11 70 29 44 -47 -19 -23 -42 -42 -10 -95
$$ packed form
6162i5R1k2J6oP3o8M2k9m9k1N4j4L9K6l5n6j4P9Jo8J57p3o5J51j90M4N1n8K9j7
6192b7Q8j0J6k4p8N5R0n5j0l9k5M2k3J2L2o1n7LJ32p0K1L9j35K7N3m1mJ28o0m2
6222b3N4%m9JN6q5J19o5jp5M8RN2N1o7k5K3n5R1j5K2j14N3M8k5k9L7k5J16n1n5
6253B1N9j06J0mk0L1l7R9np8N3q6R6Jp3R6m1k2P2j04q4J07J2L6o3M8m6K4K3k1
6283bj01J06J4j6j0R7p4n3J01m8rM9kl7j00J26p4J1K9j00R5L3J8l7k9J09q6m0
6311c0j1J1K9l4j7J3J9j3J8kQ1j23N7j1J1qM0q2J2J3j0R5m2r6Q4k1Q4m9M2k4L5
6342G1l0j21J14M1r7J00l3m9K2nL0o2N7j7J3p0JO5Pp8O9j2l3j3rj5J04l3j18J31
6372C0n4J4m4J12m5Mn1NJ7l6M8n8R4o4M1m7jM2m6N9k6J7N9m1J5r1K8mj9%L2q5
$$ plain form
6404 -95 -34 56 -10 -3 24 -42 1 -41 -45 -95 15 -30 -3 -88 17 -41 -86 -37 -19 -2 50 -75 -22 -7 42 -22 -31 -27 -13 21 17
6435 17 -53 77 -27 -43 50 37 20 53 30 46 94 -13 -7 -27 -87 62 12 18 -48 19 30 -6 26 -83 92 -2 -113 -44
6463 -44 12 51 -103 37 36 -59 -62 -59 60 8 7 1 -45 -10 81 87 53 34 -32 89 0 14 6 -54 21 -9 23 57 14 44 14 70
6495 70 72 6 7 -45 52 -77 10 11 15 -52 9 1 -121 20 -5 -55 -22 8 48 2 -33 43 -44 -29 -73 -18 -83 -62 5 -85 -67
6526 -67 -23 63 -31 -48 -39 17 20 95 7 -20 33 28 -9 -18 20 68 -36 43 -7 33 64 44 52 2 77 -10 -30 18 10 -21 95 -22
6558 -22 -10 49 -41 15 -81 -145 -6 23 -30 -95 33 -32 -31 8 -12 -11 -7 -48 33 -100 -24 55 -14 -94 8 -72 -58 62 -1
6587 -1 18 0 74 36 98 -7 -65 100 4 53 -56 -34 -27 30 -18 4 22 21 -5 51 -23 -19 23 -21 5 -61 31 47 41 42 -65
6618 -65 -28 27 -9 13 -41 -12 -14 89 89 -39 12 -49 -65 -91 -74 1 -102 26 -22 12 66 56 34 -51 68 9 81 -37
$$ packed form
6404i5O1R0o6PK7o6M3m2mn0J10m5K7q5J05n8m5M9J8J7N2j25N3J5M9o4rMJ4L4m
6435A7p0J30j04j6R3j3j7L3k3J6M8j07Ok0o0J49n0Oo6O7J1l6L2j09J75r4j11O9
6463d4N6L9j54J40jr5lLJ19n2jom6L5R1Ol4j9o6J21q9J4qo0P5l0L2L4m3L0l0N6
6495G0Ko6Jn2R7j29Q7JMo7O1qj22J41k5n0L3L0M0m6l5P6q7J5m4N5o5K1O7r0J8
6526f7M4Q6r4j7RN6LP5q8k7N3nl7rL8M8j04P9n0M0L1k0Qn0P5q7k0M8ql1J16j17
6558b2J2N9r0N6r6o4J39K9n3o5J28o5JL9k0JMm1Q1j33P6P9o9q0J02q0J4J20o3
6587aJ9j8P4l8O2j05n8J65r6M9j09K2PN7m8K2J8jk6N6p4MM2m4K6o6R2J6oJj07
6618f5L7N5l6K2n4K9kJ03%j28N1o1j6k6J7P5j03J28m8L4N4j0k2q5J19n9P2j18
$$ plain form
6646 -37 41 -7 -62 8 -24 -28 73 45 -40 -22 50 18 -1 -37 22 -35 76 -13 -32 -47 -7 17 -26 -84 36 -118 -35 -33 -45
6675 -45 -18 63 -52 45 -93 -110 -23 -151 -49 -46 -29 -102 -2 -29 -17 14 63 -11 7 47 -2 -3 -54 -38 8 31 88 -17
6703 -17 5 5 56 5 -19 -14 -42 -16 -10 96 32 -31 -50 -29 43 -29 -68 -25 -18 -64 -6 -51 -28 -98 12 17 -31 68 -39 15 77
6734 77 -133 -4 10 -20 -27 69 12 -6 20 43 -37 47 2 39 -14 134 52 66 3 17 30 -35 2 -35 45 46 48 -23 4 -13
6764 -13 26 -6 70 5 4 -18 -93 -30 40 12 -80 112 16 9 -12 -30 -47 -108 -10 -80 -38 62 59 6 17 -7 -32 -61 -13 29 -43
6795 -43 23 1 -24 -24 34 -39 25 112 45 36 -44 11 15 -19 5 -12 81 12 60 -38 35 -26 61 -19 -78 59 2 -7 15 -3 -18 45
6827 45 11 14 -90 39 30 86 30 43 -37 11 -23 51 -21 8 84 37 -69 -46 14 92 20 43 2 -18 0 58 40 11 17 -48
6857 -48 20 11 -9 -17 103 26 38 25 -12 -11 -5 0 -24 10 -29 36 -4 22 -8 3 19 19 -6 3 -33 56 43 58 24 14 -63 -34 -16
$$ packed form
6646c7P8m8n5P0l2mJ01k8q5J8P2l2j9l6N9n7J11q9j9j5M0K4m3n8J20j54Q3Kj2
6675d5K7Q1j15R7j38j7Q7j28J02LJ7p3J00k7J2L1M9p4J8M0m9jn1J6M6K3N7j05
6703a7K2%N1n1k4Nk8K6OJ06o4o3j9K1P2p2l9M3Pm6N8m5K3p0J10Nm8R9j07N4O2
6734G7k10J29J4l0pR6n7j8K6K3q0Q4m5L7n3J48q2J4o3J4J3o5L7l7Q0JKp1K7j7
6764a3L9l2P6o5jk2p5O3P0k8r2J92r6pk1j8j7o1R8p0M2J00ln3J1k4k5k9M8M2p2
6795d3O6k2k5%N8p3O4Q7o7rq0N5Ml4K4j7R3o9M8r8P3o1Q7q0n9J37n7rK2j8j5O3
6827D5l4Lj04J29rN6n6J3q0M8l4P4p2K9P6m7j06K3O0P8p2K3m1k0J8N8j8k9Oo5
6857d8O8rk0qJ20p7J2j3l7JONk4L4l9O5m0K6l0J1J6%k5Rl6Q9j3J5l4j0p7K9J8
$$ plain form
6890 -16 -73 18 -3 18 20 33 -25 27 -28 29 20 51 -48 -58 -29 102 -71 41 57 -54 37 22 -18 120 41 19 1 56 -34
6919 -34 0 -20 -21 -53 -33 30 -53 -69 36 -3 38 2 -38 -128 -92 -61 -26 85 -90 -23 56 -27 80 -20 -58 -37 -86 52
6947 52 17 -8 -14 100 59 -16 36 14 33 4 25 -35 102 50 -54 3 -31 -39 -9 -19 119 21 27 120 20 20 -17 -30 3 17
6977 17 -111 34 9 -109 -22 74 -7 -46 -39 0 8 -14 31 -8 68 -16 18 7 -19 -50 -93 -52 1 79 13 37 23 84 15 -50
7007 -50 11 -76 20 44 83 8 -2 -6 84 2 -60 -3 41 63 -25 -29 -21 47 -77 -67 -19 19 21 -4 -29 50 7 -43 77 82 67 1
7039 1 -50 -16 -44 7 22 -76 -41 -53 -54 61 -75 1 28 -5 77 -28 17 37 -82 -12 -10 -9 99 121 9 -30 4 10 11 -76
7069 -76 -2 -5 -59 -77 -3 -57 -22 -14 -24 -40 -43 -76 -41 -101 -33 -1 -107 41 -10 -28 -4 37 -46 57 -5 -23 -8 28 34 25 -9
7100 -9 -22 46 66 99 14 -120 -54 53 44 58 -54 -9 48 -20 106 29 -34 17 29 19 30 -27 61 9 -34 -41 -13 -80 -27 -3
$$ packed form
6890a6n7R1k1K1KJ3n8N2n5N7rL1r9j0K9J31j73J12J6j11R1j5m0J38p9k2j8N5r0
6919c4L4k0jl2K0O3q3j6J05l9M1l6m0r0L6L1L5J11j75O7P9q3J07j00l8K1m9J38
6947E2l5k5oJ14m1p5N2k2J9k9K1o0J37n2j04N7l4qL0j0J38r8OR3j00%l7j3L3J4
6977A7j28J45k5j18Q7R6q1l9PL9Qk2M5l9P6q4L4j1k6l1m3M1N3P8o6K4j4O1o9o5
7007e0O1q7R6K4L9p5j0mR0q2o2N7M4K2q8mQO8j24J0M8L8Kk5k5P9m3n0J20Nj5o6
7039An1L4k8N1J5r8L5j2jJ15j36P6K7l3Q2j05M5K0j19P0KJJ08K2j12l9L4OJq7
7069g6P4ln4j8P4n4L5Qj0j6ll3L5o0O8L2j06J48n1j8K4M1q3J03o2j8J5L6Orl4
7100ij3O8K0L3q5j34O6J07rJ4j12M5N7o8J26p7o3N1J2j0J1n7Q8n2m3pK8o7N3K4
$$ plain form
7130 -3 35 37 -95 -12 -13 -48 -62 46 -34 -61 -88 6 33 -116 -19 -44 -6 18 -41 54 6 -27 26 -16 18 54 -48 72 -41
7159 -41 50 8 3 -20 -21 -84 68 -33 66 62 -67 40 32 22 -106 -33 85 24 -42 -7 22 -4 2 -60 17 -131 -10 28 -12
7188 -12 -43 -30 -67 -58 16 0 -73 -13 -31 -50 48 -88 78 -34 -32 -94 -36 61 -1 17 -6 -110 36 81 -39 6 2 -4 -4 69
7218 69 -27 -15 -88 -46 -1 -52 -47 -60 -24 11 34 15 -33 -27 -36 -44 2 -51 -41 -9 78 -62 -24 2 -85 -116 34 11 -12 -39 0
7249 0 -97 -81 54 0 113 25 -57 13 3 6 46 15 36 31 -121 3 -11 15 118 -3 -32 -33 -72 10 83 80 8 -144 -38
7278 -38 77 22 -9 -21 -31 -18 -113 70 -20 32 -14 29 -28 35 25 2 -8 -50 -30 -26 5 21 -7 40 -26 -52 7 -65 -30 -96
7308 -96 27 99 -29 -74 2 -1 -85 82 -19 12 54 15 -16 22 -11 37 55 23 1 -9 -55 13 -23 -1 48 -56 46 7
7336 7 32 -22 7 -27 13 39 -58 -31 -36 -47 25 11 -98 0 -20 27 -22 36 -30 -42 -54 65 68 -25 4 50 10 -43 100 34
$$ packed form
7130cL8Kj32Q3jl5j4J08q0k7k7R4K7j49R7k5L8K4n9R5m8l3N3m2L4L6j02J20j13
7159d1R1m2nk3jo3J52j01R9mj29J07qj0j28P3J18o1o6L5K9k6Oo2P7j48J21L8m0
7188a2l1J3l7RP4j6p3O0j8j9R8j36J66j12Ko2N8R7o2J8k3j04J46M5j20M5mo%P3
7218F9r6J2p3M2M5n1Nj3L6L5K3j9m8OrqM6n3J0L2Q7j40L8K6q7l1J50k3k3k7L9
7249@r7J6J35n4J13q8q2P0j0LM0l1K1nj52J24j4K6J03j21k9jl9Q2P3lp2j52J06
7278c8J15n5l1j2j0J3r5J83r0N2m6M3n7O3j0k3j0m2K0ML1J6k8M7o6k6N9p2L5o6
7308i6J23P2j28m5P6lq4J67j01L1M2l9l1L8l3M8J8l2k2j0m6O8l6K2M9j04J02l9
7336GK5n4K9l4M0K6r7K7nj1P2j4j09R8k0M7m9N8o6j2j2J19Lr3K9M6m0n3J43o6
$$ plain form
7366 34 -87 11 8 22 43 -40 -28 -78 -26 14 18 -23 -74 -32 -5 -18 -23 -43 31 -61 -78 -93 39 -45 -18 -22 28 70 -62 -63 -79
7397 -79 -83 -27 -66 8 92 -18 16 55 -33 39 -16 -49 -33 -25 -55 25 2 -8 -10 -72 -97 9 -11 -82 26 -35 -109 56 -17 36
7427 36 -69 39 11 -90 56 -51 54 -12 13 -49 -7 -56 32 -32 -90 -90 -14 -9 -18 -65 -31 -44 -5 -4 -23 -93 3 82 81 4
7457 4 12 -24 45 -30 -29 31 32 -20 9 50 10 99 22 87 45 -16 -106 -41 7 -11 131 44 -117 49 0 77 9 2 60 -17 11
7488 11 32 3 -17 -45 22 10 -6 85 -54 -121 32 -61 38 15 100 -46 -145 -50 57 78 -45 -19 10 39 67 -60 -11
7515 -11 36 2 -55 110 49 -26 -8 41 54 8 -120 51 -6 23 19 37 5 46 -57 -21 -102 43 -33 -36 -1 -29 -29 9 28
7544 28 -80 -91 -44 3 1 -8 -70 -46 11 44 -6 -10 1 30 -43 -79 4 -31 11 -2 -5 -13 124 5 4 18 70 47 -30 86 59
7575 59 57 -22 83 33 -7 -28 -168 -3 49 -62 93 -71 -29 56 -51 52 41 -54 11 50 -1 28 -128 56 -8 -44
$$ packed form
7366C4j21R8lJ4K1q3J2n0N2M0Mm1n1M2K7j3nk0P4r2j7j5J32q4K7mN0M2j32jj6
7397g9mN6l9P4Q4j10L4L9q8P2n5l3J6Ql0Q0k3j0ko2k5J06k0p1J08o1p4J65p3N3
7427C6j05J08k8j01J46j07J05o6K5o2M2m9Q8o4n8%P6Nrm7L4j3L9Jj9p0R6P9jp7
7457DQl6O9p5JO0Jn2K9M1m0Q9p7O5m2o1r0O5M8j8J42q7j61J66m9P7o8pN8p7K8
7488A1K1k9k0k8O7j2j6R1j39o7J53r3R9k3Q5j46r9R5J07K1j23K6K9K9K8j27M9
7515a1M7l4n7J65o1p5J8M9J3m6j28J71n7K9mJ8l2M1j03L6q1J45p6lL5k8%L8J9
7544B8j08j1M7M7kro2K4N7L3n0mJ1K9p3l6Q3l5M2j3lqJ37j19jJ4N2k3p7J16k7
7575E9kp9J05n0m0k1j40J65N2j11J55j64M2Q5j07J03j1r5O5L9n1K9j56J84o4l6
$$ plain form
7601 -44 13 -12 -71 -38 6 -111 -5 -17 56 130 -81 -27 1 27 47 104 99 -18 34 8 23 -50 -55 -2 0 15 -36 -23 10 84
7631 84 -78 -21 51 7 66 24 -77 -7 75 19 -32 -64 33 -8 -78 -27 65 80 -86 -10 35 -35 -89 0 85 -40 86 22
7659 22 81 92 1 -28 -29 -2 4 -17 9 -4 3 9 -36 -33 -31 4 52 53 32 17 -23 32 -4 26 14 -27 3 -10 15 -86 -38 -44 24 -86
7693 -86 33 37 -5 80 -88 -5 -105 -62 -86 -71 54 -68 -37 -24 -51 -13 16 13 -43 71 -70 12 49 -48 -12 4 10 32
7721 32 -7 28 40 9 -60 19 56 31 -78 46 45 17 16 -16 -14 1 -55 52 5 18 -5 31 34 -63 -23 13 43 16 -34 57 -24
7752 -24 16 -32 -9 -70 -41 -52 -26 27 44 -9 -48 105 43 -43 -51 -5 69 -36 -46 47 31 -26 -35 -21 29 -118 -20 13 73 42
7782 42 -20 91 49 22 -15 -26 21 -75 -43 -34 122 -42 50 -104 -18 -32 -4 17 -82 59 19 -156 -17 21 -13 2 11 39
7810 39 14 11 -31 -60 35 -19 -23 -27 61 59 61 -26 12 -11 4 66 -24 40 -21 12 62 15 128 43 -108 -3 -81 34 -20 -60 -46
$$ packed form
7601d4N7k5n9L3M4j17J06j2P3P4k11N4K8K6K0N7nj17N2k6J5p3nN3KJ5n1J3L3P4
7631H4j62N7P2m4N9m2j01P0Q2n6n1l2R7m1p0N1R2J5j66P6M5p0n4Q9Q5j25J26o4
7659B2N9J1r1k9jK7Ok1K6j3POm5LKL5M8Jk1j5m0N5l6L0j2m1L0j3K5j01M8oO8j10
7693h6J19Mm2Q5j68Q3j00M3k4J5J25j22L1J3k7L8K9ln6J14j41Q2L7r7L6J6OK2
7721C2l9L5J2l1o9P9L7k5j09J24jk8jl2KJ5n6J07m7J3k3L6Lr7M0L6L0k7n0R1q1
7752b4M0m8K3o1K9j1K6N3J7n3l9J53o2q6qM6P4j05j0R3j6n7rJ4N0j47R8L3O0l1
7782D2o2J11m2k7l7j1M7r6L2RJ56j64R2j54Q6j4K8K1r9J41m0j75J39L8l4J5RK8
7810C9k5lm2k9R5n4mmQ8kKq7L8k3J5O2r0O4o1L3N0m7J13q5j51J05p8J15n4m0J4
$$ plain form
7841 -46 -2 -41 -5 -58 -27 61 -7 -42 -42 16 15 17 -91 15 -100 -50 5 -45 17 4 -34 -25 175 -94 -6 -49 -2 -14 -61 -20
7871 -20 -81 54 16 23 30 53 -43 -52 50 27 23 48 5 -17 19 47 48 -10 -70 -76 -44 -57 13 69 -23 68 27 30 -39 67 17 -49
7903 -49 -10 67 12 17 -39 5 -62 13 34 14 -25 -23 -40 17 36 -40 6 -42 53 -81 50 35 -46 -62 -41 -37 78 31 14 12 -59
7934 -59 53 -26 83 49 -19 -54 56 -111 -61 60 -23 8 14 -12 -11 91 -45 -112 -63 -40 -33 -48 6 -1 42 -28 -30 55 10
7963 10 -33 11 -1 72 -46 -12 21 -44 -7 64 -27 34 59 -19 12 -20 60 112 0 40 83 50 67 -6 22 18 20 -9 14 -29
7993 -29 36 29 23 -40 -70 -77 17 -52 -79 39 -72 -19 -81 -118 4 -17 -11 -43 -81 -30 -76 69 -14 -66 26 -73 -93 16 -15 96
8023 96 -2 28 -86 81 74 48 71 -88 13 -43 94 -57 -10 -74 78 33 18 40 -20 99 -11 6 -74 -23 -70 22
8049 22 -122 -25 16 -42 29 -40 50 0 -4 -9 -122 68 -43 6 -17 -34 26 33 3 -1 16 17 -77 -14 15 27 -16 53 84 -22
$$ packed form
7841d6M4l9L6n3L1Q8o8l5%N8jKj08J06j15N0N5n0O2j3l8RK00k69Q8m3M7j2m7M1
7871b0o1J35l8PPK3r6rJ02k3mK5m3k2L6K8Jn8o0oL2j3P0N6r2R1m1Lo9J06n0o6
7903d9L9P7n5Nn6M4o7P5K1k0l9Kj7N7J9p6M6m8R5j34J31j5q1j6K1MJ15m7j7kp1
7934e9J12p9J09l4o8l5J10j67N0J21q3L1Ok6JJ02j36o7M9K3Pj5N4pM3p0kQ5m5
7963A0m3M4j2P3j18L4L3o5L7P1r1O1K5p8L1l2Q0N2j12M0M3l3J7p3K8mKk9K3m3
7993b9O5poo3l0pR4o9k7J18j11N3o2l7J22k1Ol2l8N1m6J45q3n2R2r9k0J09l1J11
8023I6r8L0j14J67pk6K3j59J01n6J37j51M7o4J52m5j5K2o0J19j10J7q0N1m7R2
8049B2j44R7M1n8P1o9R0n0mnj13J90j11M9k3j7O0Pl0mJ7Jr4O3K9J2m3O9L1j06
$$ plain form
8079 -22 -18 80 -2 -3 64 50 20 65 55 0 24 64 -3 1 -61 97 -2 -17 -10 -15 -67 33 66 -5 -81 1 44 38 -30 -69 42 18
8111 18 -44 61 -4 -20 148 -29 -47 19 41 22 21 21 -7 0 -51 -24 71 86 2 -1 37 22 9 10 47 -1 11 -104 2 67
8141 67 -44 4 -57 -16 -49 28 -89 -9 -28 -52 12 19 51 -25 -12 15 11 49 -7 -46 -82 -43 -18 -39 -5 -39 -26 5 -17 19
8171 19 -8 -10 23 -39 70 15 51 5 4 -45 13 34 -3 -46 -11 38 -28 4 -36 4
$$ packed form
8079b2MR8q2jO7j4l0M5j0n5K4M0o7Mo2J58r9j5Pnn2J00L3p1p6Q2M3oo8l9J11k4
8111A8o2J05o5j6J68j77j8O6K2j9j%k8Pn1K7R5J5q4lL8j5j3JL7m8J2j15J06O5
8141F7j11M8o1M1l3P7j17Q0j9k4O4PL2p6J3K7mL8n6l9l6L9K5k1L4l4J3L1k2L6
8171A9k7kL3o2J09n5L6m6jm9N8K1l7m3L5M9o6L2m0M0
8191D
$$ Imaginary data points
##PAGE= N=2
##DATA TABLE= (X++(I..I)), XYDATA
$$ plain form
0 0 0 0 0 0 0 0 0 0 0 0 0 0 0 16 -16 16 -16 16 -32 32 -48 48 -64 64 -80 96 -112 128 -144 161 -192 223 -249
33 -249 282 -320 353 -401 449 -497 561 -625 689 -769 850 -941 1041 -1148 1265 -1391 1535
50 1535 -1693 1861 -2053 2265 -2505 2771 -3077 3429 -3841 4326 -4907 5622 -6531 7716 -9352
65 -9352 11753 -15646 23047 -42316 208066 458395 246428 98410 -108686 -222407 -303606
76 -303606 -276997 -210953 -79340 34889 123675 130327 88190 -6722 -97646 -177011 -212802 -214696
88 -214696 -154708 -49648 85670 204069 288007 311067 281152 202762 94544 -35115 -150500
99 -150500 -223592 -231155 -177696 -80273 19927 94010 126154 112247 46704 -53358 -156872 -225102
111 -225102 -229797 -161726 -44512 84411 193705 261924 272631 224241 128804 9474 -99262
$$ packed form
0@%%%%%%%%%%%%%J6l2L2l2L2m8O4q0R6j12J28j44J76k08K40k72L05l53M15m72
33b49N31o02O73p54Q50r46J058j186J314j458J619j791J982k189K413k656K926
50A535l228L554l914M318m770N276n848O506p270Q167r233J0529j2153J4247j7068
65i352K1105k7399L8693o5363K50382K50329k11967j48018k07096j13721q1199
76c03606K6609O6044J31613J14229Q8786O652m2137r4912r0924p9365l5791j894
88b14696N9988J05060J35318J18399Q3938K3060k9915p8390j08218j29659j15385
99a50500p3092p563N3459R7423J00200P4083L2144j3907o5543j00062j03514o8230
111b25102m695O8071J17214J28923J09294O8219J0707m8390r5437j19330j08736
$$ plain form
122 -99262 -161716 -166278 -127559 -65989 574 55743 88419 91635 59589 -1783 -69385 -119641
134 -119641 -141410 -132442 -96745 -42633 24113 97145 156212 177658 154469 96902 22062 -50194
146 -50194 -102721 -127476 -119091 -73041 114 73541 120548 124472 83591 15199 -55603 -112585
158 -112585 -146088 -144368 -102344 -31896 45310 104930 127608 111815 72777 25186 -21666 -58275
170 -58275 -75805 -70741 -42331 2201 44149 68161 73734 66007 46400 15995 -22409 -63223 -93305
183 -93305 -98958 -78894 -43889 -2846 36209 65301 78910 72866 42273 -5683 -50228 -72550
195 -72550 -67189 -38367 3368 44686 76823 93692 86510 51037 -846 -50940 -83533 -89938 -72023
208 -72023 -42771 -12085 16935 40042 48479 39488 17804 -7969 -26353 -30292 -24613 -16717 -5663
$$ packed form
122i9262o2454m562L8719O1570O6563N5169L2676L216l2046o1372o7602n0256
134a19641k1769Q968L5697N4112O6746P3032N9067K1446k3189n7567p4840p2256
146e0194n2527k4755Q385M6050P3155P3427M7007L924m0881o8392p0802n6982
158a12585l3503J720M2024P0448P7206N9620K2678j5793l9038m7591m6852l6609
170e8275j7530N064K8410M4532M1948K4012N573p727j9607l0405l8404m0814l0082
183i3305n653K0064L5005M1043L9055K9092J3609o044l0593m7956m4545k2322
195g2550N361K8822M1735M1318L2137J6869p182l5473n1883n0094l2593o405J7915
208g2023K9252L0686K9020K3107Q437q991k1684k5773j8384l939N679P896J1054
$$ plain form
221 -5663 10475 28810 45109 53120 46439 27463 5369 -15263 -35439 -51813 -58297 -50767 -27764
234 -27764 5151 32880 44491 40469 25432 3866 -18765 -36667 -45329 -38536 -13805 19089 44812
247 44812 54910 48747 30421 7993 -12835 -31010 -42969 -41191 -25526 -4515 13829 23424 22384
260 22384 16223 10887 4930 -4862 -15429 -21751 -21724 -15008 -4794 3226 8593 15931 23624 25214 17883
275 17883 3092 -14683 -26835 -27575 -20320 -9589 4260 20037 32115 36087 28022 8099 -15213
288 -15213 -31004 -34632 -30032 -19096 -5022 8175 19224 24990 20361 6338 -8287 -16596 -17309
301 -17309 -12170 -4650 1525 7606 15592 21654 21075 15075 7194 -563 -5770 -9429 -15141 -21562 -22416
316 -22416 -15834 -5327 5329 12145 12979 10324 6857 300 -9545 -17267 -17477 -9387 4917 19696
$$ packed form
221e663J6138J8335J6299Q011o681j8976k2094k0632k0176j6374o484P530K3003
234b7764L2915K7729J1611m022j5037k1566k2631j7902q662O793K4731L2894K5723
247D4812J0098o163j8326k2428k0828j8175j1959J778J5665K1011J8344R595j040
260B2384o161n336n957r792j0567o322K7O716J0214Q020N367P338P693J590p331
275A7883j4791j7775j2152p40P255J0731J3849J5777J2078L972q065j9923k3312
288a5213j5791l628M600J0936J4074J3197J1049N766m629j4023j4625q309p13
301a7309N139P520O175O081P986O062n79o000p881p757n207l659n712o421q54
316b2416O582J0507J0656O816Q34k655l467o557r845p722k10Q090J4304J4779
$$ plain form
330 19696 27341 26744 21623 13279 1142 -11736 -21791 -26159 -21668 -10173 566 5715 6819 6013
344 6013 3577 865 -2854 -7635 -10516 -7654 -1797 3124 6069 8117 9776 13272 16475 14660 7342
359 7342 -1065 -7849 -12620 -14765 -14533 -12414 -6727 3081 11317 12571 7734 -274 -8665 -13062 -13372 -11654
375 -11654 -7786 640 11039 18570 20738 16828 8665 1008 -2941 -5512 -7905 -8708 -6893 -3480 731
390 731 3461 2168 -835 -1622 -1274 -2474 -5073 -8166 -10421 -8668 -3126 2714 6983 11046 14662 15975
406 15975 14212 8331 -983 -9038 -11491 -9716 -6539 -2341 1760 4330 5794 5060 -185 -7595 -12524
421 -12524 -13153 -10512 -5623 -433 3282 7146 11544 13730 11834 8274 4249 785 -1077 -2292 -5069
436 -5069 -7442 -6648 -3434 12 2378 2671 580 -1401 -2924 -5565 -8977 -10114 -7654 -2233 5220 11482
$$ packed form
330A9696P645n97n121q344j2137j2878j0055m368M491J1495J0739N149J104q06
344F013k436k712l719m781k881K862N857M921K945K048J659L496L203j815p318
359G342q407o784m771k145K32K119N687R808Q236J254m837q008q391m397l10J718
375a1654L868Q426J0399P531K168l910q163p657l949k571k393q03J815L413M211
390G31K730j293l003p87L48j200k599l093k255J753N542N840M269M063L616J313
406A5975j763n881r314q055k453J775L177M198M101K570J464p34n245p410m929
421a2524o29K641M889N190L715L864M398K186j896l560m025l464j862j215k777
436e069k373P94L214L446K366K93k091j981j523k641l412j137K460N421P453O262
$$ plain form
452 11482 13643 12663 10816 7268 1777 -3906 -8194 -9895 -7661 -2854 602 1625 1986 1899 846 -556
468 -556 -2867 -5908 -6936 -4965 -1734 712 2902 4856 6314 8259 9077 6551 1755 -2249 -5025 -6851
484 -6851 -7069 -6282 -4968 -1629 3224 5909 5597 3227 -86 -3129 -4328 -4217 -4074 -2582 1298 5496
500 5496 7718 7936 5765 1872 -1275 -3092 -4879 -6615 -6414 -4759 -2149 1068 3322 3076 2380 2783
516 2783 2555 1051 -634 -2050 -2829 -1453 919 2213 2614 3174 3236 2394 949 -1589 -5202 -6857 -5948
533 -5948 -4193 -2444 -278 1764 3146 4464 4838 2863 378 -629 -833 -349 572 1233 1119 1576 2668
550 2668 2258 454 -1347 -2844 -3779 -3645 -3306 -3634 -3370 -1593 167 1468 2301 2507 1787 2019 2612 2255
568 2255 1195 872 1200 1391 1912 1755 261 -804 -1023 -1587 -2528 -3137 -3681 -3939 -3063 -1643 -1428 -1464 -427
$$ packed form
452A1482K161r80j847l548n491n683m288j701K234M807L456J023L61q7j053j402
468e56k311l041j028J971L231K446K190J954J458J945Q18k526m796m004k776j826
484f851k18P87J314L339M853K685l12k370l313l043j199J11J43J492L880M198
500E496K222K18k171l893l147j817j787j736K01J655K610L217K254k46o96M03
516B783k28j504j685j416p79J376K372J294M01N60O2q42j445k538l613j655R09
533e948J755J749K166K042J382J318L74j975k485j007k04M84R21O61j14M57J092
550B668m10j804j801j497r35J34L39l28K64J777J760J301Q33K06p20K32N93l57
568B255j060l23L28J91N21j57j494j065k19n64r41o09n44k58Q76J420K15l6J037
$$ plain form
587 -427 790 1764 2885 3299 2945 3098 3687 3531 2574 1723 695 -356 -535 -630 -1750 -2731 -2746 -2637 -2840
606 -2840 -2945 -3358 -3935 -3278 -1879 -845 276 1917 3518 4698 5942 6123 4526 2995 1862 721
622 721 -463 -1199 -1645 -1990 -1554 -1105 -1890 -3019 -3717 -4448 -4777 -4098 -3152 -2373 -638 2124 4163 5320
640 5320 6115 5955 4926 4197 2847 730 -1007 -1728 -1932 -1791 -1027 -625 -1339 -1699 -2122 -3360 -4902 -5555
658 -5555 -5399 -4041 -1319 1617 3701 5624 7012 6671 5372 3609 1382 -662 -1482 -1206 -1030 -748 -28
675 -28 46 -178 -569 -1831 -3489 -4588 -4586 -4509 -3790 -2078 -254 1536 3773 5455 5746 4949 3804 1919 41
694 41 -1146 -1914 -2081 -881 792 1811 1993 1675 132 -2178 -3869 -5044 -5724 -5088 -3060 -652 1649
711 1649 3560 4270 3738 3134 2144 661 -290 -373 -339 33 1069 1908 1885 1716 1315 384 -931 -2168 -3498
$$ packed form
587d27J217R74J121M14l54J53N89j56r57q51j028j051j79r5j120r81j5J09k03
606b840j05m13n77O57J399J034J121J641J601J180J244J81j597j531j133j141
622G21j184p36m46l45M36M49p85j129o98p31l29O79R46P79J735K762K039J157
640E320P95j60j029p29j350k117j737p21k04J41P64M02p14l60m23j238j542o53
658e555J56J358K722K936K084J923J388l41j299j763k227k044q20K76J76K82P20
675b8P4k24l91j262j658j099KP7P19J712J824J790K237J682K91p97j145j885j878
694D1j187p68j67J200J673J019J82l18j543k310j691j175o80O36K028K408K301
711A649J911P10n32o04r90j483r51q3L4L72J036Q39k3j69m01r31j315j237j330
$$ plain form
730 -3498 -4594 -4470 -3708 -2962 -1273 827 2279 3051 3319 2745 1061 -242 -723 -822 -98 1308 2507 3299
748 3299 3841 3053 1028 -948 -2705 -4225 -4908 -4314 -3226 -2304 -721 430 950 1051 1194 820 579 972
766 972 1050 820 1240 1831 2032 1965 2331 2079 1109 318 -898 -2455 -3600 -4135 -4349 -3535 -1697 -304 593
785 593 1537 1941 1315 540 98 -9 120 1096 2130 2648 2953 2738 1587 251 -660 -1811 -2638 -2688 -2090
804 -2090 -2006 -1711 -981 -849 -781 -148 293 594 984 1354 1267 974 1010 851 676 1074 1482 1256 1055 667 -424
825 -424 -1540 -1976 -2270 -2382 -1745 -706 -87 312 723 343 -167 -177 -139 -132 539 1413 1506 1528 1500 966 -62 -475
847 -475 -534 -816 -532 -144 -147 -410 -469 -714 -1214 -948 -486 -319 138 702 735 328 303 241 129 284 787 808 757
870 757 823 394 -357 -552 -715 -916 -660 52 159 5 -11 -391 -1003 -1024 -721 -448 96 981 1246 1166 1104 607
$$ packed form
730c498j096J24P62P46J689K100J452P72K68n74j684j303m81r9P24J406J199P92
748C299N42p88k025j976j757j520o83N94J088R22J583J151N20J01J43l74k41L93
766I72P8k30M20N91K01o7L66k52r70p91j216j557j145n35k14Q14J838J393Q97
785E93R44M04o26p75m42j07J29R76J034N18L05k15j151j336r11j151q27n0N98
804b090Q4K95P30J32O8O33M41L01L90L70q7k93L6j59j75L98M08k26k01l88j091
825d24j116m36k94j12O37J039O19L99M11l80n10j0L8PO71Q74R3K2k8n34j028m13
847d75n9k82K84L88lk63n9k45n00K66M62J67M57N64L3m07k5o2j12J55N03K1n1
870G57O6m29p51j95j63k01K56P12J07j54j6l80o12k1L03K73N44Q85K65q0o2m97
$$ plain form
892 607 -93 -381 -161 -270 -120 350 336 38 -207 -514 -986 -1138 -754 -566 -446 53 288 104 100 402 291
913 291 669 1105 1184 1006 838 447 -385 -845 -892 -913 -856 -195 51 -72 -216 -470 -810 -1032 -575 -238 65 1052
935 1052 1444 1351 1309 1072 484 55 -117 -228 -339 -270 -266 -735 -996 -941 -1064 -1096 -532 0 107 458 629 398
957 398 299 500 578 611 1163 1329 1005 843 348 -466 -1148 -1257 -1430 -1454 -952 -393 -289 -134 194 -21 -186 59
979 59 331 492 809 1104 953 641 630 259 -61 -29 18 -208 -423 -463 -902 -1267 -1181 -949 -832 -82 607 907
1001 907 956 1023 727 229 101 -36 -228 71 462 380 282 275 -33 -647 -718 -694 -764 -664 -232 87 67 306 495
1024 495 455 555 788 507 300 207 -179 -619 -799 -702 -691 -375 254 377 388 555 160 -259 -339 -215 -242 57
1046 57 712 974 1064 1015 565 -162 -582 -857 -1189 -1282 -853 -684 -510 4 267 207 428 719 619 560 639 545 314
$$ packed form
892F07p00k88K20j09J50M70j4k98k45l07m72j52L84J88J20M99K35j84mL02j11
913B91L78M36P9j78j68l91q32m60m7k1N7O61K46j23j44k54l40k22M57L37L03R87
935A052L92r3m2k37n88m29j72j11j11O9Mm69k61N5j23l2N64N32J07L51J71k31
957C98r9K01P8L3N52J66l24j62m95q14o82j09j73k4N02N59J04J55L28k15j65K45
979E9K72J61L17K95j51l12j1l71l20L2M7k26k15m0m39l65Q6K32J17P50O89L00
1001I07M9O7k96m98j28j37j92K99L91q2r8pl08o14p1K4p0J00M32L19k0K39J89
1024D95m0J00K33k81k07r3l86m40j80R7J1L16O29J23J1J67l95m19q0J24k7K99
1046E7O55K62R0m9m50p27m20k75l32r3M29J69J74N14K63o0K21K91j00n9P9r4k31
$$ plain form
1069 314 334 409 214 242 441 326 -171 -427 -872 -1382 -1626 -1521 -1273 -833 50 717 1059 1382 1366 854 549
1090 549 436 206 90 318 363 294 265 193 -406 -788 -926 -1206 -1480 -1263 -902 -797 -362 373 536 855 1182
1111 1182 1343 1125 1083 880 221 -186 -157 -258 -310 -135 25 -134 -344 -393 -972 -1158 -1081 -907 -617 -2 604
1132 604 857 1091 1248 1002 584 355 45 -272 -364 -228 -295 -390 -41 -223 -301 -190 -111 -254 -354 -131 -174 -113
1154 -113 95 348 307 681 847 570 306 241 -337 -672 -777 -868 -783 -336 90 295 308 420 329 171 120 74 42
1177 42 194 422 455 418 496 150 -262 -433 -512 -776 -847 -756 -767 -504 -246 33 80 503 771 760 825 939 698 367
1201 367 368 244 66 -55 1 -202 -426 -485 -755 -1223 -1052 -834 -770 -574 1 262 485 819 919 816 811 911
1223 911 668 599 749 327 64 -46 -263 -645 -836 -901 -977 -1041 -795 -765 -704 -483 -147 7 423 728 780 881
$$ packed form
1069C14K0P5j95K8J99j15m97k56m45n10k44J05K48M40Q83O67L42L23j6n12l05
1090E49j13k30j16K28M5o9k9p2n99l82j38k80k74K17L61J05M35P35J63L19L27
1111A182J61k18m2k03o59m07K9j01n2J75J60j59k10m9n79j86P7J74K90O15O06
1132F04K53K34J57k46m18k29l10l17r2J36o7r5L49j82p8J11P9j43j00K23m3O1
1154a13K08K53m1L74J66k77k64o5n78l35j05r1Q5M47M26K05J3J12r1j58n1m6l2
1177D2J52K28L3l7P8l46m12j71p9k64p1R1j1K63K58K79M7M23K68j1O5J14k41l31
1201C67Jj24j78j21N6k03k24n9k70m68J71K18O4J96N75K61K23L34J00j03nJ00
1223I11k43o9J50m22k63j10k17l82j91o5p6o4K46L0O1K21L36J54M16L05N2J01
$$ plain form
1245 881 1039 956 742 523 429 293 69 101 -188 -565 -560 -632 -886 -917 -792 -755 -638 -224 59 72 167 560 550 575
1269 575 687 747 568 699 639 419 176 152 -181 -444 -342 -399 -674 -750 -460 -658 -605 -317 -338 -285 -60 249 234
1292 234 413 643 465 464 681 512 344 316 372 216 -43 -122 -395 -501 -470 -327 -498 -414 -339 -438 -459 -144 -153 -161 158
1317 158 283 367 457 759 564 522 625 433 223 96 47 -106 -188 -205 -428 -654 -505 -500 -660 -483 -408 -296 -101
1340 -101 123 113 185 365 465 491 654 665 437 258 351 208 -99 -181 -253 -455 -535 -429 -552 -542 -489 -377 -422 -245
1364 -245 -24 54 128 453 459 395 449 545 407 316 343 191 -40 -122 -117 -295 -193 -410 -508 -482 -277 -301 -331 -172 -18
1389 -18 2 18 193 267 273 415 473 338 206 212 54 41 4 -161 -247 -235 -216 -377 -227 -231 -274 -257 -127 -59 32 119 173
1416 173 135 178 378 164 59 260 213 68 54 36 -20 -105 -141 -221 -238 -103 -193 -196 -207 19 -111 -117 85 132 19 59
$$ packed form
1245H81J58q3k14k19r4j36k24L2k89l77Np2k54l1J25L7J17M14K83J3R5L93j0K5
1269E75J12O0j79J31o0k20k43k4l33k63J02n7k75p6K90j98N3K88k1N3K25L09j5
1292B34J79K30j78jK17j69j68k8N6j56k59p9k73j06L1J43j71Q4P5r9k1L15rqL19
1317A58J25Q4R0L02j95m2J03j92k10j27m9j53q2j7k23k26J49Nj60J77P5J12J95
1340a01K24j0P2J80J00K6J63J1k28j79R3j43l07q2p2k02q0J06j23J0N3J12m5J77
1364b45K21P8P4L25Oo4N4R6j38r1K7j52k31q2Nj78J02k17r8K6K05k4l0J59J54
1389a8K0J6J75P4OJ42N8j35j32Oj58j3l7j65q6J2J9j61J50mm3J7J30O8R1Q7N4
1416A73l8M3K00k14j05K01m7j45j4j8n6q5l6q0j7J35r0lj1K26j30oK02M7j13M0
$$ plain form
1442 59 181 90 -25 112 52 -108 74 5 -116 -91 8 -115 -54 96 -16 -94 -55 -30 -54 -57 -1 31 26 108 63 51 34
1469 34 182 12 -4 138 55 -116 -98 65 -56 -60 112 -19 -46 106 34 -127 -58 40 -43 -42 133 101 51 154 7
1494 7 -22 -26 45 -68 -122 -28 -105 -120 40 46 -45 -27 92 46 -121 68 18 18 35 209 24 81 212 -8 -52 19 30 -167
1522 -167 -194 -80 -132 -132 11 -87 -12 -43 -36 26 -3 92 85 10 49 101 90 214 125 58 -7 18 -153 -214 -175 -223 -201 -145 -54
1551 -54 -30 -11 97 51 42 54 76 -19 14 169 124 149 158 149 8 85 59 -179 -323 -171 -162 -240 -101 -94 -158 -58 50 -93
1579 -93 38 108 16 48 36 75 152 157 209 118 -39 113 -55 -127 -208 -168 -206 -174 -214 -75 -60 93 86 -6 20 109 33 51
1607 51 57 98 67 162 263 75 162 117 20 -174 -125 -86 -220 -182 -79 -63 -58 155 -41 -15 22 15 61 10 98 -22 56 210
1635 210 142 157 108 127 23 13 -18 -155 -259 -97 -179 -118 -27 39 -78 -83 25 -14 -68 -70 26 -87 136 180 101 211
$$ packed form
1442E9J22r1j15J37o0j60J82o9j21K5R9j23O1J50j12p8L9K5k4lN6L2nQ2m5j2j7
1469C4J48j70j6J42q3j71J8J63j21mJ72j31k7J52p2j61O9R8q3JJ75l2n0J03j47
1494Gk9mP1j13n4R4p7j5J60Or1J8J19m6j67J89n0%J7J74j85N7J31k20m4P1J1j97
1522a67k7J14n2%J43r8P5l1PO2k9R5pp5L9N2j1J24q9o7o5K5j71o1L9m8K2N6R1
1551e4K4J9J08m6rJ2K2r5L3J55m5K5Rrj41P7k6k38j44J52Rp8J39Po4J00J08j43
1579i3J31P0r2L2j2L9P7NN2r1j57J52j68p2q1M0l8L2m0J39J5J53pr2K6Q9p6J8
1607E1OM1l1R5J01j88Q7m5r7j94M9L9j34L8J03J6NK13j96K6L7pM6n1Q8j20P8J54
1635B10o8J5m9J9j04j0l1j37j04J62q2O1R1O6j17nJ08l9n4kR6j13K23M4p9J10
$$ plain form
1661 211 215 201 61 122 67 -54 -166 -76 -168 -202 14 13 -171 -17 5 -18 -127 96 -50 -85 51 149 81 152 336
1686 336 158 77 135 29 -177 -194 -175 -160 -127 -64 -17 -98 -45 -15 -61 -41 39 -16 -60 111 126 11 175 199 77 125
1712 125 173 35 -95 -115 -98 -203 -214 -80 -114 -8 95 85 -34 75 87 -31 -155 125 16 15 153 99 106 20
1736 20 78 -65 -38 -45 -79 -183 -55 -27 -156 -64 120 55 36 131 112 -48 -86 -30 -24 -183 -6 -125 -110 10 69 -135
1762 -135 -54 -13 -123 -125 -36 37 -22 152 173 78 198 161 79 -37 117 -10 -46 -71 -84 -96 -89 -6 -77 -47 73 -6 -7 6
1790 6 -20 0 -11 130 55 138 94 210 77 37 -16 -71 -147 -125 -112 -45 -27 -97 -187 -50 25 -9 -177 -33 54 25 16 113
1818 113 41 89 162 103 23 85 34 40 25 -6 -39 -139 -101 58 -98 -38 -66 -104 26 42 32 12 84 26 117 135 187 141
1846 141 -3 38 63 -20 -120 -77 -150 -124 -18 -51 -130 -31 -106 -123 -106 15 -50 -29 -16 40 66 116 110 5 119 160 66
$$ packed form
1661B11Mj4j40O1n5j21j12R0r2l4K16jj84J54K2k3j09K23j46l5J36R8o8P1J84
1686C36j78q1N8j06k06j7J9J5L3O3M7q1N3L0m6K0Q0n5m4J71J5j15J64K4j22M8
1712A25M8j38j30k0J7j05j1J34l4J06J03j0j19J09J2j18j24K80j09jJ38n4Pq6
1736B0N8j43K7pl4j04J28K8j29R2J84o5j9R5j9j60l8N6Oj59J77j19J5J20N9k04
1762a35Q1M1j10kQ9P3n9J74K1r5J20l7q2j16J54j27l6k5j3j2PQ3p1L0J20p9jJ3
1790Fk6K0j1J41p5Q3m4J16j33m0n3n5p6K2J3O7J8p0r0J37P5l4j68J44Q7k9rR7
1818A13p2M8P3n9q0O2n1Oj5l1l3j00L8J59j56O0k8l8J30J6j0k0P2n8R1J8N2m6
1846A41j44M1K5q3j00M3p3K6J06l3p9R9p5j7J7J21o5K1J3N6K6N0oj05J14M1r4
$$ plain form
1873 66 -7 89 11 -51 -73 -93 -105 -139 11 -42 -136 -44 -70 -36 -79 -9 -24 14 108 96 46 65 207 1 22 116 10 -50
1901 -50 80 52 -48 -95 -100 -231 -206 -154 -24 -52 -6 -31 -56 18 110 -46 58 175 19 119 46 106 -19 90 1
1926 1 -3 -67 -25 -6 -101 -114 -50 -71 -176 -32 -25 8 120 -4 17 78 203 80 41 130 41 53 111 177 -188 -127 -73 -19
1954 -19 -54 -117 -38 -69 -71 74 -170 -92 44 -20 3 75 151 -10 17 -38 101 57 23 -34 -16 23 66 105 -155 -136 -147 -3
1982 -3 27 -39 -118 19 178 130 -10 -9 90 -14 47 66 14 59 153 -4 67 47 -33 -91 -21 -15 8 -28 -85 -4 -44 22 -93
2011 -93 -101 -156 57 -59 -44 27 -113 40 30 118 106 26 91 149 17 31 -82 -144 -20 47 -70 61 33 -81 -7 19
2037 19 -52 -136 -83 49 -49 32 -8 75 -51 61 106 28 31 31 -77 -66 -47 1 -111 -195 -129 -37 22 33 -102 -149 10 10
2065 10 -70 -114 -33 96 25 112 5 -9 7 18 -14 -54 -43 -143 -117 -16 31 -44 -20 41 53 161 105 56 -6 -67 29 28
$$ packed form
1873F6p3R6p8o2k2k0j2l4J50n3r4R2k6L4m3P0j5L8R4j2n0J9J42k06K1R4j06o0
1901e0J30k8j00m7nj31K5N2J30k8M6k5k5P4R2j56J04J17j56J00p3O0j25J09q9
1926Amo4M2J9r5j3O4k1j05J44PL3J12j24K1O1J25j23l9Q9q9J2N8O6l65O1N4N4
1954a9l5o3P9l1kJ45k44P8J36o4K3P2P6j61K7n5J39m4l4n7J8L9M3L9k60J9j1J44
1982cL0o6p9J37J59m8j40JR9j04O1J9n2M5R4j57P1k0q0n8P0OK3l6n7Q1m0O6j15
2011i3qn5K13j16J5P1j40J53j0Q8j2q0O5N8j32J4j13o2J24O7j17J31k8j14P4K6
2037A9p1q4N3J32r8Q1m0Q3j26J12M5p8L%j08J1J9M8j12q4O6R2N9J1j35m7J59%
2065A0q0m4Q1J29p1Q7j07j4J6J1l2m0J1j00K6J01M7p5K4O1J2J08n6m9o2o1R6j
$$ plain form
2093 28 71 100 37 106 43 87 -95 -119 -102 -129 -106 22 -63 -48 72 164 95 -129 -18 19 -10 56 22 -15 -19 62 82 -35
2121 -35 -61 -34 -76 133 53 -104 26 -79 -50 22 104 147 38 89 172 166 -6 -31 -140 -135 -11 47 -22 31 84 80 122 0
2149 0 -62 -170 28 64 45 -44 28 -19 134 151 -36 -16 -63 -41 -9 -195 43 -111 -166 11 70 -14 35 -94 -31 43
2175 43 -3 -54 -95 33 45 57 69 63 -10 -18 77 27 -38 -33 -55 -28 11 35 -11 -33 32 6 87 43 -118 -4 -14 102 16 46
2205 46 11 28 61 70 -17 -124 -92 -139 -118 23 -59 -76 -89 52 139 75 -89 -31 24 19 -67 -59 -70 -8 61 107 38 -25 -33 -44
2235 -44 -3 15 -66 -88 25 104 110 -24 100 131 0 131 66 -136 -60 -33 -16 2 2 -67 -52 62 21 11 5 -108 -92 -37
2263 -37 30 63 -32 48 74 137 -13 24 -81 -46 61 -67 -34 -79 29 13 73 43 -50 -45 -67 50 98 -23 6 -71 -36
2290 -36 136 17 69 -6 65 -62 58 8 -97 -193 -24 30 53 -12 30 -95 92 34 20 33 -53 -26 -1 96 70 -106
$$ packed form
2093B8M3K9o3O9o3M4j82k4J7k7K3J28q5J5J20R2o9k24J11L7k9O6l4l7mQ1K0j17
2121c5k6K7m2K09q0j57J30j05K9P2Q2M3j09N1Q3oj72k5j09NJ24N8o9N3N3mM2j22
2149@o2j08J98L6j9q9P2m7J53J7j87K0m7K2L2j86K38j54n5J77N9q4M9j29O3P4
2175D3m6n1m1J28J2J2J2op3qR5n0o5Nk2K7L9K4m6k2O5k6Q1m4j61J14j0J16q6L0
2205D6l5J7L3Rq7j07L2m7K1J41q2j7j3J41Q7o4j64N8N5nq6Qj1O2O9M6o9o3qj1
2235d4M1J8q1k2J13P9Oj34J24L1j31J31o5k02P6K7J7J8%o9J5J14m1j0oj13J6N5
2263c7O7L3r5Q0K6O3j50L7j05L5J07j28L3m5J08j6O0l0r3Nk2J17M8j21K9p7L5
2290c6J72j19N2p5P1j27J20n0j05r6J69N4K3o5M2j25J87n8j4J3q6K7K5R7k6j76
$$ plain form
2316 -106 -28 91 80 -15 -17 -116 -107 27 42 -14 -50 17 -20 90 34 11 24 26 88 28 -33 25 -22 -87 119 90 -99 -74 44
2345 44 -21 -28 -43 -36 42 -5 95 52 21 26 -58 -40 20 33 -4 -27 34 16 27 -81 -21 -60 -42 79 14 -20 -52 -25 -69 106
2375 106 25 -110 -68 96 143 -87 -43 -6 -32 -22 42 -38 -101 -27 -80 -35 77 74 -52 2 178 33 1 -68 -81 19
2401 19 11 -47 -9 -111 51 -97 67 4 -73 -42 42 -18 -7 -97 -69 67 77 31 -62 -10 -99 32 -28 -37 53 1 34 79
2429 79 43 1 -34 -75 -3 7 9 4 -38 22 56 21 14 52 2 -25 68 92 33 -49 -4 12 22 67 -80 -41 55 43 -6 -82 -61
2460 -61 -48 46 -40 96 -81 -173 75 -31 -20 11 -49 -81 5 28 -60 9 -105 -102 28 34 20 -9 3 -14 67 40 57 -42
2488 -42 40 34 13 -45 -17 49 61 36 86 36 -45 -29 50 39 30 -12 -6 -26 63 58 11 -108 -20 -36 9 20 -87 -66 -94 75 -19
2519 -19 -31 -2 -32 -31 33 5 -138 -148 -24 -13 8 45 -43 7 80 48 70 -85 -7 -4 -40 49 7 -45 32 28 22 40 -32 51 -49
$$ packed form
2316a06P8J19j1r5kr9RJ34J5n6l6O7l7J10n6k3J3KO2o0o1N8m7o5K06k9j89K5J18
2345D4o5pj5PP8m7J00m3l1Nq4J8O0J3l7k3O1j8J1j08O0l9J8J21o5l4l2K7m4J75
2375A06q1j35M2J64M7k30M4L7k6J0O4q0o3P4n3M5J12lj26N4J76j45l2o9j3J00
2401A9qn8L8j02J62j48J64o3p7L1Q4o0J1r0K8J36J0m6r3N2q9J31o0rR0n2L3M5
2429G9l6m2l5m1P2J0Knm2O0L4l5pL8n0k7R3K4n9q2M5J6J0M5j47L9R6j2m9p6K1
2460f1J3R4q6J36j77r2K48j06J1L1o0l2Q6K3q8O9j14LJ30Oj4k9J2j7Q1k7J7r9
2488d2Q2ok1n8K8O6J2k5N0n0q1J6P9j1rm2Ok0Q9nm7j19Q8j6M5J1j07K1k8J69r4
2519a9j2K9l0JO4k8j43j0J24J1K1L7q8N0P3l2K2j55P8Ll6Q9m2n2P7moJ8p2Q3j00
$$ plain form
2550 -49 29 6 -55 -26 -18 5 59 3 -56 -54 -32 -19 -94 -42 50 -57 39 97 37 25 -13 -21 22 -13 -65 -80 -30 28 82 -36 -11
2581 -11 99 39 6 90 -31 -16 -38 51 42 -14 -26 38 42 67 76 -52 -71 -27 -9 80 21 -2 69 8 104 -15 -35 -60 -20 -99
2611 -99 -37 -11 -104 -20 15 -37 37 60 -6 48 -3 65 -47 -38 -25 -21 6 59 23 65 -17 -9 -5 -59 46 -82 2 -21 5 8 20
2642 20 79 -69 33 -15 -2 -16 -111 57 86 191 56 -14 -24 35 -11 43 -89 -84 58 -25 -38 63 -28 34 130 -81
2668 -81 -14 45 13 -23 54 29 -81 -17 -5 -10 0 25 -95 -95 -8 -33 -16 -53 77 -45 29 -25 16 -20 59 -45 43 41 -3
2697 -3 44 -38 64 55 -15 -21 105 -7 125 -38 58 -33 -23 21 72 -12 25 -26 -22 61 -11 -16 -42 59 52 -47 21 24 -29 24 -7
2728 -7 38 -63 -42 -82 0 46 50 -49 31 -20 -35 97 50 38 -28 139 37 -13 -22 -35 15 -42 149 -52 46 -33 -50 34 10
2757 10 49 -17 -109 57 23 -37 -10 52 16 -36 93 -92 -11 40 -102 -7 34 41 -6 -6 70 -96 31 22 -32 2 22 -14 -39
$$ packed form
2550d9P8k3o1K9QK3N4n6n9KK2J3p5N2R2j07R6N8o0j2l8qM3l5n2j5N0N8N4j18K5
2581a1J10o0l3Q4j21J5k2Q9rn6j2O4MK5Rj28j9M4J8Q9n9k3P1o1R6j19k0k5M0p9
2611i9O2K6r3Q4L5n2P4K3o6N4n1O8j12RJ3MK7N3l6M2q2QMn4J05j28Q4k3K6LJ2
2642B0N9j48J02m8J3j4r5J68K9J05j35p0j0N9m6N4j32NJ42q3j3J01r1O2R6k11
2668h1O7N9l2l6P7k5j10O4J2nJ0K5j20%Q7k5J7l7J30j22P4n4M1l6P9j04Q8km4
2697cM7q2J02rp0oJ26j12J32j63R6r1J0M4N1q4L7n1MQ3p2nk6J01pr9O8Ln3N3l1
2728gM5j01K1m0Q2M6Mr9Q0n1j5J32m7j2o6J67j02n0rj3N0n7J91k01R8p9j7Q4k4
2757A0L9o6r2J66l4o0K7O2l6n2J29j85Q1N1j42R5M1Pm7%P6j66J27rn4L4K0l6k5
$$ plain form
2786 -39 -38 30 16 34 64 46 122 -3 19 7 144 53 137 35 59 5 65 14 54 104 79 -21 -20 25 34 -6 -66 -52 86
2815 86 -20 -79 -19 -7 -10 -39 13 -31 31 -6 1 -5 4 -76 -82 -94 7 8 -102 -4 62 27 -51 110 -31 24 12 -49 -16 -20 34
2846 34 58 0 13 32 -9 70 29 26 -57 71 -11 2 13 -36 82 -60 0 -5 -25 74 -10 -21 -129 -61 -92 82 45 -29 -7
2875 -7 3 72 -42 6 -5 17 -13 -43 12 8 -4 -57 57 17 42 16 44 -49 30 -46 -53 -16 65 -4 91 22 -2 -9 -56 -101 -42
2906 -42 35 17 -9 -51 48 66 -20 11 -21 -68 -48 6 -58 -35 -133 -73 -37 -156 36 64 -48 -78 -114 -9 -29 -59 -13 -14 -16
2935 -16 42 -50 -6 28 -9 24 -82 41 60 83 17 27 6 23 55 -14 -43 71 69 -91 5 60 -42 -8 -6 102 10 -28
2963 -28 -22 -20 81 42 17 61 64 -16 -68 -69 -50 -69 28 26 -56 -99 0 33 31 0 -58 22 -59 -58 127 -129 -12 -89 2 79 55 53
2995 53 18 63 44 -1 -19 74 -23 55 22 13 1 -16 -21 3 73 40 74 -96 -10 -59 107 25 21 -27 -92 114 -42 -69 68
$$ packed form
2786c9JO8j4J8L0j8P6j25K2j2J37r1Q4j02K4n4O0n1M0N0k5j00JM5Rm0o0J4J38
2815H6j06n9O0J2lk9N2m4O2l7PoRq0oj2J01Jj10R8O6l5p8J61j41N5j2o1L3mN4
2846C4K4n8J3J9m1P9m1lq3J28q2J3J1m9J18j42O0nk0R9q4j1j08O8l1J74l7p4K2
2875gJ0O9j14M8j1K2l0l0N5mj2n3J14m0K5k6K8r3P9p6pL7Q1o9R5o9k4pm7m5N9
2906d2P7j8k6m2R9J8q6L1l2m7K0N4o4K3r8O0L6j19J92K8j12l0l6J05k0l0M6jk
2935a6N8r2M4L4l7L3j06J23J9K3o6J0k1J7L2o9k9J14kj60R6N5j02L4KJ08r2l8
2963b8OKJ01l9k5M4Lq0n2jJ9j9R7kq2m3R9L3kl1n8Q0q1JJ85k56J17p7R1P7k4k
2995E3l5M5j9m5j8R3r7P8l3rj2j7nK4P0l3L4j70Q6m9J66q2mm8o5K06j56k7J37
$$ plain form
3024 68 52 30 -108 -27 28 -24 29 -72 -19 -9 50 -60 -15 61 -37 0 -58 22 -7 -69 97 -50 68 -61 -48 38 -15
3051 -15 -10 -56 60 75 46 20 21 100 28 -6 2 68 -74 -6 -28 -1 -22 -26 -26 108 33 40 47 42 -40 -12 42 15 -13 -40 34 -20 33
3084 33 -75 -109 68 23 69 84 -22 22 -54 -45 28 -38 -64 52 -24 3 67 37 109 59 -34 57 56 68 -3 4 -57 16 52 1
3114 1 -78 -42 -22 -7 11 44 -48 23 1 -12 89 26 -27 -3 -44 -44 -100 -5 59 -79 -10 -33 56 -27 -7 11 -72 -12 -62 -32
3144 -32 59 -16 -89 -34 -33 63 69 31 40 -1 -57 -34 10 -22 28 6 39 51 9 9 118 -31 -29 -35 19 3 63 -20 -3 -35 -2 -23
3176 -23 -26 -29 -103 -20 -28 -2 -44 17 -23 24 -47 -41 -52 -16 54 80 -47 -95 14 -48 19 -49 59 94 46 31 -27 -84 29 -45
3206 -45 -9 26 30 98 -33 -33 -20 40 -18 -29 -34 27 -12 6 -28 -47 -32 -7 2 -59 132 -39 -18 120 95 42 -23 -60 -38 53
3236 53 19 -20 -30 -7 -4 -79 -19 13 58 20 21 68 -19 41 17 45 60 60 19 68 -3 -31 41 6 -41 22 -35 53 -10 -37 -5 -9
$$ packed form
3024F8j6k2j38Q1N5n2N3j01N3J0N9j10M5P6r8L7n8Q0k9o2J66j47J18j29J3Q6n3
3051a5Nm6J16J5k9k6JP9p2l4QO6j42O8k2K7k1m%J34p5PPnq2K8N4k7k8k7P4n4N3
3084C3j08l4J77m5M6J5j06M4p6RP3o6k6J16p6K7O4l0P2n0r3R1jJ2p1Po1P3L6n1
3114Ap9L6K0J5J8L3r2P1k2j3J01o3n3K4m1%n6R5O4j38O9k3Q9q3K0J8q3O0n0L0
3144c2R1p5p3N5JR6Ol8Rm1n6K3M4l2N0k2L3J2m2%J09j49KoN4j6O0q3J7l2L3k1
3176b3llp4Q3qK6m2O1m0M7p1Oj1L6P0K6j27m8J09o2O7o8J08L5m8j5n8n7J13p4
3206d5L6L5MO8j31%J3O0n8j1nO1l9J8l4j9J5K5Ro1J91j71K1J38k5n3o5l7K2R1
3236E3l4l9j0K3Lp5O0L2M5l8JM7q7O0k4K8J5%m1M9p1k8P2l5m7O3n7Q8o3k7L2m
$$ plain form
3268 -9 -29 14 -80 64 -46 2 21 -109 11 -62 31 16 16 -5 -12 -74 63 -41 9 -31 -6 95 1 -92 -2 2 139 2
3296 2 -42 56 -10 72 32 -18 -41 19 112 37 -23 10 60 30 25 63 12 -21 -25 11 7 50 20 -15 -33 129 25 10 36 47 75
3327 75 -29 27 24 19 -73 32 52 -23 3 -71 28 13 7 37 36 61 2 -11 0 23 -67 -28 73 31 -75 -32 -1 -23 111 -41
3357 -41 42 37 -32 -4 29 -34 -41 -31 13 30 -18 -26 55 8 -19 124 6 106 -92 92 54 -65 32 -78 -12 -87 -14 33
3385 33 -51 44 -95 -11 -18 -42 -4 -63 27 -40 39 67 -96 -2 -22 -13 -7 67 -7 25 11 34 11 -14 62 83 37 114 36 1 51
3416 51 1 42 150 -54 21 -13 13 -4 -2 1 -40 43 -24 28 -35 -13 -38 44 -47 -66 -25 -24 -44 -5 76 -11 -157 45 34 -90
3446 -90 15 -53 23 7 -18 -8 78 3 102 -12 0 35 10 -77 -24 37 97 18 5 12 35 -6 50 122 0 6 -20 -13 61 51
3476 51 65 1 -13 -15 3 41 86 -1 20 -19 -28 -4 24 -26 -37 -43 9 -44 -87 -63 -41 16 33 -93 28 60 -36 47 14 51 24
$$ packed form
3268ik0M3r4J44j10M8J9j30J20p3R3j5%k1po2J37j04N0m0K5J01r4r3R0MJ37j37
3296Bm4R8o6Q2m0n0k3O0R3p5o0L3N0l0nL8n1l3mL6mM3l0l5j8J62j04j5K6J1K8
3327G5j04N6lnr2J05K0p5K6p4R9j5oL0jK5n9j3J1K3r0L9J01m2j06M3L1k2J34j52
3357d1Q3no9K8L3o3pJ0M4J7m8qQ1m7k7J43j18J00j98J84l8j19R7j10O6p5P3M7
3385C3q4R5j39Q4pk4L8n9R0o7P9K8j63R4k0ROP4p4L2j4K3k3k5P6K1m6P7p8l5N0
3416E1n0M1J08k04P5l4K6j7KLm1Q3o7N2o3K2k5Q2r1j9M1Jk0L9Q1q7j46K02j1j24
3446i0J05o8P6j6k5J0Q6p5R9j14J2L5k5q7N3O1O0p9j3PK3m1N6P2j22Ok6PP4j0
3476E1J4o4j4kJ8L8M5q7K1l9rK4K8n0j1oN2n3m3K4K2N7J7j26J21L2r6Q3l3L7k7
$$ plain form
3507 24 21 -65 28 -34 71 21 70 80 25 -30 14 -29 -6 4 -30 -32 36 47 -45 80 7 -7 -6 20 -29 -67 -26 28 -41 29 -49
3538 -49 -36 -99 -91 -35 -34 15 41 -5 -50 -26 -101 -27 -24 22 -44 -42 -26 14 51 -25 -43 76 -44 74 -54 -34 55 -39 -105 -26
3568 -26 26 -32 -44 -33 80 -57 36 2 -74 -7 35 -16 -22 -16 -6 74 22 -95 -45 -47 127 -39 31 -120 7 -31 -20 74
3596 74 10 58 -18 35 -37 65 -31 119 8 -18 17 -25 108 9 -16 -33 75 15 -20 15 -13 -39 -34 -59 -40 -58 4 55
3624 55 -36 -82 43 18 -51 63 14 34 41 -28 49 34 -51 -42 -36 -21 -83 -41 -63 -75 -59 -43 -74 -35 -103 25 -13 -13 -10 -30 6
3655 6 12 41 -42 5 -56 -33 6 -6 37 -45 39 43 13 52 -83 12 -17 -16 53 1 -10 18 43 -5 12 -92 5 28 -63 73 77
3686 77 -73 -30 5 11 16 -4 -27 -24 -34 25 -12 -36 22 -58 2 27 -116 -51 -9 62 5 -67 31 65 99 -6 -38 62 -45
3715 -45 23 -144 -58 16 48 -10 50 38 39 129 6 31 17 -50 -27 -89 -116 -6 37 -48 -31 -2 36 18 26 -21 -49 73 -37
$$ packed form
3507B4lq6R3o2J05n0M9J0n5n5M4m3K3J0l4kO8J1r2J25p3j4JK6m9l8M1N4o9P0p8
3538d9J3o3QN6JM9K6m6m5K4p5P4LM6o6KJ6M0L7p6j8J19j20J18j28K0Q9r4o6P9
3568b6N2n8j2J1J13j37R3l4p6O7M2n1oOJ0Q0n2j17N0kJ74j66P0j51J27l8J1R4
3596G4o4M8p6N3p2J02r6J50j11k6L5m2J33r9k5j7J08o0l5L5k8k6Nk5J9j8O2N1
3624E5r1m6J25k5o9J14m9K0Po9P7j5q5ROJ5o2M2k2j2J6J6l1L9o8J28l8%Lk0L6
3655FOK9q3M7o1K3L9j2M3q2Q4Ml0L9j35R5k9JO9n2j1K8K5m8J7j04R7K3r1J36M
3686G7j50M3L5ONk0k3Lj0N9l7k4N8q0O0K5j43O5M2P1n7p2R8L4L4j05l2J00j07
3715d5O8j67Q6P4L2n8O0j2JR0j23K5j4o7K3o2k7J10M3q5J7K9L8j8Qm7k8J22j10
$$ plain form
3744 -37 -48 -2 -76 -43 -30 -25 -21 11 6 30 -62 -9 10 -24 -51 14 -19 17 75 -68 68 53 -27 50 61 151 56 22 23 14 -9 24
3776 24 7 25 -4 -29 -39 -32 -15 -37 -50 2 38 62 15 27 -33 -46 -35 -15 27 -69 10 -102 42 32 93 -1 14 -41 -63 -133
3806 -133 18 -48 -15 -87 -45 -5 43 -1 -15 39 31 48 24 10 25 37 18 50 5 10 -45 61 23 11 48 -5 17 -22 12 -25
3836 -25 52 -17 -46 -6 77 -36 36 21 -47 -31 89 -39 39 -11 -62 -40 -37 0 74 45 -30 17 47 26 -57 65 55 77 19
3865 19 -41 23 76 -28 126 32 33 -19 -46 143 18 -68 -63 30 35 37 25 26 31 61 8 -18 60 -24 27 27 44 -62 10 15 -27 -147
3897 -147 9 12 -3 -65 -24 -27 34 -58 -77 -63 -34 -8 -33 28 -18 -59 0 25 -30 -96 40 23 38 -39 54 36 -50 50 -19
3926 -19 22 -56 -33 47 -48 18 10 56 72 -59 -34 6 -64 21 10 67 94 -56 58 -83 -86 66 9 -35 -4 5 60 -55 -19
3955 -19 -9 -86 -13 -38 -60 -71 5 4 3 -12 4 44 27 28 -34 -62 25 32 -1 -22 57 71 -47 -127 58 58 -80 101 -16 11
$$ packed form
3744c7j1M6p4L3J3NML2nK4r2N3J9l4k7O5l3L6N8j43J36j5q0P7J1R0r5l4Jrk3L3
3776B4j7J8k9k5j0PJ7k2j3N2L6K4m7J2o0j3J1K0M2r6P9j12J44j0O1r4J5n5k2p0
3806a33J51o6L3p2M2M0M8m4j4N4qJ7k4j4J5J2j9L2m5Nn5J06l8j2L7n3K2l9L4l7
3836b5P7o9k9M0Q3j13P2j5o8J6J20j28P8n0n1K2LL7P4k9p5M7L0k1q3J22j0K2n8
3865A9o0O4N3j04J54r4Jn2k7J89j25q6NR3NKj2JNL0n3k6P8q4N1%J7j06P2Nm2j20
3897a47J56Lj5o2M1lO1r2j9J4K9K6k5O1m6m1N9K5n5o6J36j7J5p7R3j8q6J00o9
3926a9M1p8K3Q0r5O6qM6J6j31K5M0p0Q5j1N7K7j50J14j41lJ52n7m4L1RN5j15L6
3955a9J0p7P3k5k2j1P6jjj5J6M0j7Jo2k8Q7Pl3k1P9J4j18q0J85%j38J81j17K7
$$ plain form
3985 11 -62 -54 -28 25 49 9 -18 38 -10 -42 26 -47 20 0 1 20 3 -41 -110 -53 64 20 77 -38 8 61 -27 -8 45 13
4015 13 34 53 -64 20 -48 -24 -36 -8 16 31 63 80 44 -13 -39 66 24 -38 9 100 85 -73 -37 88 -7 -33 -42 1 22
4044 22 -12 -31 -9 -20 -26 -84 -6 -104 -46 -82 24 41 -38 -44 38 -1 -74 -18 14 56 -74 -55 25 1 -28 117 -10 -51 59
4073 59 -75 -4 -24 -8 40 73 64 17 72 -11 35 24 -27 65 19 -131 108 -37 21 70 81 35 -68 25 20 -59 -29 -27 -3
4102 -3 -26 -15 -27 26 -91 -6 -3 13 26 16 -76 -87 -52 -68 -22 28 -33 23 7 7 7 -33 52 68 -5 -14 25 13 -12 -62 32 73
4134 73 -19 44 44 -15 59 55 35 -73 56 75 32 67 66 11 -81 37 -34 -16 -32 26 65 -78 20 -16 42 -9 -13 3 -7 -43
4164 -43 7 72 -22 -10 -47 -8 -60 23 46 20 63 14 34 90 47 48 11 65 -28 -21 24 33 29 -42 65 118 58 59 -67 72 56
4195 56 65 1 7 58 -21 -19 19 -55 5 16 -97 -99 14 12 -62 -57 12 140 6 23 -24 -55 96 -22 -3 -28 6 15 15 6 24 -75
$$ packed form
3985A1p3QK6N3K4m0k7N6m8l2O8p3O7k0JJ9j7m4o9N7J17m4N7j15M6N3q8J9N3l2
4015A3K1J9j17Q4o8K4j2K8K4J5L2J7l6n7k6J05m2o2M7R1j5j58L6J25r5k6rM3K1
4044B2l4j9K2j1on8P8r8N8l6J06J7p9oQ2l9p3N6L2M2j30J9Q0k4k9J45j27m1J10
4073E9j34P1k0J6M8L3rm7N5q3M6j1n1R2m6j50K39j45N8M9J1m6j03R3np9L0KK4
4102ck3J1j2N3j17Q5LJ6J3j0r2j1L5j6M6N0o1N6j6%%m0Q5J6p3rL9j2k5n0R4M1
4134G3r2O3%n9P4mk0j08J29J9m3L5jn5r2J18p1J8j6N8L9j43R8l6N8n1mJ6j0l6
4164d3N0O5r4J2l7L9n2Q3K3k6M3m9K0N6m3Jl7N4r3PM5Rmp1J07N3o0Jj26J39j6
4195E6Ro4ON1p9KL8p4O0J1j13kJ13kp4NO9J28j34J7m7l1J51j18J9k5L4R%rJ8r9
$$ plain form
4227 -75 7 -85 37 42 18 50 -60 19 19 16 -12 -4 -34 85 4 11 -113 20 -4 -47 2 -8 32 -8 -110 28 -23 132 -7
4256 -7 -10 8 -15 -33 -1 6 24 -52 -4 57 -20 19 -67 61 13 33 38 -83 -13 26 -23 2 91 41 21 -20 -5 24 -29 -42 -39 -82
4288 -82 43 20 67 -90 15 22 -7 -26 -18 19 68 -14 16 22 -95 -41 68 -66 -49 16 30 -67 -18 91 17 -58 -87 -92 -51
4317 -51 -42 -38 -96 -39 5 16 -33 -9 154 -6 -26 -30 2 37 -38 -11 -37 69 -50 43 33 43 86 45 -29 -53 -81 -14 -24 -38
4347 -38 -63 -88 -35 -34 -55 21 39 -20 46 2 75 -19 8 -6 -64 -11 -7 -12 57 14 -108 0 70 6 46 31 -33 47 -44 -30 -64
4378 -64 102 118 -8 -2 -55 36 -34 3 -13 91 6 32 -26 27 -17 87 21 -24 -19 -75 -103 -78 31 -33 -41 -43 -62 -98 -105 -42
4408 -42 16 -13 4 10 -23 -96 -15 -12 -16 -10 30 44 18 -6 -54 -6 -10 63 -1 15 -17 4 14 -10 55 40 -10 28 -49 84 33 41 34
4441 34 -45 17 29 66 -6 13 -25 50 17 80 2 31 -31 1 -5 -106 25 -18 71 6 -14 35 -23 95 17 -83 61 -9
$$ packed form
4227g5Q2r2J22Nk4L2j10P9%lk8Ql0J19q1Pj24J33k4m3M9j0M0m0j02J38n1J55j39
4256glJ8k3j8L2PJ8p6M8O1p7L9q6J28m8K0Nj21P0L9m9K5Q9n0k0m1J5K9n3j3Lm3
4288h2J25k3M7j57J05Pk9j9QL7M9q2L0Oj17N4J09j34J7O5J4r7M9J09p4p5k9nM1
4317e1RMn8N7M4J1m9K4J63j60k0mL2L5p5K7k6J06j19R3j0J0M3m1p4k4k8O7j0j4
4347c8k5k5N3Jk1P6J8n9O6m4P3r4K7j4n8N3MnO9m3j22J08P0o4M0j5o4Q0r1J4l4
4378f4J66J6j26On3R1p0L7j6J04q5K6n8N3m4J04o6m5Nn6k8K5J09o4qkj9l6pO3
4408d2N8k9J7Ol3p3Q1LmOM0J4k6k4m8M8mP3o4J6l2K1J0k4O5j5n0L8p7J33n1Qp
4441C4p9O2J2L7p2J9l8P5l3O3p8K9o2L2oj01J31m3Q9o5k0M9n8J18p8j00J44p0
$$ plain form
4469 -9 -36 -4 44 13 -90 -50 -58 -3 10 64 24 -9 36 23 60 8 -23 110 49 -14 72 -45 2 15 35 -54 -15 -10 -48 -11
4499 -11 -17 8 61 19 -58 20 53 -28 -17 18 39 48 -11 -41 29 21 -58 -11 30 -9 60 -1 50 -4 40 -30 -32 -34 -48 0 -29 69 16
4532 16 -54 -24 8 90 -6 23 -25 31 -11 -40 8 -95 20 -29 3 24 2 -67 -53 -28 16 44 -122 -20 -40 -22 -38 -38 -33
4561 -33 -21 -60 -63 -43 8 -13 53 -53 -65 -44 -31 81 72 -36 -49 -81 -67 -18 -6 -31 21 -17 5 3 49 14 22 -11 -43 2 -2
4592 -2 59 89 -48 -90 28 10 9 -37 -45 -84 40 -4 -14 44 -49 -106 70 -20 -84 -74 60 -2 33 31 48 19 -55 -57 19 -3
4622 -3 20 3 55 -64 35 -5 -50 -33 -81 15 -23 -84 19 89 -7 -13 23 -24 -30 162 56 55 -45 -11 1 31 75 -52 9
4651 9 -36 66 34 13 -35 -44 -104 -5 10 -41 -101 -92 17 -44 -9 -83 30 -67 28 19 15 32 10 57 -8 57 109 19 40 -84 64
4682 64 40 38 18 71 80 54 49 18 -80 -25 7 53 -37 4 -70 -61 25 -33 15 -17 -57 77 54 15 35 -16 -65 -43 -59 35 46 40
$$ packed form
4469ik7L2M8l1j03M0qN5J3N4m0l3M5j3L7n2l1J33o1o3Q6j17M7J3K0q9L9Nl8L7
4499a1oK5N3m2p7P8L3q1J1L5K1Rn9l0P0qp9M7M1l9O9o1N1n4M4p0kkj4M8k9R8n3
4532A6p0L0L2Q2r6K9m8N6m2k9M8j03J15m9L2K1k2o9J4K5M4K8j66J02k0J8j6%N
4561c3J2l9lK0N1k1O6j06j2K1J3J12rj08j3l2J4M9J2k5N2l8K2kM6l5Ql3l2M5m
4592bO1L0j37m2J18j8jm6ql9J24m4j0N8r3n7J76r0o4J0J34o2L5kJ7k9p4kP6k2
4622cK3j7N2j19R9m0m5J7m8R6l8o1J03P0r6oL6m7oJ92j06jj00L4J2L0M4j27O1
4651Im5J02l2k1m8ro0R9J5n1o0RJ09o1L5p4J13r7R5rmJ7k2M7o5O5N2r0K1j24J48
4682F4k4kk0N3Rk6nl1r8N5L2M6r0M1p4RQ6n8M8l2m0J34k3l9K0n1m9K2j6R4J1o
$$ plain form
4714 40 -67 53 -58 -79 18 -7 19 69 -46 -28 -101 75 -34 -26 17 -14 6 65 24 -4 2 51 82 -18 18 7 -58 67
4742 67 26 39 54 62 6 -4 -63 -59 12 -84 -28 54 -17 -30 -83 -3 43 -15 -29 -50 -42 -52 53 26 0 12 -2 43 30 -50 -57 -55
4774 -55 25 40 -6 -45 104 -11 -13 54 -9 75 18 -78 94 48 -18 6 -11 55 -2 -4 8 -48 -13 -54 -32 8 91 34 -19 70
4804 70 46 -19 -55 -42 -33 -43 10 -51 22 16 6 40 -63 53 18 -8 20 -32 -34 -16 -37 34 -49 46 10 -10 48 -62 -14 -4
4834 -4 -27 -9 45 28 0 26 -13 22 37 28 68 -18 81 -19 -5 -30 11 53 -56 26 23 26 -8 -31 -39 9 43 -99 13 45 -56
4865 -56 -61 -28 2 -48 -115 63 -34 -50 -1 18 -76 -52 -25 -110 -100 60 -29 -31 -12 98 21 1 -15 -36 4 36 -19 -4 81 -14
4895 -14 39 -1 -35 89 -14 -20 16 60 -6 11 -66 -6 -41 -68 -5 20 -19 2 -48 26 5 -10 -43 -2 -58 78 50 -70 -13
4924 -13 -51 -83 -30 12 -64 -3 45 2 -48 20 -39 6 33 28 -57 68 39 -10 -11 -45 -19 33 -41 -6 105 21 -50 -6 63 -26
$$ packed form
4714D0j07J20j11k1R7k5K6N0j15J8p3J76j09QM3l1K0N9m1k8OM9L1j00L6j1o5J25
4742F7m1J3J5Qn6j0n9MP1r6N6Q2p1j3n3Q0M6n8j4k1Qj0J05k7k6J2j4M5j3q0pK
4774e5Q0J5m6l9J49j15kO7o3Q4n7r6J72m6o6K4j7O6n7kJ2n6L5m1K2M0Q3n7n3Q9
4804G0k4o5l6J3Rj0N3o1P3oj0L4j03J16l5k6K8n2kJ8k1P1q3R5l6k0N8j10M8J0
4834dk3J8N4j7k8K6l9L5J5rM0q6R9j00J4k5M1M2j09Q2lLl4k3qM8L4j42J12L2j01
4865e6nL3L0n0o7J78r7j6M9J9r4K4K7q5J0J60q9kJ9J10p7k0j6k1M0L2n5J5Q5r5
4895a4N3m0l4J24j03oL6M4o6J7p7O0l5k7O3K5l9K1n0P4k1j5l3M1n6J36k8j20N7
4924a3l8l2N3M2p6O1M8m3n0O8n9M5K7nq5J25k9m9jl4K6N2p4L5J11q4p1M4O9q9
$$ plain form
4954 -26 -31 27 -17 -12 -31 20 11 8 86 -72 -40 -26 36 -56 -19 -33 -47 18 44 42 -17 -1 76 28 30 -68 -32 55 19 29 -43 -30 72
4987 72 35 -33 -8 5 55 28 -20 -43 -47 -12 -3 16 43 -45 39 -12 30 95 -30 -32 13 98 71 2 -32 -32 14 7 17 -14 12 -39
5019 -39 -35 -13 -6 16 -57 -47 -74 1 -20 -46 4 -73 -11 9 33 -5 56 53 -74 -14 74 20 14 40 1 -4 89 44 -3 99 63 -41
5051 -41 -4 70 38 -15 34 7 86 32 38 -4 -43 -75 -37 69 -7 61 64 -13 -21 -1 -4 23 -39 44 36 47 20 0 38 63 -27 -17
5083 -17 -71 -41 31 15 46 -21 56 22 -10 -20 -26 113 57 73 -57 16 49 -18 41 -33 50 52 64 19 -18 -71 -52 61 -9 -85
5113 -85 -30 -19 -122 -68 3 -37 65 -40 79 -81 -16 -16 -32 -90 71 4 -53 -7 -9 -11 -5 41 3 -7 -11 -1 -14 60 1 -20
5143 -20 132 -7 65 -11 39 19 21 -6 -36 56 26 31 74 55 -4 92 -116 38 58 1 -24 19 -24 -6 -63 -23 69 95 8
5172 8 38 -31 -22 -55 23 -4 64 -53 -53 41 -28 23 55 -101 8 -46 -7 12 -29 46 56 22 45 -29 -73 71 11 48 -11 -48
$$ packed form
4954b6nN8m4Nj9N1rlP8j58L2J4O2r2L7j4j4O5K6kn9J6P7m8Kr8L6Q7l6J0p2J3J02
4987G2l7o8K5J3N0k7m8k3mL5RJ9K7q8Q4n1M2O5j25kM5Q5k7o9l4%M6pJ0l1K6n1
5019c9MK2PK2p3J0k7P5k1k6N0p7O2K0K4l8O1lj27O0Q8n4oK6l9nR3m5m7J02l6j04
5051d1L7P4l2n3M9k7P9n4Om2l9l2L8J06p6O8Lp7qK0lK7o2Q3qJ1k7k0L8K5r0J0
5083a7n4L0P2j6L1o7P7l4l2j0oJ39n6J6j30P3L3o7N9p4Q3KJ2m5l7n3J9J13p0p6
5113h5N5J1j03N4P1m0J02j05J19j60O5%j6n8J61o7n7M6kkOM6l8j0mJ0j3P4n9k1
5143b0J52j39P2p6N0k0Kk7l0R2l0NM3j9n9R6k08J54K0n7k5M3m3J8n7M0R2K6q7
5172HL0o9Rl3P8k7O8j17%R4o9N1L2j56J09n4L9J9m1P5J0l4K3p4m4J44o0L7n9l7
$$ plain form
5202 -48 -23 86 10 55 11 2 37 36 46 14 12 -5 53 31 -82 17 -67 7 -53 86 -45 -18 16 -71 -47 -9 -6 -138 -7
5231 -7 6 66 44 -77 12 -16 -17 -113 -35 37 -15 -22 7 16 -27 -42 -42 57 -20 48 -45 -53 79 46 71 41 -68 9 -29 102 44
5262 44 -30 -31 -65 9 116 -132 50 -7 10 -21 -97 -85 -60 29 43 6 39 -20 -97 -22 90 -11 -50 -10 81 -38 15 -3
5290 -3 24 104 30 47 -15 65 -60 -5 7 -15 -8 25 78 -73 -49 7 -39 -5 45 31 57 12 45 29 -15 -36 11 64 -36 -29
5320 -29 -34 30 -30 -15 -16 -83 -32 -33 79 33 -32 45 -78 44 81 21 4 33 -3 -29 -37 46 -52 -23 -40 37 85 -78 64 49
5350 49 17 32 -51 -25 -18 12 64 29 26 5 36 -70 63 40 36 8 60 32 -42 -11 -73 58 -15 58 -28 -23 -68 77 22 -74
5380 -74 3 113 -58 -3 -2 -28 -69 0 -60 11 44 -15 24 -25 -72 85 -39 -59 9 -5 39 45 67 22 55 -10 15 13 -53 -11
5410 -11 22 44 -71 2 49 -33 28 -32 -28 39 -7 3 -70 61 -65 22 1 23 71 -31 46 46 114 -36 -56 26 -27 -107 -31
$$ packed form
5202d8K5J09p6M5m4rL5jJ0l2kj7N8k2j13R9q4P4o0J39j31K7L4q7K4L8Lj32J31
5231gJ3O0k2j21Q9k8jr6P8P2n2pK9Rm3j5%R9p7O8r3qJ32l3K5l0j09P7l8J31n8
5262D4p4jl4P4J07k48J82n7J7l1p6J2K5Q9J4l7L3n9p7P5J12j01l9M0R1j19N3j8
5290cK7Q0p4J7o2Q0j25N5J2k2PL3N3j51K4N6m6L4N0j4K6m5L3j6m4k1M7N3j00P
5320b9nO4o0J5jo7N1jJ12m6o5P7j23J22L7o0j7K9l6k6qQ3r8K9j7P7M8j63J42j5
5350D9l2J5q3K6PL0N2l5lk1L1j06J33k3mk8N2k8p4L1o2J31p3P3q6Nm5J45n5r6
5380g4P7J10j71N5Jk6m1O9o0P1L3n9L9m9m7J57j24k0O8j4M4OK2m5L3o5K5ko6M2
5410a1L3K2j15P3M7q2O1o0MO7m6J0p3J31j26Q7k1K2M8j02P7%O8j50k0Q2n3q0P6
$$ plain form
5439 -31 36 45 -1 -87 7 -49 41 -75 33 98 12 44 92 -4 64 85 5 -26 68 8 -42 37 17 51 -17 41 -14 18 -53 39
5469 39 46 -102 63 64 -49 50 21 111 -24 -23 9 -29 -23 25 79 -103 11 -4 -53 -6 -60 -5 -15 14 45 -1 -6 6 80 43
5499 43 68 6 -20 53 2 -29 83 -14 126 -16 -1 -18 37 125 -7 37 89 5 -44 -41 -20 -62 20 23 35 31 -25 5 -63 91
5529 91 131 0 6 -68 -2 30 -32 -75 -28 -82 -3 -3 -6 -39 -80 -93 -22 10 -20 16 -48 44 -27 27 -26 4 40 49 42 21 53 0
5561 0 23 -51 27 22 29 19 39 6 29 -44 35 -53 -9 -6 18 26 -90 -9 70 18 -38 -43 35 -45 -59 54 -63 -60 10 -1 35 1
5593 1 -60 -34 -7 -3 28 98 6 -47 -32 66 52 50 8 78 95 0 57 -17 13 -54 -12 -33 43 -2 -25 35 50 -9 6 -6 -35 68
5625 68 -52 -27 -86 -40 -51 -43 -44 19 -118 -17 -3 -11 24 -84 67 -29 -71 -85 -15 -37 -12 -45 -45 -15 56 36 -8 -2 -5 -42 40
5656 40 -73 25 -21 -40 71 2 -11 -40 -45 65 -25 20 -48 -3 77 -40 20 -60 59 -28 11 -116 82 32 -42 26 -54
$$ packed form
5439c1O7Rm6q6R4n6R0j16J08O5q6L2M8r6O8K1q0l1R4o0n0P9k0L4o8N8n5L2p1R2
5469C9Pj48J65Jj13R9k9R0j35JL2l8OM8N4j82J14j5m9M7n4N5j0K9L1m6nJ2P4l7
5499D3K5o2k6P3n1l1J12r7J40j42J5j7N5Q8j32M4N2q4m9LK1m2Q2LJ2mn6L0o8J54
5529I1M0j31Op4O6L2o2m3M7n4P9%ll3m1j3P1L2l0L6o4R2p1N4n3L0L6Rpk1L2n3
5561@K3p4P8nPj0K0l3K3p3P9q8M4LK4Qj16Q1P9n2n6nP8q0j4J13j17LP0j1L6l4
5593Ao1K6K7ML1P0r2n3J5R8j4km2P0J7r5N7p4L0o7M2k1P6m5k3O0J5n9J5j2k9J03
5625F8j20K5n9M6j1QjO3j37J01J4qL5j08J51r6m2j4P0k2K5l3%L0P1k0m4Oll7Q2
5656D0j13R8m6j9J11o9j3k9nJ10r0M5o8M5Q0j17O0q0J19q7L9j27J98n0p4O8q0
$$ plain form
5683 -54 -8 -73 -65 -4 -34 -4 8 35 18 -26 77 -11 8 -12 -6 21 35 -48 26 -11 87 77 -3 -150 -5 -28 40 46 -29 59
5713 59 -89 -31 -34 -28 -21 17 -36 -69 9 35 -49 -20 -7 -76 61 26 -40 -22 -14 -17 -24 50 17 -73 -52 -33 -19 -14 10 -31 24 13 -10
5746 -10 -11 -58 30 21 -14 79 -24 28 31 -51 29 -23 -34 122 5 40 87 -4 3 -31 -18 0 -45 -12 19 -41 14 -58 10 73 38
5777 38 79 -18 -64 23 -38 21 -31 -45 -34 -5 -92 16 2 15 10 -5 42 -84 21 20 17 -117 55 0 -32 -103 -39 34 -31
5806 -31 -125 -24 37 27 34 -14 -58 37 65 -22 -2 75 -4 17 39 -24 -52 -135 63 -42 83 20 22 60 -14 80 84 115 -10
5835 -10 -45 -39 28 -75 -57 26 22 -3 -30 -7 -45 -58 -21 46 -125 27 16 -8 47 27 33 -17 58 6 -18 -32 41 -13 44 -3
5865 -3 86 17 6 5 32 91 -30 -44 39 44 42 19 -8 -85 25 29 -59 26 -17 -13 39 33 -47 66 34 -22 13 -74 3 19 -29 -102
5897 -102 15 -26 31 -61 -33 -72 -45 -77 6 30 -60 82 -39 107 -21 24 -92 -32 90 21 12 -21 -12 3 -61 -57 -25 -27
$$ packed form
5683e4M6o5QO1l0L0J2K7j7m4J03q8J9k0OK7J4q3P4l7R8j0q0j47J45k3O8Op5Q8
5713E9j48N8lOPL8n3l3P8K6q4K9J3o9J37l5o6J8QlpP4l3r0K1J9J4NK4m1N5j1k3
5746a0jm7Q8rl5R3j03N2Lq2Q0n2j1J56j17L5M7r1Pl4J3J8m5L3L1o0N5p2O8O3l5
5777C8M1r7m6Q7o1N9n2j4J1K9q7J08j4J3nj5M7j26J05jlj34J72n5l2p1O4P3o5
5806c1r4J01O1j0Pm8m4R5K8q7K0P7p9K1K2o3k8q3J98j05J25o3KL8p4R4ML1j25
5835a0l5OO7j03J8Q3mk5k7K3l8j3L7O7j71J52j1k4N5k0On0P5n2k4j4P3n4N7m7
5865cQ9o9j1jK7N9j21j4Q3Nkk3k7p7J10Mq8Q5m3MN2oq0J13l2n6L5q7P7J6m8p3
5897a02J17m1N7r2K8l9K7l2Q3K4r0J42j21J46j28M5j16O0J22o9rl3RJ5o4ML2k
$$ plain form
5925 -27 -84 40 -29 87 -38 11 -2 85 8 16 54 35 32 13 -29 -42 34 -83 22 -50 -23 20 85 14 11 -32 116 -58
5953 -58 -36 52 59 11 -31 -26 53 -13 77 -7 -35 -14 24 33 43 -18 26 -89 -11 20 -103 -16 30 34 57 1 27 -40 63 -132
5983 -132 12 4 -9 -115 -2 32 41 35 20 -15 32 -19 -10 -15 55 -28 -71 35 47 -58 33 3 34 59 25 13 71 -40 56
6012 56 49 49 26 -17 -12 12 -12 37 -107 -49 10 -16 -103 16 46 34 19 -112 -45 0 -7 -101 47 -59 100 -140 -100 7
6040 7 120 112 -135 21 78 2 10 -24 -6 -5 -42 54 74 -75 -121 -45 0 0 -3 11 -106 34 -23 -31 51 31 -84 46 -1 -17
6070 -17 -87 20 33 -17 0 -61 0 56 -10 -11 37 -19 13 49 1 -5 15 -29 -38 -29 12 -54 -89 108 -26 -51 24 -42 -20 42 -17
6101 -17 48 -30 -47 -35 52 -11 -32 -23 19 -88 -15 8 33 -19 39 -11 -15 137 -17 -20 -27 3 -98 44 -25 -6 33 -33 -60 5
6131 5 -16 -67 -44 -19 -4 25 -71 39 -12 -106 25 71 56 -70 -5 -34 -60 -39 -75 4 2 -23 -11 58 -53 7 37 24 -33
$$ packed form
5925b7n7J24o9J16j25M9j3Q7p7QL8j9lj9m2j3P6j17J05p2K7M3O5p1lm3J48j74
5953e8K2Q8Pm8m2NP9o6R0q4k8K1L8RJ0o1M4j15P8L1j23Q7M6MK3n6K6o7J03j95
5983a32J44qj3j06J13L4Roj5l5M7n1RnP0q3m3J06J2j05R1l0L1K5l4j2N8j11R6
6012E6p%k3m3NK4k4M9j44N8N9k6q7J19L0j2j5j31O7M5pr4J48j06J59k40M0J07
6040GJ13qk47J56N7p6Ql4J8Jl7R6K0j49m6P6M5%lJ4j17J40n7qQ2k0j15J30m7j6
6070a7p0J07J3n0J7o1O1N6o6jM8n6L2L6m8oK0m4rRM1o6l5J97j34k5P5o6K2O2n9
6101a7O5p8j7J2Q7o3k1RM2j07P3K3K5n2N8n0mJ52j54lpL0j01J42o9J9L9o6k7O5
6131Ek1n1K3K5J5K9r6J10n1r4J31M6j5j26O5k9k6K1l6P9kk5J2O9j11O0L0j3n7
$$ plain form
6160 -33 89 24 -88 97 -19 -6 -15 35 -25 42 -11 11 -21 44 12 73 15 3 9 14 13 -8 -25 -71 -25 28 -17 -8 -44 -30 -27
6191 -27 -18 -27 55 -32 -49 -14 -118 19 -46 2 -34 16 0 -3 -3 15 1 -15 -24 71 26 -32 -20 -10 118 8 35 -85 -41 -32 -73
6222 -73 50 19 64 65 28 -76 -79 16 -13 -25 -3 0 72 5 3 -19 -26 -2 51 25 8 3 11 -47 -7 10 -6 20 42 -29 -145 31
6254 31 44 -8 11 42 20 -40 -70 -3 12 27 -16 52 32 -8 -31 -34 41 -4 90 -25 -30 89 -100 -13 94 57 34 -37 14
6283 14 3 5 57 -5 -42 52 13 3 -4 25 23 -62 -3 52 -7 -57 -14 -78 47 -54 1 24 46 29 -32 1 52 -25 -8 123
6313 123 -87 -34 -15 -48 -73 64 -32 50 17 -2 96 -79 134 47 21 -42 -104 30 42 62 -14 57 92 -34 64 -8 75
6340 75 -46 29 -57 -40 30 22 -42 -40 56 -5 54 -32 14 -14 46 56 -64 -40 16 39 -35 27 27 67 -85 55 33 5 66 -13
6370 -13 54 29 -5 57 20 32 -23 -81 63 -45 52 -22 14 -48 1 -17 -96 50 7 7 -2 -15 -18 -32 -52 22 114 13 93 39
$$ packed form
6160c3J22o5j12J85j16J3rN0o0O7n3K2l2O5l2O1n8j2ONjk1j7m6M6N3m5Rl6J4L
6191b7RrQ2q7j7L5j04J37o5M8l6N0j6l%J8j4j6rR5m5n8J2J0J28j10K7j20M4Rm1
6222g3J23l1M5Jl7j04lR5k9j2K2LP2o7kk2pK4N3k6j7nQn8M0J7j6K6K2p1j16J76
6254C1J3n2J9L1k2o0l0O7J5J5m3O8k0m0k3lP5m5R4j15nJ19j89Q7J07l7k3p1N1
6283A4j1KN2o2l7R4l9j0pK9kq5N9N5n9n0M3o4J25j01N5K3K2j7o1L3N1p7J7J31
6313A23k10N3J9l3k5J37r6Q2l3j9R8j75K13q7k6o3o2J34J2K0p6P1L5j26R8p2Q3
6340G5j21P5q6J7P0qo4KR6o1N9q6M6k8O0J0j20K4N6K3p4O2%M0j52J40k2k8O1p9
6370a3O7k5l4O2l7J2n5n8J44j08R7p4L6o2M9j8p9J46m3%rj3lj4k0P4R2j01Q0n4
$$ plain form
6400 39 -17 -31 0 -39 -60 62 -51 -48 -26 54 37 -24 -21 7 -14 1 3 31 77 22 13 71 96 99 -82 -56 49 15 42 51 -74
6431 -74 41 39 13 -44 34 45 -17 19 5 18 46 -86 47 -39 -78 10 -109 6 -57 76 28 -69 20 44 -52 -38 -18 -64
6459 -64 -31 90 6 -46 81 -34 47 66 -3 2 -24 8 21 -104 -23 -26 -13 -44 -6 2 74 6 -5 57 1 -75 55 23 -41
6488 -41 -56 -54 64 51 68 -74 4 56 -14 -50 -57 -32 60 31 -28 9 79 -93 -82 -33 -8 34 -66 -20 28 13 74 3 3 -43
6518 -43 -2 72 -56 -6 6 -102 -57 2 27 -1 12 7 30 93 -30 43 67 42 -107 50 52 -34 39 7 8 -1 7 59 -33 13
6548 13 3 -30 16 17 41 40 -36 -4 28 -28 -43 -72 -106 8 -32 7 48 18 -29 28 2 26 -3 37 51 -78 99 43 -30 -33
6578 -33 1 26 -15 8 71 -27 82 -21 -56 -34 -20 99 -71 22 -28 -54 -24 25 -56 -89 23 74 20 73 -37 -10 13
6605 13 15 77 -51 27 -56 -20 19 -79 -61 -18 -33 35 54 -37 9 -29 89 46 -35 -1 38 -26 53 -34 69 -2 15 35 12
$$ packed form
6400C9n6j4L1l9k1J22j13LK2Q0j7o1LK8k1J5KK8M6n5rN8K5Lj81K6J05l4K7Rj25
6431g4J15kk6n7P8J1o2L6j4J3K8j32J33q6l9Q8j19J15o3J33m8r7Q9K4r6J4K0m6
6459f4L3J21q4n2J27j15Q1J9o9Nk6L2J3j25Q1lJ3l1L8QP2o8j1O2n6p6J30l2o4
6488d1j5KJ18j3J7j42P8N2p0l6pK5R2k9n9L7P0j72J1M9K5M2j00M6M8j5O1p1%m6
6518d3M1P4j28N0J2j08M5N9K5k8J3nK3O3j23P3K4k5j49J57Kq6P3l2JrQN2r2M6
6548A3j0l3M6JK4jp6L2L2n6j5k9l4J14m0L9M1l0m7N7k6K4k9M0J4j29J77n6p3l
6578c3L4K5m1K3O3r8J09j03l5K2J4J19j70R3n0k6L0M9q1l3J12N1n4N3j10K7K3
6605A3KO2j28P8q3L6L9r8J8M3j5O8J9r1M6l8J18m3q1L4L9o4P9q7J03p1J7K0k3
$$ plain form
6634 12 -4 35 66 27 27 79 -36 -75 16 3 -78 -23 39 33 3 -14 -95 -57 11 -52 -79 -82 47 -72 43 1 -44 -22 -25 52
6664 52 -74 -32 -33 79 44 -16 -40 22 -25 -79 41 41 -40 34 -42 3 61 -40 -100 13 24 -6 -22 54 -14 -34 -30 0 75
6693 75 -70 50 65 28 -159 -29 11 -47 34 -54 18 -46 -43 -5 -20 60 -48 -17 4 66 54 -58 -45 14 -18 -54 40 -38
6721 -38 -89 -48 -80 -58 -43 -59 -33 15 58 16 46 -23 -19 -35 20 16 81 17 -25 0 -60 106 -38 37 -10 30 87 11 -38 4
6751 4 -39 -50 -58 16 -5 -71 -74 -4 -118 -95 -15 -34 -42 27 -130 3 -9 -8 -53 -81 34 -22 16 40 -23 -15 14 -78 70 81 19
6782 19 -24 1 51 -34 -36 -2 -35 1 60 18 19 -33 -28 24 13 -33 39 30 -19 41 37 18 -59 32 -61 -56 -50 -79 -86 -31 39 17 -52 6
6816 6 -13 -24 -74 5 0 -56 25 34 29 -12 12 -26 2 52 6 -15 6 -28 -20 -8 75 -62 11 -27 -2 47 5 54 -14 24 13 16 -34
6849 -34 -10 2 67 38 37 -48 12 -81 25 -60 -49 -29 -7 30 -27 -80 -28 63 35 -61 -41 7 -73 78 49 68 -5 3 17 -53
$$ packed form
6634A2j6L9L1l9%N2j15l9R1j3q1N5O2ol0j7q1L8O8o3k7lJ29j19J15m2m5K2lP7
6664E2j26M2jJ12l5o0k4O2m7n4J20%q1P4p6M5N8j01o0J13J1l0j6P6o8k0ML0P5
6693G5j45J20J5l7j87J30M0n8Q1q8P2o4LL8j5Q0j08L1K1O2j2j12J3N9l2l6R4p8
6721c8n1M1l2K2J5j6K6M8M3m2L0o9Mj6N5mO5o4m2K5o0J66j44P5m7M0N7p6m9M2
6751Dm3j1qP4k1o6lP0j14K3Q0j9qO9j57J33j2Jm5k8J15n6L8K4o3QK9r2J48J1o2
6782A9m3K5N0q5kL4l3L6N9m2Jn2NN2j1m6P2rm9O0mj9p7R1r3NOk9pN5P0k2o9N8
6816Fj9j1n0P9nn6Q1Rnm1K4l8K8N0m6k1K1l4QJ2Q3j37P3l8K5M9m2M9o8L8j1Ln0
6849c4K4J2O5k9jq5O0r3J06q5J1K0K2L7n7n3N2R1k8r6K0M8q0J51k9J9p3QJ4p0
$$ plain form
6879 -53 83 74 27 2 -18 15 -9 -31 35 21 40 44 -18 -5 -86 17 30 65 39 -60 -82 41 67 -67 -13 3 22 40 -34
6908 -34 -49 -83 113 28 -11 2 54 48 14 -10 -53 25 -15 -5 40 20 -25 42 130 13 47 52 -119 21 12 51 56 -17 -15 -86 126
6939 126 36 16 25 -2 -29 51 -76 -9 -51 86 112 16 1 -32 82 2 3 -44 -56 -11 27 1 -10 -10 -25 85 -22 -61 1
6968 1 16 -31 -3 93 -30 59 56 -5 15 2 101 6 11 -61 -62 12 16 19 9 84 0 59 19 -58 1 11 61 28 39 -79 88 25
7000 25 -18 57 5 -22 30 52 -33 -6 53 7 -45 10 34 -70 -70 -14 93 -50 -6 38 14 -26 -34 -53 -91 -67 -18 19 -49 19
7030 19 4 -34 -26 -46 0 -37 16 42 -116 83 -41 -55 43 4 -31 24 14 107 -57 -79 -5 -46 5 10 -57 57 1 -22 7
7059 7 18 15 -4 3 -16 50 -49 -52 -105 16 -85 -101 32 24 18 -15 -10 -59 -94 -47 49 -25 -47 31 -28 79 49 -47 -43 85 39 61
7091 61 9 -152 -17 -33 20 64 136 99 16 83 50 10 -54 -5 2 -13 -13 8 -26 54 66 47 88 -32 1 10 -48 53 -12 11
$$ packed form
6879e3J36rm7k5k0L3k4k2O6j4J9Mo2J3q1J03J3L5k6r9k2J23K6j34N4J6J9J8p4
6908c4j5l4J96q5l9J3N2ol4k4m3P8m0J0M5k0m5O7Q8j17L4Nj71J40rL9Np3Kp1K12
6939A26r0k0Rk7k7Q0j27O7m2J37K6r6j5l3J14q0Jm7j2M5L8k6j1%j5J10j07l9O2
6968AJ5m7K8R6j23Q9lo1K0j3R9r5Np2jP4MLj0P5q4N9m0p7N9J0N0l3J1j18J67o3
7000B5m3P5n2k7N2K2q5K7N9m6n2N5K4j04%N6J07j43M4M4k4m0qj9l8K4M9L7o8O8
7030A9j5l8Qk0M6l7N3K6j58J99j24j4R8l9l5N5j0R3j64k2P4m1N1No7J14n6k3K9
7059GJ1lj9Pj9O6r9ln3J21j01j6J33qol3Nm9l5M7R6p4k2P8n9J07l0r6MJ28m6K2
7091F1n2j61J35j6N3M4P2l7q3O7l3m0o4M9Pj5%K1l4Q0J2j9M1j20L3Rn8J01o5K3
$$ plain form
7121 11 1 11 50 49 -77 -9 -2 -47 -13 -16 -77 -16 -67 14 -1 40 17 -12 41 -40 -7 -22 34 11 0 -18 -50 69 113 -79
$$ packed form
7121A1j0J0L9jj26O8Pm5L4lo1O1n1Q1j5M1k3k9N3q1L3j5N6k3j1j8l2J19M4j92
$$ [...]
8191a3
##END NTUPLES=NMR FID
##END=
