##TITLE=1H ikalashn
110-2024-BAU
12.12.2024
##JCAMPDX= 6.0         $$ Bruker NMR JCAMP-DX V2.0
##DATA TYPE= NMR FID
##DATA CLASS= NTUPLES
##ORIGIN= UXNMR, Bruker Analytische Messtechnik GmbH
##OWNER= root
$$ TOPSPIN		Version 1.3
$$ 2024-12-12 14:07:22.375 +0400  Irina@DPX200
$$ Compression mode = diff/dup
##.OBSERVE FREQUENCY= 200.131300845
##.OBSERVE NUCLEUS= ^1H
##.DELAY= (6, 6)
##.ACQUISITION MODE= SIMULTANEOUS
##.ACQUISITION SCHEME= undefined
##.AVERAGES= 16
##.DIGITISER RES= 18
##SPECTROMETER/DATA SYSTEM= spect
##.PULSE SEQUENCE= zg
##.SOLVENT NAME= CDCl3
##.SHIFT REFERENCE= INTERNAL, CDCl3, 1, 17.49637
##AUDIT TRAIL= $$ (NUMBER, WHEN, WHO, WHERE, WHAT)
$$ ##TITLE= Audit trail, TOPSPIN		Version 1.3
$$ ##JCAMPDX= 5.01
$$ ##ORIGIN= Bruker BioSpin GmbH
$$ ##OWNER= Irina
$$ $$ F:/spectra/data/iren/nmr/1H/4/audita.txt
$$ ##AUDIT TRAIL=  $$ (NUMBER, WHEN, WHO, WHERE, VERSION, WHAT)
(   1,<2024-12-12 14:07:03.296 +0400>,<Irina>,<DPX200>,<TOPSPIN 1.3>,
      <created by zg
	started at 2024-12-12 14:05:55.046 +0400,
	POWCHK disabled, PULCHK disabled
       terminated by command 'halt'
       configuration hash MD5:
       BE 6D 3F 07 2A EA 11 49 91 17 2B D3 AF B3 58 0D
       data hash MD5: 16K
       F3 7B B7 FE FC 67 82 CF 14 2E 97 3B 49 75 8A CA>)
$$ ##END=
$$ 
$$ $$ hash MD5
$$ $$ 0D AF CC 68 B6 1E 8F 1B C4 81 5B 5E 8C 04 E7 98
##$RELAX= 
##$RELAX= 
##$RELAX= 
##$RELAX= 
##$RELAX= 
##$RELAX= 
##$RELAX= 
##$RELAX= 
##$RELAX= 
$$ Bruker specific parameters
$$ --------------------------
##$DU= <F:/spectra>
##$EXPNO= 4
##$NAME= <1H>
##$PROCNO= 1
##$TYPE= <nmr>
##$USER= <iren>
##$AMP= (0..31)
100 100 100 100 100 100 100 100 100 100 100 100 100 100 100 100 100 100 
100 100 100 100 100 100 100 100 100 100 100 100 100 100 
##$ANAVPT= -1
##$AQSEQ= 0
##$AQ_mod= 1
##$AUNM= <au_zg>
##$AUTOPOS= <>
##$BF1= 200.13
##$BF2= 200.13
##$BF3= 200.13
##$BF4= 200.13
##$BF5= 200.13
##$BF6= 200.13
##$BF7= 200.13
##$BF8= 200.13
##$BYTORDA= 1
##$CFDGTYP= 0
##$CFRGTYP= 5
##$CHEMSTR= <none>
##$CNST= (0..63)
1 1 145 1 1 1 1 1 1 1 1 1 1 1 1 1 1 1 1 1 1 1 1 1 1 1 1 1 1 1 1 1 1 1 
1 1 1 1 1 1 1 1 1 1 1 1 1 1 1 1 1 1 1 1 1 1 1 1 1 1 1 1 1 1 
##$CPDPRG= <>
##$CPDPRG1= <>
##$CPDPRG2= <>
##$CPDPRG3= <>
##$CPDPRG4= <mlev>
##$CPDPRG5= <mlev>
##$CPDPRG6= <mlev>
##$CPDPRG7= <mlev>
##$CPDPRG8= <mlev>
##$CPDPRGB= <>
##$CPDPRGT= <>
##$D= (0..63)
0 2 0 0 0 0 0 0 0 0.06 0 0.03 0 0 0 0 0.0002 0 0 0 0 0 0 0 0 0 0 0 0 0 
0 0 0 0 0 0 0 0 0 0 0 0 0 0 0 0 0 0 0 0 0 0 0 0 0 0 0 0 0 0 0 0 0 0 
##$DATE= 1733998019
##$DBL= (0..7)
120 120 120 120 120 120 120 120 
##$DBP= (0..7)
150 150 150 150 150 150 150 150 
##$DBP07= 0
##$DBPNAM0= <>
##$DBPNAM1= <>
##$DBPNAM2= <>
##$DBPNAM3= <>
##$DBPNAM4= <>
##$DBPNAM5= <>
##$DBPNAM6= <>
##$DBPNAM7= <>
##$DBPOAL= (0..7)
0.5 0.5 0.5 0.5 0.5 0.5 0.5 0.5 
##$DBPOFFS= (0..7)
0 0 0 0 0 0 0 0 
##$DE= 6
##$DECBNUC= <off>
##$DECIM= 32
##$DECNUC= <off>
##$DECSTAT= 4
##$DIGMOD= 1
##$DIGTYP= 9
##$DL= (0..7)
0 120 120 120 120 120 120 120 
##$DP= (0..7)
$$ [...]
##$SW= 21.9926040160658
##$SWIBOX= (0..15)
0 0 2 0 0 0 0 0 0 0 0 0 0 0 0 0 
##$SW_h= 4401.40845070422
##$TD= 16384
##$TD0= 1
##$TE= 300
##$TE2= 300
##$TE3= 300
##$TEG= 300
##$TL= (0..7)
0 120 120 120 120 120 120 120 
##$TP= (0..7)
150 150 150 150 150 150 150 150 
##$TP07= 0
##$TPNAME0= <>
##$TPNAME1= <>
##$TPNAME2= <>
##$TPNAME3= <>
##$TPNAME4= <>
##$TPNAME5= <>
##$TPNAME6= <>
##$TPNAME7= <>
##$TPOAL= (0..7)
0.5 0.5 0.5 0.5 0.5 0.5 0.5 0.5 
##$TPOFFS= (0..7)
0 0 0 0 0 0 0 0 
##$TUNHIN= 0
##$TUNHOUT= 0
##$TUNXOUT= 0
##$USERA1= <user>
##$USERA2= <user>
##$USERA3= <user>
##$USERA4= <user>
##$USERA5= <user>
##$V9= 5
##$VALIST= <valist>
##$VCLIST= <CCCCCCCCCCCCCCC>
##$VD= 0
##$VDLIST= <DDDDDDDDDDDDDDD>
##$VPLIST= <PPPPPPPPPPPPPPP>
##$VTLIST= <TTTTTTTTTTTTTTT>
##$WBST= 1024
##$WBSW= 25
##$XGAIN= (0..3)
0 0 0 0 
##$XL= 0
##$YL= 0
##$YMAX_a= 212591
##$YMIN_a= -138470
##$ZGOPTNS= <>
##$ZL1= 120
##$ZL2= 120
##$ZL3= 120
##$ZL4= 120
##$ABSF1= 10
##$ABSF2= 0
##$ABSG= 5
##$ABSL= 3
##$ALPHA= 0
##$AQORDER= 0
##$ASSFAC= 0
##$ASSFACI= 0
##$ASSFACX= 0
##$ASSWID= 0
##$AUNMP= <proc_1d>
##$AXLEFT= 0
##$AXRIGHT= 0
##$AXTYPE= 0
##$AXUNIT= <>
##$AZFE= 0.1
##$AZFW= 0.1
##$BCFW= 1
##$BC_mod= 2
##$BYTORDP= 1
##$COROFFS= 0
##$CY= 7568.61572265625
##$DATMOD= 1
##$DC= 2
##$DFILT= <>
##$DTYPP= 0
##$F1P= 17.9538593292236
##$F2P= -4.03888763876832
##$FCOR= 0.5
##$FTSIZE= 32768
##$FT_mod= 4
##$GAMMA= 1
##$GB= 1
##$INTBC= 1
##$INTSCL= 1
##$ISEN= 128
##$LB= 0.02
##$LEV0= 0
##$LPBIN= 0
##$MAXI= 945.577
##$MC2= 0
##$MEAN= 0
##$ME_mod= 0
##$MI= -402.1523
##$NCOEF= 0
##$NC_proc= 0
##$NLEV= 6
##$NOISF1= 8.587773
##$NOISF2= 6.764455
##$NSP= 1
##$NTH_PI= 0
##$NZP= 0
##$OFFSET= 17.49637
##$PC= 1
##$PHC0= -36.38555
##$PHC1= 8.979603
##$PH_mod= 0
##$PKNL= yes
##$PPARMOD= 0
##$PPDIAG= 0
##$PPIPTYP= 0
##$PPMPNUM= 100
##$PPRESOL= 1
##$PSCAL= 0
##$PSIGN= 0
##$REVERSE= no
##$SF= 200.13
##$SI= 32768
##$SIGF1= 18.5376
##$SIGF2= -6.396296
##$SINO= 400
##$SIOLD= 32768
##$SREGLST= <1H.CDCl3>
##$SSB= 3
##$STSI= 0
##$STSR= 0
##$SW_p= 4401.40845070422
##$SYMM= 0
##$S_DEV= 0
##$TDeff= 0
##$TDoff= 0
##$TI= <>
##$TILT= no
##$TM1= 0
##$TM2= 0
##$TOPLEV= 0
##$USERP1= <user>
##$USERP2= <user>
##$USERP3= <user>
##$USERP4= <user>
##$USERP5= <user>
##$WDW= 1
##$XDIM= 8192
##$YMAX_p= 0
##$YMIN_p= 0
$$ End of Bruker specific parameters
$$ ---------------------------------
##NTUPLES= NMR FID
##VAR_NAME=  TIME,          FID/REAL,        FID/IMAG
##SYMBOL=    X,             R,               I
##VAR_TYPE=  INDEPENDENT,   DEPENDENT,       DEPENDENT
##VAR_FORM=  AFFN,          ASDF,            ASDF
##VAR_DIM=   8192,          8192,            8192
##UNITS=     SECONDS,       ARBITRARY UNITS, ARBITRARY UNITS
##FACTOR=    0.0002272,     1,               1
##FIRST=     0,             0,               0
##LAST=      1.8609952,     214,             108
##MIN=       0,             -138470,         -138470
##MAX=       1.8609952,     212591,          212591
$$ Real data points
##PAGE= N=1
##DATA TABLE= (X++(R..R)), XYDATA
0@%%%%%%%%%%%%%%%J6l2L2l2L2l3M9o4O5q1R7j13J29j46J70j86K10k42K75l14
$$ 0 0 0 0 0 0 0 0 0 0 0 0 0 0 0 0 16 -16 16 -16 16 -17 32 -32 33 -48 49 -64 65 -81 89 -97 113 -129 146 -168
35a68L61m03M52n10N65o28P02p80Q62r54J055j165J284j417J562j718J892k086
$$ -168 193 -210 242 -268 297 -331 371 -409 453 -501 554 -611 673 -744 818 -900 992 -1094
53a094K301k541K812l117L467l872M345m912N602o458P561r049J1164j4446K0284
$$ -1094 1207 -1334 1478 -1639 1828 -2044 2301 -2611 2991 -3467 4094 -4955 6209 -8237 12047
68A2047l3865J23502J10907n7439N2497m8545o4362m7514m3444p1878j702j1463
$$ 12047 -21818 101684 212591 155152 207649 159104 94742 47228 3784 -68094 -69796 -81259
80h1259n2161n050P0395P961j6835M2865M7254q896K1676L1079k0673q506M2057
$$ -81259 -133420 -138470 -68075 -60114 -76949 -34084 13170 4274 25950 57029 36356 27850 69907
93F9907j8530n9022Q305K1596n0414k9161K5694p416k0571L7843K2047k1420K7546
$$ 69907 51377 -7645 660 22256 -28158 -57319 -31625 -39041 -59612 -21769 278 -21142 6404
106F404N2657j8621k4703L2671K613m5602n306P112l6457j4262K2009j9538k6994
$$ 6404 59061 40440 15737 48408 51021 5419 113 7225 -29232 -43494 -21485 -41023 -68017
119f8017L0670J6079l2089Q405L7814j1559r640L8719R688k1870K4441K9174k5738
$$ -68017 -37347 -21268 -53357 -44952 -7138 -18697 -28337 10382 20070 -1800 22641 51815 26077
132B6077q654K9061j2834k9870J6586J966l8579K596K5103l0326k6813L1485O948
$$ 26077 17423 46484 33650 3780 20366 22332 -16247 -13651 11452 -18874 -45687 -14202 -7254
145g254l4742Q642K9473j0395R51L2220k73j0387L1819J1964l6269k583K5007
$$ -7254 -41996 -33354 -3881 -14276 -13325 18895 18622 8235 40054 52018 15749 13166 38173
158C8173k5281l4319J2550J438k5244Q997J7374j6455N592L6328n059k0711K7281
$$ 38173 12892 -21427 -8877 -7439 -32683 -23686 -6312 -22767 -17175 19153 14094 -6617 20664
171B0664J7900k9021m475K3028j6191k1276J7592j799k9900Q389J9169k3166j0058
$$ 20664 38564 9543 5068 28096 11905 -9371 8221 6422 -23478 -15089 4080 -19086 -29144
184b9144K8619P83j8356J9442J5886j9914L486K4027j5906j9093K2232M661k7174
$$ -29144 -525 258 -18098 1344 17230 -2684 802 24829 8923 -10170 12062 16723 -10451
197a0451N998K0169j5820p886K2913m910k0360J6551J0500k6722j639K3734j2303
$$ -10451 -4453 15716 -104 -7990 14923 10013 -10347 6204 16704 -10018 -11657 12077 -226
210b26j7601K0744N812k3407P830J8282k0653j1681K3982k472k2224J4549J6273
$$ -226 -17827 2917 8729 -14678 -6848 11434 -9219 -20900 3082 610 -21614 -7065 9208
223I208j7235J430K3196j0837j5103K1378M143k7127M154K1015j4963j1767J9685
$$ 9208 -8027 -6597 16599 5762 -9341 12037 16180 -10947 -6793 14222 -741 -12508 7177
236G177J271j6009J3232Q925k2175j39K0380j4880j9891J8906Q513k1808M352
$$ 7177 8448 -7561 5671 14596 -7579 -7718 12662 -2218 -22109 -3203 5310 -16498 -12146
249a2146J9546j1444p518K0288k141j8070J4087J3059j9933j657K2197o871j5484
$$ -12146 7400 -4044 -11562 8726 6585 -11485 2602 15661 -4272 -5929 16268 9397 -6087
262f087J6766O856k0685K841J5717j6195j2254J7233j831j9455R437J2325j6887
$$ -6087 10679 17535 -3150 -309 15408 -787 -13041 4192 2361 -17094 -7657 4668 -12219
275a2219j226J9627p741j3933J8118Q178j9669M065J8418j1582j0466J7081m14
$$ -12219 -13445 6182 -1559 -15492 2626 10804 -8865 -4800 13618 2036 -8430 8651 8237
288H237j7402J0400J1317j7607k311K0057o473j5796J4661P048j9249J398J4643
$$ 8237 -9165 1235 12552 -5055 -7366 12691 6218 -9578 5083 12131 -7118 -5720 8923
301H923j3759j0884J6819L60j7302R534J4419j2872k504J8072m508j2473J4137
$$ 8923 -4836 -15720 1099 1459 -15843 -6309 8110 -4762 -7266 10806 6298 -6175 7962
314G962N646j8550K765J6060j1801j1430J5757J869j6086O707J0518j3724l228
$$ 7962 13608 -4942 -2177 13883 2082 -9348 6409 8278 -7808 -1101 9417 -4307 -7535
327g535J5647o704j3999J3468P275j7553J024J6021q967j0287J4836K422j4429
$$ -7535 8112 1408 -12591 877 8152 -9401 -8377 7644 -1323 -11610 3226 5648 -8781
340h781P550J2088j2840l267J6446m095j3264J1805O933j6197O81J4271j0389
$$ -8781 -1231 10857 -1983 -5250 11196 7101 -6163 5642 12575 -3622 -2941 11330 941
353I41j1352J3259J507j6357M993J1142j1941l866J5579l181j1174J2828Q015
$$ 941 -10411 2848 4355 -12002 -7009 4133 -7808 -11674 3905 724 -10450 2378 10393
366A0393j4748R70J5774q682j0985J2549K443j4585M953J0734j1868m514J4885
$$ 10393 -4355 -3385 12389 3707 -7278 5271 7714 -6871 -1918 8816 -3052 -7566 7319
379G319l677j3088J0116P678j4198m48J3780p515r686J2659K238j4288M505J1388
$$ 7319 3642 -9446 670 8348 -5850 -6298 7482 -33 -9719 2940 5178 -9110 -4605 6783
393F783j0815n123J4225j352j0647J0348Q028j2211R71J3597q034j0889J0508
$$ 6783 -4032 -9155 5070 3718 -6929 3419 11447 -764 207 13804 5770 -5119 5389
406E389J998j5194K194R593j0336n311J2777k213j0592J0013P910j1940P50J4171
$$ 5389 7387 -7807 -5613 3980 -6356 -11667 1110 -1103 -11695 -1682 6228 -5712 -4962 9209
420I209n519q861J2019L916j2825L377R628j0528o664J1259k774j2036Q020P373
$$ 9209 3690 -5171 6848 10764 -2061 1316 10944 416 -6248 5011 2237 -9799 -1779 5594
434E594j1411O03J3374n921q949J1520K983j3932K091R765j0006o020J1273j519
$$ 5594 -5817 -5214 8160 2239 -6710 4810 7793 -6139 -4048 5717 -4289 -10309 964 -555
448e55j0147Q779P575j0679Q45J3887m447q532J1050L831j2170K118Q376j0372
$$ -555 -10702 -1923 5652 -5027 -4182 9705 5258 -3274 7776 11607 -563 1555 9931 -441
462d41o856R075l093j1792O550O760j0067P47J2965l594p212J0645L371j1657
$$ -441 -7297 1778 -1315 -13107 -6557 203 -9864 -9117 3848 254 -6958 3687 7058 -4599
476d599K512R154q476n259J1184M87q542P540P248r556p90R544p001j0158P700
$$ -4599 -2087 7067 -1409 -6668 4516 5003 -3539 4001 11249 1693 903 10447 3446 -6712 988
491I88J716j2561J740R925o525l966J1238M61q582O675O290j0004j201J0571m659
$$ 988 2704 -9857 -8117 1808 -4717 -8683 2555 3016 -5566 1109 7399 -2605 -3806 6765 2106
506B106p841R163L533j0487K478Q982q098n830R779q24r500N915P073q297r3J0285
$$ 2106 -5735 3428 6961 -3526 -1048 7934 -164 -5994 3785 2961 -6539 -624 6449 -1848 -1941 8344
522H344m350p977P675J866j2165O88P953p165n385J0138J156p201O887P498p293
$$ 8344 3994 -3983 3692 5558 -6607 -5919 2034 -5131 -10516 -378 778 -6423 464 7962 669
537F69l46J0183m241p549P550K676j0784L31P414p461o245P239o99q907M917O511
$$ 669 323 10506 6265 -1284 6266 8942 -1842 -1511 5903 -1558 -7803 -564 -1263 -10170 -5253 1258
553A258o755l12J0853k257o244P998L172r544J003P270o837n933Q316P63q288
$$ 1258 -5497 -5809 5044 2787 -3457 4541 7713 -1831 -828 6442 -395 -6328 1988 2751 -5537
568e537M574O202p599j532P932l764p851O708K890q938J656Q961m679m224Q724
$$ -5537 -963 5239 -2360 -3892 4040 276 -7575 -867 2023 -6915 -5259 3702 -977 -5201 3523
583C523J167q070M048N523p730k141Q483k867o600P174L615q239J176P512n755
$$ 3523 4690 -3380 668 6191 -1539 -3680 4803 1936 -4664 2510 6125 -2114 -938 6574 819
598H19n648P078O2q418L488N969o624j517Q240k178n850O429L480q057J229P906
$$ 819 -4829 2249 2311 -6107 -2619 3350 -3274 -4791 3449 1271 -4579 1850 5330 -2727 -1498 6408
614F408m869n008P590Q37p829K668N289o971k316P186k531o264O429L783p147
$$ 6408 1539 -3469 4121 4958 -2871 -203 5086 -1885 -4201 2985 454 -5810 619 4402 -2745
629b745R38P344m630n153O144k87q149K397N038o192k018P745q85n223O587M462
$$ -2745 -1807 5537 907 -4246 1898 1611 -6538 -4141 897 -5295 -7313 432 -453 -5676 911 5373
645E373o459J545P505l886m567O681J174q422J554M467p258l657N522k595o396
$$ 5373 -1086 459 7964 4078 -489 6192 7366 -1056 498 4965 -2293 -5950 -428 -3023 -9419
660i419N326L630n869J987Q696k393l503P846J767o821K187M634o412l497N870
$$ -9419 -4093 -463 -6332 -4345 4351 1958 -1545 6301 8068 1247 3434 8068 1656 -1841 4029
675D029k452o726M358L511o847K97P155l461m447O822J473o906K362N486n598
$$ 4029 1577 -5149 -791 2720 -4127 -3830 3325 -136 -4583 2239 3712 -3194 -832 4654 -944
690i44k918O223j196o374M167L395o144L59O621l303m541O313J825o515J733N778
$$ -944 -3862 2361 1165 -5209 -1042 2353 -3791 -3432 3189 -114 -4655 1658 3483 -3032 -1299 4479
706D479m478k261O346r38n553M534L131o808j106N377m430n109M914J411o185
$$ 4479 1 -2260 4086 3148 -2405 2129 5260 -1548 -2654 2723 -1707 -6816 -1902 -491 -6676
721f676K604O443l774j126P365N1n624M068L171o187p68N162m052m733M913J284
$$ -6676 -4072 2371 -1403 -2529 4836 4887 -737 3331 6502 315 -453 4709 657 -4076 837 2121
737B121p060J609N424m883k357N955j60m556M631M016m782L74N927l191m869M334
$$ 2121 -4939 -3330 2094 -2789 -5146 809 649 -3907 724 4740 -42 332 6259 3068 -1801 2533
753B533N60p105O52M467m320k430O461N19m280M452M159m832o59N002l149n064
$$ 2533 3093 -4012 -3360 1107 -3213 -5643 818 1337 -2943 1509 5668 836 177 5179 2030 -3034
769c034L841O04o557R73N019m218k362O025M74m381L639M074m268M6N647k272
$$ -3034 807 1411 -5146 -4173 846 -3372 -5734 291 765 -3616 23 4097 -171 -125 5522 3250
785C250m422M443J160o242Q22M073m327l361N029m08m792L300L766m756j92N777
$$ 3250 -1172 3271 4431 -1811 -989 3084 -1243 -4604 425 17 -4775 -1475 2291 -2465 -2657 3120
801C120k084m109M444J892n642J397M581l534k757N345R8m995K832L289m693j053
$$ 3120 1036 -3073 1371 3263 -2379 -982 3599 65 -2692 2653 2751 -2244 588 3877 -816 -1869
817a869M724k428m507M300J566n459J373M861l436k722N207M51m929K825L491
$$ -1869 2855 427 -4080 220 1786 -3673 -2300 2561 -875 -3597 1610 2061 -2868 -43 3448
832C448m601q12M764j847m081M171J852n022J034M639l034k823M804J89m704K327
$$ 3448 -1153 -1965 2799 952 -3129 1042 2894 -2128 -1094 3545 511 -2312 2492 2681 -2023 304
848C04L158m666j182M372j880m187L499J690m802J052M489k908k125N110Q43m376
$$ 304 3462 -1204 -2386 1986 106 -4081 -582 1108 -3694 -2642 1847 -1061 -3186 1924 2767 -1609
864a609K723L497l851j298M524j816m243L245J188n331M82M343l173l000M435
$$ -1609 1114 4611 760 -538 3986 2170 -2073 1172 2360 -2971 -2489 1854 -1319 -4319 116
879A16O54m415K403L318l679r01M980j266l857L707J940m468M62M372k983k664
$$ 116 770 -3645 -1242 2076 -1603 -2504 2476 1210 -2647 1060 3000 -1468 -1006 3366 383 -2281
895b281M362L07m552K134L303l961j255M156j262l908L109J671m331K57M097k581
$$ -2281 2081 2388 -2164 -30 3273 -688 -1943 2213 951 -2957 152 1823 -2508 -2251 1846 -735
911g35k599M367M94m324J906L544l425j155M229q40l446L318J757m170M95L760
$$ -735 -3334 1033 1527 -2797 -891 2653 -772 -1927 2302 1462 -1984 1334 3091 -1079 -584 3176
927C176k404l181L743K87m425J582K985l491j363M364q99l438K936K170l933O19
$$ 3176 772 -2409 1334 1621 -2804 -1222 1763 -1728 -3091 1273 374 -3064 -128 2042 -1891 -1272
943a272L797k140k316L899P75l989J378L191l313j821L842j055l339K374J713
$$ -1272 2525 385 -1931 1968 2743 -1246 132 3323 10 -1811 2031 976 -2363 11 1724
958A724m033K12L847k369k436L532N55l933J791L260l013j142M062m31l153K743
$$ 1724 -2309 -2097 1750 -619 -3055 477 1032 -2901 -1110 2150 -863 -2005 2057 1626 -1527 1216
974A216J827l701k0L327k126k424L234P85l864J357K964l108j635L320p20l354
$$ 1216 3043 -658 -678 2649 523 -1901 1333 2118 -1746 -389 2575 -533 -2168 1152 432 -2922
990b922K079J861l603J40L782j838k077L719P71l397J395L035k746j503L469m43
$$ -2922 -843 1018 -2585 -2445 1337 -501 -2578 1141 1912 -1485 -90 2945 199 -1304 2165 1722
1006A722l231K309J724l500j15L212k028k754K957R41l579R29K887k373j400L631
$$ 1722 -1509 800 2524 -976 -1091 2121 93 -2661 296 1237 -2342 -1413 1474 -899 -2299 1332
1022A332k92l348K208K064l147j11L369j409k270K920R37l480R72K934k747j612
$$ 1332 1040 -2308 -100 1964 -1183 -1294 2075 666 -1604 1316 2253 -1227 -255 2679 -68 -1680
1038a680L081m64l141J816J792l060j31L246j564k198K669J010l206R12L076k355
$$ -1680 1401 937 -2204 -388 1404 -1656 -1787 1459 -105 -2303 366 1376 -1830 -918 2158 -197
1054a97j358L267K45l170K017K046l302m63K769j368k562K589J016l226Q23K634
$$ -197 -1555 1712 1957 -1213 804 2850 -452 -915 1854 486 -2076 513 1529 -1697 -874 1760
1070A760k635j532L041l52l074J872K175k783l10L453j068k127K837J121l287
$$ 1760 -875 -2407 634 282 -2792 -920 1255 -1528 -1838 1615 547 -1580 1257 2378 -909
1085i09Q31K648k358j630K979k01l277J712J808k677p35L038j101k576K402J049
$$ -909 -78 2570 212 -1418 1561 1360 -1917 -205 1603 -1074 -1809 1229 128 -2448 -46 1003
1101A003l104P03K718j982j478K989pk721J856K060k521j75L058j013k277K282
$$ 1003 -2101 -1398 1320 -662 -2140 849 842 -1879 -23 2037 -484 -659 2399 1386 -891 1391
1117A391R06l080P7K332k137j967K863p2k914J396K266k256m49L092r35k155K511
$$ 1391 2297 -783 -706 1626 -511 -2478 385 313 -2601 -1205 1061 -1195 -1644 1448 513 -1642 869
1134H69J193k856M17K582j877j515K505M7k718J361J665k157p98K862q70k158
$$ 869 2062 -794 -377 2205 328 -1187 1318 1365 -1353 8 1673 -484 -1282 1580 710 -1448
1150a448K100J058k559K68K231j511j998K485J63k962J469K022k027n03K585l85
$$ -1448 652 1710 -849 -581 1650 139 -1859 626 789 -2173 -704 1318 -709 -1212 1373 988
1166I88j885K038J120k661M18K409j853j796K586J23k967J094J862k371j042K602
$$ 988 -897 1141 2261 -400 18 2427 574 -1222 1364 1487 -1480 -386 1476 -895 -1937 665
1182F65r08k255K053J167k298L28K702j348j532K688K73k511J375J714k169o94
$$ 665 -243 -2498 -445 722 -1576 -1248 1454 106 -1426 1262 1535 -976 399 2113 -56 -750
1198g50K356p39k348J718R84k605J03K100j472j680K324M43k462J299K106j814
$$ -750 1606 867 -1481 237 1221 -1384 -1281 819 -653 -2333 -9 434 -2028 -729 1377 -437
1214d37q41K476k26k065J670Q37k194R0J959j545j223K158L39k441J039J935j787
$$ -437 -1278 1198 972 -1093 577 1414 -780 -690 1269 -276 -1499 659 998 -1443 -404 1531 -256
1231b56o61K297n90k143J514J081k297M7K079j311j755K199K88k142R71K043j804
$$ -256 -917 1380 790 -1353 161 1242 -1055 -1008 1071 -240 -1995 204 492 -1650 -679 1364 -440
1248d40o94K462k04j927J717J091k034j02K031j703j563J832P5k134Q54J754j766
$$ -440 -1134 1328 1124 -803 914 2005 -29 -131 1900 197 -1366 466 541 -1593 -739 1015 -751
1265g51r42K366k68k057J750J175j785R6K093r00j491J877N34k284P62J449j737
$$ -751 -1693 673 405 -1652 98 1273 -512 -416 1677 777 -714 1163 1697 -587 175 1624 -113
1282a13q08K026m83j786Q92J181k024r2K058j041j371J878O30k251J010J745j442
$$ -113 -921 1105 622 -1164 -272 909 -1115 -1207 851 -190 -1561 317 947 -1304 -294 1451 9
1299Ip93J840p5k080J450R38j824k34J973r72j440J815L92k097M90J743j530r77
$$ 9 -784 1056 981 -1099 351 1289 -535 -769 1204 232 -1208 607 999 -1098 -608 1135 -395 -1372
1317a372J901j28k105J369J322j823l20J980q27j141J542P50j946N73J801j681
$$ -1372 529 401 -1704 -335 987 -836 -1156 824 -3 -1144 398 1148 -798 -225 1576 -105
1333a05o31J936k98j566Q30J094j592r9J540q75j656J715K05k019P16J240j203
$$ -105 -736 1200 902 -664 166 1260 -332 -431 1109 234 -1422 293 498 -1521 -805 435 -768
1350g68o40J839K7j566J370J053j666k01J951p07j158J271N04j630J08J489j549
$$ -768 -1408 431 458 -1108 262 1315 -351 -552 1399 692 -466 805 1309 -321 -213 1276 -273
1367b73r19J894l00j635Q73J226j824l16J611m37j162J444N97j420K57J642j072
$$ -273 -1192 702 402 -1233 -360 866 -958 -1274 337 -100 -1262 182 779 -641 -384 1258 186
1384A86r40J598J55j807J075J112j402n02J396m22j386J159N46j547K85J511j359
$$ 186 -754 844 999 -808 267 1379 -23 -525 871 449 -937 222 768 -779 -494 1017 -342
1401c42q67J771j55j483P54J144j478j01J466m01j148J299N43j524L03J329r11
$$ -342 -1209 562 407 -1076 -322 822 -656 -757 709 308 -840 459 1002 -522 -219 1110 199
1418A99j077J582j6j614P15J331j614k44J257m79j156J189K61j315M19J287r73
$$ 199 -878 704 688 -926 -211 1120 -494 -738 519 40 -1116 73 334 -981 -562 725 -248
1435b48p55J508J45j361Q68J082j302l30J432n26j184J112N67j314j57J299q74
$$ -248 -1003 505 650 -711 157 1239 -63 -393 1039 513 -671 441 1008 -306 -463 836 -38
1452c8q18J166M9j367O50R05j178m53J465k45j238J240P01j172K69J109r02n53
$$ -38 -856 310 359 -1008 -358 547 -631 -1084 381 136 -1102 138 839 -333 -64 1045 143 -410
1470d10R48J92j298O99Q86j064n21J163l97j084P96N95j357J25J126o06q99J511
$$ -410 538 730 -568 131 1017 -47 -568 595 198 -886 -90 505 -852 -727 399 -207 -1106 405
1488D05j16j152O90J139j207m57J468l36r81Q98N29j288J50J114o49r19J051N2
$$ 405 289 -863 -173 966 -241 -698 770 434 -547 351 880 -408 -258 856 207 -712 339 391
1506C91j180M28Q80j063m04J229j78r53P42N80j084J61J120n48p34R83M43j210
$$ 391 -789 -361 519 -544 -948 281 103 -850 -108 472 -612 -451 669 121 -613 370 813 -397
1524c97N41Q20r65m77J160k40j239Q97O32j166N2R64n84p31J024L7j009J86J033
$$ -397 144 964 -1 -478 682 442 -797 100 732 -434 -382 582 -2 -733 291 328 -681 -495 538
1543E38r23l79J286k07r02P41N53r64J6J085o51p12J136M4j148M39Q63j038l62
$$ 538 -385 -764 522 315 -587 154 707 -257 -241 844 193 -519 617 661 -487 -48 815 -223 -585
1562e85J098k43j194R17N00j199l1J172n64n92J000J25r58L96J166r64m24J228
$$ -585 513 270 -924 -7 493 -706 -737 435 -129 -721 279 404 -554 -158 1008 44 -380 848
1580H48m08q08N63L59q36j05J126o74p07R18q0q48J71Q68o82m47R86k35p32Q03
$$ 848 440 -368 195 554 -282 -387 739 65 -642 276 196 -652 -481 387 -295 -742 244 9 -723 80
1600H0L63p37K69O14l21o14O91L94p83K46O41r73m47J080l24o41M97M07q00n0
$$ 80 443 -294 -25 589 268 -346 345 739 -44 202 843 -130 -577 503 179 -462 35 442 -358 -408
1620d08J014o86m43P54K06q91L00M73m53j73O52qp76O90K95o34j48R00o10m36
$$ -408 606 -80 -523 231 437 -454 -154 319 -134 -307 345 337 -439 251 546 -88 -236 664 54 -382
1640c82O59J44q00K22P66o29m06P75j80p67N84M64q46j65Q24m04m03Q21Q8p95
$$ -382 277 421 -379 -157 609 -20 -426 349 169 -598 -14 450 -396 -561 263 -141 -544 277 365 -430
1660d30L10P53m69l02O81j58n39L58K16n04k02N44l54m90M97M35q24J79N35o76
$$ -430 -120 633 164 -138 543 385 -154 204 420 -84 -286 258 -96 -586 -89 346 -478 -299 236 -440
1680d40j06P53O0o57N22M81n70j34P25l22o70N30K13p15j9Q36n37k42M66j37p19
$$ -440 -546 207 267 -390 132 613 43 -91 634 312 -358 172 385 -330 -349 487 -50 -292 174 37 -682
1701f82M52M19o33K8P99m18l42O61j8n02O2O56n70j67M17N7m94L69N77n31j71
$$ -682 -230 189 -444 -416 383 -35 -377 284 266 -236 -174 482 -88 -255 162 219 -275 94 671 140 -31
1722c1O58n12n47N87J64o53M9O00n31l89O43L5m51J58N28n48p6O65l34k65N18
$$ -31 627 115 -432 155 319 -334 -285 315 -216 -605 38 73 -378 -220 308 -240 -316 349 15 -250 268
1743B68L27o91J70L72n17j11N98Mq41K51M85m72k10M49K4o71N54K39n68K16K71
$$ 268 595 -96 74 446 -71 -182 416 420 -421 -170 315 -157 -367 82 106 -565 -11 228 -340 -124 147
1764A47m54J19L49m8m29L49N15n00m4L88k18m37N49J73o61J93L42m24k27K02J82
$$ 147 -307 -188 161 113 -316 33 548 48 4 392 174 -263 286 459 -202 -9 333 -91 -318 -116 66
1785F6l90M73N0k21j61L60j97k95L41K17l94O5M96n03j20M58k27k43K29L47l67
$$ 66 -324 149 199 -22 -183 177 -20 -315 26 243 -151 -86 410 -93 -213 245 18 -225 4 351 -16
1806a6j04M43l36l13K93L42m37j23N58l60m02P72j72m22Q7N81m77q7N04j86l71
$$ -16 -120 323 -13 -326 -33 309 -128 -251 307 -53 -455 317 145 -277 -190 391 -86 -173 331 145 -226
1827b26N13J15o07J68M8J17l27L81j29k74P8M22m29k2K28l9k09J69K46n02M4L63
$$ -226 287 402 -205 -37 11 128 -199 182 53 -221 -143 279 -150 -172 56 17 -192 -23 223 -279 -235 128
1849A28j53m9J99J04m94K50K50j84p7K84j54k99L16P5k25O0J05l26M2K17j9p7
$$ 128 -25 -74 125 229 -265 -15 235 51 -26 258 104 -195 121 196 -29 31 136 -190 -148 69 50 -27
1871b7J03J05l92J52L15k87l4J94K15l15QK79j23l80M33n4l62J71J26l3m62O68
$$ -27 76 181 -211 -59 256 -31 -65 129 344 29 37 316 193 -187 246 192 -170 1 127 94 -368 300
1893C00l56j25J27K83l98m0L34j58k12J61J56k04J51L19l53lN42n97N9M5J34j54
$$ 300 -56 -181 -54 229 -169 -209 125 -33 -245 -84 72 -132 19 338 -15 -18 524 -73 -14 31 165 11
1915A1k2L04k51o9K28P0m42J00K36m07m6M05Ll73L52Q6k21J99m1j37o6L66pl94
$$ 11 -11 293 42 -27 201 271 -171 -71 165 -242 -288 117 120 -253 99 185 -36 163 122 -15 -81 285 278 -116
1939a16J49K88j38j51Q5k22%J34K8l82Q3O04l73k23K44Q0k91J93m0Q3j21J99J14
$$ -116 33 321 183 32 117 -105 -105 29 57 -325 -242 362 -11 -234 10 90 -201 -8 -48 35 -86 113 227
1962B27l00J81Q5l08J72J85k70j34K42J29k93J14P4k42O0J27j75j1K38j5j78j10
$$ 227 -73 108 193 -115 57 242 -28 -162 80 209 -84 30 104 -138 -78 49 -126 -137 101 86 -92 -202
1984b02K40L0k02K15jk66J25K17j89l0K94j46k70J67J02j93K19P0k51j55L62k17
$$ -202 38 68 -134 81 80 -186 -61 156 -33 -63 231 85 -185 -18 84 -109 110 180 -71 -226 136 -81
2006h1k42M91j36k0l22L10K04l91K74J88l38N6O5k1l3k0n5k9O5L9n8k8J23Qk40
$$ -81 -323 168 32 12 -310 0 204 -187 87 275 -63 -7 58 37 4 -16 -71 -100 -35 4 -54 -82 41 49 -191
2031a91O5J04q5J30N5j26j3J81j03j76M6K05j47K01M0p6j76J65j24j81J03K33
$$ -191 -126 -22 -107 23 78 -48 -61 120 17 -159 -113 92 -55 146 186 110 -66 99 -25 -206 -103 130
2053A30J7j33q1J51j88JO3j29k3J22P5r1J02j15P8j7Q6K5k42J90o7L0L3J62k45
$$ 130 147 14 -67 84 -104 -103 -40 -169 -192 -70 5 -86 16 -99 -21 -38 48 73 -169 21 -46 -16 17 179 -66
2078f6j03K90p1j47K67o5k15J04K08j12j87J81j89RJ89Pm8M5j32p2M4O3J00j63
$$ -66 -169 121 50 -97 170 105 -110 -6 202 90 -97 84 -105 -96 93 100 52 97 -35 -107 -63 0 100 -63
2102f3J15M3k32K33r5j20J67Rr3J5O3J39l06J05o7O5j33K68J51k79o3J26o4K6
$$ -63 52 95 -137 96 1 -119 48 57 -36 -21 42 181 -125 -20 -87 -22 -155 113 264 -15 -78 48 -16 10
2126A0L3J50k79n1P1O9O9j8k15j8J76r7K58l04K93l1k03O3k3M3rJOM8j5J6p9K00
$$ 10 43 193 -86 -137 -66 3 72 54 -161 -179 -3 -100 158 -146 147 116 -87 -24 -47 -4 -13 -12 -6 42 27 43 -36 164
2154A64q2j85O4o1R3j18J22j62K18l3lK4po7j36N9J06J89j17k8pM9p9L2J02K3
$$ 164 82 -103 -39 -100 -7 -125 -3 -165 53 20 17 41 34 -33 -169 -110 -4 185 68 40 33 82 3 35 137 160
2180A60l11J06K48l18M9r6L13r2p3J79q3o9N2j36O2O0L8r1j73O4K0J44k2K5k2
$$ 160 -151 -45 203 -115 -66 -162 151 59 -14 165 82 13 65 -71 -9 51 89 -2 -175 -111 -91 53 31 56 34
2205C4J11p7o7Q5nn0n0J44k12Q5j29R3J88k24Rj65K69k5Q0j60K0r2J8J99np5O4
$$ 34 145 68 1 86 81 31 -19 125 -87 -2 -131 -38 150 -74 -65 -230 39 14 94 -66 -46 -138 -120 79 74 -1 63
2232F3q8j66K65l3j12j73K70KJ48j86r4k0K0J74J1j52o2P6J18J47p9r5P5K6j65
$$ 63 -25 -191 74 41 -71 -244 26 28 176 -10 -104 -124 -104 70 81 -71 -133 -57 61 208 129 34 109 135 -30
2257c0L4J0M9j48k4K16l5j04k2J2r6R6Q6n3K76k27O3Mq0P3j73P6N0j08M5j7Q2
$$ -30 4 14 63 -85 -109 107 72 -32 -54 -42 -138 -42 44 -9 267 40 103 107 27 100 -73 3 53 -55 -10 -27 55
2284E5k37L07j51M6p8J22j16QN0J1m7K6K3j9m0R2J1j47qK05p9j36K22J7j32K7
$$ 55 -182 125 -26 20 -58 64 -52 -44 6 17 -30 -4 19 0 -40 52 63 -84 -92 113 34 -102 120 137 5 32
2310C2q9J39j44J17j38m1Q7R0J1k1l1k4J12j00J5j31K61j85j42J22K26k41m2J79
$$ 32 -57 82 -62 55 -83 -124 -37 53 64 43 12 -12 100 0 15 -116 145 -40 -182 -60 166 -75 -117 62
2334F2j41oK76k46m3O6M2n1J54k06q5k9J49J89k43R7J26j47K1jo2l7J32Q2j10
$$ 62 -79 -85 191 -55 -98 -32 10 -41 113 -93 -178 -207 -58 131 -112 -15 111 -36 -15 -16 -78 -115 17 99 -11
2359a1p1r7J80k06K01rJ9L6rm1j26K06l8o3k4n4J67j06kqN2o5J91k12J29M5j05
$$ -11 -82 -179 1 -205 -4 -13 6 42 33 -8 -134 72 34 -29 -53 -107 60 -46 -48 -56 -4 -69 122 -90 39 84 -21
2386b1j14J79m2O2q1J21l8j80O3J13j38J03j35N3Q1p6L5l0j05K33O1j87J03j80
$$ -21 -135 44 2 64 -17 104 66 -114 -51 62 -76 27 -108 -55 26 -50 -15 -45 -150 83 144 -43 60 -120
2410a20kJ77p1j10K65j60N9M0o5l6nJ49o7k91K34J09k41P7J92j72k08J96R0j38
$$ -120 -122 55 -16 -126 139 -21 38 78 13 -23 -28 121 54 -237 -3 106 -135 -58 134 -38 -246 -50 40 -98
2434i8P3J91l17Q9K84k01j29K23r6R9k55l4L13j45r9K12k20k7K49j64k5L8K06
$$ -98 -25 166 -151 -62 222 21 -108 115 19 118 -137 -171 142 -3 -102 110 -110 -137 112 -52 -77 -39 167
2457A67k87O7R9j14J25j6nk45K80J5k61K06M9M8j49K16q0l36M06j51o8J8J24l
$$ 167 -120 -53 46 -68 57 41 36 -209 71 86 -175 31 80 128 -21 195 115 -221 185 34 -34 -16 108 105
2481A05q5n3k0j05JK28j83P6Q1L4k29J16j02J08k70N19k22p8J51n4j67O4L19l73
$$ 105 20 -33 -53 -158 -157 71 -112 -36 45 79 -150 -34 -136 -28 -298 221 -1 -79 72 18 -149 -85 234 -139
2505a39Q4o2P1n6L5J54j08j12K41k24L6oJ18ok09K44q3j63K50r1j02J39K84l49
$$ -139 -55 -117 -46 -102 -67 87 -21 -133 108 -116 -80 -86 32 26 -183 61 -22 -185 65 -26 -128 11 295 -54
2529e4p9J55R4k73L33l3k38J81jo5N6o7j03J34J7lj67R8M01k27k41O4J80l00K28
$$ -54 -133 22 116 -157 176 143 -95 86 85 20 76 9 -94 40 57 54 -113 -15 386 159 -82 -18 162 -138 90
2554I0J47k40o4J59K4j92kP7j31J68q2O8l27L40p0J4J09N9l16O5M1J5n8K39J2
$$ 90 237 -3 -67 92 116 -76 -78 -1 -132 36 -46 22 -305 35 -35 -21 88 147 -169 -104 -63 -48 -106 133 145
2579A45l59J06P6K30k56R1J86l22Q2J8oo2P2O0k21J05K15k29l6Q8k5p8O3K93k54
$$ 145 -214 -108 -32 198 -58 33 219 -103 -21 -3 -9 -71 1 61 -160 -55 160 -69 -105 -17 -42 -120 -57 236 -18
2604a8R2J30k82J15j24M0j8J63j14r7k2J89l4m0N5l9k95K03K61j56j04O0J87l14
$$ -18 74 204 -78 37 -87 -47 -65 98 -16 -113 -135 54 20 -20 35 -4 -299 -96 165 9 -95 -35 152 -162
2628a62Q4K60l98K29J32j82k7J09O1j93J41k4k2n4M0O7j33J70j6j01Nlj61k7M27
$$ -162 -78 182 -216 13 145 -37 -64 45 106 -87 54 30 8 -46 -6 61 -72 98 82 -19 -14 -17 -178 -205 222
2653B22j84j84K06n8p8R1L5nj51J76q0J80j69K33k22oJ40j57Q1l14K93J20j65
$$ 222 38 -146 60 2 -76 15 50 45 -106 70 -10 170 1 234 12 6 146 -11 70 -244 49 169 4
2676DQ3J8j34J06Q3r9r5P0j7j82M7M96l44J3M9R7k83K2J32j51R8R4l45K66j25
$$ 4 87 105 -29 77 160 61 -34 36 19 -163 -116 380 36 49 98 195 -88 -66 66 -85 13 107 -238 28 -97
2701i7n1L7J10N0p7P0N1j55k4pm9k3J58m0K8j02K16o1q1m0J81o1j58J75r5j18
$$ -97 -148 -111 -1 49 -28 42 93 -62 -86 -93 -142 -165 -7 -47 -19 -121 95 34 -47 -87 94 33 -125 50 -45 -163
2727a63L48%k58J5J62k02L4Q7K2j43K51k30j50J27J23J23j96L14j95j42J35M5
$$ -163 185 185 -73 -58 104 -98 -64 23 45 -98 153 -77 -227 -100 23 146 -50 264 69 -73 62 107
2749A07k00o4j9K89k04m8J30J31k35J51O6k80K90Mj85J93j47J7r6N2mk62L39L
$$ 107 -93 -157 -176 113 -91 -139 -9 122 -113 38 104 -176 114 118 -67 126 -21 -4 -100 -48 -52 -314 25 28
2773B8L8kN9p6j65J08K16j56j23m0Q4j33J83j59O7P7k5r5J73kM7p1j19J83l7n
$$ 28 66 64 123 47 -118 -10 206 50 -73 -113 -29 -162 21 -138 -71 6 -19 -114 59 57 104 33 -86 97 60 55
2799E5O9j62J7Q8J1k24R4J98k4k76L8J41j80K71L8k72J80Q4k09o3K70j57j38K32
$$ 55 124 -38 -21 67 78 -146 -52 146 122 -154 -116 25 -155 116 154 -118 62 146 -63 -126 144 -13 -151 81
2823H1jj40o8L17p4k11J19J63l23j0J48J1o7J49j33oj03K50k01p0J50L1j28J13
$$ 81 80 -60 -128 189 115 -96 23 186 -137 -147 1 12 -55 94 -39 -45 -148 102 -99 -169 -19 12 -116 -3
2847cQ0j55l7N8J70k11P9K9p7J25j8j7N4J04k72j02K39n3j67K76O6l30J87R7n2
$$ -3 77 -78 -115 -57 113 -98 -19 10 -67 58 40 23 77 181 -91 -193 46 -7 -174 102 168 -162 25 122 70
2872G0r1o7O9q4J84j86J7N0oN6J3p8O4K8j76J66n8P7k8l0J77k50M0J5n5J5M2m9
$$ 70 -21 -88 -19 -103 81 -105 -88 -38 -44 12 25 -53 11 39 -137 29 -29 48 20 -10 167 -83 -43 -28 -83 -68 -26 -75
2900g5J64q7k0J89j61J5p2K27k61J89L5j81m1l5J69j00L4k4J65m3k44Q3m3K65
$$ -75 89 2 -18 171 10 25 -47 180 -81 108 143 -38 -79 -114 55 -45 -11 -35 130 87 -157 -74 -117 148
2924A48j29lJ17k37J6R9J0L2J16j22j57K32r3j44j13K46N0L4j13L5Kj92K34j43
$$ 148 19 16 133 -104 -88 11 21 53 169 47 -110 122 29 -115 -228 18 68 102 -11 24 26 -166 68 -75
2948g5P0J41k41K3L13j63j85J7l1qJ85K5NOM5m0l7k08J70k1q3J99j92l1K47j06
$$ -75 -5 136 -105 -82 231 68 -117 -100 -131 -139 46 71 76 82 127 87 50 -158 12 -9 -92 107 -85 -116 131 25
2974B5N8o5J16j3o8j19M9q1J23jj34P4m0Q7Q8j54m3J11pj42J0J96j12J89l27K29
$$ 25 83 18 134 121 53 -66 -17 -98 25 24 -110 -36 -76 11 99 -55 -98 13 6 -136 -126 70 -42 147 -180 49
3000D9m9L9J4k30K00J2l8r8J72k9J55n0r1n7q1P3q0l9j7JJ08J63r6k27J20M6J30
$$ 49 0 39 53 -177 23 35 -3 -101 71 42 197 147 56 -1 -82 -9 -89 -128 -145 -144 -36 127 31 -196 -76 -30 100
3027A00j86n2K28o2j02J08K06k97L54k40p5j06O3J41j40J82r1mJ15n9j64M1l1
$$ 100 -86 -138 90 28 -74 34 240 -57 297 57 -18 -124 -61 80 -60 122 31 27 142 83 -81 -40 -71
3050g1K06j50m9J57j53R5m9K4j03J86n2m0O4m6LPm8q0J68r2J2J53n1p1o9K28l79
$$ -71 135 -15 -64 93 -60 35 -14 10 -93 93 41 1 65 19 22 29 -19 -99 69 -23 -11 142 91 20 -49 179 -200
3077b00K21n0Jk3j5J06p6J84j83m2p1J00J15K0j92P1J02Q5j33o0jmR6J4j40K10
$$ -200 21 -29 -28 -51 -66 40 -36 148 -35 -77 -148 -48 67 87 -105 -34 68 153 20 -40 -41 -45 51 65 -75 135
3103A35Q1k05K2j09ql6P1PM2M1Om1j48J05O6j2j99K14Q0j11J3j07j9l2L26j97
$$ 135 216 11 33 -76 -84 -120 -49 -42 0 41 47 6 -142 -37 29 17 -182 32 112 1 14 -93 -112 -144 182 -15
3129a5m0M2k38N1J16K19l2j90J37j2p3p1R8k2J76k17J7P5q3K0J34J11rJ0j14o6
$$ -15 -55 -13 -251 -200 -84 135 103 -87 50 38 -35 -106 -8 -30 146 -71 -54 21 -62 -42 92 203 194 204 90 24
3155B4M9N6J11k89R9r7R8m4N7r1J2j8r5R6J94p6p7l7K8J16j37K09j59j42J45L8
$$ 24 73 129 240 -49 50 -47 51 7 64 -27 -15 -33 -128 -32 162 86 9 -28 0 116 -21 188 29 -113 32 70
3181G0j15J67k70J49n6K3J26j71J62j16Q2j84L6L5j93L97p3J6j67K89j26J1j09
$$ 70 -45 122 -148 1 -55 -32 94 -77 85 -31 51 -133 -97 -62 -255 142 69 85 -82 207 81 92 -17
3204a7j8M5K6j24L7M7j8j31N7J00m0J21N7j18M9p7l3nJ09q6J62k20L24j18j87
$$ -17 -35 10 36 -88 -51 -4 -22 -153 -96 4 -36 85 142 24 73 -4 -37 -42 67 -19 143 -77 247 129 -58
3229e8OJ7j35j2J48r9j39K78J13p4m7k31K60p4O8j57K8O8k8P3J29j32P6j28MN
$$ -58 -52 -35 -170 -182 -34 -133 -272 6 119 45 -2 -233 27 -47 21 -136 -108 -40 -68 5 134 2 78 -50 -46 -41
3255d1J87k57N8P5Q2k10J67j90Q8J72j14j37J10k1o3J84q5n3r1L61k01r5P7Q1
$$ -41 146 -111 -53 22 104 -106 61 -129 -41 131 17 -120 -10 -31 -94 90 5 -48 -139 222 21 -74 3 84
3279H4j35J39o5q9M3p8K3R6j68L48n7l78K79K4o8j76J29j12k0J46j21L64j62j19
$$ 84 -51 88 23 -66 -23 -101 -78 18 -150 198 141 -237 42 66 -2 -178 -49 -161 -181 -35 -156 208 46 -73
3303g3K18k18l3L5J28q4K27q2j01J10Kj90l8L0j86M87Ll05J20J8K1n6P5l03N0
$$ -73 145 -73 -106 -71 57 -27 200 118 17 127 129 -61 -99 -69 -255 232 235 -70 50 68 89 33 108 -195 -145
3328a45K53nm6Q1j90K00j85j68J50N6m0J14n0r3O7m0L7M8o1J46j62J79k88J69
$$ -145 108 103 57 138 -52 148 -37 -205 -55 1 -39 75 25 -68 -1 -41 -4 44 -17 129 -33 146 -142 27
3352B7j45JL7P5QN5k6p6K25k32K54q9k39J01J0o5J11o1L9J0k1N0k7Q3n5j46R9
$$ 27 -118 -117 -80 -5 3 58 32 -44 181 -51 203 114 -125 -24 -14 -79 32 -29 10 20 -1 49 22 105 50 -96 3
3379Cj33J22p5l6K75j63J58j96J47oj39%m6j3J05K9J58k24J47j85J27p4M5j76
$$ 3 -130 -8 -83 -119 156 -7 151 -45 102 96 -43 -43 -89 -102 3 32 190 -34 113 -72 55 -19 26 -150
3403a50K71j00k5l4mK8N4l1J04k06K63j64n2M1J06J1j97K53k00N4l3M1o5J26K4
$$ -150 121 21 -4 -38 -42 -14 40 9 113 -93 170 6 -46 -5 101 112 -85 168 -32 22 -11 30 -35 91 115
3428A15P8l10J52j31L8N5l4k17J57L7q9L03j24J17q5j60J35K8o3J34J5k31J4J22
$$ 115 193 -117 35 -96 -58 -3 -37 -254 -97 -60 -149 154 30 147 62 -98 37 65 2 136 151 -80 -66 56
3452E6n5n3N4j8N4k0L1l40J56K63k20J42J14q0j69k2N5J13j44K23J8n1j70J08
$$ 56 1 -52 2 -16 38 18 49 -291 -135 128 -92 50 164 84 -85 -107 -52 61 -83 140 158 107 -63 45
3476D5j5Nm1p9l6J11J15o0Q5j35j59J43K83k29LQ8Rl46K24P3r9P1O7J10k62O4
$$ 45 30 35 -6 -85 -121 -10 105 45 130 -5 -164 -21 262 33 36 124 133 -213 11 84 -15 56 123 233 -29 35
3502C5rj94QO4O0J03P9q0j61J45J93k06J9r8J10m4k64L55j42j6K2J07j80J39J02
$$ 35 26 -168 -160 -96 -36 67 146 66 -95 50 243 37 56 -42 68 24 -240 115 -27 -43 -21 86 -94 45 147
3527A47k36K4P6j04J1J25q3K8J39o1j48L1M9j16L7M8K6j55J86l7m6k51M32j33
$$ 147 -89 -65 11 -93 -82 43 -40 -12 127 66 -82 -51 -2 -118 -81 -33 -7 -162 24 -13 -59 -310 122 -11
3551a1j24K65K17l10n8n3K30m15Q1K08Jn7j1P3r2n0K15j84k7J44j18P7O6L8l46
$$ -11 -135 130 347 37 -21 -74 156 -259 -178 30 31 -26 -37 36 -56 -106 109 -75 -102 42 -76 1 67 105 -241
3576b41J47J12O5j15J31j17J08O2J5j35o0J41q1j08J40m7m5L9n7m7q4K27J6o0
$$ -241 -94 18 83 -32 99 -18 90 152 167 32 -28 113 32 -76 64 17 -28 11 -46 -93 -177 50 66 6
3600FK8R7j80P0J27j58nK52k25n4p1K47j99J61j40J3r1rJ05J99k65J71p9p4J07
$$ 6 34 131 -49 21 148 -10 -15 237 12 -42 -113 134 -65 96 -44 -31 -122 -131 -26 173 -92 79 0 -74 33
3625C3Or6J93Ok75M0K08o1j93L25o4l50Q9K29qM3r0J80j10j92K39m6j65N6k25
$$ 33 39 -57 136 142 -133 -93 115 54 -139 186 122 -228 -139 90 82 125 35 215 105 -87 152 106 -59 -3 -228
3650b28J8J53Q9k03K54n7Q8j37N6Mj41K30j23l0J19j53N2M5j77K09k10J68l5L0
$$ -228 -210 -57 32 -171 83 26 114 -23 33 37 -104 126 3 -27 92 -61 -9 36 -141 68 -142 26 -9 21
3674B1n8N0j26J28j82Q7j32J66J61j36k4L2J79k27P9L4j81P9J10K32l50N2K07
$$ 21 -37 13 -113 15 -167 -80 -212 -46 115 -21 -45 -13 166 -61 18 52 -129 -50 60 292 -58 -6 201
3697B01k32j87M52k76J5L6J18m26K43J13j78J43o3L9k13J92J03j7o6N3P4r7O1
$$ 201 -31 -218 234 -42 -27 9 127 -299 -56 57 -121 22 -41 -2 -215 -23 80 63 -3 50 124 27 88
3720H8R6k84j3L43j28j54Q0j53K45m4j00k12J76K65n2k3r5P3j82N2K51j62j29
$$ 88 184 -100 -113 230 102 -52 28 -125 120 76 -24 -236 -60 205 153 130 35 108 -74 -22 229 67 -62
3743f2J59j75O3k30L03l25K86M7j18K7k0J01k5J0j36J1o1Q4R2l6OP9k62P2K01
$$ -62 97 -78 -15 -245 58 -267 19 66 -52 -25 -45 56 31 41 -95 -84 -145 -61 31 -5 1 80 -182 -110 91
3768I1j08q6J06J03k28J45J1l3jJ1K2n6O1K6q8l5J56k11L8J37j75O2RR2J56l33
$$ 91 -17 -103 3 106 -122 23 34 1 0 11 33 -23 38 64 -24 -59 97 -114 -76 61 -114 -52 -43 49 205 -128
3794a28J08J40j67J53R9j75p8J00o4j09l1O8J03r7L11j30r1rJ17k65R0K34k52
$$ -128 -20 120 -47 106 205 30 -48 52 -12 -121 -152 -84 19 -78 233 103 12 3 120 -145 -55 179 -73
3817g3r1J07l8M9J08R9q7j6J45p1m13L76J44j59r0K51j88j11L7M0j41K42J31l54
$$ -73 -164 -57 -95 -46 62 161 74 58 203 132 -281 95 239 80 -10 241 53 -58 -21 19 -122 120 251 -103
3841a03K4R2k3j79J99j09J95j23Q0m1m0J58l7r9J55l3j10q9J68K32o23L09J54
$$ -103 -79 13 -10 -189 10 -99 96 -27 53 12 -28 130 93 -6 149 116 6 -83 85 317 -306 3 157
3864A57k12n1Q5J49j62J66j54j90J70R3j33L2K51j93j97L07L3k28J32Q5r0j49
$$ 157 -55 -106 -21 128 -34 132 -22 -212 -42 51 -82 -50 201 8 -189 118 151 -77 55 140 50 -99
3886i9J30n4lJ00Q4k62RJ70j33j21K93N1m15L47j56j22m7K94j04j8J66j30l8K5
$$ -99 31 -23 -26 74 158 -104 -95 75 -58 -179 114 165 -250 97 -59 -181 -228 66 -38 -56 110 -20 -58 -33
3910c3m8J04j09J38Qj42K12k4k12m1J89k4oJ11M2k30q4L04j47r0P9j50M2N1J52
$$ -33 -81 23 -86 52 60 -82 130 106 -106 -147 42 18 12 123 165 -65 -149 155 8 -82 -3 -153 -111 -60 92
3935I2p0j65L69j16j12L9P6j85M3N2Qk31K33J54j08p9l1k9QJ43M3j73k0L7nJ34
$$ 92 22 -143 226 110 -2 37 113 -72 -29 23 31 -200 33 187 79 0 -31 -60 -52 91 134 -39 -59 -22 -27 107
3961A07J57l90M9J42K0j48L5P5r5J8M8J0n3J29p6k39L5K69j18o9M6M1j26J08J39
$$ 107 264 -126 -77 65 85 -63 -28 47 -48 -30 18 28 -25 104 28 -211 -176 93 -25 -94 -48 -7 -133 -25 114
3986A14n5j47K41j90K26j54L0k9o6J51j08j21K27j60j30J51k7l2l0N3J8j60K07
$$ 114 59 -88 153 -37 189 35 65 36 -30 121 13 -108 119 -41 -171 -20 -47 -79 -109 -56 -38 -198 9
4009In6p9J18J76k11K69p2j33j51K85M5k93K2J99J07l06K27O7k69QN6J00k43q0
$$ 9 -47 -126 -8 168 -43 226 154 21 -130 155 200 -93 -71 128 235 -71 156 223 -46 -38 18 118 -125 -205
4033b05K98l20J43J82j68j12K48K8l00J54L07k86R5L7j07j62K33K09n33K26J43
$$ -205 93 -227 -84 98 -70 -182 66 94 -206 -52 255 -31 64 101 -6 -168 65 274 -259 -33 110
4054A10j44l3L9J84m65J16K31l0j34L47k74r0J33K7r1J30J34j71j81J95P7j95
$$ 110 -34 -67 -28 156 -309 -193 38 8 -126 221 -53 -143 -10 17 -74 56 190 19 -162 33 110 -85
4076h5J70r6pk1K00k05l1N1P5q9j41K35r6j76L11M5m38L82J35k23K7J22r7k46
$$ -85 85 -11 -18 -39 161 -44 -75 -24 51 -38 -179 56 -40 -216 95 140 -298 84 219 -4 23 145 48 -198
4100a98K01K40l97J88O2j42j04K60K9j56J04%k04Q3Q3k0Jkj2l0o7J96r7P3J71
$$ -198 3 243 -154 34 96 -46 -150 110 139 -17 87 87 -117 -34 49 29 30 28 16 -14 -81 115 18 91 262
4125B62k85j29N7L71l54k6K41N1k68J53o4k9r3J66j4k24L93q7l30J97K37l05J10
$$ 262 -23 -152 -95 276 -78 -104 137 188 -80 73 9 -20 -113 53 39 -185 208 121 -209 -12 225 -80 30
4148C0oK2j36N8q1P8K30j59j20O8J39kr4L8p5n2J64l2p9j64J85m7r2Q2J33k02
$$ 30 24 46 -90 -32 -113 -35 195 36 -84 -16 123 121 27 65 -10 -62 102 70 -9 -173 12 -35 -127 -45 88 -114
4174a14O7J64p7j40J61J3k0k74M81j16j25J42K2k43j29K63P7j81O1j00j02J74
$$ -114 -47 117 40 -100 61 74 54 -220 261 145 20 162 184 -59 -188 75 152 -29 32 -68 -170 4
4196DK2j90R0J10p4j15K29J40l47K10J5M0m88M03jj85K15K02k86k01K73k6k34
$$ 4 26 -164 -74 36 -38 -153 76 216 -131 79 94 134 -354 49 48 -137 78 280 -6 -207 66 40 -194
4219a94K21P3j87M0J50k05o6K60J33j64m1J7j53K6j6Q8L3nM1j85J35J33k08j16
$$ -194 27 100 -87 -47 103 -102 -168 92 225 61 20 37 -116 -90 -106 -18 15 10 51 -134 1 134 -74 -190
4243a90J93j1l17L49N4j44m3K02j02N7p3K12l58O0R1J98l92K93j7j38R5K21m96
$$ -190 3 -8 -325 24 78 -66 -109 93 -9 48 -25 187 -171 -111 -20 178 -214 79 62 -76 19 240 -256
4266b56J76J54K5l19K47O5j15r4K27j12j62J65r0q0Q7L67j80k05J58j06J5O4J40
$$ -256 -80 74 99 -220 27 92 -23 -117 110 -2 -164 1 -89 -169 -82 285 105 -100 58 -48 -33 31 171
4289A71l10m1K01J06j05OJ53l29J06K04q9k69K96m1k11J64R0l65J37J14K4j27
$$ 171 -139 -180 21 127 22 28 181 -148 -42 162 73 -196 100 59 -152 12 102 -263 -126 -12 12 -115
4311a15p8K01j73J84K0k00K66l5m3k18J43K47k97Q1q6j5J77P9m5j54J33o7j56
$$ -115 -193 8 -165 19 39 -161 105 70 27 -191 -48 199 -98 -17 -103 -118 59 138 93 -61 72 5 -151
4334a51J97j99J78j60K00Lj76q8R3j31K72P7k5l5o2N2r5J05J84q9j77L6K00q5
$$ -151 46 -153 25 -135 65 68 -108 -196 -103 -234 38 115 90 55 -7 45 -50 55 239 150 -27 9 209 124
4358A24j57L59m31m4K53R7k48n6L24j75j64J34J33l25Q0Q4p9M8O0PQ9j02n1k6
$$ 124 -33 326 -105 -149 104 201 -47 -103 221 46 -118 16 149 -176 -96 -12 -91 -43 17 24 113 11 -40 -66
4382f6K3R1j64J13J33l8j33%nj21l5J05O4j20K50o1p6M7J49k75n5J78K00k96K29
$$ -66 -43 48 -116 -3 130 92 -41 -41 -46 -167 -202 -97 -33 -153 97 36 -40 7 156 -119 -174 4 204 -92 137
4407A37L1j35o2j9m2J13j7j22J01K5JQ3l46J61J55k48K53J9l02K96N5L2j96J86
$$ 137 168 33 -29 -48 -90 23 6 -116 -15 10 11 94 -252 -91 64 -184 69 88 -214 82 137 169 -27 159
4431A59K5k76K94l9j48j46J11m0k3N3J50j85r8J99Q1j96J58j16n6n5K61p9j44
$$ 159 184 -92 202 163 15 -131 -20 -60 -83 -30 120 -65 -163 36 117 -79 79 -37 -93 -148 113 34 -110
4454a10L6J07k10N2K82k03K4M1Lj23L4K25m31Q9L82k64n7L56j90Pj77J67k08J05
$$ -110 -74 33 -177 -125 157 -46 -22 19 22 -101 -67 158 -273 -184 198 -66 -123 233 43 50 -127 40 -168 -63
4478f3O5k2J89J38k45m7j49L02J3l34K16j27P5qqR2j79K43k06l50L75K46m07R0
$$ -63 2 -20 169 307 62 15 -134 168 181 -153 63 -64 11 3 -5 87 -92 151 -55 -405 -30 216 -191 -101
4502a01J31j2k57L18j30l1j11K23j29P2M2J37k59Q6j1k7J15J54l15J54K17k79
$$ -101 30 18 -239 79 -51 -82 -193 30 -99 -27 15 152 -107 -21 -32 -59 56 210 -105 49 266 -13
4524a3k04J29K05k24K8J21p4n9K30r5j68nK44k11J20J18j90l2n9K85k42J53J9
$$ -13 -217 -88 117 -107 -79 42 -32 -91 139 44 -124 -129 115 -96 24 142 -48 -80 -139 146 -96 57 76
4547G6j4q9l3J71j89n3J31j15p3J45J60l4j73J00Q1j95J40K03k99J09P1j11j5
$$ 76 62 -27 -60 111 -78 -131 0 -115 -188 -43 117 83 -90 10 91 -104 36 239 -60 49 120 9 -6
4570fL9Q9j60J43j22o3K01O3j74j91L39l83K26M9N3l12J50K29l02J03N4n8q7K18
$$ -6 33 122 -38 105 -17 -80 121 184 10 -181 158 -225 1 50 103 -209 -59 170 -132 -29 25 -33 -120 98
4594I8j7nj2%J11j85J22o6j10J3J21K8j71K65k65k8N9J11m6j63L17n3j82j11K74
$$ 98 81 76 64 64 175 -10 112 46 -64 -51 70 98 -73 192 -73 -101 -42 69 23 -140 177 124 -58 -169 105
4619A05j07m8Q2m5L6p4L55l50j64L60k35o9K17j38n8J18J90k82jJ07K1l2J53k8
$$ 105 -2 -50 32 -13 23 -51 304 -46 -210 150 -85 -154 63 -75 -133 -15 175 -107 -108 -1 20 -12 141 113
4643A13j28p3J78m9K3J77k71r2J62j92K10k5Po6j44K71k6j31o5O0q4J43J3ok71
$$ 113 -15 -88 90 41 64 241 -30 -122 40 -152 58 33 40 -26 -170 101 75 -56 -121 -61 -145 -2 11 5 -266
4668b66J09J75j51J8M30l86p5M4K29l77K66N7j45r3L95r0r8J13j67M7l54M27j63
$$ -266 -157 18 -133 -115 315 -71 -146 -102 127 -250 16 73 -72 -165 230 140 42 155 -12 35 -319 108 -55
4691e5j01J39J34j66Q2m5L6LJ9P6k56QK59r4r5J95j82n2J61L0k62j8K43Q9k96
$$ -55 -156 -17 117 -49 33 -12 24 27 46 122 -134 -126 133 39 -56 139 -43 -95 66 96 -166 -184 59 148 -148
4716a48J16l6r3K00Q7p9J7K7j6j36K13r7q2j43K40p8m5J35p1o4J18lo6j50Q4l3
$$ -148 -32 -68 -161 39 126 47 64 91 75 -61 152 55 -27 -170 70 -8 -53 82 11 -53 65 62 -4 -154 -70 -103
4742a03N0O8O9j34m3J19m7k25K72P2p8j59K37k52K15j35L4N8O9r6l3N4J09j78
$$ -103 -53 15 84 -50 -93 26 -21 -246 26 98 20 -139 98 -154 61 -74 -40 18 87 -9 -42 12 121 -57
4766e7n8K87j30n2j0J87qk18O7j63J00M0jk01K0K72j53R7P6l8n5O7J97k76o7J45
$$ -57 -115 172 42 -10 -20 167 159 -59 8 -155 -55 -15 -16 -217 -197 75 -78 19 95 57 2 69 266 -10 -77 68
4792F8O8m8J22j45j86J21l7K0k08J89j8j2K9j19R0M8Q8J20k95R7O5j29j21J05
$$ 68 136 88 210 65 -121 0 -37 -17 -225 -36 -54 -66 -37 -156 -66 -18 70 190 -105 -8 57 -72 -193 -88
4816h8l0p7J11J83j37O8N2q2q4L8J42j48K67j13j11J65j33J11l12J48J27k74K80
$$ -88 -118 -195 -84 99 -38 30 82 0 -84 -46 96 -52 215 102 -9 156 23 134 -178 -30 97 -177 103
4839A03o5l8L2K0P1j60R7N1J3m1P6p9k79J52P0k33J96N5l7j92J10J85l48K68Q
$$ 103 38 0 32 52 123 -37 60 111 124 83 159 80 -199 -47 23 -210 -14 41 4 -188 -78 107 -241 27 35
4864C5n5p4J9J07j38L6P0o6R2K33k56Nm0j4j0J65m4q2m8R9p0q6M7M3R3k66L37
$$ 35 -20 -94 -75 32 -106 -70 0 -66 26 259 3 8 -32 -46 -56 109 65 -17 -65 34 -36 -122 -75 -32 61 -205 132
4891A32l31J73O5Q2j40Q6k9J14k97J35J53j11r9J57qr9Q9r9r1N5J02k03J7J58
$$ 132 -199 -26 39 121 -19 67 38 152 -145 -10 143 32 -67 90 82 -17 72 -27 -118 -63 39 -164 -147 11
4915A1m9KJ4J05o9q4L64l33o8J23J11j86O7Q8o9r5J19p1j60M93m70j36M09j1K
$$ 11 -38 -36 -22 83 14 -70 294 -39 -107 16 127 -59 8 96 27 -68 51 -20 -180 313 -157 -293 116 105 107
4940A07p4Q7p4j69Q5K4j50K15K08k43NK33j66P1k39K15j10J2n0l3J38j47l4oK10
$$ 107 33 120 46 -123 -38 -14 -164 51 259 16 21 254 88 159 -80 135 25 37 -13 -46 92 -55 -89 -95 115
4965A15k01J27j10J82r2O0r2K4n4j0L7n9L8O1K3K32j62K2n1k65K80M0p6j59J42
$$ 115 -86 41 -69 113 21 81 -11 13 -41 -51 -14 -73 -35 26 49 281 119 141 90 -175 105 145 69 -90 52
4990E2k0p4J70j42p9J53j12Q0O2k02K70j64J75j20o0J2P1j97R5K20k44J8K75k39
$$ 52 32 -42 128 -14 -93 60 -52 28 90 -112 158 -6 169 49 -11 1 72 -125 -30 190 -54 -36 239 0
5014@r5J20J44j81j5l8M6o1j4J44j28o3J43jr1K20k89J66oJ22j45Q7M0j38K7j52
$$ 0 -95 25 169 -12 -27 -65 -19 -80 -94 50 -78 -141 2 1 -90 130 -159 7 1 123 -22 65 105 -33 -6 -158
5040a58K0P9j33K63k03K19j99K31j73PJ23n3l7K7N7r5n5P3q3O8J20k54Q0K7J9
$$ -158 -138 -59 -192 71 -132 87 -112 119 -54 -47 76 23 -14 13 70 -25 -80 -7 -90 -22 98 -156 -76 -49 -30
5065c0o9k0J65k05J06L2J9n2K69k46q7P4Q2L3j59P4N9mj11J30l1j00J73r1Q1R6
$$ -30 -99 -119 46 -159 -53 -21 -2 -54 215 -31 -118 -44 38 71 -88 -14 45 41 -70 60 29 -71 102 11 92 188
5091A88j89K8o1p0J31o3J0n1J35o8o7l1l8Q5k6R0l1Q1r5n4J55j38l0K03j12j3
$$ 188 -1 27 -34 -104 27 -36 -26 -77 58 -10 -77 -108 -146 -61 -87 3 -28 53 -42 -96 59 -79 -109 94 -18 -31
5117c1J29J9K2j58J53j23j23J55M3j75j13J95J7o1l9J20p0J00k10K06j12j06K02
$$ -31 98 117 139 -19 134 11 -112 43 86 -89 -202 -7 10 -51 -90 30 -40 60 -150 56 -56 -162 40
5140D0j80N3J70k9q1K09r8j15L8L5P1j80M9l3j3M3k04K83l14L04r2j98J21J21
$$ 40 -140 -87 83 54 -27 182 84 -31 7 42 113 -67 -18 -51 -64 -21 -225 58 -256 48 -44 -242 -121 0
5164@l3l0J22m8l4J43k35Q4K6J95j45P6K8k17K8K06J2j28m2m9j2o8j6J06q9P4
$$ 0 -33 -63 59 11 -23 120 -115 -31 -5 190 45 121 149 -68 -40 166 178 50 8 -41 -53 -121 -137 -31 -120 -46
5190d6K5L6n6L5J10k50N6p4J92J6J77l05k8P9m6L6K34j18j50K7J79k5k89K53M6
$$ -46 -21 15 -41 -6 104 -146 -90 -164 28 44 221 -84 -112 -33 -79 -43 191 73 -77 -50 129 104 -185 68 114
5215A14k67R8N1j62%NJ20M0l7n7P3k7L6J86l54K48q1p6NJ75j36j11J08J30n0M7
$$ 114 -153 -55 -4 -166 -166 -161 -41 -1 -38 -95 -22 -49 -13 173 -181 67 -14 -90 -85 90 -46 -157 -49 81 31 78
5241G8R5j62J7K9j99K27j41P9r8N6K11k24o7K36J2k08J41L1O2k68P6j63N0j3K67
$$ 78 173 11 28 57 -142 85 -56 23 -75 -19 192 -32 -99 137 149 -59 82 113 175 -93 -17 -180 -130 -143 124
5266A24k41K25j2j39M8q8P9L4rj06J63oL2j52k7M9O6p1J77j89L2jn6M3p4%J82
$$ 124 -117 108 96 -43 5 -83 -4 30 21 -85 78 72 104 -48 -75 -26 40 -31 146 -43 -11 -12 -68 -25 -99 -99 83
5293H3o3o7L2P9o0NJ1j55J22m7L1j80K71J33k38J0J63j55J58j05M7O5j63J28k58
$$ 83 20 -47 -15 64 4 9 20 -135 -13 -60 -29 -209 62 195 -43 -33 130 -25 133 28 75 140 -23 105 -153
5318a53K61o5k0j8l4M6j28j36L55k08J57J09Pj96j43L05j78m5J57q8j0r4J76j85
$$ -153 108 43 23 5 -29 17 -111 -247 108 -100 57 166 173 -23 -166 139 -39 -84 73 -15 -25 -119 57 -128
5342a28j16K25N7j21K13j16l2M5J62j52M3oJ3l1O7k10M8P8J6Mr0P2J07l96K47
$$ -128 -244 -19 38 -83 130 14 -18 27 189 37 80 74 87 56 123 -87 -39 39 55 59 -31 41 148 -248 -1
5367aJ74r3j10J80o7p2J89k95K64l05K19j1pm3o4lm5K05j37m2J51o3N1k83K38
$$ -1 173 80 -30 150 83 11 200 -95 169 -136 83 72 65 22 -42 -45 -90 115 -22 -64 87 24 75 -208 30
5392C0k3M8O6j16j51N2J20j70K32l6p8J31j82k6J43r5m3J75j80n2L11k38J47M
$$ 30 7 55 121 5 -146 -94 26 -144 88 52 -26 105 -77 -103 40 -55 -98 77 -103 -155 156 -82 65 69
5416F9j84K79j21r5j49J43J87j00j21J81j85K7Q1O2l4l6l4j68L09P4k89j5J29
$$ 69 -115 164 43 -52 -201 -58 129 29 -92 89 -96 -69 12 74 40 4 -30 -198 111 185 -104 -119 10
5439A0j32J04LM3K39k27n7L5O5J3j33J47Mj18k5J29q9Oo0J95j90j04L06j02j57
$$ 10 -122 -18 -15 28 267 40 -17 18 83 96 -37 110 114 -4 -29 100 11 17 -43 152 -38 -142 164 62 -95
5464i5J68K5j89R5r7K23j12j01O3o4J46%m7r2j89k2K16M4N9P3k53K4K96r5j14
$$ -95 73 98 -91 4 -93 130 18 -83 -20 -84 62 62 15 -77 -266 -288 -72 -28 31 104 -149 -125 171 76 -38
5489c8J17O0n1n7j43K10r9o8Q7j49Q7Q8n6M8o2P6j72M2M3j13J81j56N7j40J19
$$ -38 79 139 88 31 -112 98 -1 -69 18 -131 -44 44 -12 36 -26 50 -122 -80 -37 -150 31 -125 -68 -208 -89
5514h9J55Lk47K03j21k6J16p8R9q7J77j70O6K5J2j70nJ77R4l17l2J92k8J40j57
$$ -89 66 69 -178 25 -96 -122 -6 -84 15 -72 105 -65 1 26 38 -132 -137 40 134 -183 -215 -23 -51 89 -68
5539f8j50J53J13j52J06l1p7J4K34j85J70n3J6j54J28R3j63J04j63m7J00n9oO7
$$ -68 -218 -65 48 -104 2 -29 -106 -92 142 -43 127 74 90 -64 64 157 -6 98 -65 -112 -12 -71 -77 -10
5563a0J67j89j78L54k1P1l42J44j3P4j33J26LJ1p8J30j11M1j59K44r3k27J10L4
$$ -10 157 -32 -210 144 123 194 -148 -4 -17 57 -76 50 53 64 -14 116 5 46 -113 131 38 -189 -79 -45
5587d5O6q0J40j47L7O2j68J56M6q3Q1m4j9J19j95j8R3k8L4K59j87q5l1n7m1K68
$$ -45 21 -59 81 -66 -29 33 -135 21 67 -16 65 21 2 121 -74 -92 1 -27 7 266 79 -6 -37 -94 -135 133
5613A33l2n6j25J44n7l9J8N2p6jJ82k97O6J85k86K11L5q5J53j31p4j44K21P1j44
$$ 133 101 45 -80 64 7 -32 -14 38 -38 -39 143 -154 -88 97 -189 22 57 -28 125 -6 -80 -224 -3 68 -76
5638g6j9L5J76k52Q5J93j35j28J41qJ62k41J21P7k07J39J12k76J43M1j87j3N4
$$ -76 -95 -60 116 -136 -51 142 7 -121 20 12 174 -67 54 131 -76 63 175 -101 42 83 -104 -117 -63
5661f3J59k66K06j59K63j69nM0J21o5j26%OJ08m4J10n3q2o4J81p6p6J93j40n8
$$ -63 96 -170 36 -123 140 -29 -34 6 127 62 -64 -64 -58 50 6 116 63 -19 -83 98 22 -54 139 -1 -59
5686e9qJ49j52n7K59k16oj2Q2l0R8o8Q5O2n0k8L0j23l0K42p2jo9O4j83J92k5Q9
$$ -59 -67 82 -70 -127 132 -84 -90 -102 -20 -50 48 -20 65 127 77 49 79 -44 -74 168 96 95 26 90 -93 99 74 163
5714A63j00j08j21L0K25k55J30R5N0k12L4J83k11kO5K58l49K93k74N0l3J0N7Q7
$$ 163 63 -45 -166 -136 89 -166 -36 59 109 -103 -69 114 -97 -99 -34 224 -125 168 -106 -56 -89 -79 -22 65
5738F5J9n2j86J78j38K2K37k1j12j80P9J32oo7q1J0R3J21m9n9r6J83j21M3O4j32
$$ 65 84 32 -154 24 -114 -92 145 124 12 -168 -89 43 37 -30 -111 -101 -8 113 64 5 -91 92 -29 14 78 -54
5764e4J31mr8J32j50K14k91mK42j69p1R0J51j65q3K27k3j19M8k3j92K47R9k97
$$ -54 77 73 -25 107 -43 171 -120 -124 118 -51 -122 -32 119 -46 -129 98 75 -44 4 -19 -211 36 135 -162
5788a62J02m4J09m4q5K41j65J11m8pq4K22j67j30K71nl60K41l9j7k0J90j55l4
$$ -162 -60 -104 5 -39 -124 117 -48 63 15 8 -76 146 -21 -151 120 115 -245 -4 -43 -60 -80 110 -45 -79
5812g9o8K06j29j0K61j97k1J89j69J05j21J07J34k50q1L87j86o5o4k9j7J02Q9
$$ -79 -147 59 -70 -80 181 -16 -37 152 -17 88 -33 74 208 -42 -123 264 78 13 -51 -80 -97 5 94
5835I4j51k5M0o6J27J35j02P1k56K87k35P9M3J0l7M3n2J6M4K4l4k1k19J99j17
$$ 94 -57 -82 -42 -108 19 154 52 123 -133 154 -81 -2 41 51 14 57 5 21 65 89 55 34 -185 14 -103
5860a03J1L54j67j79K00j49P4j32J86j21k92M12M9l01J66L7k01J05J95k67n9L11
$$ -103 -92 262 95 -84 116 -33 41 -91 95 -26 -318 94 143 -158 8 45 -156 -51 144 -123 -182 129
5882A29j79k6Q4j02j53L07j1N8k08J6j4J43k32K23q7m9P5qJ13k27O8J05Q0J06
$$ 129 -50 -76 8 -94 -247 60 49 107 -101 -85 -99 44 -188 35 -52 -101 -26 -34 79 -148 -80 25 105 211
5906B11k24j05M0J00p9k9J15q8Pm1P6J92j02q1J1o7P6L1o7J21j83K34j52O6k06
$$ 211 -13 -118 -78 22 -57 -86 29 -59 -52 -93 -17 175 73 -8 3 -64 12 43 -24 97 -86 148 -4 62 -144
5931a44J79J0p%Qj36J55J9%j84n4O5J37j52J84K4n8o1j97K14O0M6k30K33k27K46
$$ -144 35 45 38 38 46 -90 65 84 84 -100 -154 -89 48 -104 80 104 46 -15 -212 2 62 108 -122 111 -116 130
5957A30ro3j17K17j02r7J80n3j51K30l60J97q5Q2J69j54q6o2J35p4o1M3Q5J35
$$ 130 121 58 -59 158 56 -41 139 86 -65 165 -195 2 -83 -1 168 14 -72 -134 1 -73 -134 -91 -6 129
5981A29q4j99L93j58O9k62j8J86n9J3qK6p5J10r9Q7l1K5j3O7Qr8k3O4m7n1L1K13
$$ 129 45 -154 239 81 150 -112 -130 56 -3 10 2 28 -47 63 -36 51 20 45 32 99 107 9 -14 50 3 -48 -17 196
6009A96k62J33k15J56j54k2P6J56J01k70K01j56J57j39Q1j69J95p0j9Jp7J9J00
$$ 196 -66 67 -148 8 -146 -168 -92 64 165 -105 96 -60 97 -42 39 -130 65 -5 -24 -23 -100 -81 19
6032A9p2m2P3o7J00m1j86K86j21l9O1m4K7pN5M8L2j4q9J76j29j33j1L33j86q4
$$ 19 -53 -95 -22 -89 11 -30 -216 70 -51 -90 -29 -73 -46 -53 2 50 82 68 -21 155 26 -107 -118 215 29 -55
6058e5K4PJ9M0N1j06j05J27P1j61K4p5J18j24K10M2M1k18Q6j12J28J6k61K37K43
$$ -55 -31 -24 -5 35 86 -20 -125 2 73 -88 -64 -139 -21 -145 65 107 148 -70 16 -96 32 48 -213 24 267
6083B67k90k1K22l4k58L5J30j34O4K18k96J88R9j40O3n6o6N6q7n1J33j20J05M9
$$ 267 -23 -44 178 144 -114 -79 51 -83 -19 199 -97 91 190 50 113 57 -9 47 -40 -91 42 -78 27 76
6107G6J5q4Q5k06J58k29J13j38J43J14L6j54J48L5r3q7K98l24k0K36j98J28q6
$$ 76 91 7 92 -114 44 -185 -72 -210 -67 47 83 -71 77 112 19 -68 230 -94 -114 122 -76 52 -34
6130c4r0K41k29N0p2J93n9j34J31M8P7q1j53K60m8K4j46J72j51k05K45k9j07l7
$$ -34 -124 117 -112 -62 -134 59 0 -134 -3 45 122 41 -112 148 100 124 -22 150 -1 -206 39 10 -97 -134
6154a34RJ40j16J37j33J03J55m6j41o9KK51k88O2L6j36J98N3k8n7R3j16N2N3o2
$$ -134 -125 15 -101 36 -97 6 161 115 -26 -95 -93 158 -130 -68 -32 -168 30 83 55 -2 91 -25 27 80 18
6179A8j9K9J01k35N4J00j10m7J81j6p8k01L22j92j47L11j66KJ10j60J48%l8j81
$$ 18 -1 28 129 -106 -52 48 -62 -109 72 56 -22 -223 99 -93 -240 71 -95 -93 17 -143 5 5 -33 -214
6203b14J81J15q9M5k05L06j50J4n5k3N2O6K6K3n6J4l4l2M4K8Q1n3P0j22m0m3J66
$$ -214 -33 82 -7 38 -167 139 -11 3 -52 -75 -23 43 69 92 36 50 16 -16 28 56 137 84 154 32 -8 -51 115
6230A15k05J24L4N6o8j19J08l8m0p2J87P1k85J51L3J17k50L6J04N3j04J7J83k31
$$ 115 -90 34 68 124 56 -63 45 7 -33 -105 82 153 -132 19 52 169 -81 -45 59 112 8 25 208 -23
6254b3Q3J99k71R6j87L8J49K1K8r1k5j65K35m1l11K28O6j84L12j30Lj81J81j92
$$ -23 60 259 -12 84 -103 -65 84 105 133 42 17 -148 87 46 -265 -37 29 -155 157 27 30 -151 30 -162
6278a62K23j4q8L9j29J40o6j8L04j67k60K77q6j34J95Q9j87J90j59M2m8J2L1k24
$$ -162 61 47 -41 -2 -131 9 -57 -75 229 62 -198 79 -7 -141 54 143 -44 146 -13 29 -19 -7 24 -200
6302b00R7K18j15j56O8K16L2j77J32p3q1O3L4k24L78l63J52k6K6oj7j3J44k01
$$ -200 -103 115 0 -156 -88 128 160 -17 115 42 -39 24 58 -166 212 -151 1 -25 1 -5 -22 -35 109 -92
6326i2J24k4J1J89l03K37j86m3Q4m4P6K10j10k03j72J44K17j72K43K1k15L4M9
$$ -92 32 8 19 208 -95 142 -44 -87 -3 -47 29 239 129 -74 -246 -102 115 -57 186 207 -8 26 75
6349G5j61K4J4R5Op7K0O1q6p7M9N8J2O5P4j83J01pm1N3p4n3J01j60K23p1kj38
$$ 75 -86 -62 -48 47 53 -24 -4 57 -29 -106 -57 1 13 78 152 -31 70 63 22 75 1 -52 49 -111 112 41 39 -99
6377i9J56p6n5q4L92r5k14J6K6N2j29P6r9QJ36N4j01J39O5j46LP9k6k87O8K98
$$ -99 57 -19 -74 -158 234 139 -75 -59 -33 19 -110 -34 -133 -125 11 65 -36 103 168 22 25 104 78 -209 -141 157
6403A57r8j80J41J69m46K72p1J28J9j95K37k00J43j21M3o7J22j71K32j32J04m1
$$ 157 59 -121 20 189 -257 15 -56 72 91 -104 133 -67 76 -45 -2 -69 53 -118 114 -18 86 45
6425D5K9n3j4o5jJ22j16J11l2k03K63p0r9P8L1J19k61J7K16j39o2Q9Q4o8Q1j48
$$ 45 74 21 7 -58 -59 63 -53 58 26 -177 86 16 -83 -5 26 145 -116 -99 117 -22 -84 5 89 21 102 -46
6451d6N7J16r1J6q6o1K05j71l0K00qj10l7J9m2R0L0j9r4J5N9J45L1q7k2L7k6p7
$$ -46 11 127 36 52 -34 -95 110 -61 -91 109 101 -9 -46 -27 -69 21 51 32 -62 -47 12 157 188 101 79 116 90 13
6479A3n2J65q8n8o2K54k39J9J29k44L20p0j24j11j6K94j20j16J04j28N3J12o3
$$ 13 -39 126 38 -20 -82 172 -67 -48 81 -163 157 87 -37 -148 -164 130 10 -106 -2 -130 -77 35 -28
6502b8J47j92J03j5J1j5M0r7l8L81k60j68J27q6O1j19R3P8j14J07r9J82k18J17
$$ -28 119 -73 30 15 26 11 51 -46 -84 297 37 -131 -4 -90 -29 -148 -55 23 -91 16 -83 99 -119 -2
6526bk22J22J62j36LJ67k30J36j59K20j41K1K11j04j68J17M4j42j4L6q9J38n0
$$ -2 -224 -102 60 -76 -73 94 -136 0 -159 61 -80 -59 152 48 -120 -3 41 -101 -115 -79 -168 -30 -80
6549h0j64J13J19j2j37J92p9K0j57K46M5p3j12K01n0j26j67N13k94r9L2J76j22
$$ -80 -244 -131 -12 -24 -161 31 -48 -28 -185 61 106 33 -79 122 72 -54 -221 292 -2 -101 -69 107 -15
6572a5j15L38l56J40Q4j16m6L03j09k48L9J37j03K2R8J21l40J62r5J19p2J42k37
$$ -15 -130 208 -148 -8 76 -40 -86 217 108 -140 -101 36 -67 -45 53 174 -166 -4 -99 20 -52 90 -147
6595a47lK47j41lN8JL4k6M9n2r1J01j40ln9J92l7N0J6r3J66j87o1J03k24K21M0
$$ -147 -150 97 -44 -47 11 12 46 20 69 17 -74 27 -113 -116 -175 17 -20 30 46 -47 119 -68 -129 -26 -250 -29 11
6622A1n4P0j24l9J97K7k31j13L45p0j23J62rj76R2J84K5j26J11j37L9M2j88Q1
$$ 11 -43 27 -97 -136 61 88 -143 -256 89 19 -104 58 49 -127 -35 149 174 48 159 22 61 103 -85 -4
6646doJ99l25P8p5K33j52NL2m2r2J63p1J31M2o7l8j02J87o8J89k32J30m35K79
$$ -4 -10 189 -136 -58 -133 100 -52 -47 -15 -57 -149 14 -57 74 116 49 11 -91 96 28 217 -15 115 -320 -41
6671d1pJ44j3j21J64r7k5J86k96J15O2j3K4j1l6k1j67L16j5k74K20k69J91J06
$$ -41 -48 96 83 -38 126 29 4 190 -106 9 71 58 82 71 35 14 -153 163 148 -126 94 -175 16 122
6695A22k02MJ02M7m1k04J18J23j96K0J88k34J67r6J12p1n5k9m4P0J75j18J52p7
$$ 122 -80 -76 26 73 32 -172 -54 69 -127 -107 81 -153 14 -82 30 -41 -96 -125 -169 -99 76 -42 110 33
6719C3J3L8j23j4n5P6J05J59k62Pl7J44k25K36p5j28J29J50k71J08mN8j24O7L4
$$ 33 46 84 -39 -53 -108 -32 73 232 -30 -23 -60 84 -141 95 20 -108 21 171 -100 8 4 62 -62 5 39
6744C9j09J87M8j45p4R7j72K04j27LK0k04J82p8Q2N1j38J21j9K7j35J16n7J16
$$ 39 -70 117 165 20 -54 43 -129 75 -52 -49 -29 -233 -51 -129 -47 4 -134 -13 -32 -5 -140 -24 -81 35
6768C5j38k2Q3M6q8n4M1J48K9j10j6N9J02j63PQ0k35J79J22k00mK16m6k38Q1K91
$$ 35 -103 -125 -42 4 -84 -138 -97 51 80 -30 -46 13 115 -48 -41 39 -196 -17 105 -95 -99 117 71 -167 -86 205
6794B05j77q1L7j19K37j32r1J08j13J39L1P7n2q6n5n3%M48m25J11j2k09Q9N2K06
$$ 205 28 -53 -16 -135 102 -30 -121 -13 -126 13 44 121 69 -17 -72 -125 -125 323 -102 9 -3 -212 -123 -71 135
6819A35k41Q2P8j27n8J50J18k78J88M0L9j40l0J04k2p2L1p1J47R1k82Q1K4K10
$$ 135 -106 -24 54 -73 -131 19 137 -141 47 87 126 -14 -44 60 38 -34 -3 -74 73 164 -118 -37 -13 197
6843A97k29P7kl7k07K71r2R8m0j50R8oK69k05k17J93l4j49L28n0k9m6q7O4N1k2
$$ 197 -32 45 43 6 -201 70 -22 76 36 -114 -16 -22 247 42 -175 18 -16 -165 163 113 84 38 -49 15 66 44
6869D4O7q6m9Lm1l9J86j91J12K0j31j4J94M4m9q0l5K3j26R6R6o9Q8k98K47l7m8
$$ 44 111 25 -24 -21 -62 -101 85 -106 6 26 -105 -119 75 119 70 -10 -45 -22 -148 -52 44 -25 63 -235 12 -25 -73
6896g3J36j20J6k0J8LK34k37j41L40j23j2J25k13J15k97J14Q7P5j42J52j56OJ33
$$ -73 63 -57 -41 -61 -43 -40 194 -43 -184 156 33 21 146 -67 48 -249 -135 -48 27 -115 37 -119 -113 20
6920B0j05J03j95L66m41K72o9P6j38J1P9l5p1R7j3r6R7k8J08j42K74p0r8j4lL6
$$ 20 -85 18 -177 189 -252 20 -49 27 -111 -100 -21 -56 -127 -30 -43 -139 -42 -70 38 -104 170 100 2 -12 -15 21
6946B1R4j36K5j63P8J43j48N1J7o6J47j36J34k1Q5l8k00J64J12k00J24j06n9P6
$$ 21 115 -21 4 -159 -81 62 -86 -35 -18 -84 63 -73 61 40 125 87 -113 51 163 -37 87 -19 -78 -2
6970bJ31j72J54Q7l43o2J52lJ32r9J51m9r1J31j23m7j18L19j85m9J59m5j23J55
$$ -2 129 -43 111 198 -145 -207 -55 -58 74 -25 126 77 -14 117 -6 -53 -171 148 -37 -86 73 28 -95 60
6994F0p3K01k62O9l3J19j23QL2L5k68J70Jl2J40Q7j82J28N6k22P0P3j0k3L0n1
$$ 60 -13 188 -74 -5 -38 81 -42 -34 -2 33 -235 -65 -64 -96 44 131 -51 77 133 -89 -19 54 44 21 51 0
7020@K16l17J00j65K04k78K21j00K17n6n0J18n7n0j23Q1J16o7R2k79K0L14j99
$$ 0 216 -101 -1 -166 38 -240 -19 -119 98 42 -8 110 53 3 -120 -39 77 10 102 -177 -157 157 -42
7043d2L4J6J30j1k49q6J97j8k5L8J9j9L0k2Q1p9j47J49j02J11k1r7l0K27p8o7
$$ -42 -8 8 138 127 -122 -208 -11 -29 -54 -16 3 -16 14 -8 73 -6 -153 -4 -106 5 -16 -113 -143 84 6 -61
7069f1J14oj63QK11q5J13j64K26k52J62j98M7K22k34J10l9N1k6m3J16J9l7q3L8
$$ -61 53 47 -116 -108 103 18 131 -33 193 -59 103 -95 -48 174 -60 50 11 62 36 -7 109 128 91 8 46
7094D6J24k67J16j25J65k1n5J01k51K03j74J03Q3J5j24O6j5o4n0J95p7J7n3J49
$$ 46 170 -97 19 -106 59 38 -17 84 -167 36 -138 -35 48 63 -61 5 -10 -74 -124 71 -6 11 -42 107
7118A07l08J90p3m5J52R1q6k76M90m15P0J92k29J23P6P2j28k7n4P5N5j80J60J12
$$ 107 -201 -11 -84 -129 23 114 28 -248 242 -173 -103 89 -140 -17 59 131 3 -24 -78 -3 52 -128 32 144
7142A44l11J94Q3m7j59K50l5k09L3J46j6j33Q0k8j35J92r7n7j2J38O0j29J59k18
$$ 144 -167 27 110 63 -96 154 119 -90 -57 89 73 -60 20 -8 -143 49 -48 -105 -117 21 81 -48 111 -107
7166a07J72o7L8j21J14j57J25q8J59n3m1j14K70L6l02K85j69K2J48j10r8J42J04
$$ -107 65 -2 36 -85 29 -128 -3 -91 68 15 -26 -140 130 166 -136 149 -20 2 150 40 -58 84 188
7189A88k92K9J61p7MR5j06J0N4L5l5k58J51J89k90J22O9n8rJ43j27n5j2J31n0
$$ 188 -104 -75 86 9 13 108 2 12 66 101 66 -192 -41 148 -142 -20 49 -9 -18 125 -2 -57 -69 62 12
7214A2k24N0J35J9j71L97n6J7k07R0Q4j37n2P8k2l5j30R1j14K27K4m8J22j88k5
$$ 12 -212 -162 -27 -8 -179 218 162 179 -28 62 146 9 -43 35 13 -22 -152 -61 -175 52 76 28 150 -38 -63
7239f3J6J12m3K21l08O6Pm8J06k24J8L30k44J84P7l38M5L0j57J10nJ44J2q9j0
$$ -63 -47 65 22 243 -65 1 8 -40 66 -158 -140 190 -54 130 207 -131 -86 -56 -213 -103 -108 36 48 -41 -51
7264e1p0K32k34J12k5P5jr6j17J85NQN2l5j12K9%k0Q4k06L31q1j04jRp8J97P1
$$ -51 -121 111 -123 -11 -36 39 38 -58 -175 10 15 23 75 40 -72 -43 -43 -63 21 -185 146 65 -39 -40 -31 -109 88 159
7292A59j93J37M6j17j31J71Qj34Q1o3O9k28N6J55n2J49j53pO5M8N3j92K19k55
$$ 159 -34 103 149 32 -99 72 80 -54 27 -36 33 -195 -139 16 -36 113 -40 -47 18 66 119 -73 146 -109
7316a09J3J97j23m0L9j12J07O0J46j82qq3J68l9%J6j13r9L65k49p3J49q6M1J0
$$ -109 -96 101 -22 -62 -23 -135 -28 32 178 -4 -12 -95 73 34 34 50 -63 -162 203 -46 -119 30 -56 -15 -5
7341eO3j42p0J16N6K1q6P1j2K8J19j47m5J27P3P3k09j06J57jJ39k23K1o2m2J97
$$ -5 58 -84 -154 -38 18 39 -47 24 12 40 159 12 -33 94 167 240 31 -75 82 81 220 -3 18 -44 -86 111
7367A11p4J31l5k40J99j77j0O4L7Lq7J06k25J69j8q3P1k2M8k5J77j19K3O3j10
$$ 111 37 168 133 -107 92 -85 -95 -31 6 9 -78 28 -197 -28 -46 -129 -58 -80 -32 -57 120 1 24 87 -23
7392b3M5j8P8m0P4j70K5M1QL2j04R0j30J62m6p9M3O9m3J86m36J92J47nj9j91p1
$$ -23 22 4 82 42 116 -54 -29 12 20 52 -52 38 -92 70 24 -55 -12 57 14 200 -236 -44 103 98 79 -112 -183
7419a83J48j58K34j36L4q2J70j6q0N4m5J90q7L2p2K5r7J65l5r7l3J12K1K0R7k05
$$ -183 -35 -193 41 -95 -61 -143 27 11 -69 -15 -60 130 43 75 3 28 -69 96 61 -36 -69 43 64 84 181 -24
7445b4P5j34J8J03k2O3J47l5k72K12k01K3j0j62J96q6J84p9k0R0l50L38j49p8
$$ -24 51 -83 -65 38 16 79 226 191 -81 131 -70 -47 -57 -219 -23 -109 75 -4 -24 66 -284 54 -95 -173
7469a73J74P6n3j87K27q3rO7J35k22j34K03J40k95J16N2J6p6o9J98O3k2k12kM7
$$ -173 1 77 24 -163 64 -19 -28 39 174 -48 -182 21 161 -134 -18 34 50 -26 -95 103 166 144 -68 -70 -23
7494b3J27n2k85J02P3K9j43K12j2o3p2j9p3o1K87P1j01J4MJ0q8l2L1l4L7K0J05
$$ -23 104 52 -233 -131 -58 -29 -172 40 28 -35 -107 -126 -199 -260 27 98 -3 11 15 25 -63 -95 -64 -98 -61 -41 64
7521F4j00J80q9o8Q3O1k47O9QO0J96l27K1O2l7mK02l4q9n0K4J23j82R5r9j1J44
$$ 64 -36 144 55 -13 70 131 -116 -47 -39 21 217 -110 -89 -27 -64 -68 134 100 11 -39 -15 108 -74 21 -78 -89 55
7548E5n9m9R6L8q2RR1j05rj0MJ28j77Q5O8j46J00j45oK48j33k60L71k02Q8q1K8
$$ 55 -4 -53 43 81 -1 8 99 -6 -15 -25 -21 107 -70 15 83 -63 37 -108 -114 134 1 -259 112 -90 -2 -83 -55
7575e5J56r1q6L2M4m6o7P4m0L2J29p8P9j18N6o8O5q0P1Lj4o5N9Q2m2j08j03R4
$$ -55 101 10 -76 -44 0 -46 -113 -39 -79 -47 82 4 83 -35 21 -47 18 -62 9 12 -2 -67 -8 74 32 -76 -179 -85
7603h5K67k66O2N5J9j55J18k04K29l1J24k86R2J00j40R4k62L00q6J72q6O2k4n3
$$ -85 182 -84 -22 33 52 -103 15 -189 40 9 133 -153 -61 39 -101 -7 -269 31 -55 117 31 93 69 16
7627A6r7R9j12M5O8j34L21j9k63R6N3p6j07J62n1j53K59J1k16J50j34j0J37q9
$$ 16 -81 18 -94 -49 19 -115 206 187 -76 20 73 -3 -110 52 1 -152 107 118 -98 52 -82 -92 45 -44
7651d4j01J03M7Q6j20R9N3j32M9j16m0O9J55P5j79n8j04J38K09j61j37R0j20L9
$$ -44 -145 -42 5 91 -29 70 123 -9 40 -76 -116 -47 108 183 4 -54 -158 -20 189 28 -109 -19 -139 -100
7675a00o8N1J17j1m4k56K92J46l18J39P7p1N0j3J32J24l22J61n3r0N4OJ13k8r0
$$ -100 -168 -117 0 -11 -55 -311 -19 127 -191 -52 25 -46 4 -9 123 247 -75 86 33 -57 -3 3 116 88 -2
7700bP8l0M7k47K56j87p9N8J14M1p6N4O9jj24j48K05p4P7l6L4or5qp1K05J1Lj53
$$ -2 76 46 93 -154 102 -85 -164 -106 8 49 -27 27 96 95 -29 -177 28 -46 31 -5 29 23 -72 -80 -151 54 65 68 -85
7729h5n9K02k21K90j16o7K05j33J02j87J0O0J0l2o8J59j86M7J60j84J17J1k04
$$ -85 -144 58 -163 127 11 -56 149 16 118 -69 -59 1 11 -21 -89 70 -116 -69 91 -93 24 35 -169
7752a69K01p1J20J31j91j98J92k8m4j26J13j34K12k19K03n2Q0r0QJ16p6nJ21p5
$$ -169 32 -39 81 212 21 -177 15 -13 -57 -183 -70 -204 8 -211 -8 -60 20 -70 -62 54 -22 -27 94 19
7776A9l2J54L7p4p1J42k08o9J68M5j32j7o0J94j10o1J43j23m0o9M44k08k78J29
$$ 19 -13 141 178 104 33 175 -33 -102 66 111 -21 -38 -98 96 -14 -75 68 -55 -95 -164 280 72 -206 -77
7800g7J07m7J25N2j96q6J18N2N6j15qmj2j21J14jj2J37k58K75j42P1J2L6k3j4
$$ -77 30 -17 108 160 -36 -122 -4 48 104 -11 -19 -23 -35 -156 -42 -43 -55 82 -176 99 -43 28 40 76 53 39
7826C9Q2k53K14j0o1l3Rj16M3L1l17N11j15l4L4nj53K65j8k6J6j39L6k18Q2K35
$$ 39 121 -132 82 72 11 -22 -13 -129 -86 -55 -372 139 24 -10 24 19 -134 131 113 87 103 -36 0 -218 -136 99
7852I9j51J68k74J57QM6j44Q8L6k10K02l7k6j11J71O7j04qK00l65K76j44j24M
$$ 99 -52 116 -158 -1 7 53 -91 -3 33 -177 25 -12 -38 -149 22 89 -15 -23 177 -188 88 -56 -180 -176
7876a76R2n2P7k7R7j03J66o7J26jp2k07L44l12j9K92j75Qj4O7R8j9p3m0j2J04
$$ -176 -84 -136 -59 -86 11 -92 74 7 133 132 60 -147 197 -115 -134 158 -17 -9 -23 44 142 123 50 10 -2 102
7902A02K36k82j24j8J0P7n1p3n4O1K00o0m3M4r3J14j22r6J21L3N7l89J54K55Q2
$$ 102 338 56 -68 -86 -76 1 -50 -123 -177 -116 84 24 -19 25 -68 46 -76 -172 -51 -18 39 -350 -196 59 141
7927A41j04l7K03k70J18p0Q9j38J44q1J27k37J41j39J27k2p5K6J0J87k24J38r
$$ 141 37 0 203 -67 51 -19 70 -68 76 -5 122 -115 26 -113 14 -8 -83 -57 -47 140 -84 54 45
7950D5m7K2L5m9o3N7M5J4k9J64n3O7j06o7L9j35j31JK72j48r3L70k71K9J09r0
$$ 45 -2 20 55 6 -57 0 45 59 30 194 141 208 102 35 74 -61 -192 -191 81 -67 -160 210 -61 -32 77 -13
7976a3o8k2J41K7J44j83L7j63N9j43K65Kj8m9J60k42J05l2O9r8K18j45m3m0qm
$$ -13 -81 -103 38 65 209 26 63 -100 -41 -184 81 83 65 16 176 -66 39 7 76 -22 196 51 8 -32 -40 -44
8002d4J49j33K2j2j2J8q4J61j3q2j96J84R1kJ89j37K3j66K2nJ13kj41k0P1j46
$$ -44 105 -28 -6 -18 -30 -12 -96 65 52 -30 -226 -42 49 47 236 99 122 -44 -22 -27 86 84 -57 -77 -6 -152
8028a52J90J0Q1r4j22P2P7j26L2J85j4j84j6K3M8j21j9K17j39KQ1q9k4P9L3J7
$$ -152 38 48 129 35 -87 -15 62 -64 -32 153 139 -45 -61 -38 10 -111 -130 87 -52 -50 31 -58 -82 -3 30 47
8054D7m0j3k02J80p0J46l1Nj23K5N9J73r4R3k54K1L9j27N6n1K31j66J72j02L7
$$ 47 7 -6 -208 -28 -98 48 17 22 -101 -76 -17 156 62 155 -99 -78 -39 -166 -110 -161 70 -96 76 -26 11
8079A1j04J77r5pJ11k16Q7n6N1m3J62r5j23R4J32k22J71L7r3m9j19J61O5J02k4
$$ 11 -93 84 -11 -18 93 -123 -36 -92 -41 -84 78 -17 -140 -46 86 -136 35 72 -21 -70 -189 -28 37 139 115
8104A15l14K69P2k22J48OJ06k29j4p7J76k8N2j47J92j85M7m4R7J88k68jL3j4J07
$$ 115 -199 70 142 -80 68 74 180 -49 -63 -140 36 8 60 -87 105 -80 -33 -77 20 208 -60 -61 -28 -42 65
8129F5O4j45p9r5L40j87k0J1P7j21K18j93J86r1K4P3N5k59n6N8J22q1K0o0L01
$$ 65 129 -16 -95 -190 150 -37 -57 -46 31 -90 128 -65 121 30 54 127 182 -77 -133 -75 47 -34 -14 -74 227
8154B27l69K34j31J46k66P6P4jm3p9J86j07P0o9%Q1j17r9J97N7j40N5J22j07j9
$$ 227 -142 92 -39 107 -159 -83 -9 -10 -53 -132 54 -53 17 -52 -52 29 -88 -187 10 67 -73 -18 104 -3 -22
8179b2O2R6j44K38j22P3j03l26L46j42L0K28
$$ -22 40 136 -8 230 108 181 78 -248 98 -44 -14 214
8191B14
$$ Imaginary data points
##PAGE= N=2
##DATA TABLE= (X++(I..I)), XYDATA
0@%%%%%%%%%%%%%%%%%jJ7l2L2l2L2l2M5o1O4o5Q1r7J10j26J44j61J79k08K34k57
$$ 0 0 0 0 0 0 0 0 0 0 0 0 0 0 0 0 0 0 -1 16 -16 16 -16 16 -16 29 -32 32 -33 48 -49 61 -65 79 -82 97 -111 123 -134
38a34K84l19L58l99M42m88N41n98O60p29Q02q84R75j075J183j303J441j594J768
$$ -134 150 -169 189 -210 232 -256 285 -313 347 -382 420 -464 511 -564 619 -684 757 -837 931
57I31j968K198k470K792l183L676m312N168o391Q283j1662J9510o7529l3919J38187
$$ 931 -1037 1161 -1309 1483 -1700 1976 -2336 2832 -3559 4724 -6938 12572 -54957 -88876 49311
72D9311L3060J2009N3425L9882m2339j0196n896o3592n4091R513l8604o4033R103
$$ 49311 82371 94380 147805 187687 145348 135152 129256 65664 11573 21086 -17518 -81551 -72448
85g2448K4592l8838q80N1494J216j6081N0684L0756k5827J3357M2621j9691k5075
$$ -72448 -47856 -86694 -87574 -36080 -34864 -50945 -261 30495 4668 18025 60646 40955 15880
98A5880J6421j5697m2025P171P35m5872k47M6627q278k0131M5833L5872j6457
$$ 15880 32301 16604 -25421 -18250 -17515 -63387 -63634 -17007 -25285 -45416 417 36289 19832
111A9832J1319K7874j9257r561K4220k2976m3400K1889J7268n0934j9362L5519
$$ 19832 31151 59025 39768 30207 54427 31451 -11949 9940 27208 -23726 -43088 -7569
123g569r573l5333J5551J2331k3030J2487K9371j7659l816M5674Q114k7793K0425
$$ -7569 -17142 -52475 -36924 -24593 -47623 -35136 -5765 -23424 -27240 18434 26548 -1245 19180
136A9180K8662k1821p394K3903j3696k2310K1434J50m0576R93K2995k8750k5707
$$ 19180 47842 26021 18627 42530 28834 6524 27958 28108 -12468 -11475 11520 -17230 -42937
149d2937K4100K592k2481K0654K4712j5650R395M0657p094k3386K4876J0351l7443
$$ -42937 -18837 -16245 -38726 -18072 6640 -9010 385 41042 33948 10562 35438 45789 8346
162H346r114J6062k3189k1256K0265p76k3820J8687K4142j8993j665L2477k777
$$ 8346 -768 15294 -7895 -29151 -8886 -9662 -33482 -14795 9347 -9646 -11311 21166 18389
175A8389j9372K0118J1196k6644Q69K0141k0727k0528J8956j028k6837Q209J5479
$$ 18389 -983 19135 30331 3687 4556 24697 3970 -16558 2398 1370 -25467 -17258 -1779
188a779j8935p73K7821q493j9011K5325J4144k9290k008K5576j1163j7369J8318
$$ -1779 -20714 -21487 6334 -2159 -21170 4155 18299 -10991 -12999 12577 1414 -15955 2363
201B363M050j8213J3324J5890k2283m700K7829p534k6358J5789J5418k1493k005
$$ 2363 6413 -11800 1524 17414 -4869 -9569 18260 10726 -15632 157 15575 -5918 -7923
214g923J9858j0576j1691J9854j692k5643R545J7202k2089r701K4282j615j7539
$$ -7923 11935 1359 -10332 9522 7830 -17813 -8268 8934 -13155 -22856 1426 -189 -17728
227a7728J7074J2667k0162K688K1738j4326j6892K0008N117k1933P596J8949j4567
$$ -17728 -654 12013 -8149 -5461 16277 1951 -14941 5067 10184 -11749 -4153 14796 229
240B29m888K2110n325k0271J4744J0328k4396m102J9901r835j5363J6554M871
$$ 229 -4659 17451 12126 -8145 6599 16927 -7469 -11571 8330 -1505 -16868 -314 4557
253D557j8290P456J5742j6584o921K1139k990j8325J4421J3540j6694Q19K0838
$$ 4557 -13733 -6277 9465 -7119 -14040 7099 4109 -14216 205 13745 -2949 -2130 18708
266A8708r130j3244J7985L726k1972L956J5420j5930j0049J6753l761j7476J3025
$$ 18708 9578 -3666 14319 18045 -3927 29 15449 -481 -10530 6223 2462 -15014 -1989
279a989R850k0220l51K1883q179j5762J6290Q110j7291L684J3812j2930o122J7902
$$ -1989 7861 -12359 -12710 9173 994 -14768 1522 9632 -7659 -3975 9837 -3093 -9215 8687
293H687l808j7120J3836J3319j7796k444J9482o289j4544J2205L272j8562L460
$$ 8687 4879 -12241 1595 14914 -2882 -5326 14156 7867 -6677 5528 8800 -9762 -6302
306f302J2824j5086q357J8643o31j6256J1352J2804j4581j610J7733o508j3070
$$ -6302 6522 -8564 -16921 1722 1091 -15165 -3813 8991 -5590 -7200 10533 4025 -9045
319i045J4449N597j7144K855J5232j0728q181J4979q59j5002R443R861j6268k799
$$ -9045 5404 11001 -6143 -3288 11944 1216 -6965 8014 7155 -7847 1596 11457 -4811 -7610
333g610J7067o676j4475J2165O058j5421K013J2973j0504o771J5656k95j4961
$$ -7610 9457 2781 -11694 471 6529 -8892 -6879 6094 -4410 -11181 4475 4180 -10781
346a0781R593J2510j3705k705J6441l978j2126J1904N541j6013J675J3199j1294
$$ -10781 -1188 11322 -2383 -5088 11353 7375 -4751 7153 12694 -3319 -1644 11555 261
359B61j0395J3079M0j5330P023J0214j2788j711J6262m514j2110J2790P487j4980
$$ 261 -10134 2945 2985 -12345 -5322 4892 -7896 -9607 6655 2141 -9969 2821 10308 -4672
373d672L65J3696q053q443J2402L61j3176P676R941j3720l326J5404l945j3285
$$ -4672 -4307 9389 1336 -7107 5295 5656 -7520 156 10097 -3623 -6949 8455 4510 -8775
387h775R909O977j3004L06J1940q719q286J1920K29j4324O214J0621j0797l220
$$ -8775 1134 8111 -4893 -4587 7353 -1366 -9652 2268 2497 -11827 -5613 5008 -5789 -9009
401i009J5280j741r942J1030P368j3065N07J2107q557j0080J0451O20j3599M306
$$ -9009 6271 4530 -5412 5618 12986 -79 428 12535 3978 -6102 4349 4969 -8630 -4324
415d324Q314j1257l574J3369l378j1806J0661Q073j1783J013J3319n418p194J1257
$$ -4324 3990 -7267 -10841 2528 -850 -12656 -1995 6078 -5705 -4692 8627 3209 -3985 7272
429G272R33j2977M886Q773j2157m898J2882k337j0868R347P459j0976Q82J1913
$$ 7272 8205 -4772 114 8887 -3270 -8168 4714 2377 -8491 856 8315 -2661 -1779 10134
443A0134p255q569J0341R42j3799L508Q267j0096m045J1648k660r556J0158P475
$$ 10134 2879 -5690 4651 5593 -8206 -4698 3569 -6527 -10572 1076 -1584 -11140 -982 6493
457F493j0640J888J3636m561p409J0303J475j1722K478O178j1483n053J0415l202
$$ 6493 -4147 -2259 11377 6816 -593 9710 11185 -537 1941 8119 -3364 -8417 1998 -1204
471a204j0716Q638P663j0092M8J1336n361p832Q908Q49j0913M019R529p427k294
$$ -1204 -11920 -3282 4381 -5711 -5663 5673 312 -7520 1388 2237 -8676 -4657 4872 -2555 -4849
486d849J2803k1q526P780N247j1548j684Q936p346r296Q515K311j0203L492R229
$$ -4849 7954 7933 -593 7187 12434 886 -798 8138 792 -8504 11 2322 -7881 -4389 4840
501D840p684l123J0657k404r681P554O102j0344l88J1051m006p389Q209K224j0436
$$ 4840 -2844 -5967 4690 2286 -7395 159 6261 -4083 -4471 6580 2574 -4815 3394 5618 -4818
516d818K702P310q364l883J1058p29q386P781O890r042q51Q899o112q543O547
$$ -4818 -2116 5194 -3170 -7053 4005 3276 -5110 2671 9561 519 -332 8567 2455 -6088 459
531D59Q48j1016K234P987o863k993J0297J62p109P643O153q144J47J0322m255
$$ 459 1307 -9709 -7475 512 -6351 -9344 953 1115 -5994 1649 7802 -342 -195 10127 5872
546E872p390P233J990j0093O54N804p901m673Q135j480p686O805O890p564j79
$$ 5872 -1518 5715 7705 -2388 -1734 4070 -3831 -8504 -369 -1849 -9535 -2730 4160 -3404 -3583
561c583R975l442o890P116J848r127K148P248o303l449R170l49q122N119M619
$$ -3583 6392 2950 -3940 3176 5024 -4103 -1955 5293 -1010 -4459 4711 4362 -3760 1359 5978
576E978q853j820Q004m465p100P335L115p720K211Q049n311l793P664o51q013
$$ 5978 -2875 -4695 3309 -1156 -8256 -921 2194 -5526 -3315 4734 -577 -4370 3294 2643 -5370
591e370N052M942p570n19R283k537o770O920L245q302Q42O198o110m266P293n95
$$ -5370 -318 4624 -2946 -3465 5818 3281 -3489 3431 6676 -1626 -784 5414 -696 -4962 2331 1736
607A736p834M835N440p114j310Q035k627o216O700L179p510J996P353m842m460
$$ 1736 -6098 -1263 4177 -2937 -4247 3788 1161 -5055 1645 4824 -2686 -690 6663 1821 -2639
622b639O971k10p717L570M565o942j118Q082k274n866O965L409p721P06O004n473
$$ -2639 4332 4122 -3595 -25 4540 -2402 -3520 4562 2288 -3578 3387 6796 -925 -219 5785 312
638C12m972N656j254p671L562M793o728j126Q328j561n224O870M204o057J634
$$ 312 -4660 996 -258 -7929 -4367 426 -6302 -7428 900 -661 -5885 985 5189 -868 766
653G66P330l936l934O216m72q458K103L615q250k778O314k831n627O488M163n824
$$ 766 8096 4160 226 6442 5970 -2488 -385 3230 -5020 -7798 -1484 -4315 -9942 -3454 709 -5115
669e115K202Q367l263l695O749O17o802K726M101o533k047O486k557o268N435
$$ -5115 -2913 5454 2191 -1504 5245 5862 -940 1786 5887 -646 -2693 3793 1236 -5032 403
684D03L437o744O08O549l323l760O335L61o749K999M434o124k325O408k052n405
$$ 403 3840 -2904 -2296 4253 930 -2830 3505 3866 -2883 116 4550 -1574 -3899 2509 457 -4948
700d948M707K989o292M51O286l715m358O050J013n666L191N297m624j163O809
$$ -4948 -241 2748 -3544 -3093 3193 -522 -4880 1170 2183 -3483 -292 5005 381 -782 6027
715F027j864n810M103J962p679j027N242m233m420N729J496n116L378N506l966
$$ 6027 4163 -1647 2456 4418 -3261 -4288 954 -3279 -7699 -1970 -474 -5590 -2212 3294 -672
730f72j179O966j238n540M394L013o465m25N492l744m532M702M23o582K057M491
$$ -672 -1851 5115 3877 -1663 2731 5744 -721 -1146 4346 602 -3930 772 1195 -5387 -3330 1161
746A161m538j479O698l73l973M904L464n481K4M923l962n201M104N69o241K093
$$ 1161 -3377 -4856 1842 1469 -2504 2400 5864 383 407 5330 1368 -3833 271 840 -5401 -3308
762c308M503l418j021O735l64m263M256L203n989q42M979l571m823M059M12n629
$$ -3308 1195 -2223 -3244 3491 3127 -1136 3120 6323 334 -508 4471 900 -3923 136 548 -5081
778e081J537M309l888j901O038k45m167M217L801m697J40N593k804m357M541O82
$$ -5081 -3544 765 -3123 -5024 1014 769 -3398 819 4620 -77 63 5656 2852 -1505 3036 3718
794C718o134J077L894m211k447N424q98m518L941L031n303l20N482k284m352M767
$$ 3718 -2416 -1339 2555 -1656 -4103 1321 423 -4095 -154 2877 -2426 -2746 2736 452 -3900 867
810H67J681n205J765M257l557j908N458o51m841L110K807n287o12M901k575m210
$$ 867 2548 -2657 -892 3365 -192 -2100 3358 2707 -2134 976 3783 -1504 -2116 2785 210 -4000
826d000M583J141m878J378M575l828k245N172m33m474K847K761m632l50M879k269
$$ -4000 583 1724 -3154 -1776 2799 -1029 -3274 1898 1465 -3009 -162 2599 -2033 -2383 2496 227
842B27l671M409J844m931J275M534l047j939M577m58m577K691K717n253p65M422
$$ 227 -3444 965 2809 -2122 -847 3687 640 -1299 3278 2820 -1757 934 3651 -1602 -2367 2055
858B055k484m155L879J492m840J482M283k765j580N144P7m140K982L284m443p95
$$ 2055 -429 -4584 -705 787 -4053 -2571 1712 -1053 -2633 2511 2588 -1552 1430 4714 271 -524
874e24M345k170m159L664J346n184P59M381l528k462M347r1m324K850L015m325
$$ -524 3821 1651 -2508 1156 2502 -2682 -1923 2458 -1070 -3532 815 724 -3600 -750 2265 -2060
890b060l70M759j674l741L926J681m594Q73M058k679k272M237M2m129K472K762
$$ -2060 -2430 2329 655 -3086 840 2521 -2073 -1200 2858 179 -2093 2144 2186 -1943 529 3291
906C291m088j045M434j851l846L461J586m546O57L955k996k103M012K85m109K170
$$ 3291 -797 -1842 2592 741 -3105 356 1942 -2604 -1947 2008 -988 -3091 921 1206 -2903 -733
922g33L072l648m53M368j320l293L507J803m226M16L630k785k610L761Q5m169
$$ -733 2339 -1309 -1762 2606 1286 -2007 1500 3303 -923 -507 3123 338 -2272 1489 1574 -2595
938b595J931K670l806q34M371j685l334L506J642l572N08L978k348k159L734O15
$$ -2595 -664 2006 -1800 -2634 1737 52 -3282 224 1866 -1706 -1198 2780 432 -1727 2007 2622
954B622l920J681K671l668p94L757j360l440K997J455m069J51L730k570k430L491
$$ 2622 -1298 383 3054 -614 -1408 2349 989 -2451 546 2001 -2068 -1917 1813 -757 -3187 304
970C04O10l728J677L204l114p35L902j146l075K987J796l791J64L698j895k426
$$ 304 914 -2814 -1137 2067 -1047 -1782 2120 974 -2101 886 2682 -1109 -945 2753 858 -1568
986a568L614K26l582J621K331l399j368L368j279l268K803J709l414K42L601j918
$$ -1568 2046 2272 -1310 311 2642 -757 -2125 1243 -36 -3304 -501 1208 -2206 -1964 1637 -281
1002b81k061L508M60l471J508K792k713r34L435p17l195K724J552l804OL375k234
$$ -281 -2342 1166 1626 -1845 -337 2455 -258 -1192 2243 1526 -1669 1055 2607 -1197 -1191 2184 -50
1019e0k456L156N58l231J093K857k835j115L262p75k951K430J936l307L60L403
$$ -50 -2506 650 1208 -2023 -930 1927 -908 -2023 1239 464 -2487 -57 1879 -1428 -1068 2335
1035B335j626k142K887Q52l512J240K342k670j358L084n96l185K290J606l301
$$ 2335 709 -1433 1454 2306 -1206 34 2376 -294 -1652 1432 836 -2349 -59 1547 -1754
1050a754k20L328j897k275L006R60l124J184K774k295j051L275l19k948K155J692
$$ -1754 -1974 1354 -543 -2818 188 1148 -1976 -792 1982 -313 -1364 1911 1592 -1356 799 2491
1066B491l151k52L133j511k482K723P91l215P21K250k600j339K875m17k841K134
$$ 2491 -660 -912 2221 710 -1772 951 1742 -1473 -752 1498 -1102 -2441 434 17 -2824 -690
1082f90J856k840p0L475j183k293K765R94k871O48K639k169j572L006l48k914
$$ -690 1166 -1674 -1744 1731 548 -1745 1020 2014 -857 -209 2430 261 -1311 1695 1347 -1567
1098a567J794J732k727m87K834j395k556K725P45l078N98K448j946j202L043k67
$$ -1567 227 1959 -768 -1255 1579 184 -2372 353 1098 -1980 -1382 1066 -880 -2082 961 694
1114F94k446K081K160k803o9L078j116k326K394N82l224L32K348k281j391K562
$$ 694 -1752 329 2489 -314 -383 2695 1579 -747 1647 2229 -995 -663 1685 -596 -1987 575
1130E75j33k706J824J807k493k10K830j191j985K471R67k842N21K466j745j443
$$ 575 442 -2264 -440 1367 -1126 -1336 1494 303 -1682 789 1756 -1086 -565 1901 156 -1287
1146a287K361m6k581J561J717k313m93K998j296k046K303Q04k952K13K511j987
$$ -1287 1074 1028 -1553 8 1725 -588 -1081 1917 621 -1425 878 1682 -1270 -1057 1454 -533
1162e33j617K453o3k622J511K026k290l19K956r25j859K200R05k534L84K455j767
$$ -533 -2150 303 240 -2382 -871 1155 -1135 -1454 1502 577 -1282 918 1823 -711 -327 2128 361
1179C61j466K282k29k402J051J559k513m76K382j212j957K301J089k613O01K656
$$ 361 -1105 1177 948 -1454 -403 1156 -1357 -1833 549 -663 -2620 -319 770 -1843 -1242 1414
1195A414j637j228K726J72k588J559J786k333m72K480r60k269J837P90k644J3
$$ 1414 -223 -1451 1275 1447 -1141 418 2204 -129 -601 1879 919 -1350 487 1277 -1367 -1354
1211a354K263j777j117K359K46k319J407J892k064o86K632p36k095J941R21k547
$$ -1354 909 -868 -1985 374 620 -1699 -292 1600 -464 -1150 1482 746 -1349 592 1513 -1034
1227a034K72K455j589j707K620J42k103J045J886k010o52K443r21j804J567P36
$$ -1034 -762 1693 104 -1603 1017 1159 -944 101 1987 -23 -675 1768 847 -957 610 1346
1243A346k343Q3K170j680j257J920L39k222J243J720j507o57K611o93j871J903
$$ 1346 -997 -914 1256 -424 -1681 239 578 -1644 -401 1319 -188 -845 1766 1073 -798 1105
1259A105Q42k262L8J904j349j719K133P0k568R86J429j607o64K252n55j782J719
$$ 1105 1947 -315 -277 1627 278 -1441 692 762 -1806 -820 609 -998 -1662 590 35 -1747 -28
1276b8J021j903J82K258r83j468K040L20j942L88J667j816p80K082o14j893J395
$$ -28 993 -910 -728 1530 547 -921 1119 1439 -503 -115 1552 -264 -1044 1038 424 -1469 -74
1293g4J006k194J50K075j181j138J621O00k277R46J770j615p39K135l59j804J423
$$ -74 932 -1262 -1112 963 -218 -1356 265 865 -1412 -466 1304 -311 -1050 1085 726 -1078 345
1310C45J010k024J18J823j071j389J821M44k209O26J714j695q70K039k41j920
$$ 345 1355 -669 -551 1272 201 -1188 633 1077 -1132 -506 1208 -487 -1357 682 441 -1479
1326a479J344J095k124K27J827q97j280J561O43j816N17J781j509m31J738j86
$$ -1479 -135 960 -1164 -937 890 -7 -1287 274 917 -899 -382 1399 -110 -541 1197 1011
1342A011j624J053J032j878k7J671j076j240J220K16j908Q59J266j058o84J732
$$ 1011 -613 440 1472 -406 -433 1238 162 -1078 142 358 -1550 -691 575 -483 -1167 565
1358E65k68j409J236J057j452r3J680q99j086J534M69j804N11J265j471q71J712
$$ 565 297 -1112 124 1181 -271 -364 1316 417 -669 865 1334 -470 41 1306 -165 -1036 676
1375F76m13j600J074R91j635j92J489n28j131J493N00j619O15J436j423n75J681
$$ 676 263 -1337 -263 728 -907 -1099 390 -138 -1269 224 724 -895 -280 1156 -267 -842 839
1392H39p6j568J199P39j684N0J547p94j301J362P25j824K19J379j172r46J708
$$ 839 763 -805 394 1133 -551 -501 1046 252 -1049 313 1038 -786 -567 812 -360 -1306 402
1409D02k81j357J037J036j488o0J503m78j016J288L91j710N37J434j146p41J556
$$ 402 121 -1236 -199 837 -651 -711 792 314 -702 586 977 -733 -196 1238 92 -649 907
1426I07k08j455Q86Q19j479r8J250o37j393J548K05j325L04J304r90o23J601j36
$$ 907 699 -756 130 949 -530 -628 622 -15 -1408 140 345 -980 -676 628 -362 -985 616 480
1444D80j261R53P71j001k26J216l83j438J492J29j064K28J065j071q47J353j63
$$ 480 -781 172 943 -58 -284 932 549 -889 603 732 -332 -104 961 -110 -957 396 233
1461B33j178N49Q16j119j00J462m20j192J151M30j225L14J148o93o84J274k7j147
$$ 233 -945 -396 420 -699 -799 663 243 -949 202 632 -593 -279 869 176 -508 766 739 -408
1479d08N98Q87j298l14J347p04j019R66M36j415K71J277p69o08R73L21j427P46
$$ -408 190 1077 -221 -535 812 108 -911 55 491 -924 -653 624 -145 -753 220 541 -886 -140
1497a40R31q86l88J267l34j021J023K74j252M97R81r03o77J027p1j148O19Q90
$$ -140 791 -95 -483 784 450 -571 452 726 -526 -29 952 49 -628 399 328 -820 -201 689
1515F89j139k61J072l37q38R14O22j409K88J061q41m74J384n6j037O36O93q63
$$ 689 -450 -711 361 24 -814 100 722 -687 -399 662 -179 -653 731 675 -362 274 967 104
1533A04p41J439n41q38R77L30j120R3J041p38o99J075j91j099L89R70q85k62J323
$$ 104 -637 802 261 -577 400 730 -390 -297 744 6 -693 382 191 -908 -519 451 -434 -696 627
1552F27m52q55J002M74j350K54J172q13p11J186K51j222M95N65n91m57R30m13
$$ 627 175 -680 322 796 -554 -300 872 59 -652 534 785 -437 58 623 32 -425 505 92
1570I2j019R55L10r19n6J050p15m69J030J06q94L85R47r38l50J164k15j038J038
$$ 92 -927 28 338 -581 -637 413 -302 -771 259 365 -529 -144 803 -135 -485 679 464 -574 464
1589D64K37r50K02P87p25n66P07M17j131J75P53p64l42R55j96p12P71K70p35J06
$$ 464 701 -249 -47 740 15 -551 156 573 -558 -383 370 -394 -736 219 23 -689 82 352 -383 -277
1609b77Q89m06n95P73L29j013L62N65p67p5N81k02p67P47J57p22N2Q31l74n50
$$ -277 612 206 -389 384 713 -300 62 627 -140 -215 366 164 -603 144 301 -421 -369 462 88 -462
1629d62N95J7p92N99N28p82l4P02j29p56O13M96p52lO20k98n99P52L03q37j36
$$ -462 133 150 -642 -43 485 -297 -331 371 242 -514 99 595 -157 -160 460 162 -437 315 618 -219 -355
1650c55R13o69l07R19m38o19M64J63o58K14Q03n90m57Q80O4n79J56P00o37k35
$$ -355 558 -111 -418 501 63 -556 -92 71 -587 -373 430 -160 -617 263 327 -252 -96 604 -33 -268
1670b68Q70j75o13L26L59q40q1P50n21m72P07K8q19N47N20n82j73Q62j92m75M33
$$ -268 602 427 -186 140 499 -341 -422 328 -193 -665 42 70 -749 -202 318 -264 -437 425 233 -242 191
1691A91K40o35P0Q02n56k82N16K12q38L93N08q49j01N11j27o67O68K22n36n2P44
$$ 191 431 -204 -134 668 112 -170 346 558 -280 113 621 -228 -329 182 55 -612 56 278 -258 -310 434
1712D34m38m23O46j07m81M34M48p47j9L91j07l76P26K75p14m0M69k43o82Q39j75
$$ 434 -4 -427 219 112 -369 65 513 -234 -253 138 31 -345 381 656 -58 -98 371 128 -554 285 110
1733A10m33J39N15n76q3L49k8m31J81L47m47R2O01k32n47O92O0m75J33M65m20
$$ 110 -323 -184 331 -245 -328 21 -7 -438 -257 90 -357 -265 336 104 -443 249 309 -166 -33 432 12
1754A2k08O21k37o66M48M57o46j1M46k08n34N68j81l88L43M35m51l83R44k57k85
$$ 12 -196 425 188 -478 -30 427 -219 -230 216 8 -526 42 -139 -527 -184 251 -200 -583 361 104 -181
1775a81K48K71n06J66M93m80l05O49o5n73J25K88k27l49O47j66n42L23L85l28
$$ -181 67 338 -168 -2 491 11 -294 355 290 -283 -158 130 -97 -446 201 35 -507 -184 201 -127
1795a27k34O95n16p3K53l1k66L68K33k43k79M05j35l34L40L51o90J91M46l0n36
$$ -127 -361 334 -182 -255 -2 -33 -299 69 302 59 -220 185 50 -284 56 407 -283 -92 354 324 -212
1816b12K48L11n52J67K69l81l15O50l38r6K44R5j38j43N11J2n48L72jk92K15L46
$$ -212 36 347 -205 -38 231 -150 -465 185 -153 -249 -5 90 -48 -191 320 332 -216 156 155 -137 78 424
1838D24n54j88M33ol25N2L91l48J5K36k42j94M76P0l80p6M60n43j39N51n5j05
$$ 424 -130 -318 115 109 -216 -164 227 -121 -106 130 -112 -306 170 240 -140 -216 244 -299 -438 113 58 -47
1860d7J70O6k96n1K33N7l42L11N6k28J3J61k46p8J48n3j32K02K04m07J59K20j30
$$ -47 123 189 -107 -158 75 132 -210 101 157 -71 -58 103 -143 -221 -73 -126 -258 -56 148 -259 -100 120 -10
1883a0k07J92J60j42J5L07k28j43K50o2l08J69J68l23o8M24j62l48M10j0k39p4
$$ -10 -217 -25 135 -7 8 315 87 -56 194 132 -176 -7 161 -162 -230 194 32 -316 94 84 -155 -229
1905b29K29l4j65L94j2m64L18K4j43n5L14j31k96L47M9k21M8K21j61j48K37j34
$$ -229 0 -34 -199 195 183 -281 37 61 -82 -137 177 46 -250 97 146 -75 -27 194 33 -115 122 -12
1927a2k97K43J14p2r6J90l0o9m9R0k58Q8L92k06m2J22Q3j81M9J01j83J06K12j93
$$ -12 -309 -66 48 -24 -120 70 40 -29 -78 12 -246 -158 234 28 -14 108 191 10 59 160 -23 83 295 102
1951A02k30Q9L9o5j20L41k31j56K31P4j23J60j22m2k5K47l0k89L26q8j12K2K20
$$ 102 -128 -39 0 -65 -185 156 -75 -231 0 74 -49 111 -11 -53 -78 169 139 -150 176 88 -24 -2 218
1974B18k69m4K49j96r2Q3R3j94L7Q3j09p9J43P1k23Q3J61l6m5K46j4k22N9Q3l2
$$ 218 -51 -95 154 -42 -134 -51 42 -152 -115 -32 -141 -220 -77 -6 -229 -146 15 -21 -66 180 166 -56 3 86 54
1999E4L0K84l51l03K30O8r6J06J14j08k32L14l4l54J77J70j86Q3o9K43k04K25
$$ 54 84 368 17 -286 -56 12 -84 22 136 28 -204 110 76 -278 -101 69 -117 -34 -103 140 -64 161
2021A61r0j52J30rK1j74K53p6o4q6K40q7j89J73p9J4N9ql19K80M5k36P5K01k5
$$ 161 71 -81 49 40 61 -113 140 64 0 -86 154 67 -122 51 -28 -14 45 37 -282 -2 43 -193 -118 83 58
2046E8k63L35r3n4o1J66J58j80J6MJ7j72K49K6l10J34L0p2R2J67k09j64J52oj20
$$ 58 -205 130 37 -17 -78 88 246 66 82 86 103 -69 180 206 -104 30 60 -12 80 247 38 -126 26 20 -100
2071a00J82j58j09N3J64J32j92n0J01k5PP3j00k7N6Q4k81J62J53l6j75K19j2j83
$$ -100 82 -76 -185 -132 32 164 -28 -78 23 -2 5 78 -22 -49 7 91 -190 -28 125 89 -86 133 121 -62
2095f2K00n4r3Q7r1j58O1L05j70o1r7JJ34J81j21K5l5J0M9l16J67P9O7n6J80l84
$$ -62 138 84 -9 78 -13 -171 -110 195 25 -36 -133 -132 2 183 62 87 52 62 111 -205 -38 41 108 52 232 -152
2121a52J47K5L0j23n4J77J4l8j60L33k19n9K68j92Pj02K16r4j1j39J62j11L0J97
$$ -152 -5 20 50 -73 -127 50 64 26 -134 199 -20 -79 189 -3 4 -98 118 24 13 -126 36 -75 -45 152
2145A52k15rP7P8j90L7k9O0J92k91P6J16j83K46m6K69j84k8Mq8k36K78Ro8J33
$$ 152 -63 -72 5 83 -107 -70 -99 -39 153 -138 -62 54 -129 117 71 340 156 128 132 44 -192 86 95 27 160
2170A60o9J17m47L74j7P4k43m5N7p3R5O4K1k50M77l92mK77k41J03p4K6O9j4l5
$$ 160 91 208 -239 135 118 192 -51 -96 -39 -112 -17 47 68 -182 295 -97 -101 176 -65 38 -36 -10 59 45 10
2195A0pk2J33r0rn2K07n3j49r6Q1J10Kj75K04j45rJ49M0j58R1q0O5J33j78J8J46
$$ 10 3 -19 114 24 15 -37 170 117 -32 -128 -47 63 65 -110 94 -51 -60 89 129 -29 62 -18 47 180 2 20 166
2222A66j79q8J54J05J77k48j41l2J27l9q0J04Q8r8p9K50j20j25O7Mo9M6kn6J62
$$ 166 -13 -101 53 158 335 87 -54 -86 41 2 -78 26 114 16 -63 187 67 -58 9 13 -56 -10 -12 -68 94
2247I4j39J12j19J6J53k62K14m0L3j28J47M8j62K13k03r1o7J73o3L25n4k63J43
$$ 94 -45 67 -52 -36 117 -145 69 29 62 -66 81 129 -33 180 -23 -114 -181 -8 -71 254 200 -63 80
2270H0k47P1PJ45j18k8j5J57jj77N8qJ16m1K5%K6m6N7q0M9M0m2J4k7j79K07J06
$$ 80 -167 -96 -89 56 -62 -90 -105 52 51 -126 -68 -76 40 -1 24 24 50 4 61 -19 30 70 28 42 15 -164 43 149
2298A49k79J96r2r8O4Q2n4K09l56J43k44K82l7Q1J1m6Q8J9nj62j1O7j26m0J85
$$ 149 -130 66 -26 -124 -60 22 -32 177 -179 -36 -280 2 -35 46 57 11 99 118 113 -49 -60 7 -119 -159 26
2323B6j3P9j16J90k18P1q7l4J21N5k06jK78k11K09j67KP2j95J5K12j94J16J08
$$ 26 13 92 -24 166 -52 19 -68 -102 19 74 -132 -133 145 -66 143 -24 -22 50 -145 -130 82 -112 4 112
2347A12k99J78m1l4M1J77j56r0K30j63kn5N9L00j34k16R3j31K1K31j37O8j43K27
$$ 112 -187 -9 -50 -84 -43 134 -22 -112 118 -45 -47 -102 -43 257 123 -93 0 -131 -110 121 -16 52 -91 136
2371A36j84pK1J74j47J17N4k27L6O4k3m8J09j32L6%K42k72P5m8J68j53L7k09J19
$$ 136 -48 -55 -34 140 -7 110 164 -63 -27 37 14 -34 75 -57 -21 -21 221 -51 24 -24 144 -9 28 -181 -62
2396f2L9J58j73k3J02o6j13K50M7k89m9K21j27j54K49L0n8P8J16j85N8o3J29l
$$ -62 -23 135 -38 -61 41 -25 -138 112 159 -130 -179 42 -85 -239 10 40 -18 60 176 -9 49 -14 115 112
2420A12mr0j39O1J94l17J23J63j60R0j16K20j45j3J77j69L7K1J0j52P4J22k61
$$ 112 108 18 -121 -60 134 -183 -60 103 -57 33 -83 137 -8 -21 156 -13 24 45 55 -97 -23 99 -162
2443a62J02j4J68j15Rl1q8J96m0j05q4K14J48k94q4M14l14m3K84j56m9L0Q7j40
$$ -162 -60 -74 94 -21 -12 -43 -131 65 25 -80 -164 50 198 -96 -180 234 -80 -123 161 5 -44 -14 73 -67
2467f7j10K52j14j09K76j08j19K23k15M4r7K89K2j3k28K09k90P9J38r5j29J18
$$ -67 -177 75 -39 -148 128 20 -99 124 -91 -47 -144 145 167 154 -74 135 -155 -76 62 -33 -162 -44
2489d4J01j31r6L29n6k23J79J0j53m5J18j9j38K64j07j11R8J57j99P8J0r7j33
$$ -44 57 -74 -170 159 103 -120 59 69 -84 -129 -11 -30 -168 96 -11 -122 -24 133 -66 12 22 -75 -208
2512b08L22l01O4K26L1j79q1K85j06p6R6J61k60J21j49p2Q9J58j59K5M1k5K5P8
$$ -208 114 -187 -123 103 134 -45 -126 159 53 -23 73 234 -26 95 -54 -126 -37 121 -38 -13 28 3 28 106
2536A06N5j37k87M22j69k08K32j46j09K18O8r7m6J2m4J69oPl1pP7lk22J36L4j30
$$ 106 161 24 -263 159 -10 -218 14 -132 -241 -23 45 -52 -98 -86 -130 39 33 40 9 2 79 76 -146 -10 24 -106
2562a06K4L55k79M1J27n2l7j05J93J0l43M56k21r0RK8R9r0K29k68j53J00K27j30
$$ -106 -82 273 -6 35 162 110 73 -32 161 171 -172 284 63 -27 -18 10 109 19 248 -20 -173 -73 154 24
2586B4MQ7M2m2j34r6J27J55j8l14J52J9m8rj29K75j80j38K51n3p8j3J43j74J6
$$ 24 28 115 157 115 -19 -115 12 167 149 -165 -13 6 -42 -51 -180 95 -85 -223 28 -25 -103 -116 27 -147 -131
2611a31J92oj13M8j73N2K8R5l6J05P8j94P2QK9j15j18K37j19M9m2L8q7K75j70
$$ -131 61 55 -58 -10 -183 -131 -103 -8 -44 61 139 -55 17 25 54 -61 -179 58 -61 -12 -54 -16 -103 172 2
2636Bn1J06p0j02Q6K89j55j51N5l1J71k41N6Q6j51p9K80j01N5P7j13O1q9M3l7
$$ 2 -49 57 -13 -115 -29 260 105 -46 9 -22 149 -92 -36 50 -101 -180 100 -1 54 131 18 79 -10 33 -4
2661do7j09J18NJ87j32j21K14N1j34R5k9l0j44K15Lq3J2K13j33k02N8J43k75J57
$$ -4 -71 -180 -62 -57 130 -2 -123 91 142 8 103 74 44 -100 115 118 35 47 260 127 -75 -17 126 -149 8
2686Hj1r7o8J44K7%J64k1j16k9J67j53j45J52m3mo2J75j46l1P7M4j85J87M5J45
$$ 8 -3 -100 -168 -24 3 3 167 146 30 1 168 15 -130 22 -21 -25 -87 88 -58 -89 -12 32 -153 34 79 224
2712B24k18r8J28k62K78Kj42O3J02k19O7J59j36O8L4q2k4m2K86q5j13M8J45m03
$$ 224 6 -92 36 -226 52 54 -88 -25 77 -142 -75 84 -52 16 50 -32 -56 -98 188 103 -10 38 183 -220
2736b20K08J0J7k37L30o7l65L85j22qK2o9j8ll1N1j28K06k3o8J04k5N4j6J91k02
$$ -220 -12 -2 15 -222 108 41 -324 61 -61 -69 -47 -116 -134 -137 -168 -117 -245 -39 -62 -130 -26 -51 3 -13 178 -24
2762b4JJ11L1k13N2M4N3k2j30K30P8k44O2J1j17O0l7J10j29K88k14j13J08J93
$$ -24 -23 88 119 -94 -42 2 55 33 -97 133 211 -33 29 40 -77 -17 -54 56 -73 215 1 -112 -4 189
2786A89k24J9Q3l6l3O3o1j73K54pr7J31k11pPJ49J00k14J5R6k9JJ35j34q7r9L33
$$ 189 -35 -16 67 31 -2 61 0 -173 81 74 -23 108 -103 -110 -103 46 146 -68 -53 43 14 15 150 16 -71 -170 163
2813A63j85J23K8j10r3K10m2n4j29J13Q6o5j11O1M1k51L69k02R0K24j41k94K68
$$ 163 -22 101 129 19 -74 136 94 40 -89 24 110 45 -66 -5 36 -215 154 -48 42 266 125 -169 99
2836I9o5k66J34J50k2k04J33R7j61M7J65N8j28N5P5j89J17n2q8j33J75J17j59
$$ 99 34 -232 -98 52 30 -174 -41 56 -105 -58 107 165 37 92 167 -22 95 43 -45 -178 -3 114 -45
2859d5J31J0m60L98M7k69K00l1K92m01J93Ll7K0lM3j93K1J90K9k57J57j63J74
$$ -45 86 96 -364 34 81 -188 12 -19 273 -128 65 68 31 51 48 91 -102 -81 109 138 -119 38 -125 49
2883D9q1qO4j05pJ19NO0k65J45j36K31k65K23%j6n2J84q1k98K97l79L88r9jj09
$$ 49 -32 -40 24 -81 -88 31 36 96 -169 -24 -160 71 -194 29 29 13 -39 145 64 -234 63 -316 72 -27 -28 -137
2909a37J26pJ43l28L33p9q7K74k03p7L8o9J83k83K36o7N6n1J63j7m22K01P1R6
$$ -137 -11 -18 125 -203 130 51 -36 238 35 -42 -4 -73 110 -173 63 -4 52 1 164 147 -275 -74 -3 93
2933I3L7j07K09k96J00J9j37J93K6j33o2J31N8j68K2Q9m5j12J68j6j1n7k4J7Q8
$$ 93 130 23 232 -64 36 55 -82 111 137 4 -58 73 131 -37 -15 74 29 -83 85 69 58 1 -23 -6 82
2958H2q1r3J73K2r3K7K7j93J51K4J40k96OMJ89j5j24J17j49J84k74J53m8J10m5
$$ 82 1 -92 81 103 10 37 64 -129 22 46 186 -110 -104 -100 89 74 -50 67 -82 102 -172 -19 -67 43 -2
2983bL9J67j68j55N3J18r7m5L54p9l00K58n0o1p7o9K04k17j5K24Jm2N3J50l19
$$ -2 37 204 36 -119 -66 52 -45 -90 264 185 -115 143 93 32 -45 -114 90 -127 -142 82 83 41 94 244 -75
3008g5j7Q5J55o0J1j88M5J69j24m0N6p8j8K26k64J06O9R9k10J15m3k7m2J36O3
$$ -75 -92 -7 148 88 99 -89 -44 125 1 -39 17 -61 -79 147 -117 -11 58 157 -53 62 19 -8 -50 86 149
3033A49k09q4R4O2j17P7J73k87J7J21O5n6q0j2J29j11rK9J8O6l4p0kO4J12j59
$$ 149 -60 -144 -50 12 -105 -28 145 -142 -125 -4 61 5 -75 -87 42 -69 -78 -49 -31 35 1 -69 -71 -7 105 -54
3059e4J04m3p1O1J62q7r1J16j36j38K89n8j59J31Jl2L0J08l9j70R3O0k23J77R
$$ -54 50 7 -64 -3 159 72 -19 97 -39 -177 112 54 -105 26 27 -5 25 133 94 -76 17 77 -146 31 40
3084D0j67m7K31k10K70n0k03kP6P6j6j22L8Q1M5L9j02R2j56pJ45l3o0J40j49o
$$ 40 -127 -174 57 -153 117 67 -136 -138 -62 14 -2 -124 -86 -5 40 79 -23 69 -87 -94 51 18 -42 98 -51 -57
3110e7l1m0P6R4M0q2J3J3j45J20Rrj60K53k76J04N7N3R9k13J46k6k36J87J05N
$$ -57 -88 -128 -52 42 82 0 13 26 -119 1 10 1 -159 94 -182 -78 -21 32 131 -82 64 38 -198 -11 94 99
3136I9m9k8J12k74J59J20j19JQ6n1j58Q7P2Jm5K1ql4p2Q2J0L6m0l6J38Lo5j11
$$ 99 50 22 134 -140 19 139 20 21 107 56 -102 -15 57 58 13 34 26 -8 -80 2 12 48 8 -28 110 113 48 -63
3164f3l0M7J3J4P7r4J5J61k06K7N2j40J63j61J23J12l52K93ok99L66k26J73j47
$$ -63 -93 -46 -33 -19 58 -36 -21 140 -66 -39 13 -127 36 -125 -2 110 -242 51 45 -254 112 -114 59 -88
3188h8J37kM5k0l4%j16P4j40J1K35k06L8J61k23J72j18k2J86j46K17mm30J72R9
$$ -88 49 47 92 72 38 38 -78 -4 -144 -133 102 -104 -66 95 -128 44 -74 -96 90 -56 161 157 -273 -101 -2
3213bR7l22J48Lk1j09J69M5j78K73j79j48K54m8L6R5p2J26j56N0p0j8J2O0l8n8
$$ -2 95 -227 -79 -76 -97 -206 -37 8 -170 103 -76 -224 30 -18 18 113 41 167 11 61 -9 -27 -15 45 7 -51
3239e1q2RK22q6L4p6J6L3m1Q0k50P9O9O5J18o4J3q0K1R9m4J19k90J13qj00J11
$$ -51 -133 -124 98 12 46 -30 -14 19 -22 58 -192 -113 -44 21 139 75 88 8 29 128 84 203 -87 26 18 -82 29
3266B9m9Q9r8Qn0m0R3l5l9K80j83Q4j43J38p2J32l18J69K6p3n0J79j34j44N04
$$ 29 -20 69 -29 -21 -71 -111 -18 -53 -92 188 5 89 -54 84 12 144 -174 -5 21 -52 -102 77 -57 -201 303
3291C03l51J97j77Lk7N4R4l03N1L35k78rK33j20J86l62J64o3J05k6J42m8j81J13
$$ 303 -48 149 -28 -25 -52 2 96 -207 -156 179 -99 -108 125 5 191 -171 -7 -70 35 9 151 103 -78 35
3315C5m8Q5J8O1j22J23k10J9m2K14n8k57k4K22J4R7L5k23Q2J39j22lO2n7r6n4
$$ 35 -13 72 90 151 29 152 -58 -39 -81 133 75 -182 -206 16 30 127 162 -61 21 160 38 35 97 40 -56 -110
3341a10K40j09L0P3j76R8J2M3k59J8J46J17p5j1J16o8n4M3j72J09M4K2l38K42
$$ -110 130 21 51 124 -52 46 58 101 -158 -140 6 123 48 37 153 85 31 74 -98 11 55 77 -261 -19
3365a9K21q6l0O0j33j03M0K65k08o8K25q4j79J83K7j21qJ24K1j17J12k0j51J32
$$ -19 202 116 86 146 13 -90 -50 215 7 -61 164 80 -99 84 111 -10 -18 106 127 10 122 102 -49 83
3389H3k15L8J20J7n9K20k48P8j53J58M5r0J52k05R6l7j25jJ62o0K00j63m7Q9J34
$$ 83 -132 -94 26 43 -16 204 -44 34 -119 39 84 -6 146 -59 37 0 -125 -126 36 -24 176 13 -34 55 189
3414A89k35p5N7L4QM2m6l6J72l9M6l25M15l8l70K74j80p7K27K03j37j76j15J92
$$ 189 -46 -121 -64 -30 -22 20 -26 -62 110 71 117 -208 207 169 -201 73 -107 -184 43 246 109 -67 -182 10
3438A0j24R9M8j00J81Q2l19J02N3j16R2J06j15K9m5J44k60J18M2Q5j83J77L2j54
$$ 10 -114 -15 33 -67 114 196 -123 -21 32 -84 8 114 -1 28 -17 127 -133 -15 27 112 -71 106 138 -16
3462a6J3j27L9M6m4m1J65j29R9k9lj03J77K5J0M6j72m0J49J18k89j47L66j74J84
$$ -16 -3 -130 -91 -45 -89 -130 35 -94 5 -24 -27 -130 47 72 82 128 -44 -84 65 183 -106 -253 113 -61 123
3487A23M1j74M2J00j21p0k4J23O9j98J83mk56P2O0J28j12j31L27k22Q1L2q2o6
$$ 123 164 -10 32 132 11 -59 -83 40 109 -89 94 90 -166 -94 -34 94 -18 -149 178 -44 37 69 -13 -79
3511g9K97k79j08J64J77j89q3L19j97j41J61oo2j28K44j70J0N7k0J5K15m0k29
$$ -79 218 -61 -169 -5 172 -17 -100 219 22 -119 42 36 -26 -154 90 -80 -70 -13 -33 -18 197 157 -72
3534g2O8K05p7q4LP9j64Q4J24l01K63Op1k92K99N4j81J05M5r6M2j2j38O3J27Q4
$$ -72 -4 201 124 40 43 122 -42 42 166 -135 128 134 63 -229 70 124 -57 48 93 -3 39 27 -111 -48 79 163
3560A63n8j42K2Q8j95J80r7M7Q7j27l2j5K55J4k27K0J28j51m6J89k18J3L5k8O
$$ 163 105 -37 -15 73 -122 58 -39 8 95 -32 -64 -79 176 190 -37 -17 111 -40 -86 103 -115 -102 -67 -95 -89
3585h9J30N1r8j07m5K11q5M0J43j38o8L3Kq4K13j58QQ5j3n2J27m0k71M4K12J0
$$ -89 41 92 -6 -113 -158 53 -32 8 151 13 -55 -22 -20 -104 109 -49 -41 44 31 -21 106 66 -205 -161 51 61
3611F1j57J22J13k1o3J5q2R4j88K85r5j12J91j68k06M3Q2O8o2J31l0j98J44o5
$$ 61 -96 26 139 118 55 70 -12 82 -106 179 84 -28 163 -5 -211 -168 -86 -18 -80 51 21 -177 -33 -98
3635i8m2Q0J54j62k5J55k9k9j0R0r5rjJ94j59K11k22K2j67K21o6P7j53rl8J08
$$ -98 -140 -60 94 -68 -93 62 33 4 -6 84 -11 -20 -21 173 14 225 3 25 -142 79 13 90 -63 -72 -110 -2
3661bn7k9R3j9N6n2J73qJ0k94L58k56p9J27J75l28K09oj47j59K39Q0k6rK7n9p
$$ -2 -59 -88 5 -14 42 -10 163 155 165 -129 229 -27 -106 21 196 -132 77 71 -76 -235 4 84 58 49 76 17 10
3688A0K40k25j49M9J75l03K75l6M0N5O1o7k08J78q7n0O3J3k18qJ14J94l31l8L13
$$ 10 250 25 -124 -75 100 -203 72 36 76 131 192 125 -83 95 8 -42 21 34 -184 -192 -78 116 -215 -253 60
3713F0r2n5J21L5j04P4Q8k22K16n4qn7J47p0j42J9L32l23q1J8J65k03M8j4L2p3
$$ 60 -32 -87 34 69 -35 39 127 -95 121 67 59 2 149 79 -63 -44 288 -35 -116 -98 67 -136 -88 -102 -70 -143
3739a43K84j15j80J40Q6O7k08M6q4j11J87l3Q7L6K0n2j16J52J9k79M94n7k38m6
$$ -143 141 26 -154 -14 72 139 -69 -23 -107 -218 -31 -64 23 59 79 27 -89 63 82 -197 297 240 2 -44
3763d4P5j24J29J10q6k36M7L52k65o4Q6N6q8R0j2p2J09J6k1j57J37J11k34J49
$$ -44 31 -93 36 146 60 -176 -129 223 -42 -106 -20 36 -52 38 26 -46 63 79 58 -99 38 149 -85 64
3787F4J10l16M8K22k19m7l3K25r5J15k47P8J94Q9k52J47j71K18nj19R3j80M7P7
$$ 64 174 -142 -94 128 -91 -138 -171 54 -41 74 -173 -95 99 188 -64 83 -88 130 125 6 99 -81 -34 43
3811D3j4j62K70o7l6l9l2J18k56K67j08j65o2L21L3j19P9j1k15J49N2j05j0J61
$$ 43 29 -133 137 70 34 -5 -37 81 -175 92 -16 -181 -243 78 111 -8 71 60 -155 -6 46 -59 -69 92
$$ [...]
8191A08
##END NTUPLES=NMR FID
##END=
