##TITLE=1H ikalashn
109-2024-BAU
12.12.2024
##JCAMPDX= 6.0         $$ Bruker NMR JCAMP-DX V2.0
##DATA TYPE= NMR FID
##DATA CLASS= NTUPLES
##ORIGIN= UXNMR, Bruker Analytische Messtechnik GmbH
##OWNER= root
$$ TOPSPIN		Version 1.3
$$ 2024-12-12 14:15:08.609 +0400  Irina@DPX200
$$ Compression mode = diff/dup
##.OBSERVE FREQUENCY= 200.131300845
##.OBSERVE NUCLEUS= ^1H
##.DELAY= (6, 6)
##.ACQUISITION MODE= SIMULTANEOUS
##.ACQUISITION SCHEME= undefined
##.AVERAGES= 32
##.DIGITISER RES= 18
##SPECTROMETER/DATA SYSTEM= spect
##.PULSE SEQUENCE= zg
##.SOLVENT NAME= CDCl3
##.SHIFT REFERENCE= INTERNAL, CDCl3, 1, 17.49637
##AUDIT TRAIL= $$ (NUMBER, WHEN, WHO, WHERE, WHAT)
$$ ##TITLE= Audit trail, TOPSPIN		Version 1.3
$$ ##JCAMPDX= 5.01
$$ ##ORIGIN= Bruker BioSpin GmbH
$$ ##OWNER= Irina
$$ $$ F:/spectra/data/iren/nmr/1H/4/audita.txt
$$ ##AUDIT TRAIL=  $$ (NUMBER, WHEN, WHO, WHERE, VERSION, WHAT)
(   1,<2024-12-12 14:14:47.562 +0400>,<Irina>,<DPX200>,<TOPSPIN 1.3>,
      <created by zg
	started at 2024-12-12 14:12:39.406 +0400,
	POWCHK disabled, PULCHK disabled
       configuration hash MD5:
       BE 6D 3F 07 2A EA 11 49 91 17 2B D3 AF B3 58 0D
       data hash MD5: 16K
       A9 9F 31 6A 53 4F 64 95 F7 8D 70 5B B2 88 F6 2A>)
$$ ##END=
$$ 
$$ $$ hash MD5
$$ $$ 7E 7B F2 6A 37 CB 7B AB 03 C9 00 11 8E 4F 75 3F
##$RELAX= 
##$RELAX= 
##$RELAX= 
##$RELAX= 
##$RELAX= 
##$RELAX= 
##$RELAX= 
##$RELAX= 
##$RELAX= 
$$ Bruker specific parameters
$$ --------------------------
##$DU= <F:/spectra>
##$EXPNO= 4
##$NAME= <1H>
##$PROCNO= 1
##$TYPE= <nmr>
##$USER= <iren>
##$AMP= (0..31)
100 100 100 100 100 100 100 100 100 100 100 100 100 100 100 100 100 100 
100 100 100 100 100 100 100 100 100 100 100 100 100 100 
##$ANAVPT= -1
##$AQSEQ= 0
##$AQ_mod= 1
##$AUNM= <au_zg>
##$AUTOPOS= <>
##$BF1= 200.13
##$BF2= 200.13
##$BF3= 200.13
##$BF4= 200.13
##$BF5= 200.13
##$BF6= 200.13
##$BF7= 200.13
##$BF8= 200.13
##$BYTORDA= 1
##$CFDGTYP= 0
##$CFRGTYP= 5
##$CHEMSTR= <none>
##$CNST= (0..63)
1 1 145 1 1 1 1 1 1 1 1 1 1 1 1 1 1 1 1 1 1 1 1 1 1 1 1 1 1 1 1 1 1 1 
1 1 1 1 1 1 1 1 1 1 1 1 1 1 1 1 1 1 1 1 1 1 1 1 1 1 1 1 1 1 
##$CPDPRG= <>
##$CPDPRG1= <>
##$CPDPRG2= <>
##$CPDPRG3= <>
##$CPDPRG4= <mlev>
##$CPDPRG5= <mlev>
##$CPDPRG6= <mlev>
##$CPDPRG7= <mlev>
##$CPDPRG8= <mlev>
##$CPDPRGB= <>
##$CPDPRGT= <>
##$D= (0..63)
0 2 0 0 0 0 0 0 0 0.06 0 0.03 0 0 0 0 0.0002 0 0 0 0 0 0 0 0 0 0 0 0 0 
0 0 0 0 0 0 0 0 0 0 0 0 0 0 0 0 0 0 0 0 0 0 0 0 0 0 0 0 0 0 0 0 0 0 
##$DATE= 1733998486
##$DBL= (0..7)
120 120 120 120 120 120 120 120 
##$DBP= (0..7)
150 150 150 150 150 150 150 150 
##$DBP07= 0
##$DBPNAM0= <>
##$DBPNAM1= <>
##$DBPNAM2= <>
##$DBPNAM3= <>
##$DBPNAM4= <>
##$DBPNAM5= <>
##$DBPNAM6= <>
##$DBPNAM7= <>
##$DBPOAL= (0..7)
0.5 0.5 0.5 0.5 0.5 0.5 0.5 0.5 
##$DBPOFFS= (0..7)
0 0 0 0 0 0 0 0 
##$DE= 6
##$DECBNUC= <off>
##$DECIM= 32
##$DECNUC= <off>
##$DECSTAT= 4
##$DIGMOD= 1
##$DIGTYP= 9
##$DL= (0..7)
0 120 120 120 120 120 120 120 
##$DP= (0..7)
150 150 150 150 150 150 150 150 
##$DP07= 0
##$DPNAME0= <>
$$ [...]
##$SW= 21.9926040160658
##$SWIBOX= (0..15)
0 0 2 0 0 0 0 0 0 0 0 0 0 0 0 0 
##$SW_h= 4401.40845070422
##$TD= 16384
##$TD0= 1
##$TE= 300
##$TE2= 300
##$TE3= 300
##$TEG= 300
##$TL= (0..7)
0 120 120 120 120 120 120 120 
##$TP= (0..7)
150 150 150 150 150 150 150 150 
##$TP07= 0
##$TPNAME0= <>
##$TPNAME1= <>
##$TPNAME2= <>
##$TPNAME3= <>
##$TPNAME4= <>
##$TPNAME5= <>
##$TPNAME6= <>
##$TPNAME7= <>
##$TPOAL= (0..7)
0.5 0.5 0.5 0.5 0.5 0.5 0.5 0.5 
##$TPOFFS= (0..7)
0 0 0 0 0 0 0 0 
##$TUNHIN= 0
##$TUNHOUT= 0
##$TUNXOUT= 0
##$USERA1= <user>
##$USERA2= <user>
##$USERA3= <user>
##$USERA4= <user>
##$USERA5= <user>
##$V9= 5
##$VALIST= <valist>
##$VCLIST= <CCCCCCCCCCCCCCC>
##$VD= 0
##$VDLIST= <DDDDDDDDDDDDDDD>
##$VPLIST= <PPPPPPPPPPPPPPP>
##$VTLIST= <TTTTTTTTTTTTTTT>
##$WBST= 1024
##$WBSW= 25
##$XGAIN= (0..3)
0 0 0 0 
##$XL= 0
##$YL= 0
##$YMAX_a= 363384
##$YMIN_a= -272805
##$ZGOPTNS= <>
##$ZL1= 120
##$ZL2= 120
##$ZL3= 120
##$ZL4= 120
##$ABSF1= 10
##$ABSF2= 0
##$ABSG= 5
##$ABSL= 3
##$ALPHA= 0
##$AQORDER= 0
##$ASSFAC= 0
##$ASSFACI= 0
##$ASSFACX= 0
##$ASSWID= 0
##$AUNMP= <proc_1d>
##$AXLEFT= 0
##$AXRIGHT= 0
##$AXTYPE= 0
##$AXUNIT= <>
##$AZFE= 0.1
##$AZFW= 0.1
##$BCFW= 1
##$BC_mod= 2
##$BYTORDP= 1
##$COROFFS= 0
##$CY= 7568.61572265625
##$DATMOD= 1
##$DC= 2
##$DFILT= <>
##$DTYPP= 0
##$F1P= 17.9538593292236
##$F2P= -4.03888763876832
##$FCOR= 0.5
##$FTSIZE= 32768
##$FT_mod= 4
##$GAMMA= 1
##$GB= 1
##$INTBC= 1
##$INTSCL= 1
##$ISEN= 128
##$LB= 0.02
##$LEV0= 0
##$LPBIN= 0
##$MAXI= 945.577
##$MC2= 0
##$MEAN= 0
##$ME_mod= 0
##$MI= -402.1523
##$NCOEF= 0
##$NC_proc= 0
##$NLEV= 6
##$NOISF1= 8.587773
##$NOISF2= 6.764455
##$NSP= 1
##$NTH_PI= 0
##$NZP= 0
##$OFFSET= 17.49637
##$PC= 1
##$PHC0= -33.84425
##$PHC1= 6.862033
##$PH_mod= 0
##$PKNL= yes
##$PPARMOD= 0
##$PPDIAG= 0
##$PPIPTYP= 0
##$PPMPNUM= 100
##$PPRESOL= 1
##$PSCAL= 0
##$PSIGN= 0
##$REVERSE= no
##$SF= 200.13
##$SI= 32768
##$SIGF1= 18.5376
##$SIGF2= -6.396296
##$SINO= 400
##$SIOLD= 32768
##$SREGLST= <1H.CDCl3>
##$SSB= 3
##$STSI= 0
##$STSR= 0
##$SW_p= 4401.40845070422
##$SYMM= 0
##$S_DEV= 0
##$TDeff= 0
##$TDoff= 0
##$TI= <>
##$TILT= no
##$TM1= 0
##$TM2= 0
##$TOPLEV= 0
##$USERP1= <user>
##$USERP2= <user>
##$USERP3= <user>
##$USERP4= <user>
##$USERP5= <user>
##$WDW= 1
##$XDIM= 8192
##$YMAX_p= 0
##$YMIN_p= 0
$$ End of Bruker specific parameters
$$ ---------------------------------
##NTUPLES= NMR FID
##VAR_NAME=  TIME,          FID/REAL,        FID/IMAG
##SYMBOL=    X,             R,               I
##VAR_TYPE=  INDEPENDENT,   DEPENDENT,       DEPENDENT
##VAR_FORM=  AFFN,          ASDF,            ASDF
##VAR_DIM=   8192,          8192,            8192
##UNITS=     SECONDS,       ARBITRARY UNITS, ARBITRARY UNITS
##FACTOR=    0.0002272,     1,               1
##FIRST=     0,             0,               0
##LAST=      1.8609952,     9,               42
##MIN=       0,             -272805,         -272805
##MAX=       1.8609952,     363384,          363384
$$ Real data points
##PAGE= N=1
##DATA TABLE= (X++(R..R)), XYDATA
$$ [...]
1954d29Q36N52j444K85R63p02k60P26Q2j116N14P38r56l59J062m35q21O05O61
1973E02j163J33Q46o21l78J016J64j039L72J351j194J00M44L4j288Q80K81j130
1991f90M30Q91p42n06P39J29j096M38Q39j193p8J028k79o73R13Q97j132K96J086
2010A297q34n07O02K90j267M22P90j016p15J205k25q28N88Q04j562L68J056p29
2028b61p16J196N2j130R41N89o71m82J120k74n24O94N09r19J4Q92r19l61R29j71
2048E08j202K34P36p00p75J347j94j029Q64P20j215K22R90k52r31J206J43p65
2066i3M03Q15q06n72J004j30j483M92Q44r10m64J120k54p09J026J32j112O76N27
2085E06n78n46R94n3j069Q07M96p40l76J102r7j088R65N24j215J2P85p44p77J239
$$ y = [-429, 407, 959, -485, -200, 763, 61, -199, 527, 609, -507, 7, 745, -211, -570, 492, 57, -764, -159, 502, -661, -528, 318, -303, -681, 335, 499, -540, -168, 1183, -11, 89, 533, 567, -721, 159, 440, -690, -260, 631, -111, -617, 122, 251, -845, -407, 432, -761, -839, 189, -90, -763, 150, 1047, -85, 211, 1297, 463, -44, 558, 848, -419, 3, 793, -223, -938, 267, 42, -786, -198, 606, -956, -588, 468, -261, -977, 219, 271, -859, 82, 671, 0, -482, 638, 364, -160, 534, 1043, 124, 138, 1030, 111, -250, 679, 508, -694, -460, 276, -424, -1199, 148, -46, -1075, -211, 509, -706, -484, 506, 254, -677, 529, 672, -93, 310, 1125, 319, -253, 751, 621, -862, -370, 474, -436, -900, 220, -34, -743, 283, 415, -697, -21, 506, -72, -618, 376, 323, -746, 61, 557, -183, -559, 543, 446, -642, 323, 847, -368, -356, 429, -315, -1092, 147]
2105A47J20j229M23P82p39l07J433n61o07R86L30j350O14P05o59m83J006L7j110
2124d62M86R32r64l54J152n75r67Q71J75j117k14J002o24m85J255M08j338O33
2142a86J299j220k97J499l94j020Q94O23j442jJ168p77r50R82J07j379Q52O83
2160D41j083j91J264l17q54Q51L47j053L39Q17p96m11R88K66j207P49N78p82k9
2179h3Q85j62j213J043M64j543K4J140r47p36Q94K26j067N73P69o09l51J481m79
2198C09p23R13O32r21O7Q23o28q84N73K08j226O23Q37j108l48J070j6j030R93
2217A64N99j429K13Q92n88o56R44K34j022M32P11n23l85J279K6j010M85P04r50
2236A20k09Q97q78p67R30J25j561L73J402j031r6J017j08q82R37O12j129K03J064
$$ y = [147, 267, -962, -539, 243, -496, -803, 630, 69, -538, 448, 778, -572, 42, 747, 88, -395, 611, 648, -462, 24, 956, -8, -362, 790, 215, -752, 119, 294, -823, -1037, -35, -659, -1144, 111, 519, -819, -186, 1113, -107, -404, 1095, 701, -319, 575, 1198, -244, -245, 923, 146, -804, 178, 285, -1094, -242, 441, -642, -833, 431, 114, -740, 111, 458, -595, -256, 561, -235, -646, 342, 608, -599, 150, 728, -54, -83, 802, 640, -573, 470, 934, -609, -585, 555, -392, -1128, -234, -8, -1075, -502, 267, -342, -693, 788, 309, -414, 499, 1131, 210, 277, 1100, 472, -412, 161, 369, -857, -234, 603, -505, -853, 217, 201, -829, 164, 763, -666, -453, 439, -149, -805, 139, 373, -649, -217, 494, -29, -414, 865, 891, -119, 366, 1070, 120, -89, 808, -70, -837, 93, 218, -1343, -970, 432, -599, -695, 322, 214, -668, 269, 881, -248, -45, 1019]
2255A019o22j013R45M93j260K36J147j255k82J024J39j304R21L51j004q0J034
2272D89p49q31J043J83r27L40J223r62k59J116P8r14Q78K49q26p2R23o52q41P41
2292B30J96j223J49J152j265m44J159L15j267P41R19j041L4J316n22q83O84N38
2310G88j166M75N67o59p93J383k28r19O69N19q37j90J057o81q26J027J65j358
2328a007J60J216p34p56J283J19q65M97Q55p99q9J177k61j043N53O31j117J91
2346A1P85r36n02Q70k4q94N52L28p67l5Q83k18q63R04N62j195K03J152o69n81
2366d34J269o5j150O44N37j064k74J004n22r86J278Q4j060M97P68q65m39J206
2384D28j71r42K89J144r42m63J425l34j046J081K52q78J22J114o06n88R12l70
$$ y = [1019, 397, -616, 329, 822, -438, -202, 945, -310, -592, 432, 571, -733, 188, 539, -465, -545, 489, -260, -1091, -48, 135, -792, -452, 771, -191, -450, 666, 744, -170, 708, 957, 131, 59, 982, 330, -511, 230, 426, -797, -648, 504, -761, -1205, -46, 269, -998, -257, 662, -379, -345, 971, 449, -434, 250, 788, -378, 97, 664, 5, -788, 595, 367, -552, 117, 636, -201, -391, 666, -15, -841, 186, 351, -1007, -847, 369, -365, -1121, 162, 281, -584, -87, 768, -31, -120, 1057, 796, -247, 306, 937, -180, 11, 796, -140, -642, 228, 204, -690, -138, 190, -577, -612, 271, 53, -810, 94, 656, -539, -336, 816, 147, -434, 835, 770, -380, 264, 801, -263, -537, 467, -55, -1041, 237, 321, -739, -242, 526, -339, -778, 428, 257, -685, -396, 748, -194, -657, 768, 434, -612, 469, 721, -157, -35, 1079, 473, -115, 797, 427]
2402D27j137O02N78j070j01P40m42p79R52L96j181K92J257k67o72R48L65r49M07
2421C66O10q69k74J244o17q23O54L5j137K05Q33n18m65J054j83p99N96N27q58
2440d19O4Q48l65r32Q10L46r47q5J099o22k83J103K17r28L08P10p07j66P87l98
2460D40q77L35L01j089j69J359q34o48J146K21p97P09P60o92j55J322n32q97O33
2479E36L59j039j35O50o26p38Q71O9r27M46Q42o41l88J036Q7o23M71O73r35k4
2499c6N89l21o71O54J53j002O59M74n40o05J194M2j117R91N75j421R3R81o51q30
2519g89Q21m7o93O1Q44q89q3J320l54o78P13N81q02J79R10o95n60O50K52j126
2539c85K7O90q04k44J141n29p78O24P41j046J08Q63k12p68R68J04q02J13Q64q56
$$ y = [427, -710, -108, 470, -600, -701, 39, -403, -1182, -230, 166, -1015, -723, 534, 267, -405, 543, 908, -41, 366, 976, 107, -167, 1077, 460, -363, 291, 326, -811, -606, 227, -291, -756, 298, 115, -684, -88, 439, -419, -355, 493, 128, -804, 6, 352, -595, -680, 419, -203, -486, 617, 834, -94, 214, 924, 217, 51, 838, 440, -437, -102, 199, -890, -1059, 300, -534, -1182, -36, 185, -612, 97, 857, 165, 10, 1332, 800, -97, 536, 895, -144, -279, 371, -255, -993, -122, -53, -980, -534, 308, -333, -721, 315, 402, -221, 250, 923, -12, -36, 553, 232, -439, 215, 368, -634, 25, 499, -41, -646, 548, 590, -527, 464, 1039, -382, -289, 692, 41, -789, 32, -15, -708, -647, 197, -692, -775, 545, 191, -487, 226, 807, 5, 184, 1094, 399, -161, 489, 741, -385, -358, 332, -472, -716, 425, -104, -882, -258, 483, -563, -455, 408, 196, -572, 396, 500, -302, -189, 675, -181]
2559a81q5O54K85j036N68N41n87n79P80j78q86P20K55j021K39P51o01j74P26j19
2579G2o05N10Q97r83M1Q05l45n60M04M26j001K66N00p63m10J045k09p79L88P04
2599D03o12j61Q00j82o59N75K12j080J09J006m15o12Q63J17r35N51R20r98L60
2618B62L22N6p49L26K87p27j57Q23o97o54Q05K39j044M41P42q27J17Q76j65o51
2638c75P34K08p40M8O54l55m64Q77k04j097L85O81q06k37R36p5p04N77K00r32
2658f89L40Q84q36k10R66j93n98M66N34p91LO49j1q03O58P3p66K04O67o45n82
2679f80O92J35p27L19P12q38q1Q21j18p65P58K61r51R8J054o86o63J249l17o50
2699c77L48O49p46J46R36q28p86Q83J32r53K66N93n99m32R28Lp77M06P56n71n1
$$ y = [-181, -266, 388, 673, -363, 205, 746, 159, -420, 360, 182, -704, 16, 271, -750, -511, 240, -361, -535, 191, 72, -533, -23, 874, -109, -68, 737, 392, -168, 236, 662, -339, -73, 427, -336, -746, 299, 90, -689, -301, 403, -209, -370, 430, 248, -411, 164, 376, -704, -595, 411, -4, -616, 247, 364, -571, -20, 900, -98, 262, 584, 640, -109, 217, 504, -223, -380, 443, -254, -908, -103, 136, -908, -467, 275, -552, -435, 441, 276, -375, 359, 567, -173, -125, 529, 174, -290, 587, 383, -714, -329, 352, -454, -691, 245, 170, -534, 43, 243, -689, -349, 535, -301, -511, 455, 262, -336, 130, 664, -127, -124, 525, 514, -289, 369, 442, -324, -120, 547, -98, -680, 12, 147, -580, -261, 451, -387, -468, 353, 235, -530, 228, 489, -462, -364, 690, 4, -659, 590, 273, -377, -29, 620, -126, 20, 956, 128, -658, 225, 357, -596, -330, 263, -336, -768, 160, 163, -614, -208, 548, -23, -74]
2720g4N22Qq29P65j49o12M01P68p36o56R85Op14L11K51o21P1L46p6n26K42M81
2742A64n28o2J019o12k85O00K40o97K76Q89r09k15P19l37n84O26K08o27q6N79
2762C78l52m45L95K39r17M38N79n79j09R15l42n61N48K15o90K49O35m68l85M56
2782A99J61q23N03P28r27l80R21j64q73M81N30q37J33N09k92k09N45O9m99N33
2802C08M33n94j13P35m24n07N19m7l37j79O33k77q25R55k38o49M43O31n44k58
2822c35N35j76k88M71M9m17oL23j60m05P98k8n04QP76q39m1Q16n02m75K27N99
2844D26p66m1O02m49r6L76R7p61K27P23q90J77O09r7n96N48M46o48o4N35m1o80
2866c63P94p6p92K20M60l43l20R64l97o72M93J16k21k11N64m19q1M19J07n83N26
$$ y = [-74, 448, 456, -373, 392, 243, -369, 32, 800, 64, -592, 393, 399, -315, -4, 247, -374, -303, 43, -33, -559, -317, 164, -364, -426, 593, -19, -304, 296, 536, -161, 115, 1004, 95, -120, 599, 262, -322, 304, 512, -115, -201, 378, 26, -419, -24, 215, -702, -264, 315, -264, -373, 542, 200, -361, 187, 402, -288, -39, 596, 128, -257, 199, 360, -463, 40, 768, -159, -539, 382, 218, -655, -174, 356, -481, -348, 161, -131, -340, 205, 274, -225, 308, 741, 147, 34, 769, 345, -162, 357, 310, -27, -206, 427, 150, -675, 280, 42, -607, -164, 467, -77, -335, 200, 24, -264, 207, 256, -161, -167, 156, -4, -409, 389, 361, -143, -135, 641, -198, -239, 577, 75, -400, -173, 426, -340, -381, 221, -228, -324, 52, 149, -612, -385, 338, -552, -375, 234, 137, -459, 89, 535, -113, -177, 358, 317, -363, 431, 355, -437, -217, 243, -100, -420, 544, 147, -525, -32, 84, -137, -348, 216, -203, -284, 135, 242, -341, 185]
2887A85L48l51l93O18k02o18L88M08n53k45P46j22p84N17J76o75N11Q1k99j01
2907c65O75k69j28K96K12o56r8N03j95k27M89J47n96R4L30j36k24N00j16n64L86
2928E8J78l57J13L2k2l10L48O1m50M02K46k72Q3M1K51l41K37J42n55n9N49j99
2950A76m56M62j6n70K77M26n79k71R28O4q17J49M78m79k5O20l07k19L85J22o37
2971b89O42J99k52n06M23J69m98J5L06k50k80M82k9l59L19P7l56J78Q4j27j66
2992b18M00j33k53K49L37n4m50K87p0q1J95j11l07R0L05m32j28N70k10k09J70
3013e3L29l50k06N33m65j19O68o6n87L69K88j72k30J39K63m71L86J78n98j42L13
3034GL6k52L03l6L6k01L85l88k7J55j2k81L54J18m2j98J49j57K0P7L66m86lL82
$$ y = [185, 533, 182, -211, 407, 205, -413, -25, 383, -170, -415, 331, 209, -575, -58, 118, -557, -46, 35, -264, -365, 310, 41, -87, 209, 421, -235, -333, 170, -25, -252, 237, 384, -212, -118, 212, 76, -148, 352, 236, -328, 58, 236, -121, -8, 24, 2, -308, 40, 101, -349, 53, 299, 27, 110, 151, 402, 61, 298, 440, -115, -174, 375, 176, -280, 182, 166, -404, -127, 299, -280, -551, 377, 441, -376, -227, 251, -228, -253, 367, 60, -159, 226, 348, -289, 353, 552, 300, -206, 217, 386, -112, -97, 209, -41, -321, 161, 132, -227, 92, 169, -187, -9, 75, -52, -218, 182, 49, -204, 45, 382, 328, -122, 165, 95, 14, 209, 98, -209, -119, 186, -246, -374, 196, -14, -223, -53, 276, -74, -280, 253, -212, -331, 337, 271, -316, 53, 341, 169, -61, 78, 341, -130, 256, 434, -164, -306, 7, 43, -209, 94, 58, 94, -107, 278, -110, -137, 18, 6, -275, 79, 197, 155, -43, 106, -51, -31, 46, 412, -74, -77, 305]
3058C05l02j61L14k3o70L47N25n76J70J27j3j85J9J29k39M11Jk84L61rO2m34J0
3081a15L21j91K87o9n0m75K67N7j80NL00r3j36J04R2l32M82R3o79J82L68k48j31
3104a41J24K10m03J20K17j7j19J70k9k88J62K55j13m05J73K76l03K40o6l33K62
3125hl9M4l48L73J15J4J0M6j26q8J69j03j94K37J24l61J64Q6j06k39K91j16p9
3148a34J05K15m32k2N39j55m58L18N7q4k60O23k03k43L85Q8p65L42M27m57n0K35
3170G1r9k89O13J00n56j14M90m82O1N1K95m55K97L48n08J09K65J13k82k07M76
3191B97m37K40j16K01k85k2M55m54L3K17l16Q5K23k97J40k66L16j63m0M30m10
3212a69R5J93J01m37O7K37Q9j86J32J5j53J17k53m8K16M8j65j85L86N3l16Q4K14
$$ y = [305, 3, -158, 156, 133, -537, -190, 335, -241, -71, 56, 43, -142, -123, 6, -233, 178, 179, -105, 256, 247, 309, -125, -115, 206, 15, 302, 233, 183, -292, -25, 32, -148, -143, 157, 64, -72, 32, 124, -208, 274, 367, -312, -130, 238, -10, -141, -17, 193, -210, -90, 127, 110, -9, 161, 132, -156, 6, 261, 148, -257, -84, 192, -111, 129, 63, -270, -8, -47, -3, -351, 22, 137, 151, 161, 207, 81, -7, 162, 59, -135, 102, 226, -135, 29, 115, 9, -230, 61, -55, -134, -29, 186, -246, -268, 271, 116, -342, -24, 33, -51, -311, 312, 109, -134, 251, 339, -426, -84, 343, -114, -164, 71, -28, -317, 296, 396, -160, -274, 216, -266, -205, -154, 141, -314, -17, 331, -177, -68, 197, 310, 28, -179, 297, -140, 100, -16, 185, -100, -122, 333, -121, -88, 129, -187, -102, 121, -176, -36, -302, 14, -149, -189, 241, -169, -74, 119, 220, -217, -150, 87, 176, -10, 122, 137, -16, 101, -152, -200, 16, 64, -101, -286, 100, 153, -163, -79, 135]
3235A35k22O2L56l02j32K95j80j27K39j7j21j23P2R7r7L2J78k8m26M83%m87J94
3258a19M72k91k69L59p1Lj40J63j43P5ll3MM13k54l23J03K36j12m8J59j03j25
3281d7O5j4j31J46R2k01J59P1J6j08O3j55o4n1M52k39j6O7k3m1J78k56jJ90m6
3306A06j31j64J75J25k87J48k35L62k21n2K77J5r0K4k21OQ6J89m6m2J97k67K65
3329B19n3j29Q1J32k86j05K4J02J6N9j5l88J64K88K43m00n3K20k79O4Q2K7J28
3352A41M2j37j50R4k10L76j98R2m8N5K26l05J87k45n6J07j04K46p9o6L1k69K85
3375A5j55L3J61J02k30J88k72Q4k37K33K19m1Q1j59J14j20k8j26J63K3j02n5L43
3398B34l43O1J27R8m64M34k07j95K89J25q0j59O7K38J4k34l6l7p1K21j35o1J39
$$ y = [135, -87, -25, 331, 29, -103, 192, 12, -115, 124, 107, -14, -137, -65, 32, -65, -33, 145, 117, -309, 174, 174, -313, -119, 353, 62, -207, 152, 81, 84, -56, 107, -36, 39, 36, 3, 7, 420, 166, -157, -54, 182, 70, 22, 181, 78, -47, 18, 4, -127, 19, 111, -90, 69, 140, 156, 48, 111, -44, -108, -159, 293, 54, 38, 105, 82, 41, 219, -37, -38, 152, 106, -25, -189, -14, 111, -176, -28, -263, 99, -122, -174, 103, 118, 28, 52, -169, -163, -77, 112, 66, 24, 221, -46, 219, 166, 37, 118, 250, -36, -141, -117, -15, 1, 60, 45, -343, -179, 109, 352, -48, -101, 119, -160, -96, -14, 13, 141, 183, 46, -104, -10, -220, 156, -42, 50, 2, 57, 283, -22, 165, -80, -136, -29, -133, 113, 34, -32, -1, -270, 15, -140, -107, 54, 156, -74, 114, -158, -74, -311, -78, 141, 100, 181, 22, 136, 16, -12, -138, 25, 48, -54, -109, 234, -109, -48, 79, 177, -287, 147, -60, -255, 34, 159, 79, -80, -13, 225, 239, 5, -31, -68, -139, 82, -53, -114, 25]
3421B5J03m1N2j43J6K71l54L14P4m14L28j57M6j05K8o2P9J06j41L8J76k83J32
3444H8j3j36J75j53O3j3N1J83l73J02J58k28L15m74J78Q5kk85M4K16N5k63K39
3467A2K22l98K51j54K96q7j68j2j8l1j37M19O6k19j35j14M0k17K34N2J63j30L04
3490B39k28j79J02p6M78l24o8K60j60m3j82L47k11R7J1j06j79L2M33j78J1J1j45
3513e8k44N93j62p5p4K41l25M20m01j38J60R5J91m18N83m14j20K42rk44K37pk5
3536D8j29R3nl4m9P5j8o4J52k2O7j39j4L95n02J58J11k03k71K81k1k06K77j24
3560a44K14k60k3J92j91M48P5k64l84L91j30O5O5N3k13J76n3j39K54j52j66K9
3582a57J09k23J40qJ45l0j27K33j67j03J32K63l30K11J15j03O7l32L81m36K19
$$ y = [25, 128, 87, 139, -4, 12, 283, -71, 243, 317, -97, 231, 74, 120, 15, 43, -19, 60, 166, 25, 63, 239, -44, 88, 75, -61, 114, -39, 24, 11, 62, 245, -128, -26, 132, -96, 219, -255, -77, 8, 6, -279, -235, -19, 36, -227, 12, 234, -164, 87, -67, 229, 142, -26, -38, -56, -87, -224, 195, 261, 42, -93, -207, -167, -384, -150, -98, 65, -65, 239, 11, -168, -66, -142, 336, 12, -56, 204, 44, 1, -181, 166, -45, 52, 63, -43, -222, -190, 243, 65, 76, 87, -58, -302, 291, 129, 54, -20, 221, -104, 316, -85, -223, -63, 32, 223, -195, 388, -26, -146, 96, 87, -157, 80, 73, 48, -81, 12, 7, -27, -76, -1, -19, -83, 69, 47, 114, -25, -39, 356, -146, 12, 123, -80, -351, -70, -91, -297, -20, -144, 70, -190, -213, -21, -212, 236, 311, 47, -337, 54, -76, -11, 54, 107, -106, 70, 17, -122, 132, -20, -186, -157, -48, -271, -131, -139, 6, -24, -151, 82, -85, -188, -56, 207, -123, 88, 203, 100, 167, -165, 216, -220, -1]
3603an9J48m15M13O4j66l4Q9K09k76J75k36k92N15j39l0P4N5M0k91L01j10J40
3626A74k75K23k33J15n2OK50mk21lj05K8K44k47j9J7qL00k68J31k02J88o2J96
3650A73j92J80j11j82K83j14J90o2k25L1K09k64k0J42qj15J32k71M26k17j28K49
3672A06J39k74k2K6m2n0J82N2k51M46k73l38L27J09m88K89K66p7k81J44L62m95
3694a43j10K04Rj69J38L1K40j15J2K8k25K60j75j46j8K84j80L7k3r2N8KJ25K0
3718E2L0j97kK13j73M1K59j75m7j22J06J23R1l38M06k34r0r7R1N2J02K4n7j06
3742d8mK25l86L21j63pK34j86N8J26k14M7l9p4K0j8j26K09K60l27p9J55K05o48
3766d59N64j26l54K73p8L73k01j40M00k40j1J96k05J83j43N7l87O90j69j30r9
$$ y = [-1, -60, 88, -327, 86, 150, -16, -50, 39, 248, -28, 147, -89, -381, 134, -5, -35, 39, 94, 134, -157, 144, 34, 174, -101, 122, -111, 4, -48, -42, 208, 204, -17, -20, -125, -97, 147, -100, -119, -102, -110, 190, -78, 53, -149, 39, -23, 173, -19, 161, 50, -132, 151, 37, 227, 165, -60, -29, 180, -84, -104, 38, 30, -85, 47, -224, 202, -15, -143, 106, 245, -29, -51, -25, -67, -117, 65, 117, -134, 312, 39, -299, 28, 137, -351, -62, 204, 127, -154, -10, 352, -143, -253, -49, -40, -209, -71, -40, 200, 85, 97, 125, -100, 160, -15, -161, -179, 105, -75, -38, -61, -153, -95, -93, 32, 52, 82, -115, -117, 96, -77, -36, 223, 48, 1, -121, -15, 108, 199, -139, 267, 33, -57, -154, -63, -11, 91, 115, 58, -48, -52, 173, -213, 108, -55, -62, 172, -14, 44, 170, -44, 3, -36, -110, -90, -108, -234, -25, 235, -92, -171, -16, 189, -459, 105, -21, -375, -102, -180, 193, -8, -148, 252, 12, 1, 197, -8, 175, 32, 89, -298, 392, 223, 93, -6]
3787fJ62k24k36O01l29k64L53kk1Qo8J23k22QJ1N7j7K12k16R5j86K25l3o0J83
3812A54m39K39L71p3l23P4J9j94L96nj88q1J39pn4P2p1j95M69K6k52J26j19N8
3836A42k31K1J0N6k43L86m9j03k10M08k41q9J21J01L6K21n77J02M9N1O1K10rj69
3860E4n24M22L40k28k15K8J20j49K48J58n60L95J83l61k1J12p6J97j03OR3l89
3882b70L43k32j1N2J66L2Q8o6k37J6L07o2k51R4J3r0O6M65m44L6m0k30R3J44p8
3907i6m0nK30k39J87r4N91m58mL9o2j66J96N7j86o0J77j1j74K49k9k69R1J64k34
3932a46K20J9K0k75L13j12j93K7M22l71K28l5r4o2P5K03k50J25Qj12k37M92l27
3955f2p7J68L53n02p9K31J36k19j9J47j12J01m5L3oj23J23l57L45K8j90j12L29
$$ y = [-6, 156, -68, -304, 297, -32, -296, 57, 55, 34, 42, -26, 97, -125, -117, -106, -49, -66, 146, -70, 25, -161, 64, 31, -29, 154, -285, -46, 325, 252, -71, 3, 22, -172, 224, 219, 31, -50, 89, 82, 28, 100, 29, -166, 303, 329, 77, 203, 84, 142, -89, -68, -58, -2, -245, 141, 92, -11, -221, 187, -54, -143, -22, 79, 115, 336, -241, -139, -90, -39, 22, 232, 223, 54, -470, -48, 292, 64, -151, -123, -3, -152, 96, 254, -306, 89, 272, -89, -110, 2, -74, 123, 20, 26, 119, -270, 73, -159, -170, -118, 48, 80, 168, 102, -135, -119, 188, 126, -125, -31, -18, -108, -42, 423, -21, 15, -25, -255, -162, -18, -96, -136, -141, 89, -150, 37, -57, 534, 76, 72, 111, 49, -117, 79, 136, -50, -110, 67, 56, -118, 131, 102, -167, -76, 88, -146, 74, 93, 113, -162, 151, 39, -154, -127, 295, -76, 152, 117, 23, -39, 36, 239, -11, 114, 122, 10, -227, 265, -62, -139, 29, 382, -120, -199, 32, 168, -51, -70, 77, -35, 66, 21, 54, 48, -75, 48, -309, 36, 64, -126, -238, 91]
3978I1k80J62k2K32J1j88J83l87Pj3K22j14J15N2j34m5J98j62j07L5K09jm7N3
4002G0N4J03k53M9p0Q7K4j28J71k20J70k57R7K10k66J12j11K55l51L25k7j78N6
4025g8K35n54L59K93l3l26L31J04m10j37J74p0J51J84j61k24L2J37m5J00n8j38
4047a34j39K10P8j99L64k21Qk0L93k1m85J18K71k88N6nj56r0J64L32k48l2J67
4070A23k02M9MJ2M2j64L76l17k1L98j98k23K34J06m61L81p7J4m22M13jN9k94M19
4094B50k92k19N82j27l38K67O3l93R4J97jk1j15R1j26p6K87j59P9M8j64j82L42
4117H7j13k9Q8j04J45j24l0J61l22K28j6J59j96K45j44l2j31J56L9l0L20k86m1
4140C0n7K33l28k3L86o22M09R2j45l14L42J01k02K16j29j64J49R6J69n87K64J03
$$ y = [91, -189, -27, -49, 183, 194, 6, 189, -198, -191, -204, 18, -96, 19, 71, -63, -108, 90, -72, -179, -144, 65, 64, 17, 70, 124, 227, -26, 23, -47, 40, 64, -64, 107, -113, 57, -200, -103, 107, -159, -47, -158, 97, -254, 71, 44, -134, -78, 157, -397, -38, 255, 222, -104, 227, 331, -79, -216, -42, -112, 39, 223, 62, -162, -130, 7, -38, 62, 4, -134, -273, -63, 15, -184, 180, -41, -33, -53, 340, 319, -166, -48, 223, -65, -9, -14, -170, -260, -96, 236, -12, -44, 123, -79, -30, -26, -14, 28, -136, 240, -77, -98, 300, 102, -121, 113, 219, -242, 139, 62, 76, -346, 67, 66, 125, -169, 250, -42, -261, 321, 194, -144, 123, 186, -207, -113, 84, 83, 62, -53, 38, -88, -164, 123, -36, 43, 91, -73, -255, 87, -26, -55, 33, -71, 74, -50, -80, 81, -241, -13, -29, 130, -66, 179, 35, 3, -128, 28, 67, 37, 357, 71, 30, -27, 206, -122, -145, 241, -381, 28, 120, -25, -339, 3, 104, -98, 118, -11, -175, -26, 70, 239, -348, -84, 19]
4162A9N6j50K48j54m3J5J78j34j25L26j90j1j5o9o5j49L44o5j89K94m23K85m3
4185f0K21l11j15M66l43J12J15J06j52l4J50k61j58M07r1J44j91L75m56j93J04
4206a65Q8MK32mm19l2M15k25ML75j86l65K70J79k85R4M3m3J59K1J82l04m0o3J72
4231A07O3j30nj27M4J69k08k9N2J26m2o1J81k46K05J07j21j10J44J87o67P20j03
4254B56k86R4J26k91k47L64K49l54j22L22j16J91j24l1k32PK04l3oJ47j42k76
4276c00L24K57k78j10K98j04r6J14J31l75r7J56r5K7N6m7J72r1Q1K5%J69j79P7
4300A15J2p2l53N5M27l76MJ38J84k91R1K62n08M16r7j16qQ9R6k12LK96J1k09L40
4325B97k68j78P5J62j35K18Q2l88r2K44J59j86j43K72q5j21K35p8k44J42K98n15
$$ y = [19, 75, -75, 173, 19, -24, -9, 169, 35, -90, 236, 46, 35, 20, -49, -114, -263, 81, 16, -173, 121, -302, -17, -60, 161, -150, -265, 201, -142, -30, 85, 191, 39, 5, 155, -106, -264, 143, 52, 196, 5, 380, -76, -269, -165, -77, -73, 159, 155, -264, -296, 119, -106, -102, 273, 87, -278, -8, 171, -114, -20, 23, -20, 139, 160, 342, 38, -2, -65, 107, 170, 40, 35, -92, -48, 121, -87, -116, -64, 62, 20, -41, 140, -106, 99, 206, 85, -25, 119, 306, -361, 359, 256, -30, 64, 190, -101, -348, 16, 265, -89, -211, 111, -5, 186, 62, 31, -201, -194, 10, -23, -29, 118, -24, -300, 24, 281, 3, -107, 191, 87, -9, 105, 236, -139, -236, -80, -175, -148, -92, -139, 33, -58, 23, 48, 48, 217, 38, 115, 127, 55, -298, -243, 184, -192, -188, -50, 134, -157, -66, 196, -312, 104, 7, -109, -117, -28, 68, -144, -141, 155, 166, -43, 297, 29, -149, -74, 88, -47, 171, 253, -135, -227, 17, 176, -10, -153, 119, 34, -87, 148, 70, -174, -32, 266, -249]
4347b49M07r7k07j74L75J91k47o0M29k75j92L72k59j37R8j6j09J78l3pk15K78
4369E1N0j4j02pQ2r8P9o7p0L22k97p2J71q1rq3N18l30m2n9K05L8r9J20r2l12L7
4396a61M01k35J25k64k39K29J39j44J79l04J42K25J32j24N7l7M5J7o44L60J24
4417B3lj0j67N03j77j07o6M2l74J18L14l19N10m01m4J86N8k00q7K06J76k06k62
4440b87L47M6o2L5l1p4P0Pk10q0L93j60l45M38m5j26J05o3k62M38j8j73RK93m99
4465b54M7J87J59J86l42Q5K36l29K06j06k64K3L61m29K68J71l18O0k52O11l52
4486d6J77k52K64p6LR0j38p9P5R5k57L21j90l17L91J6l6q2M7J41L1j80Q3j40J33
4511G4J24j81L8J5J32k05Q1QJ83j56k35K01k14J13J45r0M3j79l3K12K65l12j01
$$ y = [-249, 158, 61, -146, -320, 55, 246, -1, -61, 368, 93, -99, 273, 14, -123, -25, -41, -150, 28, -5, -12, -227, 51, 101, 87, -15, -22, 60, -38, 41, -26, -96, 226, -71, -143, 28, -53, -62, -145, 373, 43, 1, -58, 147, 185, 86, 206, 114, -198, -161, 240, 5, 130, -134, -373, -144, -5, -149, 30, -274, -132, 93, 225, 101, 158, 121, 166, 183, -461, -101, 23, 20, 10, -157, 346, 169, 62, -4, 38, -336, -218, 96, -223, 287, -114, -158, 28, 86, -114, -201, 5, 181, -25, -287, 60, 106, 44, 79, 48, -26, 44, 51, -159, -239, 154, -6, -351, 87, 42, -84, 21, -42, -304, 134, 116, -57, -48, 245, -254, -207, -20, 139, 325, -17, 68, 304, -25, 181, 75, -189, -166, 195, -234, 34, 205, -113, -53, -305, 306, -46, 131, -121, 143, 67, 70, 160, 22, -57, 18, 113, -144, 177, -13, -330, 61, 77, 41, -41, 6, 147, 178, -2, 81, -59, 74, 198, 17, 55, 70, 202, -3, 78, 86, 269, 113, -122, 79, -135, -22, 123, 33, 76, -103, -136, 76, 341, 29, -72]
4534g2R0R0j72p6r6K29J76k55L5j07J96L2j88J97R3o2l94J87j7K3K61l07K22k49
4558a64K27R7j46J68l47J63J0M8l5l6r1R5K5N8J23j25j04k38L33L5l13J66K82
4581B31l87J20J02q0J53j34r2o5M53k14n8L2m4M8m8k50K48K1m9P9j28R0j89K79
4605A18j21k88M47m33K87J39j21M7N1o3j50K29J6j00r7R3P7j14kj51mJ40j29q4
4629b13m2K29P5l52N10K2k13m6K1L4L8M9k56P2o2J56J9m0k7N4j62O0K93m22J97
4654fO0J08j10j42L82k55oj44N6K29P3l03j91K48J84J20o39N50j62j88J65M1j26
4677e6j9L4K9J08m4L7k45J31Q6J75N6l89K97l45L22k96P5J28l56J36M6J0J93L9
4701A52k15J36j59j19L86l95J93j24K08K4P4k51J32j25K8j80J28k5L07l58J41
$$ y = [-72, 18, 108, -64, -140, -236, -7, 169, -86, -51, -158, 38, 70, -118, 79, 172, 110, -284, -97, -114, -91, 170, -137, 85, -164, 63, 160, 14, 182, -165, -2, 8, 56, 21, -15, -106, -11, 14, 72, 195, 70, -34, -272, 61, 96, -217, -51, 231, -156, -36, 66, -14, 139, 5, -87, -152, 301, 87, 29, 61, 17, 65, 17, -233, 15, 36, -13, 66, -62, 28, -161, 118, -3, -291, 156, -277, 10, 149, 28, 75, 126, 63, -87, 142, 158, 58, -39, 54, 131, 17, 15, -136, -140, 0, -129, -213, -255, -26, 49, -303, 207, 229, 16, -30, -9, 25, 63, 112, -144, -72, -134, 22, 41, 1, -26, 28, -134, -74, 219, -203, -6, 54, 162, 52, -90, 292, 37, 31, -113, -57, 172, 245, -58, -249, -1, 183, 303, -336, 214, 52, -136, 29, 70, -56, -75, -41, -12, 96, 52, 89, -156, -25, 61, 236, 292, -97, 200, -145, 177, -119, -44, 84, -272, -136, -90, -80, 113, 152, -63, 73, -86, -205, 181, -214, -21, -145, 63, 87, 161, -90, 42, -83, -55, -235, -107, -132, 175, -183, -42]
4722d2qK44o7k22L4l0J95o2R4l08K48j12r6P7J5J5M1J12J3k32J3k6L59l98n1L79
4748A85k10j14K12j5k3N5o1j82L69k69j54rK85j29L5P9K9r2K2R9j39K62l31J89
4772I3j83J96j63J53O5o2k50J61p6n6kJ57k6j32J76J4k1k3K39m59n9J30M8K48
4796A68p0l6k08P0R6Lj4J18L4p7m18L60j76j52K67j84K26m1m5J19j2j45K49k55
4820a23J18M8p3K00j80J96k33N2L68l52j7j23R2l58M54kj68J73l42L72k10K63
4842A55j56Q3j0j21j15J97j02k09J51K76j94j5J48m6j1j82M5J23o3n3N4j01K56
4865A10k28o4K37j26K91j50M8K07l49J13Q6k19J42N7P7m07L2j45P3L03q2J82j50
4888C8l22M48j48J44j43k29J33L11k07j77K39j51J22q2q3j25K58q0Lj4J10n0J09
$$ y = [-42, -50, 194, 127, -95, -61, -91, 104, 42, 136, -172, 76, -36, -132, -55, -40, -25, 16, 128, 141, -91, -78, -104, 255, -143, -194, 185, -25, -139, 73, 58, 35, 90, 29, -153, 216, -53, -207, -216, 69, -60, -25, 54, 83, -9, 13, 112, -27, 235, -96, 93, -90, 106, -57, 96, 161, 99, -151, 10, -66, -122, -124, 33, 7, -125, 51, 65, 44, 21, 260, -199, -258, -128, -80, 168, 98, 62, -146, -76, 20, 23, 9, 127, 161, 84, -334, 26, -150, -302, -35, -219, 7, -34, -79, 40, 28, -117, 132, -123, -5, 43, -30, 170, -10, 186, -47, 5, 373, 21, 4, -119, -27, -385, 69, 67, -101, 72, -270, 102, -108, 155, -1, 82, 72, -49, -164, 33, -69, -278, -127, 149, -45, -60, 88, 42, 31, -151, -106, 17, -46, -99, -45, -146, 110, -118, -182, 55, -71, 220, 70, 118, 325, -24, 89, 175, -44, 98, 155, 232, -175, -143, -288, -215, 88, 6, 188, 38, -284, 164, 16, 160, 17, -212, -79, 232, 25, -152, 87, -64, 58, -24, -107, -232, 26, -54, -51, -65, 45, -5, 104]
4911A04k41L2k5L7j49K70j29K42k49q4J97n3J9J96r2J62k51r3q7J09q4j53J29
4934a93q6P6K45J00p2pl54L80J80p5p2l9o9K26l13K93k3j48j93J1JNJ90o8j86
4959a91K93j54J16J3k18L45Mm09L06o6k54L57k13L2J06J03k49l6J69o2P4Q8o0
4982I4q0n2O3l4k5j21J80j99K68r5P1j63o7K23J1L18l80j03J14qL9J0k04J64J69
5007A93l13J84J24j89J20n6pRJ17k04l5J02q4r0J99J08k68L58k31j88K54n4j38
5030h9L32l3j37m53N74k16l4KJ17q9j59M34j92m8J90J47q2k63p8p2K3K43j61j06
5054a50n5J19K04j77Q0%r3P2l7J6j37Q1k11M42l62L41k09k12J48L10k81O9j25
5077a67M34k52R8n8l17M82p1j52q6J44J44l76O3m8K91j57J23m1j77K85k11K4m3
$$ y = [104, -137, -105, -130, -93, -242, 28, -101, 141, -108, -192, 5, -48, -29, 167, 75, 237, -14, -107, -194, -85, -169, -322, -193, -279, -203, 42, 142, 70, 63, -291, 89, 269, 194, 122, 83, 14, 240, -73, 220, 197, 49, -144, -133, -132, -127, 63, -5, -191, 102, -52, 64, 77, -141, 204, 208, -201, 105, 39, -215, 142, -71, -39, 67, 170, -79, -115, 54, -8, 66, 154, 94, 14, -38, 25, -9, -34, -155, 25, -174, 94, -1, 70, -93, -160, 63, 74, 392, 12, -91, 23, 15, 54, 64, -140, 24, 193, -120, 64, 188, -1, 119, 63, 56, 65, 182, -22, -57, 45, -39, -129, 70, 178, -90, 268, 37, -151, 103, 49, -89, 243, 210, 73, -380, 194, -22, -56, -54, 63, -26, -185, 249, 57, 9, 199, 346, 264, 1, -77, -149, -126, 117, -44, -150, -205, -86, 118, -59, 21, 21, -72, 0, -37, -21, -158, -77, -288, 154, -208, 133, -76, -288, -140, 170, -111, -42, -167, 267, 15, 113, 55, -262, 220, 149, -3, -89, 55, 199, -177, -114, -162, 129, -28, 95, 54, -123, 162, -49, -25, -68]
5100f8L5J28L6j5j03J80k91K56m52J51K4J89k55L31m1P5l11J23l8R8K73l10q2
5123f7o3K17J91j46r2j05o0K87O2k36q1o4L3L75l4l66K30O2l14L37k78l4j4R9
5147f1N6R0m11M74q2r4o2J57j78J78J90l19q6qJ58J02J69k0l29K13j06n1k7K40
5171A93o5m11K35l32L87j4n6n8k6L32j50J00p0q1J20k55R9Q5k91K69J34M3l61
5194a73P9K48l77J15J68l8r4K6j16O9o3J30K1P0j05J34k52J32j4j45K28k10J52
5217a5MN3k6K00l27K87n8q6O5l55K62J69Qj14J41k05K3j71J77JK27o8j59M9j55
5242g3K09k53k4J72J7j66P8J27j80R0j36L41k39J81k2J2O7m23n3K65J83j97J75
5265A51R9j23l46K05J64j18j53K83k47Q8k4p1J41k06M10k92N1j51J29J2j8l2k7
$$ y = [-68, -33, 95, 131, 116, 13, 193, -98, 158, -294, -143, -119, 70, -185, 146, 105, 180, -131, -8, -46, 52, 325, 15, -67, -130, 87, 278, 132, 40, -65, -125, 162, 224, -12, -93, -157, -124, 251, 217, -149, 81, 143, -171, 166, -112, -146, -160, -61, -5, 85, -326, 148, 66, -28, -90, 67, -111, 67, 257, -62, -148, -156, 2, 104, 273, 253, -76, 137, 31, -20, -47, 193, 128, -283, -48, -380, 7, -7, -63, -121, -147, 185, 35, 135, 65, -16, 104, -151, -52, 33, -258, 11, 145, 188, -173, -94, 154, -223, -108, 60, 22, -72, -46, -162, -93, -156, -26, -5, 65, -40, 94, -158, -26, -40, -185, 43, -167, -15, -11, 42, 16, 216, -111, 176, 118, 32, 97, -258, 4, 173, 181, 67, 208, 3, 26, -145, 32, 33, 260, 192, 33, 82, -73, 136, -117, -141, 31, 48, -118, -40, 87, -93, -3, -139, 202, -37, 144, 122, 134, 201, -222, -275, -10, 173, -24, 151, 250, 127, -219, -14, 150, 32, -121, 162, -85, 3, -21, -92, 49, -157, 253, -39, 12, -139, -10, 2, -16, -48, -75]
5288g5J33o4K87l13j03nq8L8K86P0k75L02j11n1j18j18L47j47R0N6j70j35K26
5311F2j65K61J71j16k69P2RK3j1o3p2P7M2k32K32M4l4j43K07M1ol5K0j31o2J97
5337A19q4l3J62j46j28Q2l2K03j79%J23nj71M1l9j26J92L25k71l6m5P4p4k53K43
5362e8J95k54K13j4k35J53J26k06L71n4k08k7J47j63K00k16J15j33n5K03k47m8
5384a95R0K02O7j61N6j8l07K80n0rJ44m4K2j81J04j44J73l8O5k70J97J44j17k56
5408b46P5K54J40J4k08k14M0J33K99j37J9m02L18L2n22N04k14r7N89M0o45M06
5430A78Pq7n3k02R8J41p6Jo0J5j54J55K4L6L6J15j50n4L1M2K9n8J12l8j12J83
5456A59k39r3L09p0l7j27L18k21NJ71k11o0J67j07K80l99K88l1M9m9Q3l02RK51
$$ y = [-75, 58, -6, 281, -32, -135, -140, -228, -190, 96, 166, -109, 193, 82, 31, -87, -205, 142, -5, 85, 141, -29, -164, 62, -103, 158, 329, 213, -56, 16, 25, 48, 37, -26, -98, -21, 21, -211, 21, 65, 31, -112, 95, 136, 130, 95, 115, -16, -78, 119, 35, 2, 164, 18, -110, -28, -60, 143, -36, -36, 87, 82, -89, -48, -87, -213, -21, 304, 33, -3, -48, 26, -48, -301, -58, 137, -117, 96, 82, -153, 0, 126, -80, 291, 237, 29, 2, 149, -14, 186, -30, 85, -48, -103, 100, -147, -195, -105, 97, 164, 3, 59, 41, -266, 14, -36, -45, 99, 55, 77, -104, 0, -144, 29, -9, 56, -214, -17, 127, 10, -246, -171, 83, 223, 237, 29, -185, -145, -12, 287, 150, 169, -233, 85, 117, -405, 99, -115, -212, 377, 417, -228, 178, 185, 98, 45, -157, -59, 82, 6, 7, -53, -38, -192, -37, -13, 23, 59, 174, 24, -30, 1, 43, 72, 14, 126, 88, -24, 159, -80, -173, 136, 66, 29, -98, 220, -1, 4, 175, -36, -96, 71, -36, 244, -155, 133, 102, 151, 102, 185, -117, -108, 143]
5480A43k82OJ97R9l58J64J64l6j33k7r5J77l7MK1J53p8l5q3j9P1j29K30k55K80
5505A42m2k51L68k11No5L11p7j29K5J5j22L3jo5J18J99l34m9J78Rr3K00N2k51
5530c5R0lK1N9J57j53r1p7m8K26j49R1J53m23L46j11J08n5l02J42j23J13K1k01
5554b44L37J1l8j30j5L97k45m6N1n8J16n1r3Lkj22K53l02k2R9N0Q0n7j11Jj4K
5581a50Q2L14k31q9K59l80N4J12J79j29jK5l28M9P7M33m52K66k94j14L06J52q
5604A32l24K43r4n0j17M26l51r8M58k58L2j39J13LO6J11q6k78L13j03J2K16j44
5627H3q4J8R1J37k96Q4k4R3k21j3J80j7J53R9k28k48M39l48O6J59J19n16M91l23
5651a06J13k36K22J19l53J90m9J50p8j30J96K20k32q3o3J41l21J86n6R4j28R2
$$ y = [143, -139, -133, 64, 163, -195, -31, 133, 97, -36, -63, -158, 19, -18, -14, 7, 160, 82, 47, -36, -55, 16, -113, 117, -138, 142, 100, -151, 217, 6, 11, -54, 257, 180, 51, 76, 91, -31, 2, 1, -64, 54, 253, -81, -130, 48, 57, -36, 164, 216, -35, 55, 52, 73, 132, 289, 136, 45, -32, -80, 146, -3, 88, 241, -182, 164, 53, 161, 106, -196, -54, -177, -64, -43, -244, 93, 104, 66, -64, -79, 318, 73, 27, 78, 20, 136, 85, -8, -5, -7, -129, 124, -178, -200, -101, -51, 29, -28, -139, -138, -152, -150, -68, 246, 15, -74, 185, -195, -141, -29, 150, 21, 20, 45, -283, -234, -157, 276, -176, 90, -204, -318, -12, 140, 132, -192, 51, -43, -93, -210, 216, -135, -233, 225, -33, -1, -140, -27, -24, 42, 153, 67, -211, 102, -1, 11, 227, 83, -1, 17, 108, 245, -51, 33, 9, 102, -119, -132, 48, 31, 184, 283, 55, -193, 246, -102, -36, 123, 242, -274, 217, -106, 7, -229, -7, 112, -241, -51, -100, 50, -28, -158, 38, 258, 26, -57, -120, 21, -300, -114, -170, -76, -204, -112]
5673a12K58k09L6J5o5J75l77K24lj29J85J69j72J76j17O7l08P8J74O1k8PK1j79
5697e3l3K3J04j64p0K28k03K26k33K09ro0o3j21K87j50M3P2J67k50j63J64Q0j85
5721a54Nk3J34r0M66l67J0N44m79p6J88j47N2j75j0J81O9j9O9k35J60Q2j46m9
5745a0l0N1J0p9K3p5j36L68L9k92K32m01K17J58j00K31l86L40l99K38J04Q1j98
5768a4P0k53L51k98R0M9J31k11O9J1rJ99k50R1l4J80j2j85Q0l39K57K36r2L7j91
5793c7J27nk9j86R8K9k34L29j11j19L35j28j28P7R3p9r7L3k98N06k28OR1n9J38
5818A24j97J33l26K96k7n0K75l96P5M16k40l53J78J65N6o9j36n6j35K87n8j84
5840b22J01K14J87j38k7j85J40L29m68J29j25L7R2j39M7J65l78K14K76m09J86
$$ y = [-112, 146, -63, -27, -12, -77, 98, -279, -55, -58, -187, -2, 167, -5, 171, 54, 121, -187, -109, 65, 126, 98, 105, 126, -53, -86, -63, 41, -123, -193, 35, -168, 58, -175, 34, 25, -35, -98, -219, 68, -82, -39, 33, 200, -50, -213, -49, 31, -154, -149, -172, -38, -128, 338, -29, -19, 525, 46, -30, 158, 11, 63, -112, -122, 59, 128, 109, 178, -57, 103, 185, 39, -10, -40, 11, 21, -58, -35, -110, -246, 122, 161, -131, 101, -300, -83, 75, -25, 206, -180, 160, -239, -1, 103, 184, -14, 56, -197, 154, -144, -54, -5, 126, -85, -16, -5, -14, 185, -65, 26, -8, 172, 160, -25, 55, -284, -27, 209, 117, 154, -37, 90, 85, 56, -130, -32, -3, -237, 92, -19, -138, 197, 69, -59, 18, 111, 32, -65, -32, -330, 176, -52, -46, 45, -14, 124, -73, 60, -266, 30, 3, -47, 228, -168, -93, 323, 83, -270, -92, 73, 129, 60, -76, -132, -267, 20, -38, -222, -121, 93, 280, 142, 115, -70, 70, 399, -69, 60, -65, -28, 64, -75, -28, 137, -241, -27, 249, -160, 26]
5861B6j17Q5J28k23P2o4K77j7J14j05p1N8k80J25J2n7nR7l23K1p0L80k36K24o2
5886a1k7P4l5J27l28n5K52n5J46j01j31O0Qk47L27oR0L65l61l14K96K3k01K22
5910A18n4j39J31pq5r9l6K66k68K76k17J39o5j25N8K18k78K88j32P4O4j11Q9m00
5934b95K40PJ08j4O6o7N5m22L07J45j28m1L30k43O8j23P4m9k06J71O0r0J46n3
5958D6j36j83J9K00jK4J43r4j50L18k72P1J51L1k21j11L24j25N6n8K8P1r4K19
5982B56m63O3J55l53L21J39J72m8l5L5l83J7J48J4j78M7K54l27L38j86O3K9Or0
6006fK06j61k3r8n0M93m34p4Q3L04m42L60l25K41q6j56P1J21M5k74M17j74N4m52
6030c60J86L53k48J20j63K00o9J27N7j75j62J48R2J9o9j39q6O6lPk3L30Nl69K20
$$ y = [26, -91, -6, 122, -101, -29, -93, 184, 167, 281, 176, 105, 163, -117, 8, 20, -37, -42, 55, -268, -247, -317, 63, -173, 51, -11, -38, 36, 1, 128, -200, -255, -3, -58, 88, -13, -144, -84, -76, -323, 4, -2, 88, 453, 92, -222, 74, 97, -104, 118, 64, -75, 56, 49, -36, -135, -171, 95, -173, 103, -114, 25, -40, -165, -107, 111, -167, 121, -11, 63, 127, 16, 105, -295, -55, -48, 60, 46, 112, 45, 100, -322, -15, 130, 2, -39, 291, 48, 116, -7, 67, 18, -188, -17, 43, -47, 99, 46, -90, -273, -254, -54, -55, -31, 112, 18, -132, 186, -86, -15, 136, 167, -54, -165, 159, 34, 90, 32, 60, 131, 37, 256, -207, -144, 11, -342, -21, 118, 290, 242, 207, 242, -141, -124, 24, 38, -140, -93, 161, -166, 172, -14, 49, 78, 84, -6, 200, 39, 16, -82, -132, 361, -73, -147, -64, 240, -202, 158, -167, 74, -12, -168, -97, 24, 69, -205, 212, 38, 92, -360, -174, 179, -69, 51, -112, 88, 19, 146, 203, 28, -134, 14, 106, 125, 56, -83, -169, -103, -106, -99, -122, 208, 213, -156, 64]
6055F4Mj59J44q0O3K9n6N4R7J4j11k8O8j26n4J52k66J98R3o4m7K30O7l00J84j52
6081A8M3l38J93J47J5j34oj52J14L49m10K55r6j69K73r5k76J63J20J04j53R3o7
6104ij6j37J97l21L50n1l2n8r3K69j21j57L23k59J99j27M9r2J4K04P3L0l60K4
6128a01l2Q1J18j79k0J05OP5J61l66J07J7M9p9K55k53K18q9j07M7l8Q5k1J49l16
6153a28J47j1o1n6K04k41K07l77N82l06r0K24qj93j12K50J75j75r3J4mL2K15n62
6177c67M57k12J75k02k97M86j65J59J93l78K09J06j76r3J60K57l81lJ51O6j30
6198A5Q4j93K50l14K27K33j65n4j53NP5J96l05J09K80l22rk3k3R8k2L0R1j51K34
6223A93k80J86k85M18p7k43L06m48L1L55o9k43M3L15k77J19n5j6O1nR4l6k02L95
$$ y = [64, 68, -91, 53, -27, 36, 65, 9, 63, 160, 174, 63, 35, 103, -23, -77, 75, -191, 7, 100, 36, -11, 219, 286, -14, 170, 18, 61, -277, -84, 63, 78, -56, -62, -214, -100, 249, -161, 94, -2, -171, 102, 7, -269, -106, 14, 118, -35, 58, -9, -25, -162, 35, -286, 64, 13, -19, -77, -170, 99, -22, -179, 144, -115, 84, -43, 6, -86, -72, 132, 205, 235, -125, -101, -133, -52, 66, -113, -133, -28, -22, 53, 214, -152, -45, -28, 21, -58, 197, -56, 162, 73, -34, 13, -25, 60, 39, 188, -128, 19, 8, -53, -109, 95, -146, 61, -316, 266, -40, -130, 94, 86, -107, -219, 31, 206, 31, -62, -48, -52, -20, 195, -367, 90, -122, 53, -149, -446, 40, -125, 34, 227, -151, 58, 164, -12, -105, 55, 312, -69, -72, 79, 145, 15, 99, -94, 156, -158, 69, 302, 137, 83, -70, -65, 10, 206, -99, 10, 290, -32, -41, -64, -87, 11, -11, 19, 110, -41, 193, -87, 99, -186, 232, 155, -88, 218, -230, -199, 156, 87, -156, -113, 202, -75, 44, -11, -27, 34, 29, 123, 87, -115, 280]
6247B80k28q1J80j46K7k7Jk75K48L14k85l7K36j82J89j32m5j9O5r6j42K13J0j6
6271E2J79l87J00J86j34j90K11J95p6J13l92J10J29j46p9K44l25L0K01J67l12
6292a24J31K53k35M2l5O9j95k5L25l58j02J20PP4J81P6k25j3R8j6q3J47k0o9q1
6317e8M6J8J08l3no4o6N8l6l0L8J12J72q5k12J10l08K97o4J54j59lk54J86J81
6342A03j61j22J58o3Q8j40L23l26k4N11m55p5K75K07l33j20J56o0R8p7J12q4N1
6365D2l1J7j93K08q8m5j07Q2K00k34J86q6r8L51j37K7k87K78k35N8l9j6o4M70
6389B59N1j55j72K56j80j03m1J42k26M27k54J24r6J41j52j79J17J52k06j43N91
6410C53l58j05K44l07J03J43M6j58j83M20O5k46Q8k8j56N9M7J11o8m5l4k71M00
$$ y = [280, 52, -29, 151, 5, 32, 5, 6, -269, -21, 293, 8, -29, 207, 25, 214, 82, 37, 18, 83, -13, -155, 58, 68, 52, 231, -156, -56, 130, -4, -194, 17, 212, 136, 249, -143, -33, 96, -50, -129, 115, -210, -180, 21, 188, -124, 7, 260, 25, 67, 32, 101, -94, -119, 206, -152, -254, -134, -127, -53, 128, 204, -21, -34, 64, 48, -35, 112, 92, 23, -58, -12, 6, 114, 81, 76, 12, -54, 4, -32, -62, -24, 88, 260, 175, -37, 73, -235, 62, -2, 152, -7, -10, -264, -78, 103, -58, -180, -22, -85, 3, -137, 186, -140, -164, 347, -108, -183, 92, 299, -34, -154, 2, -58, 40, -37, 75, -9, 42, 11, 28, -165, 43, -45, -90, -197, -115, 85, -149, 37, -49, -147, 204, 67, 94, -193, 85, -150, -92, -131, -147, -211, 259, 310, 155, -17, 239, 59, -44, -85, 57, -169, 258, 4, 128, 32, 173, 21, -158, -41, 111, -95, -238, 353, -5, -110, 134, -173, -70, 73, 119, -39, -222, 198, 263, 17, 105, 77, -79, -20, 27, 138, 70, 25, -9, -280, 120]
6433A20l8P2j10K07l24K8Kk2K47l36J39j56O4J8L59l03J96n7o0l36L17p1Q8J45
6457A89J89m41J24N3J09l76J00n2J74j55M75o44mK8J38P8K16k19m7J53m5P3l19
6480b03J82K37m8j86o6O5l3J86j12k67J53Q7j11J41o2l8j69K45j72n6L38k13K43
6503A41k93k23N03r4R6k56j5l0L62k2k42M8m1k00K03J49k48J02k40N10n22J87
6525a25K07j75J04K49j38j52j8j41K70k19K34j01K5L2O5k58Q3J36q3k26J27L20
6547B16j74p9K96k50j02K12l90K61j8q1o0J30L23k59j15J28R4j27k19K12q1J45
6569F2K84j01m15j40M44o6j95n6%K37j40J87j51Q0J00Rk6j34J33m17M33Ll98J87
6593h0Q7j04j2J87Om02J00L87j58N8j7j52J69k86J90P9l08L80k44J87N5j54N5
$$ y = [120, 82, 154, 44, 251, -73, -45, -43, -65, 182, -154, -15, -171, -107, -89, 270, -33, 163, 106, 46, -290, 27, -44, 44, 189, 378, -63, 61, 114, 223, -153, -53, -105, 69, -86, 389, -255, -259, -231, -93, -15, 201, -18, -65, 88, 43, 116, -203, -21, 216, 168, -18, -84, -19, -52, 134, 22, -245, -92, -5, -116, 25, -37, -75, -244, 1, -171, -227, 111, -102, 141, -152, -375, 128, 34, 130, -126, -141, -171, 191, 169, -73, -25, -66, -266, -63, 86, -162, -60, -300, 210, -312, -125, 82, -93, 11, 260, 122, -30, -48, -189, 81, -138, 96, -5, 20, 52, 117, -141, -58, 78, -5, -231, -104, 216, 42, -37, 259, 9, -93, 119, -271, -10, -28, -109, -169, -39, 284, 25, -90, 38, 132, 5, -214, -2, -83, 62, 346, 245, -170, -310, 134, 68, -127, -183, -183, 54, -86, 101, -50, 30, 130, 139, 113, -21, 112, -305, 128, 131, -267, -80, 7, -97, -109, 78, 84, -318, -218, 169, 11, 69, 52, -100, 69, -217, -27, 52, -256, 124, -120, 67, 122, -32, 23]
6616B3N1J51j54l35M18j59J04l44L23j24P2L5j25j52L49M1k80%K76l08j0L31p5
6639A08j90O0K2J80p0P3k72L7K6N4N6j52J84j60k63M82m6k64L94l62J26j50K03
6662G6R4l05J16K25m14J32K98l06R3K4J57l42K07R7k63J5L05l52j47K93n8m4p
6685a06k4J17J10q0J1J6OM2j87J61r1oj82N5O4l8J08M9j80K74j86n4n7J76j21
6710a23P2j11N3M3O5J12R4l48q3O36k31k09K24l23j74L21m0J83R5P5k65m33O30
6733B63j84j27j30J36J31j91K95k84M7J16J94k39j59L27j40o2m3n2R6J81kj91
6755a8j03m1L17j67j59K16MP1J00k20j19l9J85k05O2M07k67mL4R4j99K11l54J07
6779h7P4L7L2k05L82k14j57R4J28j34J46L7j03Nj62J04k02K6K35p1j64L61nl15
$$ y = [23, 74, 225, 71, -264, 154, -5, 99, -245, 78, -46, 26, 61, -64, -216, 133, 174, -106, -106, 170, -138, -148, 183, 108, -82, -22, 0, 180, 110, 183, -89, -52, -26, 28, 84, -68, 116, -44, -307, 175, 129, -135, 259, -103, 23, -127, 76, 170, -135, -19, 206, -208, -76, 222, -84, 9, 33, 190, -152, 55, 152, -111, -96, 209, -143, -290, 3, -55, -99, -106, -130, -13, 97, 17, 28, 44, 50, 92, -95, 66, -25, -31, -213, -158, -94, -132, -24, 25, -155, 119, -67, -121, -178, -2, -123, -51, -162, -109, -66, -1, 111, 205, -143, -226, 410, 179, -30, 194, -129, -303, 18, -22, 161, 256, 331, 66, -367, 263, 79, -48, -178, -42, 89, -102, 193, -91, -44, 72, 266, 27, -132, 195, 55, -7, -50, -102, -6, 175, 173, -18, -121, -162, 155, -12, -171, 45, 49, 120, 220, 0, -119, -158, 27, -178, -116, 291, 24, 20, 54, 148, -51, 160, -194, -87, -13, 24, 56, -149, 233, 19, -138, -44, 84, -50, 96, 133, 30, 35, -127, -23, -225, -199, 36, -35, -199, 162, 157, -158]
6803a58O8K23m13J30N67m79p7J56O6l16M3K82k44n9O9J72j21j70M66k61O3j00
6825i3J52l99M11p8M33k94lj27j78Q7p0J22jJ17J21k01Q4J75n10M72m48J46l5
6848a17K34k16m7J71J35l47K03K45j09k07n6L43l37R0L3j01R4J40M9j24P7j4j28
6871A1k9J78j06l27K59J42p4rPj56J18K03l03r6L09j56p6J45N2k00L6Q2P1P5k80
6896a24L36q4k58M01l39N7j0K29j14l90L44j7j29N29l57r8O4n7K0m1K09j07l9
6919B5k4M3q3k35N83l05k29J81J32k52L28j71l34J45L25k4l89L26j50j32L34j99
6941a05m3k09M14j20j30R9J12l7J51j40P1Oj96L51j61k30K80k12j5K55j99k87
6963c45P1K36n2j55J82M37m77J40N5l88M52Ql6j68R8K51l35N0j56O5l34N54j90
$$ y = [-158, -90, 133, -280, -150, 417, -62, -139, 17, 83, -233, -190, 92, -152, -211, -142, 30, -91, -261, 205, -56, 7, -93, 59, -340, 71, -7, 426, 132, 129, 2, -176, -89, -159, -37, -38, 79, 200, -1, 83, 258, -252, 220, -228, -82, -117, 117, -99, -146, 25, 160, -187, 16, 261, 152, -55, -111, 232, -105, -15, 18, -83, 11, 151, 200, 76, 153, 139, 11, -18, 160, 54, -273, -14, 128, 54, 45, 52, -104, 14, 217, -86, -182, 127, -29, -105, 40, 92, -108, -72, 10, 81, 156, -124, 212, 128, -130, 271, -68, -11, -21, 208, 94, -296, 48, 31, -98, 431, 74, -24, 40, -17, 3, -38, 171, 64, 25, 1, 44, -39, -274, 309, 4, -225, -44, 88, -164, 164, -7, -341, -196, 129, 105, -284, 42, -108, -240, 94, -105, -148, -357, 57, -63, -193, -94, 18, -19, 132, -8, 63, 69, -127, 224, 63, -167, 113, -99, -114, 141, -58, -345, -274, -38, -90, -245, -63, 374, -103, 37, 92, -296, 156, 164, 128, -40, 58, 309, -26, 24, -132, -67, -401, 153, -37]
6986c7p1K7N7j72J2J33J16K8k2J05k82K14j10K06l98R5Q6j00j50K39L8l8K73k38
7010A1R5j20J41N3m3o4j71K26K00k40J03l81J85J24l09J27K32k16K53j24l90L50
7032D2j9Q5j67j1J94l16n1J93n7O1Q1k37M60l02j21K34j99K90j61QR1K3k26R4
7056a1J61j39J24j03L6k85J23M06k62j12J51k51NL3J29l26L58J03j96j75M18k46
7078e9k26K69j4N3M6P7p2m29L78J94m34M79k84q2K47j01r5J11kr8J47j10J24j63
7102d4J51p7k4Nj38L86j10l51K37K06k69K84k79L1j5K8K8l81M04Pl1J83n43J66
7126a46j2K47q4l70K69J96M0%J49k59J9J27l37L45j84j49R1l79L85K78l42J47
7148C1K22n01K38P7p7K12l43M14k92n8L9n2Q5J58K4j91L42k77p2k25J95Q6k07
$$ y = [-37, -108, -81, -24, -196, -184, -51, 65, 93, 71, 176, -106, 108, -2, 204, -194, -99, -13, -113, -263, -24, 14, -24, 249, 11, 106, -14, 127, 180, 137, 73, -98, 128, 328, 88, 191, -190, -5, 119, -190, -63, 169, -47, 206, 82, -308, 42, 23, 108, -59, -70, 124, -192, -243, -50, -107, -46, 35, -202, 258, -44, -165, 69, -130, 160, -1, 7, 98, 121, -105, -11, 150, 11, 135, 32, 68, -217, -94, 312, 50, -62, 89, -162, -157, -124, 5, -321, 37, 140, -56, -231, 187, -59, -285, -16, -30, 23, 69, 146, 74, -355, 23, 217, -217, 262, -22, -104, 143, 42, -53, 58, 56, -42, 105, -5, 119, -44, 107, 30, 6, 11, -127, 259, 149, -202, 35, 241, -28, 256, -23, 8, -7, 21, 49, -332, 72, 79, 48, 231, -312, -146, -158, 89, 5, -365, -96, 100, 140, 140, 289, 30, 49, 176, -161, 184, 0, -149, -58, -437, -52, 226, -116, 31, 253, -248, -10, 67, -10, 202, -141, 273, -19, -77, -38, -90, -5, 153, 177, -14, 328, 51, -21, -246, -51, 35, -172]
7171a72J51J74k46L6K8M9j35J05N6k47K68N6k25M5J76j82M5L35l27J82k52P5L4
7194B9Rj6r3J38k2Rj99k1J46K28j81J59k46O3J33j9j02P6j81K34k71k52P89k85
7218A25j90o2J29l9J91k52j22L51m0M1k64L02m5k04J51o2K16l94M36j12k47J59
7240F8J46k51Q2j8K7J21N3J1k35n6M86p08K45J19J4l6j38l6M6M1J07J07m57J83
7264g9L5j10K44K0N8j88K54J16k50k84J60m0P4n5PN5K49k17q0O8P4j60pL79n98
7289b75K37L15l95J78j02J22q0m3Q4j41LJ0NQ7J11l82L71k27m4NR7j67M52k57
7313c6j6K06j82o2k0O2L1k38K65k11j4M57k40p6O7j46J96j86L29n8l71K29p4q
7337i6NJ67k89J00K09K1j13j44j09L66k90L22j79Q7J69p9j31j51K32k17N8L63
$$ y = [-172, -21, 153, -93, -57, -29, 20, -115, -10, 46, -201, 67, 123, -102, -57, 119, -63, -18, 317, -10, 172, -80, -5, 29, 38, 22, -71, 67, 45, 54, -145, -166, -20, 208, 27, 186, -60, 3, 136, 117, 15, 91, -90, 144, -127, -379, 410, 125, -65, -127, 2, -37, 154, -98, -220, 131, 91, 132, -132, 170, 125, -79, 72, 10, 226, -168, 268, 156, -91, 68, 214, -37, 45, 27, 54, 175, 228, 239, 4, -52, 434, -274, -29, 90, 104, 68, -70, -106, -60, -19, 88, 195, -262, -79, -44, -154, 90, 110, 168, -20, 234, 350, 100, -184, -24, -64, 10, -45, -38, 17, 266, 49, -31, 37, 111, -49, -56, 323, -275, -38, 277, -118, 60, -42, 80, 0, -43, 41, -100, -97, -87, -82, 5, 116, -266, 105, -122, -166, -161, -64, -231, 221, -36, -52, 154, -28, -90, -110, -48, -17, -255, 10, -201, -215, 242, 2, -74, -7, -153, 43, -143, 186, 128, -243, -14, -88, -96, -91, 76, -213, -113, 96, 117, 4, -140, -249, 117, -173, 149, -30, 57, 226, 147, 16, -135, 97, -120, -62, 301]
7359C01K4l84j73L53j84j65j64N06j25k7J55j53J13K02j25l60J14K05j15r2N15
7380D21o01p2L40o9N0n5K22l42K08n2L4J1m0Ol25J89o2j85M43M1j86J14m7j46
7404a03L0R9K3Qk69L58p4p2m7J55k68l3M46on87L89n8J1j04J14n9k07J66K68l81
7429b01M50P5k13o6J21j91J1p1K23j15j72J69k67K42J63N4l29lq3J75p2L2J21
7452E3r5R1J18l01j18L34j35j82J04M01m09j21K16J93n08K83J49j49j6K43j26
7473B5K8j02o8K77k07J06j74j0j22K95R9K50k78M9j06R5j11j9K2p7J54n10N94
7496B10l26J43Q3n0j97M9OL3k00K61o0KL2q7j79Q1M13k42M7m3O8N0j30L05j7k40
7522A2J09O1k45K47O2l71n5L18j98o6K17o1j5j11K51k34J93k92J86m8n6P9o1R6
$$ y = [301, 325, -59, -232, 121, -63, -228, -392, 114, -11, -38, 117, -36, 77, 279, 154, -206, -92, 113, -2, -94, 421, -180, -252, 88, 19, 69, 14, 236, -106, 102, 50, 84, 95, 55, 61, -264, -75, -137, -322, 121, 162, -24, 90, 43, -103, -73, 26, 49, 57, -212, 146, 72, 0, -47, 108, -160, -193, 253, 247, -340, 49, -9, 2, -102, 12, -47, -254, -88, 180, -201, 249, 324, 111, 45, 166, -25, -14, -85, 138, 23, -149, 20, -247, -5, 158, 212, -117, -120, -203, -28, -100, -68, 53, -42, 49, 167, -134, -252, 82, -53, -235, -131, 270, -139, -260, -44, 149, -359, -76, 73, -76, -92, 151, 25, 53, -49, -117, 160, -47, 59, -115, -125, -247, 48, 147, 397, 119, 168, 62, 157, 46, 27, 49, -28, 126, -384, 210, -116, 27, 110, 60, -137, -88, -82, -49, -249, 12, -48, -46, -14, -101, -280, -199, 214, -28, 19, -24, 44, 94, -36, 269, 252, 12, 121, 182, -63, 184, 246, -125, -180, 138, -60, -126, 91, 30, 15, -96, 155, -79, 114, -178, 8, -40, -96, -17, -78, 18]
7546A8k64K30j37J27J3K3j55K94j23M5j54K24l04R3K5k69K32j52M25k63j21O3
7568a30J17J2n6J85l33L19o2j95J22lK6K18j16r9J33r3j13J08j41J67J46j95K
7591A9j41J72J6o0n1J26K8j84J20J48r3j47Q8j2j52j55M01k34j94L75j53M5L00
7614B62l35N5J41K8k10p9J85J15p1n0P1M8k12L41L2l17R2j25JJ37k76O1j04J0
7638b00J56j34M00l03K45l29k7L15l8O6j56l2o1J09j78K02M0p2j12J28L29l48
7660@q5n9L14l53K21J94O0j96Ok06Q2J01L4r8j18K61o8k3M7J29r3J14j64p5j5
7685A0l1K5m2L29l09J77j22M0J27m24L06j76n9L02l64K53Kj50n4k99K96R1j12
7708a84R8J94k97J90J61r6k32K86k80l9J13J96k39J46O2O4o4j79L64j98j52J98
$$ y = [18, -246, -16, -153, -26, -13, 10, -145, 149, 26, 71, -83, 141, -163, -70, -45, -314, -82, -234, 191, -72, -193, -130, -13, -1, -57, 128, -205, 114, 52, -143, -21, -24, 2, 220, 104, 5, 138, 45, -68, 40, -101, 66, 212, 17, 19, -122, 50, 66, 6, -45, 81, 109, -75, 45, 193, 100, -47, 41, 29, -123, -278, 123, -111, -305, 70, -83, -38, 262, -73, -18, 123, 151, -59, -138, 47, 162, 91, 41, 112, 160, -52, 289, 321, 4, 96, -29, -28, 109, -167, -106, -210, -200, -44, -178, 222, -81, 164, -165, -192, 123, 85, 151, -5, -37, -98, 11, -167, 35, 75, 3, -109, 19, 348, 0, -85, -144, 170, -183, 38, 232, 292, 96, 102, -104, -22, 79, 113, 15, -103, 158, 90, 67, 114, 243, 150, 264, 100, 25, 10, -21, 4, -38, 291, -18, 159, 37, 77, 204, -220, 86, -90, -149, 153, -211, 42, 44, -106, -160, -459, -163, -72, -184, -86, 108, -189, 1, 162, 66, -166, 120, -160, -199, -86, 110, -129, 17, 79, 143, 79, -100, 264, 66, -86, 112]
7730A12j68O2J4Q1j31k86N14m13Q4m8J42j23K72k6L40m46qO0l13L41M5k74JK50
7754H2k73K34l81M17Ql8Q6P5k20k2K22l09J64j35O7K51m5j29L3j82O3q0j28N61
7778C21k02l16K14O9j08j64K28j0NK3q8Q1K02p4l18L20M3l45L60j70J19j64l8
7801a2O7m8r4K77L3m52J63J86j17Q6m7j86j15J80J91j81J26m5j5j90J64J01k15
7824a43M52m16J50k14O8R9q4J81M1j90j27J44J93Mo9N9p1j2k36J30N1r4o4J55
7848Gj77O8P6m9L41k3l24K40l7k01J67k12O1O6m7R7k31k49L13j9J30l0K4k04J58
7873e5O8k36m6K32M8k22K47J37KJ0k28J11j72L24l93N7J78j31K12j82R4o0O9r1
7897b7k1j41L5R2J48j74J66L7l4j25o5J36J51j13k8L5k58K14k02K45kj52qJ44
$$ y = [112, -56, 6, 20, 101, -30, -316, 198, -215, -131, -179, -37, -160, 112, 86, 426, -20, -28, 32, -281, 60, 105, -169, -168, 82, -191, 43, -338, 79, 87, 49, 135, 210, -10, -32, 190, -119, 45, -90, -23, 228, 183, 54, 87, -95, -32, -112, -240, 321, 119, -197, 17, 86, -22, -186, 42, 32, 37, 60, -28, 53, 255, 181, -137, 183, 226, -119, 241, 71, 190, 26, -12, 55, 7, -87, 190, 223, -229, -66, 120, 3, 89, 42, -144, -259, -79, 112, -69, 57, 12, -3, -193, -29, 72, -143, 309, -107, 43, -171, -103, -4, -88, 93, 134, -56, -183, -39, 154, 158, 89, 148, 77, 65, -171, -41, 10, -84, -148, 7, -170, -102, -26, -75, 266, 243, -81, 159, 122, -79, 88, -124, -63, 3, -44, 53, -178, -427, -114, -133, -3, -33, -9, -213, -55, 13, -223, -269, -37, 11, -211, 36, 173, 175, 185, -43, 68, -104, 220, -173, -116, 62, -69, 143, -39, 55, -5, 64, -27, -48, -189, -154, -62, 86, -88, 78, 115, 81, -44, -109, 27, 178, 65, 37, 72, -186, 28, -174, 71, 69, -83, -91, 53]
7921E3J74k31N8l9Q0j27K33l04l8P9j08J33J61k31M08j95j49J94j27L08l46p9
7943i3L27j02O2j63J1M6j41j1K8J87j36k66M87m12P1O6k32J80K09j58J63j47j18
7966a42k1J78oP7O5Q3J9k78j9N7o7r0J33k9J58k44Q6Q3mN9J38l39J53M4r8j97
7992b01K67J04j30P1k99P3K88j33O8l41L32j70JK77k17jJ05k91J51K62j25l9j54
8015a02J52N2k73l3K54J27j82kj9j97J01j08L26k35M38j83k08J2R0o9K4L41l48
8038d2l9l8Q1j97J50M16l69J32m5k07J78Lr4M3J2l0K96l07j10K83k90J89j03J87
8062I9r8K7j31P4N6Nl5L9k65K30J95r8j48J78j30r1j4J55j1l58M17j15J79Pj36
8087C1l08L38m9j07l9l7J07j1J05j21j8Kj16K83j12j3J18r1j03L22j2j15q3r4
$$ y = [53, 227, -4, 54, 15, 95, -32, 201, -103, -141, -62, -170, -37, 124, -107, 301, 106, -43, 151, 24, 332, -14, -93, 234, 132, 194, 31, 42, 88, -53, -64, -36, 151, 15, -251, 236, -176, -105, -39, -271, -91, 118, -40, 123, -24, -142, -163, 15, 9, 86, 151, 234, 253, -25, -44, 13, -54, -144, -11, -40, 118, -126, -40, 43, 39, 98, 236, -103, 50, 94, -4, -201, 66, 170, 40, 111, -188, -115, 173, 40, 108, -233, 99, -71, -70, 207, -10, -11, 94, -197, -46, 216, 91, 52, -102, 50, 102, -171, -204, 50, 177, -5, -7, -26, -223, -122, -230, 96, -139, 299, 116, -92, -80, 10, -59, -35, 306, -42, -81, -119, -38, -235, -85, 331, -38, 94, 49, -158, 20, 23, -71, -28, -16, -46, 250, -57, -167, 116, -174, 15, -88, 99, 1, 28, -103, -29, 27, 32, -3, 36, -229, 1, 196, 98, -50, 128, -2, -93, -107, 48, 37, -321, 96, -19, 160, 167, 31, -277, 61, 12, -95, -134, -171, -64, -75, 30, -91, -109, -107, -223, 60, -52, -65, 53, -38, -141, 181, 169, 54, -29, -123]
8111a23N4J19p6K34j80k11J36l7J35n8r1j13L06q4P6l30J44O4j0M07n57N31l80
8134d4L0L9j91Q3J54j1J46K5j31j0q7R1J2k6l73K87K64k61J06L2j17R0n5j2J28
8159A69j44n9J77o9k9o5j11K30j00J01M4j66O4q8l12K11J25J73j30J65k4J49l59
8182d8Q1o0jK55j20Q0j76j7J5
$$ y = [-123, -69, 50, -26, 208, 28, -183, -47, -84, 51, -7, -98, -211, 95, 11, 87, -243, -99, -35, -45, 362, -195, 336, -44, -14, 25, -166, -83, 71, 60, 206, 231, 100, 90, 3, 94, 106, 80, -293, -6, 258, -3, 103, 135, 18, 108, 53, 41, 169, 25, -34, 143, 74, 45, -20, -131, 99, -1, 100, 144, -22, 42, -46, -358, -147, -22, 151, 21, 186, 162, 311, -48, 33, -27, -28, 227, 107, 187, 11, -6, 9]
8191I
$$ Imaginary data points
##PAGE= N=2
##DATA TABLE= (X++(I..I)), XYDATA
0@%%%%%%%%%%%%%%%%%%Pl9O4o4O4o4O5r7J28j29J47j78J93k25K57k90L32l64M18
37B25m80N38n94O59p32Q09q94R91j098J212j337J473j624J788j969K172k395K644
55A388k926L247l611M031m529N122n840O745p914R482j1727J5215k1437L5870
69B3116j25118n8686K63363O3932K2944R2502N0224q2759N948j7369j66356j04469
81c2728O4177p1403j66355K0902R3132o8968k0309J22680N1623r991R9945O5515
93A48220n3152J7963P8131o0030r1163Q585k9266j00695k5552q119o5636R158
105a71556P8789o489J420J12623N2141m1301N2899P3611o5598m8034O0555k5876
117G3184r2682K1653J6205j03365j9339R1041k8436p6145P3352P1340n1946N427
$$ y = [0, 0, 0, 0, 0, 0, 0, 0, 0, 0, 0, 0, 0, 0, 0, 0, 0, 0, 0, 7, -32, 32, -32, 32, -32, 33, -64, 64, -65, 82, -96, 97, -128, 129, -161, 171, -193, 225, -255, 283, -311, 348, -384, 425, -469, 522, -576, 636, -701, 772, -852, 936, -1033, 1139, -1256, 1388, -1538, 1709, -1902, 2129, -2400, 2722, -3118, 3627, -4287, 5195, -6532, 8683, -12754, 23116, -102002, -160688, 102675, 166607, 189551, 282053, 332277, 249518, 255466, 238097, 71741, -32728, 31449, -39954, -206309, -185407, -92275, -161243, -181552, -58872, -7249, -17240, 82705, 148220, 95068, 113031, 191162, 131132, 39969, 48554, 19288, -81407, -106959, -115078, -180714, -171556, -92767, -99256, -97836, 14787, 66928, 25627, 78526, 152137, 86539, 38505, 99060, 73184, -19498, 2155, 18360, -85005, -104344, -13303, -41739, -117884, -44532, 26808, -25138, -19711]
129a9711Q3693j570k1631N1066q070o9541J6038J9943q4251l9229N4468j0024
141b8819m6112L7672K7878k5127L7349M0885o4151k7296P4234p451p7888K7647
153c1179N1393m2209J028P1627j3845l3548P0888K7808q3550o586O1181m4595
165B8413o5108L6876J1147n5450Q914K7691m8620j0191O2350r108m6311M4715
177a4682M4352l3990N17L7306k6470j8341M4784j3192o0322K3986L3808n0458
189c2702q094O4307n758l5642N0339K7937n6266K367M9103m0570m7267M4147O979
202A8880o0991J0950M0779m0520k0190N1497m617m1792L8791L7064l7636J190
214f595M9688j3471k0569M4053L753n2614P984K3800m9396k3741L8494j6471m1342
$$ y = [-19711, 63982, 62412, 40781, 91847, 83777, 14236, 30274, 50217, -34034, -73263, -18795, -28819, -74931, -37259, -9381, -34508, 2841, 43726, -20425, -47721, 26513, 19062, -58826, -31179, 20214, -21995, -20967, 50660, 36815, 3267, 74155, 101963, 18413, 11827, 73008, 28413, -36695, 181, 11328, -44122, -35208, -7517, -56137, -66328, -3978, -13086, -59397, -14682, 29670, -4320, -3803, 33503, 7033, -11308, 33476, 20284, -40038, -16052, 17756, -32702, -40796, 23511, 17753, -17889, 32450, 60387, 4121, 6488, 55591, 15021, -32246, 11901, 18880, -42111, -31161, 9618, -30902, -51092, 405, -4212, -46004, -7213, 29851, -7785, -6595, 43093, 29622, 9053, 53106, 56859, 4245, 12229, 36029, -13367, -37108, 1386, -15085, -56427]
227e6427L6165K3585m5959P555N3788k3144l1095M7952J4467m5747J7215M2345
239D0700l3263j7338M6824p811m6671K6738K5394n0441j4513M0516j4572k9939
251c4376L4252J2847l6022J5520L3497l1608j6328M0477p410l9922K4889K3489
263A9305l7954n81M0773j8958k4520M2019J1645m2505J5719L9246l2883k3096
275a1790M0054l357m1166J9782J9433m6536j0755L9519j8740l5638L2763J8042
287A611l5994R236L8430j8280j1170M0968Q11l1214K6155K5268l7473q845L4672
300C4175j9018l4536K3762O006l9729P759K9150k9284j5442M3700L318l3509K3507
313a41K8339l2597q087L5631j4303l1397K6403J1678l7381N968L6102j8506j6835
$$ y = [-56427, -20262, 3323, -42636, -35081, 18707, -4437, -35532, 12420, 26887, -18860, -1645, 40700, 7437, -9901, 36923, 29112, -17559, 9179, 34573, -15868, -30381, 10135, -4437, -34376, -124, 12723, -23299, -7779, 25718, -5890, -22218, 18259, 10849, -29073, -4184, 19305, -18649, -19230, 21543, 2585, -21935, 20084, 31729, -10776, 4943, 44189, 11306, -11790, 28264, 24907, -16259, 3523, 22956, -23580, -34335, 5184, -13556, -49194, -16431, 1611, -34383, -25147, 13283, -4997, -16167, 24801, 25612, -5602, 20553, 45821, 8348, -497, 34175, 15157, -19379, 4383, 10389, -29340, -21581, 7569, -21715, -37157, 6543, 9861, -23648, -141, 28198, -4399, -12486, 23145, 8842, -22555, 3848, 15526, -21855, -15887, 20215, 1709, -15126]
326a5126L5256N911k8673J7271K1666l2481j0293K7738j8546l4044K1367J0766
338H12l5137K895K9896j7831j2075L6966M317k8321K1363K5873k9287o145L5911
351B9237q381k8570K4051J4169l2878J942K7722k3393k4234K5960l41l4454J2158
364a7012K4514k5144p119L3784m435k2870K4669J5411l0795N18K6583j9082j9161
377b0139K7477L485k8089J5087K4141k3300o317L1794q084k7839J9591J2249l1660
390a1604k230K4966j8754k1217K4714L842k7076J3204K5719j9730o016L2422n71
403A7669k1543J9825J4602k7789l298K2486j7151k1084K1802L520k7153R310K1274
416A2470k0363q683K5859o821k6233J7263J4058k5673M79K8153j0611j5620K6105
$$ y = [-15126, 20130, 26041, -2632, 14639, 36305, 3824, -6469, 21269, 2723, -31321, -9954, 812, -34325, -31430, -1534, -19365, -31440, 5526, 9843, -18478, 2885, 28758, -529, -6674, 29237, 20856, -7714, 16337, 30506, -2372, -430, 27292, 3899, -20335, 5625, 5284, -29170, -17012, 7502, -17642, -24761, 9023, 4588, -18282, 6387, 21798, -8997, -8479, 18104, -978, -20139, 7338, 10823, -17266, -2179, 21962, -1338, -7655, 24139, 16055, -11784, 7807, 20056, -11604, -13834, 11132, -7622, -28839, -4125, -283, -27359, -14155, 11564, -8166, -14182, 18240, 17669, -3874, 15951, 30553, 2764, -534, 21952, 4801, -16283, 5519, 9039, -18114, -8804, 12470, -7893, -16576, 9283, 2462, -23771, -6508, 7550, -18123, -17644, 10509, -102, -15722, 10383]
429A0383Q172k5017R295K0144k2445j2306K6018k980k3312J7205J6583k3272j597
442c129K3541j4123k0592J6997R37k8857M544J9823j7417p664K6979O30j7944
455a6275K0398J7645k0748j86K4634j1460j8213J9445M893k5075M024J7039k0830
468d709j2130K1931l316k2934J4475J6073k0633k228K3559q645j7054J6917M121
481E427k3536N392K0454j4825q133K5188K413j6676J5687J5178k0761m277J8624
494B0155j2456k0042J5701M853k3354M336J8667j4804r489K1285j570k0350J3004
507d064J4090j9819k327K4286n244j5732J7822P876k0453M258J7109j6841j2155
520a1194J9376n46j9531J2178J4098j8825m854J9023r387j8095J4207M805k1030
$$ y = [10383, 18555, -6462, 2833, 22977, 532, -11774, 14244, 11264, -12048, 5157, 21740, -1532, -3129, 20412, 6289, -14303, 2694, 3631, -25226, -20682, -859, -18276, -25940, 1039, 1669, -16275, 4123, 21768, 1020, 834, 25468, 14008, -4205, 15240, 20133, -4942, -918, 16121, -4709, -16839, 5092, 1776, -21158, -6683, 9390, -11243, -13471, 10088, 1443, -15611, 1306, 5427, -18109, -12717, 7737, -7088, -15221, 9967, 12380, -4296, 11391, 26569, 5808, 1531, 20155, 7699, -12343, 3358, 8211, -15143, -10807, 7860, -6944, -16433, 4852, 3282, -17068, -4064, 10026, -9793, -12120, 12166, 6922, -8810, 9012, 16888, -3565, 693, 17802, 961, -11194, 8182, 7636, -11895, 283, 14381, -4444, -9298, 9725, 338, -17757, -3550, 1255, -19775]
533a9775L698J8447j1117p224K2981L544j5620J2623J3784j7488l590J9655p656
546A2262j7519J3113N728k0756R61J4497j5093j2406J6876M30j7152J0868J4228
559F037j4283j069K1576m383j4698J4224O197j9039J371J5094j2584r638J8638
572G443J650j6825R735J3410j5719m276J7531p206j6935J2698O739j8110J948
585g917J4973j2909j0743J6344J377j7043Q283J2811j3538q85K0694k808j2789
598d150J5208Q711j7051M7J3156j2506j1713J3741j134j8095P018J1857j4567
611i478m547J6481n151j3856J2995Q846j3989L095J6370q628q100J7173K778j5743
625a754N832J0220j4817n584J4303n678j3994J2863Q594j4746O29J4538q262q997
$$ y = [-19775, -16077, 2370, -8747, -15971, 7010, 10554, -5066, 7557, 21341, 3853, 263, 19918, 12262, -5257, 7856, 13584, -7172, -6211, 8286, -6807, -19213, -2337, -1907, -19059, -8191, 6037, -8246, -9315, 12261, 7878, -6820, 7404, 13601, -5438, -4067, 11027, -1557, -11195, 7443, 9093, -7732, 2003, 15413, -306, -4582, 12949, 5743, -11192, 1506, 8245, -9865, -7917, 7056, -5853, -16596, -252, 1125, -15918, -7635, 5176, -8362, -9247, 11447, 8639, -4150, 11058, 19769, 2718, 2765, 15921, 3415, -8298, 5443, 4309, -13786, -6768, 5089, -9478, -14025, 2456, -2695, -16551, -3556, 5290, -8699, -5604, 10766, 2138, -5962, 11211, 13989, -1754, 4078, 14298, -519, -6103, 8200, 2522, -11472, 1391, 9985, -4761, -4132, 10406, 2144, -6853]
639f853J3317J30j6707M945J0222j4729n818J4690l466j2187J2605R666j2283
652f468L001J6553n548o172J5814K311j5951K957P867j5971q908R670p247j4698
666b2790J0440P663j2926K626J8043k879n053J5588M834j2302O816J0227j3398
679F889p500J1402n260j4614P661N172j4369p40J3073n786o884J4687L973j2023
693d319N475J1392j0296o569J0618m930j3750P524N202j4198m12J4803k845o037
707h342J3421N938r282P345J0984j0908p140J0599m458j5207L842L859j4058k206
721a5613J1148n542o862J3634O890r942O864J3180p403n102J1438k716j2514O320
735C780M501j4188k912J2227m757q923J0770M950r206N153R778r883o277J1670
$$ y = [-6853, 6464, 6594, -10113, -5168, 5054, -9675, -15493, -803, -4269, -16456, -3851, 5815, -6468, -3467, 13086, 7538, 1366, 17180, 19491, 3540, 6497, 14364, -1607, -10515, -845, -8092, -22790, -12350, -4687, -17613, -14987, 3056, 177, -4876, 10712, 15546, 3244, 10060, 20287, 6889, -611, 10791, 5531, -9083, -1422, 3750, -10619, -11359, 1714, -4072, -10956, 3731, 7704, -4319, 1156, 12548, 2252, -4317, 6301, 1371, -12379, -4855, 347, -13851, -14263, 540, -2305, -8342, 5079, 11017, 1735, 9080, 20064, 9156, 2016, 12615, 8157, -7050, -3208, 651, -13407, -15613, -4465, -10007, -16869, -3235, 3655, -6287, 577, 13757, 6354, 1252, 12690, 9974, -2540, 3780, 8281, -5907, -8819, 3408, -1349, -10272, 498, 5448, -3758, 1395, 11173, 1290, -4987, 6683]
749F683j803j3070M447N719j1807k019J1406m444o762J2277N431r339M640J1831
763A3190o577m686J0296j472j1416N022M206j3203l837J0029n365r667Q265M610
777f05r112L864J0121o541l833J2549N05j0576N011P114j0159k110R741m540q074
792f645R089M200j0359K879R952o719n764R259o38j0347M567N118j1294k615J0026
807G09m066q623Q850N592p980L023R824n430l803J1119K93j0505M266O633r749
822A53l628Q392m609q780P385L468r821J470R689n800n196R382J097q452M658
837e92O768q672k279R587l127q035P893N118q711J207Q287n400n142Q885M19r842
853c636L435O361r540l345P986l173p665O890M068q968J729R314m077m432R464
$$ y = [6683, 4880, -8190, -3743, 1976, -9831, -11850, -444, -4888, -11650, 627, 6058, -3281, 1359, 13190, 6613, 1927, 12223, 10751, -665, 4357, 8563, -4640, -8477, 1552, -3813, -13480, -5215, -605, -9717, -5853, 4268, -2273, -6106, 6443, 6948, -3628, 1383, 8497, -1662, -3772, 5969, 1429, -6645, 2444, 6644, -3715, -836, 9116, 2397, -3367, 5892, 5254, -5093, -526, 4592, -6702, -9317, 709, -3357, -11980, -3130, 2462, -5518, -2495, 7329, 1899, -1904, 9215, 9508, -997, 3269, 9902, 153, -3475, 4917, 308, -8472, -1087, 2381, -7440, -5970, 3719, -2081, -7277, 2105, 3202, -5250, -592, 6176, -2496, -4775, 4812, 1685, -6350, 1543, 6661, -2050, -843, 7444, 2044, -3098, 5787, 6206, -3636, -201, 6160, -3380, -6725, 1261, -1912, -9577, -2687, 1381, -7587, -5858, 3456, -621, -5053, 4411]
868D411K173p900M043O960p738k903Q700k825q460N701L322r329l08P460n514
883b207n506P860O01q341L396O932o750k594Q899j557p080P081M734p675O40Q810
899G243m586n039P780J583q357L151N736p542l291P929k219p853N467L152q324
914e170k33P679m494n021O894K041p570K917O953n419k268P919r31p077N766M083
930F069p269O7P031m332n598O396J076p782K104O253o216l550P164o92o516N527
946b68M574o695K25P517l136n699O873K084p531K046N958o212l377P286j354p118
962d827L896L989p288j018O607l580n352O790K400o838K542O635m397k571P674
977D662n23o218M678M381o635n02O812k944n907N709J521o895J271M748n492l899
$$ y = [4411, 6584, -1316, 2727, 9687, 1949, -954, 7746, 4921, -3539, 2162, 5484, -3845, -4153, 3307, -2207, -7713, 147, 748, -7593, -4197, 2735, -4015, -6609, 2290, 733, -6347, 734, 5468, -2207, -1567, 7243, 2657, -2382, 5398, 6981, -1376, 1775, 7511, -31, -3322, 4607, 2388, -5465, 2, 3154, -5170, -5403, 2276, -2218, -7239, -345, 1696, -5874, -2957, 3996, -1423, -3691, 4228, 3297, -3780, 1986, 6069, -1200, -1133, 5898, 1566, -4032, 2364, 3440, -4342, -2238, 4015, -2201, -5751, 1413, 721, -5795, -268, 4306, -2389, -2164, 5353, 2217, -3482, 3391, 5475, -2056, -10, 5948, -264, -3641, 3645, 2291, -4827, -931, 3058, -4230, -5248, 1359, -2221, -7573, -783, 1617, -5221, -2679, 3956, -441, -3012, 4662, 4139, -2079, 2599, 6980, 345, -157, 6655, 3711, -2196, 3513, 5034, -1861, -590, 4158, -1334, -5233]
993e233O240j160o629L759M159o356j118O995k597m302N933K941n850K439O486
1008E707l981k722O236k18n762K928L526o189r64N833k733n536M892K054o814
1023c743J253N311n024l090O010k57n676L705M484m965o21O438j903n046M885
1038A761K391o211J157N272m423l123N636L9n898K893L486n203j670N909k441
1053d25m652M866K855n299J220N881l260k950N674K17n942L012L410n187j560
1068b140N446k107m956L956J821n779J240M693l358l359N401M02n461K889L714
1083B402m702j506N415j402m329M994L009m941J501N616k720l080M538k4n971
1098a200J680K744n476k187M521j711m359L884K363m664R95N420l013k180M773
$$ y = [-5233, 1007, -153, -6782, -3023, 1136, -5220, -6338, 657, -1940, -6242, -309, 2632, -3218, -779, 5707, 1726, -996, 5240, 5022, -740, 2188, 5714, -475, -1439, 4394, 1661, -3875, 1017, 3071, -3743, -2490, 2821, -2203, -5293, 717, 460, -5216, -1511, 2973, -1992, -2613, 3825, 1922, -3124, 1761, 4152, -2059, -902, 4370, -53, -3176, 2460, 2499, -3399, -506, 2980, -2223, -3893, 2016, -425, -5077, -211, 2644, -2655, -1435, 4446, 1186, -1764, 3910, 4127, -1815, 1197, 4607, -580, -2140, 3306, 1199, -3757, 199, 2020, -3759, -2519, 2174, -1184, -4543, 858, 1260, -4201, -1312, 2402, -2300, -3806, 1609, 207, -4122, 872, 3881, -1060, 441, 6057, 3337, 257, 4795, 4771, -1200, 480, 3224, -2252, -4439, 82, -1629, -5988, -2104, 259, -4405, -3410, 2010, -1003, -3183, 1590]
1113A590J177m415K595L787l973j209M821j787m538L558J674n133k8M463k764
1128a82k889M382N37m306K084L326m233j479M120j291m293L333K322m128L66M364
1144B033k106k224L956J231m171K004L866l617j549L747j192m381K886J648m756
1159b625q01M272k282k929M107J047l667K124L666l263j243M329p25l560K740
1174A190K264l771o2L757k309l020L283N85m458P47L467l428j956L900m28l011
1190c250K561K678l593L33M106j870k891L650J138l664Q97L261k986j995L636
1205B011m50l505J757K428l845n13L675j720k702K850J252l661Q51K821k772j727
1221c250L921m01l227K481K663k783j34L835j305k646L051J374l506M49K444k415
$$ y = [1590, 2767, -1648, 947, 4734, 761, -448, 4373, 2586, -1952, 1606, 3280, -1853, -1881, 2582, -182, -3071, 1311, 1848, -2458, -374, 2952, -1281, -2760, 1360, 69, -4224, -891, 1431, -2697, -2331, 2033, -73, -2297, 1659, 2890, -1281, 723, 4589, 972, -577, 3170, 1978, -2403, 483, 2131, -2625, -3426, 846, -1436, -4365, -258, 789, -2878, -754, 2912, -351, -1594, 2735, 2010, -1550, 1190, 3454, -317, -379, 3378, 1069, -1951, 1332, 1917, -2541, -1794, 1673, -1755, -3711, 189, -239, -3250, -689, 1989, -1604, -1271, 2835, 965, -1926, 1724, 2862, -802, 95, 3356, 370, -1625, 2011, 1561, -1944, -187, 2241, -1604, -2117, 1558, -162, -2864, -14, 1238, -2423, -1572, 1249, -1523, -3250, 671, 270, -2957, -476, 2187, -596, -730, 3105, 1800, -846, 2205, 3579, 73, 522, 2966, 551]
1237E51k254K892q31l279J868K049l425k11L303q05k342K805J424l031R41L273
1253B928k043j998L206ol482J510K469l105r47L071j193k914K286J446l324J98
1269a898L327k284j757L188J71k881J472K268k269j042L381p66k492K525J169
1284B112k579L60K901j840j770K589J24l034J101J798k980r06K466r17k218J987
1300h06J618k396J91K780r89j689K596L14k713J549J856k155j308K850o58k625
1316a585K254J226k717r8K350j712k280K532M49k653J061K050j733q31K915lk579
1333a354J879J427k449j05K384j137k075K534N05k719J051K142k076j122K311
1348A196n25k266J089J330k480j62K334r36j685K261R86k400J271K054j684n99
$$ y = [551, -1703, 1189, 358, -2921, -1053, 996, -2429, -2640, 663, -142, -2484, 321, 1745, -1286, -345, 2928, 885, -1113, 2093, 2087, -1395, 115, 2584, -521, -1468, 1603, 410, -2504, -218, 1228, -2096, -1898, 1429, -855, -2612, 576, 747, -2134, -662, 1606, -663, -1705, 1676, 910, -1582, 943, 2112, -467, -107, 2794, 954, -816, 1773, 1897, -1137, -36, 1762, -1218, -2124, 342, -575, -2793, -806, 812, -1584, -1393, 1387, 398, -1291, 1305, 1619, -1094, 455, 2311, 156, -1152, 1698, 1040, -1585, 669, 1895, -822, -920, 1430, -282, -2562, -30, 419, -2234, -1173, 877, -856, -1687, 1228, 1225, -1354, 525, 1952, -497, -602, 1782, 645, -1430, 1104, 1609, -1110, -59, 2083, 7, -1115, 1196, 671, -1595, -506, 824, -1656, -1818, 516, -420, -2105, 156, 1142, -1258, 13, 2067, 383, -216]
1364b16K292k82k326J110J398k204o69K213j191j878J932N28k199L11J980j962
1380a163r54K157K6k403J322J741j545J63K335l26j792J991O03k349M21J426j668
1397a5j203K028k47k279J598J484k161j01J969r08j680J162P34j874L71K022j200
1414c00j046K174K2j719Q82J426j515m68K063q10j853J775Q35j912j2J548j298
1431b08j053J559O4k159J153J706k112k94J875l37j415J308J172j634K99J953
1447A877r03j066J359M24j972K17J343j941j296K116o43j543J655R40j452l1J964
1464A048p40j334J496Q7j550O85J571j494m69J637J48j706R52J292j462l58J131
1481I34p72j165J082P55j824L59J217j352o91J473k27j263J000J202j623q9K312
$$ y = [-216, 2076, 1794, -532, 578, 1976, -228, -897, 1316, 125, -1753, 179, 707, -1492, -1181, 799, -1163, -2117, 40, 66, -2337, -1015, 726, -819, -656, 1679, 1353, -439, 1552, 2155, -194, 227, 1653, -15, -1218, 810, 563, -1716, -118, 1366, -795, -896, 1073, 165, -1515, -353, 381, -1493, -1122, 900, -300, -1346, 828, 850, -869, 13, 1439, -76, -544, 1519, 709, -1144, 631, 1466, -446, -458, 1090, -208, -1261, 298, 362, -1797, -644, 1062, -1050, -1344, 531, 194, -1221, 87, 1259, -375, -76, 1877, 974, -92, 1267, 1691, -281, -64, 1279, -662, -1958, 158, -485, -2028, -373, 567, -885, -916, 1048, 308, -1026, 470, 557, -993, -308, 1263, -231, -700, 937, 1085, -621, 331, 1623, 161, -197, 934, 162, -1003, 79, 834, -990, -631, 586, -766, -1457, 16, -211, -1474, -474, 728, -895, -984, 1328]
1498A328n64j149J359K82j423J54J414j415o68J729k55j744O17J196j451j36J074
1515C48n29j170J481N92j475K49J344p32q86J488k38j405R68J295j570k85J561
1532A036l49j135J113N93j653K6J413j265j208J331K27j502O69J207j054m28J459
1549D80q1j079P34J023j189n3J687q03r60J179j36r44Q5P87j035o73J138k95j060
1568a195R46J058j346j18J569r00q87J084L33j269K86J240q85m14J385m0j198
1585c51N13O89r32k86J198p72r19R66K42r08o9J206r28o36J302k67q31P63N28
1604E08p62l45J448m50p11Q42L86q74j41Q96n62r57J201J89j358L44R32j021n28
1623i63J201k78r24P12O33j041K83J275q47m79J142j46r33N16P38q82j70Q79q1
$$ y = [1328, 764, -385, 974, 1256, -167, -13, 1401, -14, -682, 1047, 792, -952, -335, 861, -590, -726, 348, -181, -1351, 130, 722, -753, -504, 840, 108, -778, 710, 472, -933, 35, 1330, -240, -525, 1036, 687, -448, 665, 1258, -395, -369, 1044, -221, -1429, -98, 129, -1373, -704, 503, -551, -979, 480, 399, -680, 54, 1077, -112, -165, 1522, 719, -241, 938, 802, -142, -57, 730, -305, -978, 160, -135, -1195, -249, 809, -537, -655, 914, 14, -873, 211, 544, -725, -439, 801, -84, -498, 887, 847, -351, 162, 851, -81, -367, 831, 59, -860, 106, 348, -560, -629, 577, -351, -987, 315, 48, -783, -20, 508, -254, -599, 849, 399, -312, 530, 916, 42, -99, 797, 235, -722, 479, 668, -690, -346, 586, -435, -963, 238, -40, -964, -252, 381, -660, -377, 898, 51, -428, 714, 568, -365, 151, 889, 7, -163, 716, 635]
1642F35q45M30N56j022j71J200p93p89Q41k29q94N72Q38n78k55Q78K7q65O75N27
1662G38q94J95N33l42o80Q70L90j074oJ037r38m09O68J66j287M73Q86q46k46J019
1682B53k89p44O47P78j121K08J178n27o23P60L66j202N33N51j037m57J268k70
1700B72j129Q08P04r01l92J106q12p62R17K32r18Q76R27j158L2J099l19p94P23
1719E11N79j091k2N49l82q62P38J19o75K56O09o30o61J195p1n88J50O61j014p0
1739f99Q79n0q16J020L93j032K39J043o76p48R23J54j038K95J015j027p0N93l98
1758@q51O00M44r27oR03o14n12J153J42n87O66Q64q40k73R85l17q19K78R9q50
1779d62j63O86l85j011J002J03o49N99P07o13l39J348l22q81R11J60j036N0P87
$$ y = [635, -210, 220, 776, -246, -417, 783, -10, -799, 42, -187, -1081, -509, 329, -249, -504, 374, 401, -464, 211, 738, -156, 39, 572, 230, -450, 420, 810, -264, -270, 767, -171, -580, 88, 254, -1033, -560, 326, -520, -766, 253, -36, -780, -133, 645, -476, -268, 910, 383, -240, 520, 886, -316, 217, 768, -269, -726, 542, 272, -857, -49, 655, -246, -638, 468, -344, -1106, -189, 43, -875, 1, 928, -230, -198, 901, 582, -212, 511, 1090, -1, -23, 526, 144, -718, 20, 139, -536, -280, 329, -301, -962, 233, 162, -426, -276, 385, -629, -699, 180, 130, -686, 334, 727, -305, -66, 977, 301, -447, 476, 630, -408, -113, 902, -125, -195, 398, 0, -851, -251, 193, -734, -740, 163, -451, -963, 190, 332, -255, 411, 1275, 435, 162, 1147, 830, 11, 289, 388, -462, -625, 61, -324, -1335, -333, -230, -879, -280, 427, -186, -525, 823, 501, -380, 531, 691, -345, -295, 492]
1798D92o54k23P72R8q88N60O67q76M5P81j07j289P61L16r78j97Q64m55q08Q26
1818b93J62q55M21J231q01m80J514k50o31N94Q07j140q8P72n37j285O23O06j286
1837i16J80Q16o34m53J139J64j184R65O41j028p8J056n44o64P61M39j016J77Q72
1856F93n41p77R40M43j414P16R81j098o16J439n45r72Q55L13j381L86J101p09
1874a86m75J091j01n82O27R19j073o45J238l32r07N64M95j113L7O43m04r90J200
1893FQ8r67K99J066q17n98J250Qp21N22O57j183n8J351r27m57J123J36r62L06
1913A22R66p29o52J145q62j004Q32L34j032l39J145m44p52J137M82j038O41O11
1931E63o95k02P88P2p48P00Q14j076j98J038o38q91P10K73j249J23J023o40q65
$$ y = [492, -162, -385, 387, 485, -403, 157, 824, -52, -7, 774, 667, -622, 139, 455, -523, -720, 144, -311, -1119, -293, -131, -986, -565, 666, -135, -615, 899, 649, 18, 612, 1419, 279, 191, 963, 426, -859, -236, 370, -916, -736, 80, -554, -1007, 132, 296, -888, 77, 718, -310, -388, 668, 124, -540, 221, 660, -356, -179, 693, 152, -625, 315, 758, -656, 60, 1041, -57, -673, 766, 221, -751, 104, 417, -964, -578, 523, -186, -661, 430, 329, -253, 374, 1293, 220, -425, 813, 481, -426, 138, 633, -480, -443, 200, -204, -1194, 6, 94, -873, -574, 492, -325, -923, 327, 335, -386, 136, 793, -390, -448, 903, -24, -481, 642, 778, -184, 122, 1088, 359, -293, 852, -10, -1014, -182, 152, -880, -1219, -74, -518, -1270, -133, 349, -689, -48, 563, -132, -334, 454, 526, -222, 478, 1292, 216, 18, 1056, 418, -473, 237, 510, -739, -616, 407, -233, -1098]
1950a098J244O2j099R62N57j020j32J220o17p20Q45L13j179O96P67q30l99J252
1968H24k59j093M62J001j080n84J263l38j355J219J5j069N40R54o67n13J408O7
1986G95r26K38Q90r67l46J018l41q06Q64J57q43N1P68o41p67J121j47j227N74
2005e35Q18j242J30J156l39o92J071N17q33K29O48n57o57R68k1j105M12O25j043
2024d50O5R89l39j307R03M73j253L91P81o81o23R68op92N19J189j136K4R45m0
2044F20r38R05Q29j495j8R02j54r90O82L6j098M31O28p14m03J115l32q60O21O51
2064D18j319M08J060m46l00O97L70r21L94M69p91o25J131m18p82N03P99j086r4
2083e33J270p25n73P86K66j095K11Q52r58k23R62r3q27J085N83j030j41J231o93
$$ y = [-1098, 146, 208, -891, 71, 628, -392, -524, 696, 79, -641, 204, 517, -662, 34, 801, -29, -428, 824, 565, -528, -66, 935, -145, -729, 534, 196, -1159, 60, 75, -994, -454, 500, -167, -680, 728, 795, -131, 107, 997, 30, -316, 702, 361, -445, 419, 576, -267, -216, 552, -89, -856, 265, 118, -1109, -535, 283, -959, -829, 327, -12, -704, 367, 884, 51, 280, 928, 371, -286, 682, 661, -444, -32, 593, -450, -385, 604, 265, -1042, -139, 334, -919, -528, 253, -428, -1051, -83, -89, -881, -362, 827, -309, -285, 660, 620, -318, 587, 1416, -79, -97, 805, 651, -339, 343, 379, -719, -288, 340, -374, -777, 338, 6, -854, -233, 418, -901, -493, 567, 121, -179, 518, 888, -33, 361, 830, 39, -586, 545, 127, -655, -152, 647, -439, -533, 737, 12, -561, 225, 491, -604, -393, 459, -499, -722, 240, 147, -680, 405, 988, -42, -183, 1048, 355]
2102C55q81J084K07j305K73O69q26k19P30j57j138Q68O81o38n5Q45p15n71P59
2121c4L06p98K69J063q78k82J092n9j014P52J015j147m74J132q51q85P13M88j381
2140i73K99P15p12l96R99R0p31O34O20q50J63J092m19p50P70M37j273K41Q40p57
2160C9q73J046M0j162Q15O58q63k35J001l31p42O40R6p68J43J069q92n10J162
2179C33P1p73O67P51r88k28J205l66q56N77L66j342k37J137o02o77P24J03j179
2198a314R09R72j174Q5J499n11r81J288O6r25L23O35o91p91R58nr12L42P62p52
2218b17j91R09j98j086P88M47j287L09J223j159o47J321j13j004N75R51p99K0
2236a58J233m21j228J027O36j265qR30j064o79J015j7j060M77R50j026J04J143
$$ y = [355, -526, 558, 765, -540, -267, 402, -424, -643, 87, -70, -1208, -340, 341, -297, -352, 493, -222, -793, -34, 272, -526, -257, 806, -72, -354, 738, 679, -335, 417, 1432, 285, -189, 943, 92, -793, -80, 408, -973, -674, 41, -671, -1067, -68, 22, -709, -75, 545, -305, -142, 950, 531, -219, 551, 988, -285, -44, 796, 39, -834, 212, 252, -910, -95, 563, -300, -535, 466, 135, -607, 33, 129, -639, -496, 573, -319, -829, 333, 404, -369, 298, 1049, 61, -167, 1038, 672, -184, 393, 759, -583, -820, 317, -285, -962, -238, -135, -1314, -405, 567, -607, -522, 977, 466, -515, 773, 839, -86, 237, 872, 181, -610, 348, 343, -569, -227, 535, -217, -408, 501, 303, -783, 5, 452, -835, -526, 697, -462, -1109, 212, 99, -905, -330, 621, -178, -158, 1075, 654, -574, 453, 1089, -176, -184, 746, -318, -997, 18, 1, -1059, -582, 368, -658, -554, 589]
2254E89m37p36O42O59r56j64J197n58j084J025N74j024K01Q82q96l84J301l01
2272E30q73O59L63j317J15P39n44r11J299N5j357O23J020o41m22J581j09j278
2290d68J104M44j175j42J353q47q07O82K69j260L11R73j069k06J079k02q27P66
2308b2R05j323J58R86o31q59R37M13j267N85P62p61m22J475m31o81N38N77j125
2327a86K5J099j011p04Q77J10j303O07Q15j082k06Q31L82j139Q25Q51j042L06
2345E5P78j97q37Q05L76j209L32P03j021p69J026K97j110M30O77r57j68R38k47
2364i8r36J275K63r89K52J292r25k59O97j75j007Q87L61j107l2R58k13j048R37
2383A33L64j070K75R52q64n26Q37O5r87Q84M29j022p9J257o00n91Q96O13j324
$$ y = [589, 152, -584, 58, 717, -239, -403, 794, 236, -848, 177, 751, -273, -72, 810, -86, -470, 831, 530, -343, 316, 679, -638, -523, 216, -328, -1239, 60, 115, -1242, -619, 401, -240, -662, 919, 810, -468, 636, 1080, -95, -237, 1116, 269, -538, 144, 413, -847, -536, 437, -632, -838, 241, 39, -788, -22, 883, -440, -282, 704, 73, -786, 151, 564, -703, -118, 644, -117, -539, 936, 505, -176, 362, 939, -186, -161, 938, -73, -777, 100, 210, -1093, -486, 329, -753, -959, -128, 254, -885, -60, 791, -251, 55, 833, 636, -201, 604, 980, -229, 103, 806, -215, -984, 42, 339, -771, -341, 336, -621, -789, 149, -98, -1034, 241, 504, -485, -233, 1059, 134, -125, 572, 397, -610, 277, 638, -469, -501, 457, 244, -804, 133, 497, -573, -298, 654, -210, -736, 101, 166, -821, 63, 492, -530, -609, 648, 48, -543, 353, 966, -358]
2402c58J07J345l45r82J148l88j212N39O95r34m44J068n34p95P19L53r45M39R19
2421C95l88m53R24L63j109O85N71j043n9R14p12o32P68P9p06p3J276r04n63J021
2441C54M7q88P02L72r13n15R71j34r11P87K21q06L16R80m62o72J113J48p54N09
2461D65N93r05j54R16q62p44P42J75j245O5R26o56j93P89N27r79M82J058o92k93
2481A5R85j02r66N34L19r45k87P10m95p34R92r0r56N24Q35n11j07J028n96l39
2501a86O24K72j297L91Q37p66n85Q91K69j020J33J286j159K59Q28n3q80Q23K75
2520I42j350J58Q60o69q56R21J0j108N81O16p47nJ136l79p53P91R42r84j01R63
2540I68l51o20O20k40j114P55M66r30k33R03k69q94O71M55p55K20P50k49j023
$$ y = [-358, -251, 1094, 749, -233, 915, 527, -685, -146, 549, -385, -829, 239, -295, -1090, -371, -18, -963, -524, 395, 7, -446, 478, 841, -268, 417, 988, -55, -114, 800, 88, -544, 224, 303, -403, -476, 800, -104, -667, 354, 401, -487, 215, 587, -326, -841, 130, -4, -915, -128, 93, -713, -397, 583, 121, -551, 562, 710, -44, 465, 1058, 153, -1, 915, 53, -691, 51, 226, -1019, -954, -28, -684, -877, -88, 439, -540, -58, 1000, 308, 15, 1000, 898, -68, 466, 785, -160, -447, 263, -232, -966, 26, -64, -1020, -496, 339, -172, -279, 749, 153, -186, 438, 710, -587, -196, 641, -125, -710, 181, 450, -570, -437, 849, -310, -51, 777, 724, -156, 667, 942, -408, -250, 610, -59, -915, 6, 16, -1092, -511, 105, -642, -647, 489, 110, -643, 148, 1090, 106, 5, 968, 617, -3, 617, 377, -737, 18, 484, -446, -679, 224, -45, -939, -268, 187, -568, -348, 402, 153, -870]
2559h70Q05O65j140K36Q54n06l45P87M3j037Q29M82r50Q0O66o05q53J011j42r59
2579i49M22N95l93l94J102l19r48J100M73r84J75R35p64l74Q43j35r59N18N06
2598D50o66m13J003j00o47K30O47q89J08P72m11r28Q99Q0q68L85Q44q41m55J176
2618C76j28n55M71Q98q92j56J207o41o80N45K8j001J60M73l42n34P38K14j141
2637i60Q68M74p74r8J128n42l06N68K69o79m5R51r12l15Q96j26r32M84M63p43
2657c31j25P35l46m39N69M26j143J62P87n00k73Q63l30n50P45K38o05K2J037n31
2677D11q10P40K64q71Q9O11o88k96R29k47p71N93K53k46k26N22k10r38P81L94
2697B84q48J87P53l93k47P83rp69L42N11q59J76O78n10n12M75K29j019L85O68
$$ y = [-870, -65, 600, -540, -304, 550, 44, -301, 486, 529, -508, 321, 803, -147, -67, 599, -6, -859, 152, 10, -949, -527, 68, -325, -719, 383, 64, -884, 216, 689, -295, -120, 815, 51, -323, 520, 385, -574, -56, 450, -216, -629, 374, 274, -373, -143, 504, -385, -277, 495, 84, -844, 55, 135, -733, -348, 496, -345, -800, 376, 248, -307, 164, 1062, 170, 14, 1221, 580, -100, 445, 473, -528, -368, 105, -237, -771, -33, 181, -960, -92, 382, -392, -490, 638, 96, -210, 358, 627, -52, -97, 854, -58, -373, 523, 397, -535, -51, 412, -331, -456, 279, -67, -506, 63, 489, -654, -492, 295, -205, -478, 385, 55, -495, 250, 488, -117, -95, 942, 411, -399, 341, 605, -266, -177, 434, -254, -550, 379, 132, -639, -46, 207, -39, -265, 257, 47, -891, -110, 284, -564, -377, 376, -17, -264, 519, 510, -259, 83, 594, -265, -89, 589, 79, -433, 42, 271, -748, -363, 305]
2717C05n43p81J253m6o04L45M26n86k8O38k04o43O87K83n47Q0O63p60j55O83k84
2738A82o08N41J78q37l5O54p1m01J79L53o57R5N94k36m30O72K41p00M14O60q90
2759a02q4P55k39p12P36M61j239K42L89l14k32N01k45n96O08L43m80r8N08j03
2779I9o65O13J03k55j25L69N4m88P27Ko46L26N35o05m27N05k3l89K62K02p21m7
2801e94Q25k82m58Q01k09l69L52O90q12J72J70J09n51N37J98q41j28P56m69m47
2821e50O61O2o11L86K95n54J08M35k14o04L68N31o14r6P16l11k76R39k50o58M19
2842A82M03l67m53O60j47r06P94Mm87q3O17j45n28M36N00j092M85L24m45K5O38
2863D15l95k82K56K19m49K49M57m26k70O50J36n54l8N60o63j67M12k75j06O6P9
$$ y = [305, -238, -1019, 234, 188, -416, -71, 355, -231, -259, 379, 175, -468, 219, 502, -45, 35, 698, -62, -217, 466, 182, -426, 115, 293, -544, -579, 75, 4, -397, -218, 135, -522, -427, 167, -69, -499, 173, 414, -286, 128, 788, -102, -186, 569, 330, -382, 354, 815, -424, -182, 207, -107, -339, 162, -83, -679, -71, 272, -208, -306, 202, 99, -566, 47, 150, -105, -230, 139, 193, -295, 432, 434, -212, 114, 649, 44, -383, 122, 99, -290, -28, 174, -547, -594, 231, -51, -509, 292, 83, -286, 66, 756, -56, 116, 286, 395, -156, 381, 579, -262, -390, 366, -103, -550, 111, 173, -438, -52, 243, -311, -203, 232, 18, -586, -218, 313, -301, -397, 319, 8, -268, 671, 421, -237, 182, 585, 218, -235, 425, 278, -628, 166, 170, -317, -400, 217, 72, -456, -20, 480, -612, -127, 197, -248, -223, 415, 20, -262, -6, 213, -236, 13, 470, 44, -226, 424, 560, 6, -32, 528, -135, -302, 110, -165, -271, -205, -126]
2884a26k50J20N66m57n27R90M5q68M96P09p81Q9M68J4j022O12M63m91l74O35m72
2905a61l48N22J41o01K86O11o30%K85N8m58M90L06m46k57N20l32n03N53J92o73
2926d45K71M22k2m78O09k63m48L48K40n30q4K66j62k31M59J06k93K94Q6p7k83
2947b15M82jn20O42r9k22k8L48j83o35N49j03l06j15M67m40J92L08l6o37N29J94
2969A71m33j4M33J58m96J22L23k06J0O1J03m76L74J87p49N50J52j23l56M31j17
2990A05m16J58K80l29j38O49l11l16J97J43j94l8Q52o95K4N28n12j79L68q2l77
3011b83K54R6k76K1L79k08l55J23L89m01p3K91O7l60M92j16j08P2J80k27k51M58
3033A64K64o49L19J38m52M9M18k78k50M17q3k33j28L60j35l31L16Ol52m3O79l24
$$ y = [-126, -376, -256, 310, -147, -674, 316, 361, -507, -11, 698, -83, 6, 474, 488, -534, 78, 541, 50, -324, 311, -161, -509, 13, 154, -447, -161, 450, -180, -180, 105, 163, -295, 195, 501, 55, -202, 318, -14, -517, 36, 228, -445, -174, 248, 226, -252, 357, 94, -354, -6, 234, -296, -380, -114, -276, -507, -48, 58, -235, 59, 145, 68, -215, 267, 266, -254, 388, 289, 67, 39, 387, 204, -431, 118, 15, -291, -406, 61, -379, -187, 121, 85, -552, -23, 171, -262, -276, 157, 315, -181, -59, 264, 58, 68, 129, 232, -244, 130, 317, -432, 118, 270, 147, -209, 222, 105, -311, -153, 127, -202, -340, 309, -2, -318, -121, 22, -172, -210, 642, -53, -29, 499, -13, -192, 176, 94, -283, -29, 67, -209, -188, 191, -17, -372, -249, 140, -261, -334, -43, 24, -336, 156, 40, -68, 4, 184, -43, -294, 164, 428, -221, 98, 236, -216, -167, 251, -27, -277, 140, 57, -176, -304, 56, -79, -410, -94, -88, -440, -483, 196, -128]
3055a28m5J79L13l90N66j35l48j52L33M5o33L99j11k77L58J23n43K80L76k72O
3076e6L02m8m21K82L11m64j1K85k33Q5q1M06k46j07K77Pm10K70L9n79L18J68k25
3099a31j65N81l25k79J70J40J6l17L74N2n29O38k91q6Q6J46j40j88L07J0k31L74
3121B12J34m17j89Q2K76j40K11N9l84k42L15J01j48n3K13j31J31K71k05l7L94
3142D53l19k83J94R2j82oK60j62m42M11J97k70J60j7j55k4J70p1l11L35j40n0
3164a60r6K83j68j10L56k00J28j09M75n24M7K28M1l81J97L36k38l11K78j21j19
3185a68oo5K34J57%k01j26L33k38j4N28j09m96R4L73l05j82L68l33j31K76N7j59
3208a13N5K88o5l08K94j95j29n7N73m00k96L94K29n33L43L42m69J42o7R4l87J87
$$ y = [-128, -173, 6, 319, -71, 495, 360, 12, -140, 193, 238, -395, 4, -107, -384, -26, 97, -446, -166, 210, -62, -56, 246, 198, -223, 59, 370, -94, -105, 180, -53, 32, -49, 357, 111, 4, 281, 288, -122, 148, 187, -392, -74, 94, -131, -296, 285, -40, -319, -149, -9, 7, -310, 64, 116, -413, 225, -66, -152, -66, 80, -60, -248, 59, 69, -162, 212, 346, -71, -260, -178, 98, -42, 169, 228, -156, -398, -83, 18, -130, -183, 30, -101, 30, 301, 96, 59, 453, 134, -149, 45, 137, -45, -51, 209, 47, -395, 16, 213, -57, 103, 86, -69, -93, 77, 6, -305, 30, -110, -160, -256, 27, -141, -251, 105, -95, 33, -76, 399, -125, -78, 150, 191, -190, 7, 343, 105, -206, 72, -49, -168, -174, -239, -5, 152, 152, -49, -175, 158, -80, -94, 434, 325, -171, -77, 296, -9, -191, 177, -156, -287, -11, 46, -113, -58, 230, 165, -143, 151, -44, -173, -230, 343, -57, -353, 41, 270, -263, 80, 422, -47, 95, 28, 122, -265, -78]
3230g8K05j43n1L29n95J24K63L3p5j4o7j78K13K58k49K03r6R7k00P5O2j20p1J50
3254G5j06j28N5K82j25l48N07k45p5J16p3l16K43J43l09K18K4R8R4K1j84JJ02
3277G0M0K2m9k50J35j18RL8M2L7J61Mk9j63J2n4J41J9N7l56K39O5o9k1J10k09
3303a17m1J32J44l20Q5M06j65m6r5k9J09j70J79O6k2j65J40m19L39j49K02m1k32
3326b09qk6L72k20K07L2Q1l12J03J65j40j59m0p0q0J12O9J78K54l03M8l57N25
3349B22j6l03P6J46j27k14J55P1k13Q6K48j30r0M29k48q9m9J9n1Q9j10j3K39R6
3373B23j92k23J10J1K29j58k6R3j98K88Mj43ONJ14q9k7j3Kk9J30n0j82K45Q0l13
3399a03K45N6m95N39j37k80J06pN2k3p4J59J34l62L55L9n3j35J25R0k99J14n8
$$ y = [-78, 127, -16, -67, 262, -333, -209, 54, 87, 12, -2, -69, -247, -34, 224, -25, 178, 82, 179, -21, 54, 116, -4, -75, 75, -31, -159, -104, 178, 53, -295, 212, -33, -108, 8, -65, -381, -138, 5, -304, -86, -62, 36, 130, 151, -33, -32, 70, 110, 132, 83, -167, -32, -150, -141, -103, -61, -24, 137, 141, 112, -51, -39, -93, 48, 67, 124, -232, 7, 72, 3, -18, 92, -117, -158, -26, 118, -202, -117, 289, 124, 78, -17, -46, 63, -107, 72, 138, 116, -49, 91, -328, 11, -138, 64, 23, -209, -217, -243, 129, -91, 116, 148, 229, -83, 20, 185, 45, -114, -154, -224, -304, -192, -123, 55, 309, 6, 54, -303, 222, 206, -97, -21, 125, -2, -216, -61, 10, -203, -117, 131, 1, -89, 340, 92, 3, -46, -27, -78, 11, -99, -112, 127, 223, 31, -192, -82, -71, 158, 0, -26, 67, -131, 157, 161, 18, 24, 29, 143, 54, 27, 14, 16, -13, 117, 67, -115, 130, 210, -103, 142, 198, -297, 242, 105, -175, -69, -76, -24, -47, -121, 38, 172, -190, 165, 204, 151, 16, 141, 231, -68, 46, -12]
3422a2K03j48k51M47k40m1J48qk6Q1o1k03K02j81L51m4l36J16m7J48Oj23k48J75
3446i2K29l39J97J37L5k93J57k00J31P4M7j40j60N2L81k29J76j60j16j9j43K23
3468e2qJ65k83n9K13L93m64k5J37k52L58l21L55r5M2L23l47M1j26N5L8M3J15k67
3492b1L1M3n0k42K34Nk5P0j12q6J88j45K7J71O9m24J77J94k83J52j85M19k91n06
3516e90M64K36k42J82N2l09J85J42k39K43l2J17k13k3L6q3J89j69J84k29J01M
3538FO9p5j6K42j84K23k95j8p9K23r1J97k40P4q4O4J67l37J22nR7l46M01k25J14
3563Dj91J12K27l06K78k7OR1j49J38j93J04p0j26L2j81K98j23k2l0J05J48j87
3586f2M7j08O4J95k88L10k00J51j87J39l5j94K23J71l56O1Q2q7M3J35K9n9l04
$$ y = [-12, 191, 43, -208, 239, -1, -42, 106, 98, 72, 153, 92, -111, 91, -90, 261, 217, -119, -3, -50, 98, 104, -19, -267, -92, 137, -202, -5, 132, 167, -126, 31, -169, -38, 36, 83, -57, -217, -165, 216, -13, 163, 3, -113, -132, -275, -52, -60, 105, -178, -237, -24, 369, -95, -120, 17, -235, 123, -198, 157, 62, 104, 427, 80, 121, -5, 50, 88, 131, 246, -21, 10, 53, 3, -239, -5, 0, -25, 45, -67, -153, 35, -110, -83, 88, 157, -267, -90, 104, -179, -27, -212, 207, -84, -590, -126, 110, -132, 50, 102, -207, -22, 120, -119, 124, 92, 209, -4, -27, 9, -74, 115, -54, 130, -99, 2, 6, 75, 0, -16, 226, 42, 265, -30, -48, -127, 96, 5, 202, -38, 36, -48, 16, 183, -154, -32, -37, 60, -286, 115, -110, 4, -187, -75, 152, -154, 124, 97, 103, 194, 45, 183, -10, 94, 24, -102, -70, -251, 47, -76, -98, -128, -23, 125, -62, -15, -123, -59, 136, -152, 158, -42, 109, -78, 61, 26, -168, 55, 226, -130, -69, 13, -74, -31, 104, 133, 74, -230]
3609b30K29K3R1K4k17Q0k34L84j11M6jO9l60P8O3K6j90L25j20J51l56K25O7j55
3633i3J91K7j14Q5L8j25r9K01N0m7j23N9o5j0J11k0k02J41J6j00K14q7k60J93
3657a9K76q1l41m5J84J33K2j96j1K66k87K05l60K43P0m6km2k02K10L3mr8J38K37
3682B83k73q0j82J92J0L8r5k47K50mL19k67Q1K3l09K46n5oM8L8M8q5K82j59m4
3707E2k26O23m54MJ04k12j95M28k77j44J15K02j59P0n0J74k80L01k11P0P2K37
3729B44m34n6L50j05jJ6K94k25j14J30Nj94J53M5k62J82J90n41rJ95K24k15K82
3752A54J36k12k73J93p4o5M45m10K11ln3J24k24K48j77k88J14N3l3j00K45L09
3774C20j60j18J9k44r3L29jk18J48o7j29J17L10l01n8K78q8l39K27M09l36J70
$$ y = [-230, -1, 22, 113, 137, -80, 0, -234, 150, 39, 85, 84, 153, -207, -129, -66, -40, -230, 95, -25, 126, -230, -5, 62, -93, 98, 125, 11, 96, 134, 9, -90, 111, 161, 114, -9, 50, -15, -25, 86, 66, -136, 5, 21, -79, 135, 48, -212, -19, 257, 176, -165, -210, -26, 107, 129, -67, -78, 188, -99, 106, -254, -11, 59, 13, 11, -31, -233, -23, 10, 6, -92, 46, 283, 10, -70, -252, -60, -50, -12, -107, -354, -104, -108, 211, -56, 25, 48, -261, -15, -70, -76, -28, 10, 58, -27, 255, 96, 52, -174, 449, -5, -1, 103, -109, -304, 124, -153, -297, -182, 20, -139, -69, -119, 55, -225, 76, -135, -65, 7, 244, -190, -246, 104, -1, -2, 14, 308, 83, -31, 99, 104, -90, 63, 108, -154, 28, 218, -323, -332, -137, 87, -128, 154, 290, 78, -195, -2, -76, -141, 304, -106, 105, 102, 49, 173, -51, 197, 20, -268, -154, -101, -134, -234, 11, 320, 160, 42, 61, -183, -276, 53, 52, -166, -18, -85, -214, -97, 213, -88, -146, 132, 44, -295, -68, 341, 5, 175]
3796A75N7j60l43K16J48m62K15M83l65J12N7l23k66M04J75j46J0J13j40j56J96
3817@K63k84n4K98l78L80k54K48j91l21L05j53J22k8k6l3q1L10n9k14JL25l16
3840a40K88k86J67k9qK3L4l2N3k60L02n2j56J17P0p7j97M07j41j4j05Q0j20p2
3864a48K73r9l8o1K75m79M82m0m2j71J67m52K47K40r8l2j21K04l46K07k52L60
3886G6k85K35q5R1r6R9L04n44J21L19j96l43L63m2n9J22m1j3l2j1L0j53J79kk8
3911IP1Jj12r4J3m9P0J87k06M0M23l27k11K07N4K31m16L00K22l94j30K09j35n3
3935i0K16j22l0k77M94j71pJ18n4j2J01nj64j9M6K05j28J08K5m35J80J4J17j89
3959g9L5P1N9%J43l54j1M54l50j91J65O4o5K83r1j98J95k27M21k40j63M3j88K48
$$ y = [175, 232, 72, -271, -55, 93, -369, -154, 329, -36, 76, 133, -190, -456, -52, 123, -23, -13, 100, -40, -196, 0, 263, -21, -75, 223, -155, 225, -29, 219, 28, -293, 12, -141, -19, -47, -73, -106, -187, 123, 64, -150, -149, 176, -140, 148, -138, 29, 0, -8, 15, 49, 17, 70, -190, 112, 60, -96, 21, 91, 14, -183, 224, 83, 69, -36, 44, -76, -148, 125, 26, -12, -73, 202, -277, 205, 165, 123, -48, 119, -333, -86, 154, 56, 24, -97, 107, -239, -32, -284, 76, -209, 26, -59, 32, -64, 35, 339, -205, -84, 235, 39, -304, 59, 17, -42, 80, 39, 26, -6, -17, 13, -140, 39, 37, 9, 80, 81, -31, -125, -112, -161, -91, 96, -110, -70, 353, 26, -185, 22, 76, 307, -109, 191, 413, 19, -111, 98, -37, -90, 126, 4, -26, -303, 191, 20, 13, 131, 77, 65, 166, 161, -3, -22, 24, 229, 101, 209, 234, -201, -21, -7, 110, -79, -44, 27, 86, 86, 229, -125, -136, 318, -32, -223, -58, 6, -59, 224, 133, -65, 130, -97, 324, 84, -79, -36, -224, 24]
3983B4K14l90j06N38r2k63K03j31j85J31K02j41p6J31J31l59j1M17k34K68m6K49
4005D74n76Q1K15j30j96K13k61J12m2L52j44j48K83M0k33J6J72l72K4N4j73J0
4027b29L92K49n61K78K13o02K79m3j00k4K16O0j57m62N01q7J04K96n43J19L44
4048B43j92n3J10l2j01k60K98J39p24M53J88L8j31K61k59j88J30J00O0k21J20
4069b1Nj35K31K05j00k82L43l87p8RJ27P7k35M56m91K10J29j82K12k40J5j0o8
4092b10M69O2k78k61M24j75k1M2j32pO8N0j99M82k16k94J69Q2p5j42J62J03l16
4115b13J09L49k57k78K65M6k40L39J54m77J66O9o8O9n8M8k19J48L38n77Q3K88
4137H4P6k25L9L16n34K56J13p0k27N5J01l62K60L52k17m7K38j98qj72J99k13m
$$ y = [24, 238, -152, -258, 280, 188, -75, 128, -3, -188, -57, 145, 4, -72, 59, 190, -169, -180, 237, 3, 271, 225, 474, -102, -21, 194, 64, -132, 81, -180, -68, -110, 242, 98, -50, 233, 273, 40, 56, 228, -144, -120, -66, -239, -229, 163, 412, -149, 129, 342, -260, 19, -24, -124, -148, 68, 128, -29, -491, 10, -77, 27, 323, -220, -101, 243, 51, -2, 108, 76, -25, -285, 13, 152, -572, -119, 69, 107, -24, 237, -22, -210, -80, 20, 80, -141, -21, -16, -151, 80, 285, 185, -97, 246, -141, -219, -210, -83, -6, -241, 215, -276, -66, 63, -119, 93, -147, -132, -142, -210, 259, 321, 43, -218, 206, 31, 10, 52, -80, -87, -19, 31, -168, 314, 98, -196, -27, 55, -20, -162, 0, 103, -213, -104, 245, -12, -290, -25, 21, -219, 120, 274, -203, -37, 32, -36, 33, -25, 23, -196, -48, 290, -287, -204, 84, 160, -65, -26, 290, -244, 12, 125, 55, -172, -117, -16, -378, -118, 234, 17, -30, 208, 10, 2, -170, 29, -184, -188]
4160a88L69j55j73J95K9p4j9N7j69J2K03p1j94J86P5j75q4L00J92n71M29j26J07
4183A55l33K49p1j18r2P7p4J81j27n1R7J59m4j26J89l2P4Q4j98j62K94k48K54
4206A37q0K2R6m11j22K80q7J33K28j58j39j98M21K9Q0%l3l31K09M5P7m1k8r7k86
4231b54L01J33l98nK19J12j87J73k61K35K9Q1j07k00m5J53j67K55n3j35J91J2
4253H2K5J91O1n8l05J18n2k58M50l35J31j18P4J50k07K34j19l7J67Jk77j01QK88
4277A13j43j76K91M2p5j55L17l26J2K78j43R3j6m7l64J09M25l31l7K37o2j80J35
4300cJ60n7p3L21l91J8M24k83m16M07J54k76j08K67l9j22J66n6p8m33P12n66J79
4323i3K40k48Q5q9J20q1J15n7M62l97P9j05k01M81k62l23K97O4j08k70M37j82
$$ y = [-188, 181, 26, -147, 48, 77, 3, -16, 41, -128, -116, 87, 16, -178, 8, 83, -92, -176, 124, 316, -255, 174, 48, 155, -178, 71, 0, -118, -210, -133, -207, -26, -153, -204, -107, 52, 8, -118, 71, 39, 113, 197, -1, -163, 131, -117, 137, 57, 79, 175, -236, -358, -78, -165, -32, 196, 38, -101, -299, 122, 151, 231, 231, 198, -133, 76, 121, 198, 157, 129, 32, -254, 47, 180, -218, -223, -4, 108, -79, 94, -167, 68, 97, 178, 71, -129, -174, -21, -188, 67, 14, -121, 70, 82, 107, 298, 359, 301, -4, 114, 62, -196, 254, -81, 50, -68, 6, 156, -51, 183, 64, 27, 194, 195, -82, -183, -175, 113, -30, -206, 85, 127, 52, -103, 214, -112, -100, 178, 35, 128, 112, 65, -299, -190, 235, -96, -133, 104, 42, -138, -3, 157, 100, 27, 348, -43, -25, 399, 116, -300, 107, 261, -15, -123, 144, 105, -17, 149, 93, 15, -418, 294, -272, -93, 147, -101, -16, -105, 15, -66, 49, -8, 454, 57, 136, 31, -170, 311, 49, -274, 23, 87, -21, -291, 146, -36]
4345c6J05j42J03N8j43J5J26k67O2J81m4k24J67J80k78R2J37j71J67L6j10JJ0
4368B5O0p5j31L22j08k10K25J2P3J47k51j26j53n4J47j08L47k6k8l33L42R6l39
4391a46n1O8RK20P7j49j71J12R6l01K93JM9k29K29k16j54L53J17k09j90J83r1
4414a00o5K06J74k32J60k07N2j98N12l60j81L10p9J08j48L23k41k41J38N8r7j38
4436b46N2J24p2L15l00m4J47J38J40k44J95j88l75M47r3O8k55L27k05Q2J63k67
4458i1M3K39J39m05L1p7J17J82j85M0j89j86k0M31l79L21j25P3M6j42P7J45j76
4481i1r1K30o2J4q9r3L13k52L68K3k97j39J79J00j13J9j19n9J49R8k9j98P9L96
4505C36m48k15K68R7J74j04J68j22j76l0O3K20k44J86l13J61N4Q7j9k09mL3K4
$$ y = [-36, 69, -73, 30, 88, -55, -40, 86, -181, -119, 62, 18, -206, -39, 141, -137, -45, 92, -79, 88, 124, 14, 15, 25, 85, 10, -121, 201, 93, -117, 108, 120, 193, 340, 89, -37, -190, -244, -97, -205, 142, 116, 88, -245, 97, 193, -146, -197, -129, -120, 100, 177, 28, -143, -31, 65, -236, 57, 58, 107, -122, 107, -109, -263, 90, 207, -2, -192, -9, -100, -165, 41, 215, -17, 143, -64, -12, -210, 302, -58, -239, 71, -8, 100, -48, 275, 34, -207, -69, -11, -108, -246, -194, -70, -142, 173, -127, -171, -24, 114, 254, 10, 205, 17, -358, 89, -4, 64, -191, 136, -69, 13, 176, -91, -48, 191, 330, -75, -44, -121, -4, 178, -7, 33, -156, -342, -362, 69, -310, 11, -114, -41, 5, -137, -60, 85, -91, -182, 48, -14, 0, -89, -182, 131, -121, 247, 270, -27, -166, 13, 113, 0, 19, -100, -159, -10, 88, 59, -139, -60, 336, -112, -327, -59, 38, 212, 108, 276, 154, -22, -52, 11, 231, -13, 173, -140, 21, 75, 162, 143, -66, -70, -37, -13]
4528a3L5J71k92J50j17p3K68m2l30L13j57J86j45J43j41R6l9Pj15j0K54j48M6
4551D7Kj55q9L6J46j28K18K1m4J7J05j37K29j55m8j5k00q1K64j93O1k6J16J24
4575A15q7k07m8K1J66N6oL1j45J16J2k64K77J64j8j31nJ04j53J59o9k09J44j44
4599a21%K0J01J31k04J37K7ol26L20J05L8L4k03m4j08J32q9K0J74j31k6Q3J8n5
4624B7j19J76p9K6n6R3M7r7J25p6N8k05L63Om40N0L6l5K10k47J42j81J23K7j47
4649a73K25j89N9K8J42k22O7J93j57J99l98L12r3o4jJ79n1j57J50M35n19Mj56
4672a87J66J83M9k25L26o4l56J5K08l91J98J33O4j28k14J3K28l1J9l3o4N2mj18
4696a61J5J3J75k31M3K13l62J68M19n13K02R6r2Q2k61K21j23J25R0q9Q1m3n2p8
$$ y = [-13, 22, 193, -99, 51, -66, -139, 129, 87, -243, 70, -87, 99, -46, 97, -44, 52, 13, 20, -95, -105, 149, 1, 47, 49, -106, -195, -159, -13, -141, 77, 98, 54, 71, 176, 39, 268, 113, 65, 50, -150, -231, 33, -160, -99, -125, -9, 115, 28, -179, -227, -206, -40, 16, 10, 41, -104, 12, 24, -240, 37, 201, 183, 52, 47, 151, -2, 157, 88, -121, 23, -121, -121, -101, 0, 131, -73, 64, 91, 85, -241, 79, 184, 222, 256, 53, 9, -99, 33, -56, -36, 138, 7, -19, 64, 82, 27, -92, 84, 5, 31, -25, 68, 115, 18, 143, 67, 125, -80, 283, 289, -151, -101, -65, -100, 110, -137, 5, -176, -53, -26, -173, 52, -137, -78, -50, 92, -130, -63, 130, -27, 172, -226, 86, -7, -71, -72, 107, 56, -101, 49, 484, -35, -31, -187, -21, 162, 211, -14, 312, 248, -108, -93, 115, -276, -78, 55, 119, -9, -223, -210, 18, -13, 6, -27, -91, -39, -43, -161, -146, -133, 42, -189, -146, 67, -295, -127, 292, -221, -19, 77, -15, 67, -194, 27, -96, 29, 119, 30, 111, 68, 16, -62]
4720f2j8J27k65L41j81M06l90j8J52r0q1P5p0j85K49j7oL20j48l03J69r6K12p5
4744D6M1l72J06OK40j54j96J59P5Oq3K29j48k71K09P6m4J12K38j81k35J9L70l6
4768B12k11K58k38J04k73J27n9R1LJ76m95L36R5N5k63R2o8R9j23J0K03j55J07
4791H3j84P2J6Q4k55L89k6k14K62k03p6Q3J02l90M79j22o2l34K38L54l52l1J14
4814B7j01o1L39j0l50J73j30K15r6O6j13O4k11K48j51O9j50K56j99K20M7k18p0
4837a36l0J69J43q7o7n7j5Q4J35J46k17j11QO5J00j1j34O0R0l39K20p6N9m7j92
4862b40K02j3R7r9Q7o8q7K25o0n5lK31k41pq9K5J73k53J50j25J38K22j51j40j48
4887b29J85J64k83m2K02N8j61N1L0j1R5r6j83K01l9l4q2J8J30l2j90K83q1J11
$$ y = [-62, -80, 47, -218, 123, -58, 348, -42, -60, 92, 2, -79, -4, -74, -259, -10, -27, -33, 287, 139, -164, 5, -91, 121, 46, 87, -285, -179, -173, 67, -87, -283, -124, -49, -43, -126, 103, -45, -316, -107, -31, -75, 37, 275, 94, -141, -122, 248, 212, 1, 259, 21, 125, -148, -21, -80, 11, 14, 190, -305, 31, 126, 181, -82, 10, -58, 41, -82, -72, 131, -24, 83, -101, -29, -13, 71, -184, 205, 179, -35, 227, 24, -52, 31, 133, -257, 222, 100, 38, -296, -58, 296, -56, -87, 27, -74, -135, 204, 194, -156, 17, -113, 102, 6, 72, -41, 23, -188, 60, -91, -22, -172, 84, -115, 105, 152, -66, -136, -166, 3, 146, 59, -8, -65, -80, 4, 139, 285, 68, -43, -35, 30, 130, 119, -15, 45, 135, -204, 16, -60, -1, -48, -240, -38, -51, 46, -53, 34, -34, -121, 104, 44, -11, -14, 217, -24, -31, -120, -95, 78, -175, -25, -150, -12, 210, 59, -81, -229, -44, 120, -163, -205, -3, 55, -106, -55, -25, -36, 59, -37, -220, -19, -58, -92, -174, -156, -26, -58, -248, 35, -46, 65]
4911F5m6k4K31j83l8mk87J40L18j94J99j56J27J35k35r9l5J46j57M4K61j12p3
4934B3J6K08k91l6J83n2k13J38K8m2n1J4j16J96k28J53J35q8J30nn6k0j17j69
4958b60Q1R1J98k19M9K40k51L9o7K36k13L4J05k12J51j11J79L37n93L29J26m23
4980a54M6Rj47J49J09R3q7j04J97k71K95k74K7K12k24J80J68jr6j10j08j02J35
5003e8K57k01J31J39k29k26l9Q0P8K54o6R6k08o3k18N2K16J0K12j50%k27K93K2
5027A55j31J08j57O2J80k08J13m08M52n0j18J01j86K74j4j51m9J86l95K50K23
5048B37J43m05K87k56J63j48j78lQ1K85k05j08RJ14p0K73j39j82J56o7j24L26
5070A89R8m80P4jK87j78P4J23p6K5l1l4l3n8K12l58n5K52Q7j38J9K57k33J54m84
$$ y = [65, 19, -5, 226, 43, 5, 1, -286, -146, 172, -22, 177, 21, 148, 283, 48, -51, -86, 60, -97, -53, 208, 96, 23, 39, 247, -44, -80, 103, 51, -162, -24, 4, -38, -89, -75, -191, 5, -223, -70, 65, -23, 107, 102, 46, 26, -91, -260, -179, -88, 110, -109, -60, 180, -71, -32, -99, 137, -76, -42, 63, -149, 2, -109, 70, 407, -186, 143, 269, -154, -108, -99, -246, -97, 12, 105, 18, -86, 111, -160, 135, -139, -112, 100, -124, 56, 224, 223, 127, 17, -91, -193, -58, 199, -2, 129, 268, 39, -187, -226, -146, -68, 186, 120, 216, 8, -55, -273, -221, -5, 5, 217, 67, 67, -160, 133, 155, 24, 132, -25, 37, 217, 9, 122, -286, 166, 116, -2, 99, -87, 187, 173, 22, -27, 159, -236, 14, 237, 380, -25, 262, 6, 169, 21, -157, -160, -79, 206, 1, -107, -98, 16, -54, 219, 80, -102, 54, -13, -137, 189, 287, -193, -119, -120, 167, -11, 63, 186, 110, 135, 104, 70, 37, -21, 191, -167, -222, 30, 117, -21, -2, 255, 22, 176, -308]
5095c08M04j84k7J56j3r3K3M4j5J08l00M74n1j41o6j86K27J34j93n1O9J32k64
5118a21L7J49o9Q6j16J42l40K18K08k89p9K15J72k22k94M21n8R1r5j0l5q5L19
5141B45j33j46L3j06K90l50J88N3J07l03J93k13L16L6j21l6k33J89p4l06M70j56
5163e7O6k5j15K37j96r3J06M5l25O05m4k29K35n0J9j54k20K61k48K0K15q5J4J25
5187A07l88M23k34p3Q2J64k31J68j55j00J78j10J11j72L25j62j8K09r6K3R4j13
5209C2oJ8Q5M6j61L7j51K29r6R1k4k30j0L51j59l6Nr8L70l33J79oO7j3k26J3J65
5236A39j50p8M1j58L98k42j25J55j74K0J69J56j42M4j31r0K32j60K53j18j13j04
5258a78M24l77m3J51q6N0j16K51l08K28j60J3o5K01o3J57J09j08K0l17J55O0p2
$$ y = [-308, 96, -88, -115, 41, 28, -65, -42, 2, -13, 95, -205, 269, 218, 77, 11, -175, 52, 186, -7, -58, 11, 143, -121, -84, 65, -4, 82, -34, 108, -232, -14, 194, -95, -174, 41, 213, -9, -303, 118, 60, 151, 56, 46, 11, -74, 245, 112, -34, -1, -107, 183, -167, 21, 74, 181, -122, 71, -142, 174, 210, 89, 53, -180, 9, -65, -371, 99, -57, 9, -16, -131, 106, -90, -183, -77, -32, -357, 248, 204, -25, 210, 160, 179, 25, -195, 66, -182, -162, 53, -32, -18, 107, -281, 142, -92, -165, -83, 81, -150, 18, -137, -237, -59, -169, -58, -230, 95, -67, -85, 124, 28, 51, 145, 32, 26, 44, 129, 175, 14, 51, -100, 129, 33, 124, 100, -130, -140, 211, 52, 16, 21, -77, 293, -40, 139, 133, 200, 187, -39, -26, 139, -11, -89, -48, -206, 192, -50, -175, -20, -194, -174, -5, 151, 9, 53, -78, -168, 64, -96, 157, 39, -74, -178, 246, -131, -174, -23, -109, -59, -175, 76, -232, -4, -164, -151, -216, -15, -78, 79, 188, 80, 100, -217, -62, -2, -74]
5281g4J15k40j9K49j90NqL16j7j96K0k01J21J04jM3jj04L77l91K47m0k6J5k3j78
5307i7k3j0J89o4j20J28p1J14o9Lr3J62O2j56j75J42j57J58L10j39J10j8L1l9
5331A78j0l80L49k8N3J84n18J83o5K01k49K75M4k48k77K40L60j36l27K62k16n1
5353a76L77k43o8r0K40l67M21R8k74r5R4M7J62j25K8J5K4r7n2pN8J70K7J42l19
5378a0Qm8K28p2j35K06k9l88Q0L47l33O9l9J83k06L5K62k21J45j27P3j57k5K07
5402E3Q5k65J57k6O4q4M4k91K03J65k1j78JJ76r0k5pj5K7n7R9j25J77L2k56L59
5428B02l43J06L15k93P7J9k56J82r0j48L43J16k89L81l3k71J32l01J69j21J09
5449FJ5m8k1J59j26k21M50k74J7L0M1j25J07J59l12o0K48r7J04L9j92MJ04J40
$$ y = [-74, 41, -199, -218, 31, -159, -154, -162, 154, 137, -59, -39, -240, -119, -15, -16, 27, 26, -78, 299, -92, 155, 115, 89, 104, 81, -97, -120, -130, 59, -5, -125, 3, -68, 46, -23, -20, -113, 49, 111, -45, -220, -78, -235, -77, 233, 94, 204, 186, 217, 178, 168, -212, 137, 109, 162, 346, -172, 11, -54, 147, -102, 173, 217, -31, -308, -68, 292, 156, -171, 91, -125, -176, 201, -42, -110, -200, 40, -327, 94, 192, -82, -177, -83, -36, 126, 1, 29, 44, 68, -29, -81, -88, -30, 140, 167, 309, -10, -2, -50, 178, 106, -29, 177, 148, -240, -160, 187, -146, -77, -116, 67, -139, -104, 158, -63, 82, -45, 28, -129, -154, 53, 138, -127, 30, 4, 68, -16, 28, -263, -60, 105, 84, -94, -93, 83, -7, -32, -39, -54, -27, -84, 15, -110, 67, 99, -157, 202, -141, -35, 280, -13, 64, 83, -173, 9, -81, -229, 114, 230, -59, 322, 289, 18, 150, -151, 18, -103, 6, 21, -27, -48, 111, -15, -236, 214, -60, -43, -13, 28, -97, 10, 169, -143, -203, 45, -52, 52, 91, -101, -97, 7, 147]
5473A47j44J07L5k33J88k1L5j42j79L90j83k7n0K09q7k5J17J76m41K27O6l82L67
5496A50q7j53R9L43l11k76J93kj04J15M2J9k79K94m6Q5l08K14j19J66k28n6j71
5519d20N36o0K7m3J1k17j55L73p7q5J26N3j74L6r2L28k18K43j10j81K40p7k91
5542b27M21j66j7M4J86l49J67j66J39M1q2j6l5j58J88K17k08J95j55P3n5k77L06
5565F6pM5j22k6j21K6J37j80O1J61r3J37O6k87L0p7L54k20K60k84N2J97j03j66
$$ y = [147, 3, 110, 145, -88, 100, 79, 114, -28, -207, 183, 0, -27, -77, 132, 45, 20, 137, 313, -128, 99, 165, -217, 150, 63, -90, 9, 352, 41, -235, -42, -44, -148, -33, 9, 28, -251, 43, -3, 82, -226, -12, -131, 35, -193, -249, -420, 116, 56, 83, 40, 51, -166, -321, 52, -25, -110, 16, 69, -105, -69, -161, 167, -51, 192, 82, -99, 141, 64, -227, 194, 28, 11, 55, 241, -108, 59, -107, 32, 73, -9, -25, -60, -218, -30, 187, -21, 174, 19, 92, 37, -240, 66, 59, 104, -18, -44, -165, -139, -2, -182, -121, 40, -53, 84, 150, -137, -107, -184, 170, -50, 210, -74, -22, 175, 72, -94]
$$ [...]
8191D2
##END NTUPLES=NMR FID
##END=
