##TITLE=1H ikalashn
108-2024-BAU
12.12.2024
##JCAMPDX= 6.0         $$ Bruker NMR JCAMP-DX V2.0
##DATA TYPE= NMR FID
##DATA CLASS= NTUPLES
##ORIGIN= UXNMR, Bruker Analytische Messtechnik GmbH
##OWNER= root
$$ TOPSPIN		Version 1.3
$$ 2024-12-12 14:23:12.015 +0400  Irina@DPX200
$$ Compression mode = diff/dup
##.OBSERVE FREQUENCY= 200.131300845
##.OBSERVE NUCLEUS= ^1H
##.DELAY= (6, 6)
##.ACQUISITION MODE= SIMULTANEOUS
##.ACQUISITION SCHEME= undefined
##.AVERAGES= 16
##.DIGITISER RES= 18
##SPECTROMETER/DATA SYSTEM= spect
##.PULSE SEQUENCE= zg
##.SOLVENT NAME= CDCl3
##.SHIFT REFERENCE= INTERNAL, CDCl3, 1, 17.49637
##AUDIT TRAIL= $$ (NUMBER, WHEN, WHO, WHERE, WHAT)
$$ ##TITLE= Audit trail, TOPSPIN		Version 1.3
$$ ##JCAMPDX= 5.01
$$ ##ORIGIN= Bruker BioSpin GmbH
$$ ##OWNER= Irina
$$ $$ F:/spectra/data/iren/nmr/1H/4/audita.txt
$$ ##AUDIT TRAIL=  $$ (NUMBER, WHEN, WHO, WHERE, VERSION, WHAT)
(   1,<2024-12-12 14:22:31.718 +0400>,<Irina>,<DPX200>,<TOPSPIN 1.3>,
      <created by zg
	started at 2024-12-12 14:21:23.828 +0400,
	POWCHK disabled, PULCHK disabled
       configuration hash MD5:
       BE 6D 3F 07 2A EA 11 49 91 17 2B D3 AF B3 58 0D
       data hash MD5: 16K
       69 DA E2 A4 C2 93 FD 58 12 0D 00 00 33 19 F9 66>)
$$ ##END=
$$ 
$$ $$ hash MD5
$$ $$ 19 73 9C F9 44 8C A6 EE F2 2F 6F 31 EE FB C9 AB
##$RELAX= 
##$RELAX= 
##$RELAX= 
##$RELAX= 
##$RELAX= 
##$RELAX= 
##$RELAX= 
##$RELAX= 
##$RELAX= 
$$ Bruker specific parameters
$$ --------------------------
##$DU= <F:/spectra>
##$EXPNO= 4
##$NAME= <1H>
##$PROCNO= 1
##$TYPE= <nmr>
##$USER= <iren>
##$AMP= (0..31)
100 100 100 100 100 100 100 100 100 100 100 100 100 100 100 100 100 100 
100 100 100 100 100 100 100 100 100 100 100 100 100 100 
##$ANAVPT= -1
##$AQSEQ= 0
##$AQ_mod= 1
##$AUNM= <au_zg>
##$AUTOPOS= <>
##$BF1= 200.13
##$BF2= 200.13
##$BF3= 200.13
##$BF4= 200.13
##$BF5= 200.13
##$BF6= 200.13
##$BF7= 200.13
##$BF8= 200.13
##$BYTORDA= 1
##$CFDGTYP= 0
##$CFRGTYP= 5
##$CHEMSTR= <none>
##$CNST= (0..63)
1 1 145 1 1 1 1 1 1 1 1 1 1 1 1 1 1 1 1 1 1 1 1 1 1 1 1 1 1 1 1 1 1 1 
1 1 1 1 1 1 1 1 1 1 1 1 1 1 1 1 1 1 1 1 1 1 1 1 1 1 1 1 1 1 
##$CPDPRG= <>
##$CPDPRG1= <>
##$CPDPRG2= <>
##$CPDPRG3= <>
##$CPDPRG4= <mlev>
##$CPDPRG5= <mlev>
##$CPDPRG6= <mlev>
##$CPDPRG7= <mlev>
##$CPDPRG8= <mlev>
##$CPDPRGB= <>
##$CPDPRGT= <>
##$D= (0..63)
0 2 0 0 0 0 0 0 0 0.06 0 0.03 0 0 0 0 0.0002 0 0 0 0 0 0 0 0 0 0 0 0 0 
0 0 0 0 0 0 0 0 0 0 0 0 0 0 0 0 0 0 0 0 0 0 0 0 0 0 0 0 0 0 0 0 0 0 
##$DATE= 1733998948
##$DBL= (0..7)
120 120 120 120 120 120 120 120 
##$DBP= (0..7)
150 150 150 150 150 150 150 150 
##$DBP07= 0
##$DBPNAM0= <>
##$DBPNAM1= <>
##$DBPNAM2= <>
##$DBPNAM3= <>
##$DBPNAM4= <>
##$DBPNAM5= <>
##$DBPNAM6= <>
##$DBPNAM7= <>
##$DBPOAL= (0..7)
0.5 0.5 0.5 0.5 0.5 0.5 0.5 0.5 
##$DBPOFFS= (0..7)
0 0 0 0 0 0 0 0 
##$DE= 6
##$DECBNUC= <off>
##$DECIM= 32
##$DECNUC= <off>
##$DECSTAT= 4
##$DIGMOD= 1
##$DIGTYP= 9
##$DL= (0..7)
0 120 120 120 120 120 120 120 
##$DP= (0..7)
150 150 150 150 150 150 150 150 
##$DP07= 0
##$DPNAME0= <>
$$ [...]
##$SW= 21.9926040160658
##$SWIBOX= (0..15)
0 0 2 0 0 0 0 0 0 0 0 0 0 0 0 0 
##$SW_h= 4401.40845070422
##$TD= 16384
##$TD0= 1
##$TE= 300
##$TE2= 300
##$TE3= 300
##$TEG= 300
##$TL= (0..7)
0 120 120 120 120 120 120 120 
##$TP= (0..7)
150 150 150 150 150 150 150 150 
##$TP07= 0
##$TPNAME0= <>
##$TPNAME1= <>
##$TPNAME2= <>
##$TPNAME3= <>
##$TPNAME4= <>
##$TPNAME5= <>
##$TPNAME6= <>
##$TPNAME7= <>
##$TPOAL= (0..7)
0.5 0.5 0.5 0.5 0.5 0.5 0.5 0.5 
##$TPOFFS= (0..7)
0 0 0 0 0 0 0 0 
##$TUNHIN= 0
##$TUNHOUT= 0
##$TUNXOUT= 0
##$USERA1= <user>
##$USERA2= <user>
##$USERA3= <user>
##$USERA4= <user>
##$USERA5= <user>
##$V9= 5
##$VALIST= <valist>
##$VCLIST= <CCCCCCCCCCCCCCC>
##$VD= 0
##$VDLIST= <DDDDDDDDDDDDDDD>
##$VPLIST= <PPPPPPPPPPPPPPP>
##$VTLIST= <TTTTTTTTTTTTTTT>
##$WBST= 1024
##$WBSW= 25
##$XGAIN= (0..3)
0 0 0 0 
##$XL= 0
##$YL= 0
##$YMAX_a= 955246
##$YMIN_a= -1165604
##$ZGOPTNS= <>
##$ZL1= 120
##$ZL2= 120
##$ZL3= 120
##$ZL4= 120
##$ABSF1= 10
##$ABSF2= 0
##$ABSG= 5
##$ABSL= 3
##$ALPHA= 0
##$AQORDER= 0
##$ASSFAC= 0
##$ASSFACI= 0
##$ASSFACX= 0
##$ASSWID= 0
##$AUNMP= <proc_1d>
##$AXLEFT= 0
##$AXRIGHT= 0
##$AXTYPE= 0
##$AXUNIT= <>
##$AZFE= 0.1
##$AZFW= 0.1
##$BCFW= 1
##$BC_mod= 2
##$BYTORDP= 1
##$COROFFS= 0
##$CY= 7568.61572265625
##$DATMOD= 1
##$DC= 2
##$DFILT= <>
##$DTYPP= 0
##$F1P= 17.9538593292236
##$F2P= -4.03888763876832
##$FCOR= 0.5
##$FTSIZE= 32768
##$FT_mod= 4
##$GAMMA= 1
##$GB= 1
##$INTBC= 1
##$INTSCL= 1
##$ISEN= 128
##$LB= 0.02
##$LEV0= 0
##$LPBIN= 0
##$MAXI= 945.577
##$MC2= 0
##$MEAN= 0
##$ME_mod= 0
##$MI= -402.1523
##$NCOEF= 0
##$NC_proc= 0
##$NLEV= 6
##$NOISF1= 8.587773
##$NOISF2= 6.764455
##$NSP= 1
##$NTH_PI= 0
##$NZP= 0
##$OFFSET= 17.49637
##$PC= 1
##$PHC0= -35.1467
##$PHC1= 8.961438
##$PH_mod= 0
##$PKNL= yes
##$PPARMOD= 0
##$PPDIAG= 0
##$PPIPTYP= 0
##$PPMPNUM= 100
##$PPRESOL= 1
##$PSCAL= 0
##$PSIGN= 0
##$REVERSE= no
##$SF= 200.13
##$SI= 32768
##$SIGF1= 18.5376
##$SIGF2= -6.396296
##$SINO= 400
##$SIOLD= 32768
##$SREGLST= <1H.CDCl3>
##$SSB= 3
##$STSI= 0
##$STSR= 0
##$SW_p= 4401.40845070422
##$SYMM= 0
##$S_DEV= 0
##$TDeff= 0
##$TDoff= 0
##$TI= <>
##$TILT= no
##$TM1= 0
##$TM2= 0
##$TOPLEV= 0
##$USERP1= <user>
##$USERP2= <user>
##$USERP3= <user>
##$USERP4= <user>
##$USERP5= <user>
##$WDW= 1
##$XDIM= 8192
##$YMAX_p= 0
##$YMIN_p= 0
$$ End of Bruker specific parameters
$$ ---------------------------------
##NTUPLES= NMR FID
##VAR_NAME=  TIME,          FID/REAL,        FID/IMAG
##SYMBOL=    X,             R,               I
##VAR_TYPE=  INDEPENDENT,   DEPENDENT,       DEPENDENT
##VAR_FORM=  AFFN,          ASDF,            ASDF
##VAR_DIM=   8192,          8192,            8192
##UNITS=     SECONDS,       ARBITRARY UNITS, ARBITRARY UNITS
##FACTOR=    0.0002272,     1,               1
##FIRST=     0,             0,               0
##LAST=      1.8609952,     -34,             74
##MIN=       0,             -1165604,        -1165604
##MAX=       1.8609952,     955246,          955246
$$ Real data points
##PAGE= N=1
##DATA TABLE= (X++(R..R)), XYDATA
$$ plain form
0 0 0 0 0 0 0 0 0 0 0 16 -16 16 -16 32 -33 48 -64 80 -96 112 -128 160 -192 224 -257 305 -353 401 -465 530
30 530 -610 691 -787 899 -1011 1140 -1283 1442 -1605 1788 -1990 2215 -2457 2722 -3015 3328
46 3328 -3673 4048 -4462 4917 -5416 5968 -6580 7259 -8018 8877 -9854 10972 -12270
59 -12270 13803 -15638 17884 -20709 24385 -29392 36640 -48118 69144 -120265 506922 214146
71 214146 -901698 -109072 479012 -29573 -707230 -89658 616108 284438 -445977 -178486
81 -178486 343063 -56322 -818823 -372308 736970 847098 -45633 -287164 288161 340068
91 340068 -463007 -774281 -135337 324323 -66530 -287231 334769 771795 57888 -767887
101 -767887 -383117 518132 421312 -333135 -310711 423766 507877 -229495 -585074 -148208
$$ packed form
0@%%%%%%%%%J6l2L2l2M8o5Q1j12J44j76K08k40K88l52M16m81N62o58P54q66R95
30E30j140J301j478J686j910K151k423K725l047L393l778M205m672N179n737O343
46C328p001P721q510R379j0333J1384j2548J3839j5277J6895j8731K0826k3242
59a2270K6073k9441L3522l8593M5094n3777O6032q4758J17262j89409O27187k92776
71B14146j115844P92626N88084n08585o77657O17572P05766l31670p30415K67491
81a78486N21549l99385p62501M46515J109278J10128q92731k41531N75325N1907
91C40068q03075l11274O38944M59660l90853k20701O22000M37026p13907q25775
101g67887L84770R01249r6820p54447K2424P34477Q4111p37372l55579M36866
$$ plain form
111 -148208 116067 -226758 -311358 317966 710680 187490 -391255 -148973 276352 9216
121 9216 -463544 -275925 247960 288545 -28395 -45288 157937 11334 -360475 -273648 244290
132 244290 390460 -27727 -237679 115789 347231 -18687 -422266 -274711 104358 146950
142 146950 -33984 16376 237303 173472 -170013 -266855 20964 172692 -68830 -234374
152 -234374 21632 312868 200448 -113206 -189803 -26604 61115 -12035 -35756 63457 87323
163 87323 -32288 -77229 27291 45292 -106445 -166579 5031 181457 148902 7886 -36553
174 -36553 17581 11107 -88112 -114695 -10381 38245 -51019 -69445 86128 169410 7651 -165162
186 -165162 -74551 147085 160750 -48408 -143381 13910 121586 -33271 -185633 -75404
$$ packed form
111a48208K64275l42825q4600O29324L92714n23190n78745K42282M25325k67136
121I216m72760J87619N23885M0585l16940j6893K03225j46603l71809Q6827N17938
132B44290J46170m18187k09952L53468K31442l65918m03579J47555L79069M2592
142A46950j80934N0360K20927o3831l43485r6842K87819J51728k41522j65544
152b34374K56006K91236j12420l13654p6597J63199Q7719p3150k3721R9213K3866
163H7323j19611m4941J04520J8001j51737o0134J71610J76426l2555j41016m4439
174c6553N4134o474r9219k6583J04314M8626q9264j8426J55573Q3282j61759j72813
186a65162R0611K21636J3665k09158r4973J57291J07676j54857j52362J10229
$$ plain form
196 -75404 79891 16434 -86025 26039 187700 114383 -88072 -102619 66264 106838 -65242
207 -65242 -158838 -22000 90718 -1405 -85283 6996 81070 -7761 -64874 53312 147134
218 147134 33418 -116210 -61041 91063 54117 -130312 -142202 46928 109194 -38193 -84302
229 -84302 76766 145469 -13603 -120136 6824 130948 20800 -146414 -88230 95671
239 95671 90246 -82435 -105906 56418 110612 -14075 -63899 39528 79166 -26228 -87543
250 -87543 -9274 50935 -20790 -91539 -20059 82714 45269 -47681 -12177 80677 42181 -62870
262 -62870 -42411 50839 27299 -79564 -78965 34405 74261 -17606 -71461 21085 110394 43581
274 43581 -60614 -26723 58409 20708 -77730 -71444 8784 19462 -37213 -42717 27137 70532
$$ packed form
196g5404J55295o3457j02459J12064J61661p3317k02455j4547J68883M0574j72080
207f5242r3596J36838J12718r2123q3878R2279P4074q8831n7113J18186R3822
218A47134j13716j49628N5169J52104l6946j84429j1890J89130O2266j47387m6109
229h4302J61068O8703j59072j06533J26960J24124j10148j67214N8184J83901
239I5671n425j72681k3471J62324N4194j24687m9824J03427L9638j05394o1315
250h7543P8269O0209p1725p0749P1480J02773l7445r2950L5504R2854l8496j05051
262f2870K0459R3250k3540j06863N99J13370L9856r1867n3855R2546Q9309o6813
274D3581j04195L3891Q5132l7701r8438O286Q0228J0678n6675n504O9854M3395
$$ plain form
286 70532 32301 -7976 20668 53311 14948 -35427 -25537 -6355 -32385 -50893 -19629 9470
298 9470 152 -6368 23551 56245 45116 5662 -2874 22948 15018 -40334 -63009 -24998 -2429
311 -2429 -28614 -39463 -215 40142 39539 17892 17670 40436 42777 3872 -30121 -22990 -10674
324 -10674 -27273 -43834 -32081 -9494 5404 13413 16866 21897 32151 32540 15654 -903 -8249
337 -8249 -15291 -21583 -24904 -30064 -27782 -7418 10781 10193 10230 24218 34159 27878 13543 721 -3787
352 -3787 -2567 -12008 -30021 -29995 -11170 -2072 -6726 -4333 8509 19833 21633 12084 1371 4064
366 4064 9389 -2667 -19429 -17230 -5571 -3366 -7326 -6616 1128 12509 16207 6870 687 8110
380 8110 11363 237 -9420 -8301 -4711 -3335 -4699 -8141 -6251 3285 6966 338 -2721 1896 4942
$$ packed form
286G0532l8231m0277K8644L2643l8363n0375R890J9182k6030j8508L1264K9099
298I470r318o520K9919L2694j1129l9454q536K5822p930n5352k2675L8011K2569
311b429k6185j0849L9248M0357o03k1647k22K2766K341l8905l3993P131J2316
324a0674j6599j6561J1753K2587J4898Q009L453N031J0254L89j6886j6557p346
337h249p042o292l321n160K282K0364J8199n88L7J3988R941o281j4335j2822m508
352c787J220r441j8013K6J8825R098m654K393J2842J1324J800r549j0713K693
366D064N325j2056j6762K199J1659K205l960P10P744J1381L698r337o183P423
380H110L253j1126r657J119L590J376j364l442J890R536L681o628l059M617L046
$$ plain form
395 4942 3549 -223 -4819 -2879 5707 6134 -3356 -4516 5007 7599 -603 -6364 -3139 2708 1813 -6721
411 -6721 -9496 934 8737 806 -6035 1763 8865 3696 -3092 -2925 -1387 -2317 -4042 -4269 -2478 -961
427 -961 -800 3093 9087 7271 1127 4377 10409 3106 -8310 -5936 1874 -3564 -14777 -11901 2741
442 2741 7911 -3570 -9522 5268 19470 8751 -8404 -2946 10856 4164 -11906 -10403 2346
455 2346 1985 -8407 -5899 9521 13507 -30 -6136 7216 14733 258 -11947 -3258 4738 -6002
469 -6002 -14454 -3754 5565 -4334 -13376 332 18551 11360 -9170 -7087 13315 14111 -8414 -16001
483 -16001 1731 10132 -4382 -11008 4582 13475 -1698 -13509 576 16950 6501 -13365 -8956
496 -8956 9948 8603 -10298 -13918 -2 3729 -5997 -4325 10117 11710 -3370 -8454 5981 13071
$$ packed form
395D942j393l772m596J940Q586M27r490j160R523K592q202n761L225N847q95q534
411f721k775J0430P803p931o841P798P102n169o788J67J538r30j725k27J791J517
427i61J61L893N994j816o144L250O032p303j1416K374P810n438j1213K876J4642
442B741N170j1481n952J4790J4202j0719j7155N458J3802o692j6070J503J2749
455B346l61j0392K508J5420L986j3537o106J3352P517j4475j2205Q689P996j0740
469f002q452J0700R319r899r042J3708J8219p191k0530K083K0402P96k2525p587
483a6001J7732Q401j4514o626J5590Q893j5173j1811J4085J6374j0449j9866M409
496h956J8904j345j8901l620J3916L731r726J672J4442J593j5080n084J4435P090
$$ plain form
510 13071 -1639 -13910 -3103 11569 6537 -6138 -4041 4683 172 -9218 -3502 9204 6146
523 6146 -7489 -7025 6975 9040 -6187 -14970 -4880 6268 3858 -1686 2099 6397 1316 -4206
537 -4206 579 6418 1127 -6506 -1461 8968 7812 -3205 -8451 -4026 -151 -1282 -1374 1883 2666
552 2666 -286 -669 3035 2409 -4729 -8154 -1721 5374 4020 -797 -1925 -423 -10 2 1214 2637
568 2637 2080 872 2687 5425 2631 -5236 -8213 -3180 816 -733 -3023 -2021 50 726 -56 -53 1557
585 1557 1934 170 1101 4459 2672 -4421 -6470 -1351 2287 484 -811 2059 5139 3406 -684 -872
601 -872 2421 846 -4299 -1897 5046 1634 -9113 -9431 687 3514 -4371 -5800 5434 13408 5226
616 5226 -6287 -2498 6952 785 -11108 -4231 11764 8109 -8322 -7066 8369 7518 -10557 -14042
$$ packed form
510A3071j4710j2271J0807J4672n032j2675K097Q724m511r390N716J2706l058
523F146j3635M64J4000K065j5227q783J0090J1148k410n544L785M298n081n522
537d206M785N839n291p633N045J0429j156j1017n246M425L875j131r2L257P83
552B666k952l83L704o26p138l425O433P095j354m817j128J502M13J2J212J423
568B637n57j208J815K738k794p867k977N033L996j549k290J002K071O76p82LJ610
585A557L77j764R31L358j787p093k049N119L638j803j295K870L080j733m090j88
601h72L293j575n145K402O943l412j0747l18J0118K827p885j429J1234P974q182
616E226j1513L789R450o167j1893O877J5995l655j6431J256J5435q51j8075l485
$$ plain form
630 -14042 5409 17306 2602 -11490 -417 11629 -3153 -20095 -6302 13954 4629 -12707
642 -12707 -539 21191 10505 -18880 -18718 10118 17649 -7316 -15903 11633 25040 -3572 -24051
655 -24051 -1377 17553 -5852 -26501 -403 30463 11946 -25280 -18688 16930 15648 -20356
667 -20356 -22590 17519 29920 -4755 -19006 11239 21127 -16316 -34938 2061 32568 6328
679 6328 -25909 -4227 32324 15146 -28642 -21780 20794 19550 -19341 -16935 24321 23129 -25641
692 -25641 -37548 7565 30317 -6463 -31763 5284 43894 16996 -27675 -14602 22355 7780
704 7780 -30747 -16730 27599 21704 -22576 -24880 17271 26952 -13920 -32641 5817 36177 8832
717 8832 -22696 -3627 21018 -3840 -34898 -13352 23184 11551 -20671 -9428 29377 28136
$$ packed form
630a4042J9451J1897j4704j4092J1073J2046j4782j6942J3793K0256r325j7336
642a2707J2168K1730j0686k9385J62K8836P531k4965q587K7536J3407k8612k0479
655b4051K2674J8930k3405k0649K6098L0866j8517l7226O592L5618j282l6004
667b0356k234M0109J2401l4675j4251L0245R888l7443j8622L6999L0507k6240
679F328l2237K1682L6551j7178m3788O862M2574j244l8891K406M1256j192m8770
692b5641j1907M5113K2752l6780k5300L7047L8610k6898m4671J3073L6957j4575
704G780l8527J4017M4329n895m4280k304M2151R681m0872j8721L8458L0360k7345
717H832l1528J9069K4645k4858l1058K1546L6536j1633l2222J1243L8805j241
$$ plain form
729 28136 -13897 -28396 5046 24552 -2534 -22425 2543 22946 -2058 -27331 -8100 18386
741 18386 4643 -21086 -8929 25593 26690 -7750 -22559 638 13872 -7974 -22245 -683
753 -683 17935 3981 -11046 2026 17282 4286 -16989 -10756 14788 18705 -4607 -15415 2266
766 2266 12094 -6340 -19502 -4279 11225 3163 -7234 3021 17504 8618 -14348 -16927 4873
779 4873 13851 -5601 -17142 2342 19427 5370 -13219 -5843 10208 5712 -9447 -5962 12858
792 12858 13963 -8906 -18706 1455 13885 -5430 -20388 -1543 19293 9174 -9394 -4046 10932
805 10932 5106 -13838 -11992 9443 12713 -9272 -14778 9443 19883 -4124 -19025 1256 19314
818 19314 4596 -14025 -4029 14278 5669 -17766 -14818 10371 12222 -13082 -16401 12341 22839
$$ packed form
729B8136m2033j4499L3442J9506k7086j9891K4968K0403k5004k5273J9231K6486
741A8386j3743k5729J2157L4522J097l4440j4809K3197J3234k1846j4271K1562
753f83J8618j3954j5027J3072J5256j2996k1275O233K5544L917k3312j0808J7681
766B266R828j8434j3162J5223J5504q062j0397J0255J4483q886k2966k579K1800
779D873Q978j9452j1541J9484J7085j4057j8589P376J6051m496j5159L485J8820
792A2858J105k2869r800K0161J2430j9315j4958J8845K0836j0119j8568N348J4978
805A0932n826j8944J846K1435L270k1985n506K4221J0440k4007j4901K0281J8058
818A9314j4718j8621R996J8307q609k3435K948K5189J851k5304l319K8742J0498
$$ plain form
831 22839 -2893 -17947 1804 17481 974 -17586 -6278 13905 6792 -14408 -9681 13936
843 13936 12685 -11648 -12485 12311 16819 -6272 -14698 3617 12733 -4118 -17062 -3875 11893
856 11893 2421 -14048 -4168 16569 10070 -11811 -8566 12744 11704 -9532 -13050 5044 11893
869 11893 -3311 -13388 -356 13339 3074 -12313 -3543 13753 7072 -11024 -7390 8792 6908
882 6908 -8576 -10167 2943 7961 -2598 -8872 1568 10903 1804 -8948 -722 10283 2439 -8961
896 -8961 -2896 7993 3875 -6582 -5361 4395 5768 -3708 -7559 1925 8173 -1121 -8857 -395 7839
911 7839 476 -7898 -2286 6141 3788 -3799 -3817 3148 5569 -1423 -5797 807 6058 -45 -5133 426
927 426 5285 613 -3666 -726 2721 952 -2418 -2653 733 1817 -2430 -4074 972 3159 -1627 -2735
$$ packed form
831B2839k5732j5054J9751J5677j6507j8560J1308K0183p113k1200M727K3617
843A3936j251k4333q37K4796M508k3091q426J8315R116j6851j2944J3187J5768
856A1893r472j6469R880K0737o499k1881L245K1310j040k1236l518J8094O849
869A1893j5204j0077J3032J3695j0265j5387Q770J7296o681j8096L634J6182j884
882F908j5484j591J3110N018j0559o274J0440R335r099j0752Q226J1005p844j1400
896h961O065J0889m118j0457J221R756J373r476l851R484O248r294p736Q462Q234
911G839p363q374N612Q427k353p587j8O965K421o992m374O604N251o103n088N559
927D26M859m672m279K940L447j769l370k35L386J084m247j644N046K187m786j108
$$ plain form
943 -2735 2580 3773 -503 -1749 953 2167 465 -1963 -1840 1443 2021 -1938 -2802 1743 2836 -914
959 -914 -1685 1175 1335 -468 -937 -1019 -805 70 -501 -1770 -361 1279 289 -10 1294 1092 327 1452
977 1452 1048 -1041 -337 1287 -244 -1980 -557 246 -661 -496 76 -112 185 298 -636 -151 877 -764
995 -764 -1921 315 1072 -1449 -1192 1754 1258 -1064 133 2544 1838 -349 -1281 404 2365 576 -3358
1012 -3358 -2031 2387 1005 -3226 -1525 2391 606 -2442 -423 2528 1140 -2091 -2144 1131 2552
1027 2552 -858 -3439 368 3262 -400 -2465 2227 3579 -1878 -3231 2528 4333 -1360 -5064 -1172
1042 -1172 3836 1401 -4706 -3365 3437 2791 -3822 -2134 5494 3544 -5198 -3892 5139 5209 -3742 -6204
1058 -6204 1475 6190 345 -5193 -140 5573 -26 -6031 844 7980 -119 -9069 -2146 8072 2957
$$ packed form
943b735N315J193m276j246K702J214j702k428J23L283N78l959q64M545J093l750
959i14p71K860J60j803m69q2K14Q75n71j269J409J640r90k99J304k02p65J125
977A452m04k089P04J624j531j736J423Q03r07J65N72j88K97J13r34M85J028j641
995g64j157K236P57k521K57K946m96k322J197K411p06k187r32J685J961j789l934
1012c358J327M418j382m231J701L916j785l048K019K951j388l231n3L275J421
1027B552l410k581L807K894l662k065M692J352n457j353N759J805n693l704L892
1042a172N008k435o107J341O802o46o613J688P628j950q742J306R031P0q951k462
1058f204P679M715n845n538N053N713n599o005O875P136q099q950O923J0218n115
$$ plain form
1073 2957 -8479 -6499 4603 6085 -3316 -5241 4495 6754 -4376 -7620 4871 9721 -3708 -11193
1087 -11193 1623 11987 2301 -9880 -4485 7178 4386 -6305 -3710 7639 5071 -8018 -6294
1100 -6294 8187 7411 -9157 -11994 4753 12069 -366 -9051 -94 8423 729 -8210 -784 9146
1114 9146 1415 -10168 -2071 12631 6188 -11773 -10534 6275 9468 -3137 -7647 2649 7606
1127 7606 -1709 -7554 1042 6536 -3782 -11022 1059 13360 4884 -9544 -6120 6085 5783 -4072
1141 -4072 -5225 2918 4812 -1447 -2289 4727 4204 -6930 -10075 1948 10060 2310 -6560 -2342 5235
1156 5235 3256 -3503 -4609 -1097 -408 -1423 1728 6657 3733 -4781 -6094 1354 5469 635 -3633
1171 -3633 -1517 2987 4848 2416 -2447 -5535 -4393 -841 2330 3488 2218 30 -925 -26 1013
$$ packed form
1073B957j1436J980J1102J482r401j925R736K259j1130l244J2491M850j3429p485
1087a1193J2816J0364r686j2181N395J1663k792j0691K595J1349k568j3089J724
1100f294J4481p76j6568k837J6747P316j2435q685Q957Q517p694q939P426R930
1114I146p731j1583Q097J4702o443j7961J239J6809L193j2605m510J0296M957
1127G606r315n845Q596N494j0318p240J2081J2301q476j4428L424J2205l02r855
1141d072j153Q143J894o259q42P016n23j1134l145J2023Q112p750q870M218P577
1156E235j979o759j106L512O89j015L151M929k924q514j313P448M115m834m268
1171c633K116M504J861k432m863l088J142L552L171J158j270k188r55Q99J039
$$ plain form
1186 1013 241 -3236 -6407 -2669 6419 8552 315 -6392 -2979 2039 516 -2265 530 3866 1762
1201 1762 -1005 2182 5195 -2439 -12593 -8066 6601 9853 -1273 -5958 3042 7348 -1526 -7904
1215 -7904 -1632 3767 -1778 -5007 5189 12949 1353 -14144 -8472 8072 7430 -6988 -6827 8528
1229 8528 11901 -1463 -7587 1101 2954 -8930 -11544 5533 16085 1924 -12756 -2873 12036
1242 12036 3588 -13805 -9191 8837 10020 -3265 -3126 8889 5639 -12259 -14197 5224 13617
1255 13617 -2194 -11859 3768 17118 3201 -14859 -8689 6359 2676 -8700 -1607 13473 8099
1268 8099 -10462 -10541 6730 8911 -8727 -13627 5412 17126 3481 -9820 -1885 7339 -2135 -12373
1282 -12373 -2065 11968 5645 -8597 -3914 11118 7364 -11455 -14055 3209 10842 -606 -6734
$$ packed form
1186A013p72l477l171L738R088K133q237o707L413N018j523k781K795L336k104
1201A762k767L187L013p634j0154M527J4667L252j1126m685R000M306q874o378
1215g904O272N399n545l229J0196P760j1596j5497N672J6544o42j4418J61J5355
1229H528L373j3364o124Q688J853j1884k614J7077J0552j4161j4680R883J4909
1242A2036q448j7393M614J8028J183j3285J39J2015l250j7898j938J9421Q393
1255A3617j5811r665J5627J3350j3917j8060O170J5048l683j1376P093J5080n374
1268H099j8561p9J7271K181j7638m900J9039J1714j3645j3301P935R224r474j0238
1282a2373J0308J4033o323j4242M683J5032l754j8819k600J7264P633j1448o128
$$ plain form
1295 -6734 3902 9433 -2331 -10797 -1334 7949 74 -9234 -568 12847 7785 -7816 -9023 3213
1309 3213 5636 -4428 -6174 4423 8175 -1210 -5967 1568 5529 -3431 -10017 -1697 8846 5263
1323 5263 -4657 -3681 4451 3649 -4691 -5357 2165 4145 -1596 -2486 4012 5759 -1710 -6861 -1680 4664
1339 4664 2020 -3882 -2139 3965 3356 -2203 -3274 462 817 -2599 -2266 2385 4074 15 -3190 -616
1355 -616 2873 1143 -3141 -2491 1745 2537 2 -803 933 1026 -1018 -1640 189 1651 70 -1901 -711
1372 -711 2059 1511 -1866 -2537 147 1238 -151 -669 529 1259 554 -691 -403 1031 394 -1691 -1308
1389 -1308 1427 1997 -244 -1340 136 1099 35 -1154 -848 527 638 -599 -853 649 773 -1303
1405 -1303 -1610 494 1525 186 -689 303 1325 816 -653 -1196 103 750 -405 -935 877 1415 -295
$$ packed form
1295f734J0636N531j1764q466R463R283p875r308Q666J3415n062j5601j207J2236
1309C213K423j0064j746J0597L752r385m757P535L961q960o586Q320J0543l583
1323E263r920R76Q132q02q340o66P522J980n741q90O498J747p469n151N181O344
1339D664k644n902J743O104o09n559j071L736L55l416L33M651J689m059l205K574
1355f16L489j730m284O50M236P92k535q05J736R3k044o22J829J462j581j971J190
1372g11K770n48l377o71K684J091j389n18J198P30p05j245K88J434o37k085L83
1389a308K735N70k241j096J476R63j064j189L06J375J11j237k54J502J24k076
1405a303l07K104J031j339q75R92J022n09j469n43J299O47j155n30J812N38j710
$$ plain form
1422 -295 -964 216 844 -137 -1056 -808 265 543 -678 -1391 -50 873 -281 -713 837 1534 443 -229
1440 -229 212 440 125 -940 -1339 -156 961 -157 -1088 452 1511 239 -775 189 923 204 -839
1457 -839 -893 -308 232 -934 -1795 -123 1417 368 -618 978 2216 869 -418 -177 368 29 -1085
1474 -1085 -1649 -418 740 -335 -1341 490 1941 517 -519 659 1426 259 -942 -883 -274 -116
1490 -116 -1137 -1763 79 1552 219 -702 1200 2322 520 -679 193 696 -245 -1387 -1482 -332 191
1507 191 -1030 -1458 502 1690 22 -704 990 1624 40 -825 -179 192 -181 -915 -1051 230 1044 -178
1525 -178 -774 1086 1652 -117 -563 843 786 -288 -678 -297 55 -120 -850 -1029 262 726 -719 -837
1543 -837 838 1032 -461 -347 737 631 66 28 56 211 382 -590 -1040 70 277 -911 -656 664 535
$$ packed form
1422b95o69J180O28r81r19K48J073K78j221p13J341R23j154m32J550O97j091o72
1440b29M41K28l15j065l99J183J117j118r31J540J059j272j014R64P34p19j043
1457h39n4N85N40j166q61J672J540j049r86J596J238j347j287K41N45l39j114
1474a085n64J231J158j075j006J831J451j424j036J178P67j167j201N9O09J58
1490a16j021o26J842J473j333r21J902J122j802j199Q72N03r41j142r5J150N23
1507A91j221m28J960J188j668p26J694O34j584q65O46L71l73p34j36J281Q14j222
1525a78n96J860N66j769m46J406n7j074l90L81L52j75p30j79J291M64j445j18
1543h37J675J94j493J14J084j06n65l8K8J55J71r72m50J110K07j188K55J320j29
$$ plain form
1562 535 -210 376 774 383 168 175 -425 -368 -63 -777 -1080 -198 0 -487 332 1178 807 696 1295 755 20
1583 20 252 -110 -1327 -1231 -734 -1235 -1311 -437 8 272 1105 956 608 1086 1200 -416 -776 195 -586 -1953
1603 -1953 -1381 -89 -114 -273 447 1132 1656 1635 596 399 1196 135 -2112 -1338 -20 -1265 -2461 -760
1621 -760 1039 537 186 745 1702 1789 568 -489 341 752 -1494 -2735 -359 805 -1338 -1827 924
1638 924 2254 797 -124 754 1632 451 -1428 -1447 545 -40 -2870 -2176 1459 1454 -1575 -931 2458 2367
1656 2367 -414 -633 1252 1358 -1109 -2388 -268 1641 -697 -3223 -54 3656 1010 -2541 93
1671 93 3264 648 -2772 -1180 1619 200 -2944 -2296 2043 2721 -1716 -2902 2313 4384 -769 -3188
1687 -3188 1231 3067 -1414 -3715 -41 2651 -437 -3656 -377 4444 2694 -3094 -2147 3790 2784
$$ packed form
1562E35p45N86L98l91k15Po00N7L05p14l03Q82J98m87Q19Q46l71j11N99n40p35
1583B0K32l62j217R6M97n01p6Q74M45K64Q33j49l48M78J14j616l60R71p81j367
1603a953N72J292k5j59P20O85N24k1j039j97P97j061k247P74J318j245j196J701
1621g60J799n02l51N59R57Q7j221j057Q30M11k246j241K376J164k143m89K751
1638I24J330j457r21Q78Q78j181j879j9J992n85k830O94L635nl029O44L389r1
1656B367k781k19J885J06k467j279K120J909k338k526L169L710k646l551K634
1671I3L171k616l420J592K799j419l144O48M339O78m437j186N215K071n153k419
1687c188M419J836m481k301L674K692l088l219L279M821j750n788R47N937j006
$$ plain form
1702 2784 -3670 -3806 2189 1976 -3439 -3201 2680 3746 -1487 -3698 1774 5758 934 -4414 -766 4518
1718 4518 527 -5514 -2425 3015 355 -4397 -1141 5054 3858 -2294 -2851 3002 4219 -2087 -5336
1733 -5336 312 3822 -1299 -4406 589 3635 -1198 -4136 965 5498 2346 -2672 -1147 3774 2426
1748 2426 -3999 -4920 459 1690 -2527 -2008 3334 3501 -1639 -2722 1485 2934 -630 -3134 -259 3278
1764 3278 1577 -2443 -2099 406 -778 -2880 98 3602 1905 -849 569 2427 579 -2257 -2679
1779 -2679 -1036 484 742 874 1308 177 -2011 -1561 824 94 -1833 98 3112 2364 184 333 -52
1796 -52 -2444 -3116 -69 2684 1516 -1385 -815 2682 1676 -3577 -4450 904 2736 -701 -141 4618
1812 4618 3660 -3245 -5242 63 2724 -2246 -5490 457 7006 3087 -4448 -2146 4102 1030 -5501
$$ packed form
1702B784o454j36N995k13n415K38N881J066n233k211N472L984m824n348L648N284
1718D518l991o041L089N440k660m752L256O195j196o152n57N853J217o306l249
1733e336N648L510n121l107M995L046m833k938N101M533l152n018J525M921j348
1748B426o425r21N379J231m217N19N342J67n140j083M207J449l564k504K875L537
1764C278j701m020L44K505j184k102K978L504j697k754J418J858j848k836m22
1779b679J643J520K58J32M34j131k188M50K385p30j927J931L014p48k180J49l85
1796e2k392o72L047K753j168k901N70L497j006n253q73N354J832l437N60M759
1812D618r58o905j997N305K661m970l244N947O549l919p535K302O248l072o531
$$ plain form
1827 -5501 -1363 7164 4553 -4717 -4319 3842 3445 -6496 -8864 1484 8099 1033 -4527 2844 8430
1842 8430 -730 -9026 -1752 6996 688 -8524 -2747 8499 5115 -7537 -7706 4449 7132 -3574
1856 -3574 -5917 6331 10353 -2328 -9146 982 7183 -3898 -12378 -1988 10444 4737 -7438
1869 -7438 -3496 8833 6119 -7446 -6862 6920 7604 -5962 -7995 5352 8575 -5252 -11938 169
1883 169 10099 1281 -8469 -281 11519 4795 -8737 -5121 7121 3482 -9738 -7425 7112 8287
1897 8287 -4953 -8411 3889 9472 -1657 -9226 538 9946 1917 -8276 -1691 8217 1699 -10121
1911 -10121 -5635 7218 5725 -5652 -5664 6222 8626 -2868 -8356 1030 6865 -1862 -8228 339
1925 339 8473 1362 -7646 -2410 6923 3356 -6361 -4720 5634 6710 -2748 -5786 2468 5404 -3000
$$ packed form
1827e501M138Q527k611r270L98Q161l97r941k368J0348O615p066n560P371N586
1842H430r160q296P274Q748o308r212N777J1246l384j2652j69J2155K683j0706
1856c574k343J2248M022j2681o818J0128O201j1081q480J0390J2432n707j2175
1869g438L942J2329k714j3565N84J3782O84j3566k033J3347L223j3827o686J2107
1883A69R930q818r750Q188J1800o724j3532L616J2242l639j3220K313J4537J175
1897H287j3240l458J2300N583j1129p569R764R408q029j0193O585R908o518j1820
1911a0121M486J2853j493j1377j2J1886K404j1494n488R386N835q727o366Q567
1925C39Q134p111r008N236R333l567r717J641J0354J076r458l038Q254K936q404
$$ plain form
1940 -3000 -7283 558 6520 485 -5359 -239 6360 2318 -5691 -4574 3290 3908 -2923 -4170 2881
1955 2881 5162 -1490 -4997 398 4413 -245 -4272 -457 4940 2543 -3659 -3542 2156 2775 -2625
1970 -2625 -3688 2067 4640 -110 -3230 268 3230 -280 -4364 -2045 3267 2683 -2278 -2623 2428
1985 2428 3409 -1657 -3800 795 3929 347 -2852 -39 3413 806 -3950 -2943 2273 2468 -2299
2000 -2299 -2728 2528 4205 -951 -3788 174 3116 -369 -3686 -708 3599 1719 -3187 -2360 2663
2015 2663 2691 -2578 -3249 2366 4093 -712 -3393 465 3200 -529 -4252 -1350 3350 1670 -2820 -1728
2031 -1728 3250 2715 -2816 -3444 1727 3275 -1188 -3061 1115 3752 -90 -3684 -858 3076 1110
2046 1110 -3242 -1461 3266 2455 -2674 -2732 1835 2405 -1912 -3004 1194 3542 18 -2925 -108 2827
$$ packed form
1940c000m283P841N962o035n844N120O599m042q009J117P864O18o831j247P051
1955B881K281o652l507N395M015m658m027L815N397k397o202J17N698O19n400
1970b625j063N755K573m750l120L498K962l510m084K319N312n84m961l45N051
1985B428R81n066k143M595L134l582l199K813L452k607m756J007N216J95m767
2000b299m29N256J677n156k837L962K942l485l317K978M307j880m906Q27N023
2015B663K8n269o71N615J727m805k681L858K735l729l723K902M700j680m490J092
2031a728M978n35n531o28N171J548m463j873M176K637l842l594K826L934j966
2046A110m352J781M727q11n129n8M567N70m317j092M198K348l524k943K817K935
$$ plain form
2062 2827 212 -3457 -1364 2883 1824 -2230 -1520 2351 2352 -1777 -2511 1086 2739 -548 -2650 245
2078 245 2609 -96 -3223 -1160 2221 1050 -2021 -990 2482 1995 -1461 -2010 933 1724 -1051 -2393
2094 -2393 390 2245 -31 -2255 -275 1958 555 -1822 -634 2049 1467 -1248 -1493 837 981 -1419
2110 -1419 -2087 233 1720 -256 -1441 421 1873 405 -1520 -356 1521 763 -1211 -868 956 700
2126 700 -1074 -1435 520 1305 -324 -891 727 1405 21 -1061 -314 780 -30 -1174 -363 854 379
2143 379 -844 -480 674 667 -364 -443 648 848 -198 -668 96 365 -427 -732 -51 502 128 -387 -35
2162 -35 446 35 -389 -179 354 144 -315 -65 223 58 -353 -111 79 179 57 24 466 133 -98 -79 141
2183 141 -67 -352 -147 222 154 -304 -165 220 11 -421 -168 406 239 -403 -229 297 266 -288 -401 241 455
$$ packed form
2062B827k615l669K093M247j059m054P10L871Jm129p34L597J653l287k102K895
2078B45K364k705l127K063L381j171l071J031L472m87l456n49K943P91k775j342
2094b393K783J855k276k224J980K233j403k377J188K683n82k715k45K330J44k400
2110a419o68K320J487j976j185J862J452j468j925J164J877p58j974L43J824k56
2126G00j774l61J955P85j629n67J618O78j384j082P47J094q10j144Q11J217m75
2143C79j223L64J154pj031p9J091K00j046m70P64K69p92l05O81N53l74n15L52
2162c5M81m11m24K10N33k10m59K50K88j65m11K42J90J00j22l3M42l33k31J9K20
2183A41k08k85K05L69o8m58J39L85k09m32K53N74j67o42J74N26l1n54j13O42K14
$$ plain form
2204 455 -179 -388 240 570 -184 -660 140 613 -140 -730 42 593 80 -667 -189 389 251 -575 -388 593
2224 593 337 -620 -470 573 636 -534 -699 371 762 -131 -614 216 643 -124 -702 4 825 75 -939
2243 -939 -264 865 300 -908 -327 626 338 -541 -435 530 468 -486 -651 553 699 -400 -921 326 910
2262 910 -163 -881 98 841 -48 -700 14 666 87 -798 -297 835 453 -798 -688 707 691 -589 -640
2281 -640 528 477 -337 -424 439 674 -204 -788 219 1027 52 -901 -197 900 293 -717 -157 568 70
2300 70 -684 -298 624 299 -661 -605 440 665 -231 -827 244 739 -67 -506 295 578 -244 -652 48 537
2320 537 -28 -647 -229 603 369 -424 -498 264 279 -479 -327 403 208 -551 -445 318 282 -207 -428 98 612
2341 612 323 -298 -112 473 11 -506 -140 373 -199 -509 -22 319 178 -121 -202 79 315 1 -343 -90
$$ packed form
2204D55o34k09O28L30p54m76Q00M73p53n90P72N51n13p47M78N78j38q26J87R81
2224E93k56r57J50J043O3j170j65J070L91q93m83Q30M27p67n78P06Q21p50j014
2243i39O75J129n65j208N81R53k88q79J06R65o2r54j65J204J46j099n21J247N84
2262I10j073p18R79P43q89o52P14O52n79q85N01J132l82j251J10J395j6j280n1
2281f40J168n1q14q7Q63K35q78n84J007Q08r75r53P04J097o07j010N60P25m98
2300G0p54L86R22l25r60N6J045K25q96n96J071M95q06m39Q01K83q22m08P00M89
2320E37n65o19M18Q32k34p93p4P62J5p58J52P30j95p59J06P63l6m89k21N26N14
2341F12k89o21J86N85m62n17L66N13n72l10M87L41j41k99q1K81K36l14l44K53
$$ plain form
2361 -90 156 -265 -333 148 179 -227 -277 193 349 178 84 -48 93 116 -88 -264 -68 -20 -429 -267 306 82
2383 82 -230 -72 278 162 46 67 -100 48 73 -186 -133 26 -74 -413 -18 526 198 -156 46 225 171 67
2405 67 -149 -198 -8 -77 -466 -134 194 -54 -419 0 488 99 -244 -80 378 204 -25 -353 -96 248 -168
2426 -168 -593 42 499 -77 -580 185 667 81 -494 -193 287 230 -348 -397 258 459 -347 -792 280 764
2446 764 -199 -650 252 855 51 -579 -51 568 310 -637 -516 503 662 -707 -776 693 759 -702 -884
2465 -884 334 905 -157 -838 63 869 221 -1054 -561 1028 441 -1050 -753 1161 909 -799 -947 788
2483 788 892 -567 -1031 339 1141 -120 -1326 -234 1168 141 -1490 -490 1435 607 -980 -538
2499 -538 1010 954 -751 -1013 510 1132 -328 -1335 305 1503 -67 -1481 -134 1368 187 -1232
$$ packed form
2361i0K46m21o8M81L1m06n0M70J56j71r4j32J41K3k04j76J96M8m09J62N73k24
2383H2l12J58L50j16j16K1j67J48K5k59N3J59j00l39L95N44l28l54K02J79n4j04
2405F7k16m9J90o9l89L32L28k48l65M19M88l89l43J64M58j74k29l28K57L44m16
2426a68m25O35M57n76n03P65M82n86n75L01M80n7n78m9O55K01q06m45J072M84
2446G64r63m51R02O03q04o30N28O19k58r47J21J019J59j369o9J469O6j461j82
2465h84J218N71j062o81R01Q06o48j275M93J589n87j491K97J914k52j708j48J735
2483G88J04j459m64J370Q02j261j206J092J402j027j631J000J925q28j587M42
2499e38J548n6j705k62J523O22j460j007J640J198j570j414J347J502j181j419
$$ plain form
2515 -1232 -467 1185 622 -971 -963 653 935 -808 -1363 477 1359 -273 -1251 405 1443 31 -1180
2532 -1180 -309 1040 441 -885 -684 971 894 -819 -1210 566 1032 -558 -1023 507 1233 -80 -963
2549 -963 -259 743 75 -1060 -585 922 971 -651 -832 681 833 -677 -930 392 997 -89 -677 -13
2567 -13 645 178 -972 -670 609 649 -543 -647 663 943 -527 -948 -41 501 56 -496 27 929 614
2586 614 -608 -634 435 493 -605 -660 650 800 -145 -729 -164 393 -1 -816 -397 707 765 -480 -637
2605 -637 517 483 -762 -878 335 797 144 -492 11 801 344 -914 -671 712 619 -622 -713 665 658
2624 658 -598 -938 48 639 9 -618 16 1031 490 -955 -564 741 565 -609 -598 792 785 -396 -874
2643 -874 126 747 107 -704 52 1158 475 -1022 -595 645 292 -924 -722 671 803 -376 -758 117
$$ packed form
2515a232P65J652n63j593QJ616K82j743n55J840Q82j632r78J656J038j412j211
2532a180Q71J349n99j326K01J655p7j713l91J776M66j590m65J530P26j313q83
2549i63P04J002o68j135M75J507M9j622j81J513J52j510k53J322O05j086n88O64
2567a3O58m67j150L02J279M0j192j04J310K80j470m21R07N42m45n52N23R02l15
2586F14j222k6J069N8j098n5J310J50r45n84N65N57l94q15M19J104N8j245j57
2605f37J154l4j245j16J213M62o53o36N03P90m57j258K43J383r3j241r1J378p
2624F58j256l40R86N91o30o27O34J015n41j445L91J305j76j174J1J390pj181m78
2643h74J000O21o40q11P56J106o83j497M27J240l53j216K02J393J32j179l82Q75
$$ plain form
2661 117 650 -127 -917 -68 1042 500 -843 -390 770 163 -959 -580 631 679 -219 -541 304 687 -360
2680 -360 -1079 -132 964 194 -847 -12 887 189 -981 -695 438 604 -308 -418 725 1017 -167 -1084
2698 -1084 -63 775 -77 -835 181 1021 363 -795 -415 332 109 -593 -460 649 955 -145 -735 168
2716 168 431 -417 -892 152 920 258 -431 -15 495 91 -646 -582 493 610 -225 -413 464 447 -590 -828
2736 -828 90 348 -101 -277 298 571 53 -550 -326 225 96 -430 -119 658 385 -401 -324 207 -32 -341
2756 -341 -244 237 404 47 -280 50 281 -205 -461 -29 359 -125 -218 225 326 -163 -317 -90 107 7 -13
2777 -13 65 219 146 -186 -197 70 123 -396 -56 312 55 -400 46 218 -27 -349 -95 205 102 -270 -195 267
2799 267 305 -300 -351 320 385 -274 -346 385 560 -306 -388 127 409 -186 -344 -55 389 2 -592 -126 568 159
$$ packed form
2661A17N33p77p90Q49J110n42j343M53J160o07j122L79J211M8q98l22Q45L83j047
2680c60p19R47J096p70j041Q35Q99o98j170K86J133J66r12j10J143K92j184r17
2698a084J021Q38q52p58J016Q40o58j158L80P47k23p02J33J109L06j100n90R03
2716A68K63q48m75J044P68o62o89M16N10m04p37O4J075J17q35j88Q77j7j037k38
2736h28R18K58m49j76N75K73n18o03K24N51j29n26L11P77k73p86P7N31k39l09
2756c41R7M81J67l57l27L30K31m86k56M32L88m84r3M43J01m89j54K27J97j00k0
2777a3P8J54p3l32j1K67N3n19L40L68k57m55M46J72k45l22K54L00j03l72P5M62
2799B67L8o05n1O71O5o59p2P31J75q66q2N15K82n95j58K89M44l87n94M66O94m09
$$ plain form
2821 159 -674 -208 570 276 -531 -371 473 260 -414 -438 303 542 -230 -577 371 674 -225 -809 159 744
2841 744 -182 -727 -19 750 97 -718 -211 572 323 -663 -455 681 533 -529 -532 575 664 -683 -702 431
2861 431 743 -316 -726 285 644 -120 -831 2 829 63 -871 -270 777 274 -880 -294 799 485
2879 485 -736 -540 657 696 -502 -736 489 741 -366 -820 282 967 -115 -883 134 927 -37 -1031
2897 -1031 -107 800 218 -851 -337 864 470 -795 -674 752 655 -692 -646 665 818 -408 -855 496
2915 496 946 -236 -907 148 830 -30 -906 -172 914 213 -989 -368 851 311 -897 -508 723 582
2933 582 -728 -634 488 753 -401 -786 440 884 -274 -890 212 883 -135 -901 -22 810 246 -844
2951 -844 -243 752 254 -796 -520 641 385 -717 -673 595 747 -498 -626 476 673 -368 -697 227
$$ packed form
2821A59q33M66P78k94q07J60Q44k13o74k4P41K39p72l47R48L03q99n84R68N85
2841G44r26n45P08P69o53q15N07P83k49r86K08J136j48j062lJ107Q9j347j9J133
2861D31L12j059m10J011L59p64p11Q33Q27p66r34O01J047n03j154N86J093l14
2879D85j221J96J197L9j198k34J225K52j107m54J102O85j082p68J017P93r64r94
2897a031R24R07n82j069N14J201l94j265J21J426r7j347M6J311J53j226m47J351
2915D96M50j182o71J055O82q60q76P34J086p01j202O21J219n40j208L89J231j41
2933E82j310R4J122K65j154l85J226M44j158o16J102O71j018p66Q79Q32n64j090
2951h44O01R95m98j050K76J161k56j102M4J268J52j245j28J102J97j041l29R24
$$ plain form
2969 227 774 -77 -674 32 758 4 -754 -195 679 166 -694 -263 699 278 -596 -419 468 253 -553 -403
2989 -403 444 569 -315 -559 281 589 -209 -502 258 596 -134 -466 54 553 -60 -612 -38 510 148 -514
3009 -514 -204 544 249 -442 -332 397 181 -469 -377 347 450 -301 -386 359 542 -252 -582 114 565 -164 -563
3030 -563 147 638 -116 -737 -115 576 48 -692 -162 663 397 -458 -373 454 247 -606 -437 545 598 -326 -463
3051 -463 388 586 -289 -805 190 727 13 -628 61 646 102 -817 -394 525 174 -614 -216 680 463 -563
3071 -563 -479 355 354 -334 -530 360 766 -56 -660 8 525 -135 -774 -125 703 287 -389 -133 465 172 -663
3092 -663 -470 257 449 -240 -385 440 584 -402 -706 87 566 -82 -445 279 614 151 -526 -319 279 16
3112 16 -430 -190 523 392 -288 -508 130 161 -407 -457 156 490 132 -278 -38 246 -104 -600 -239 361 424
$$ packed form
2969B27N47q51n97P06P26p54p58N59Q74n13q60M31R62m21q74J77Q87k15q06J50
2989d03Q47J25q84k44Q40L08p98k93P60L38p30l32N20M99o13n52N74N48l62o62
3009e14L10P48k95o91J10P29k16o50R2P24J03p51q5P45J83p94l30O96M51p29l99
3030e63P10M91p54o21O22O91n28p40N30Q25k66q55Q5Q27k07q53J69R82N3r24j37
3051d63Q51J98q75n16R95N37p14o41O89N85n44r19M23R19l51p88L98Q96k17j026
3071e63Q4Q34jo88j96Q90M06q22o04O68N17o60o39O49Q28m16o76K56N98k93q35
3092f63J93P27J92o89j45Q25J44r86l04P93M79o48l63P24L35m63o77K07N98k63
3112A6m46K40P13j31o80k20O38L1n68n0O13L34l58m10K40K84l50m96L61O00O3
$$ plain form
3133 424 -79 -89 290 56 -414 -514 18 201 -21 -150 114 342 -30 -444 -250 153 78 -232 23 381 225
3154 225 -214 -187 8 -16 -156 -128 242 231 99 -126 -72 28 -72 -234 31 218 191 -41 -70 -30 -152 -327 -160
3177 -160 -47 235 198 26 12 -77 -256 -227 -80 79 98 137 106 68 -36 -128 -267 -153 113 93 66 181 26 -110
3201 -110 -240 -144 -179 -56 197 94 92 145 82 -184 -212 -35 112 12 111 197 96 2 -60 -199 -147 -59 -55 39 256
3226 256 178 -124 -133 -121 -144 -153 32 94 210 70 7 -91 -12 -72 -207 -135 163 230 39 137 67 -39 -181 -161 -63 23
3252 23 116 68 -2 184 -26 -187 -193 102 32 -55 -3 184 85 -4 -86 -66 73 90 -123 64 189 119 -78 -74 8 -112
3278 -112 -127 -54 66 141 114 -68 24 39 32 -227 -41 132 -41 -70 110 90 -95 -98 -115 -40 67 187 2 31 65
3303 65 4 -223 -69 18 -145 -78 -12 121 -66 -28 -68 42 -98 -27 -72 12 92 12 -75 16 174 -4 -38 73 35
$$ packed form
3133D24n03j0L79k34m70j00N32J83k22j29K64K28l72m14J94M03p5l10K55L58j56
3154B25m39K7J95k4j40K8L70j1j32k25N4J00j00j62K65J87k7k32k9M0j22j75J67
3177a60J13K82l7j72j4q9j79K9J47J59J9L9l1l8j04r2j39J14K66k0k7J15j55j36
3201a10j30R6l5J23K53j03kN3o3k66k8J77J47j00R9Q6j01r4o2j39N2Q8MR4K17
3226B56p8l02rJ2k3rJ85O2J16j40o3r8P9o0j35P2K98O7j91R8p0j06j42K0R8Q6
3252B3R3m8p0J86k10j61oK95p0q7N2J87r9q9q2K0J39J7k13J87J25p0j97MQ2j20
3278a12j5P3J20P5k7j82R2J5pk59J86J73j73k9J80k0j85lj7P5J07J20j85K9L4
3303F5o1k27J54Q7j63O7O6J33j87L8m0J10j40P1m5Q4Q0q0q7R1J58j78l4J11l8
$$ plain form
3328 35 18 101 -64 -18 79 -34 -57 32 87 -52 -23 18 -1 -77 -91 110 20 48 34 -5 42 85 8 -12 -6 49 -112 17
3356 17 105 78 -79 5 90 -5 6 54 14 -4 70 67 10 10 -12 -81 -31 175 -99 4 88 107 -5 61 -54 25 44 6
3384 6 -56 136 79 -125 -55 77 149 -20 37 42 56 -64 97 4 -81 17 -131 12 110 54 -32 35 111 36 22 -2 110
3411 110 57 -32 -16 112 77 -62 -80 -26 118 -51 -36 32 109 15 -93 107 9 33 -39 -17 140 -35 -88 -106 27
3436 27 78 -5 -62 73 44 -112 -184 56 82 -108 -31 44 75 -86 -218 47 81 -17 -85 -4 171 60 -130 -70 124
3461 124 -13 -134 -103 60 86 -19 -27 59 67 -68 -78 31 157 -22 -145 -66 108 -61 -164 -31 140 63 -143
3484 -143 -127 126 106 -118 -32 126 105 -201 -197 134 97 -119 -137 72 146 -11 -239 -23 214 -26 -156 -73 197
3507 197 118 -139 -48 198 95 -114 -49 247 168 -153 -47 56 152 -186 -108 102 182 -110 -177 88 233 -88 -123
$$ packed form
3328C5j7Q3j65M6R7j13k3Q9N5j39K9M1j9p6j4K01r0K8j4l9M7M3p7k0ON5j61J29
3356A7Q8k7j57Q4Q5r5J1M8m0j8P4ln7%k2o9N0K06k74J03Q4J9j12O6j15P9J9l8
3384Fo2J92n7k04P0J32P2j69N7NJ4j20J61r3q5R8j48J43R8n6q6O7P6p5j4k4J12
3411A10n3q9J6J28l5j39j8N4J44j69J5O8P7r4j08K00r8K4p2K2J57j75n3j8J33
3436B7N1q3n7J35k9j56p2K40K6j90P7P5L1j61j32K65L4r8o8Q1J75j11j90O0J94
3461A24j37j21L1J63K6j05qQ6Qj35j0J09J26j79j23P9J74j69j03J33J71p7k06
3484a43J6K53k0k24Q6J58k1l06ML31l7k16j8K09P4j57k28K16K37k40j30Q3K70
3507A97p9k57R1K46j03k09O5K96p9l21J06J03R6l38P8K10Q0k92o7K65J45l21l5
$$ plain form
3530 -123 63 115 141 -120 -74 126 65 -218 -76 153 71 -115 -165 49 218 -131 -180 135 165 -94 -179 65 217
3553 217 -21 -225 57 139 45 -229 -11 138 48 -187 -103 221 116 -154 -168 176 182 -88 -183 90 156 -161 -195
3576 -195 94 166 -27 -326 -74 236 -46 -285 -43 212 36 -292 -126 179 18 -123 -118 148 142 -132 -60 208
3598 208 135 -121 -103 199 235 -18 -171 55 214 52 -202 0 294 32 -124 -38 195 60 -145 -124 165 180
3620 180 -40 -127 19 249 -138 -153 32 218 -15 -199 75 136 -94 -107 -61 126 -36 -221 -105 223 66 -168
3642 -168 -183 53 -3 -170 -141 169 157 -16 -126 128 186 24 -179 20 173 2 -174 -116 174 91 -158 -74 102
3665 102 11 -181 8 208 93 -170 -143 132 91 -115 -96 162 170 -7 -179 16 137 -26 -160 -20 173 24
3687 24 -111 36 105 22 -187 -102 38 48 -132 -140 9 104 -86 -169 70 146 -55 -27 4 177 -43 -99 -58 -9 -25
$$ packed form
3530a23J86N2K6k61M6K00o1k83J42K29q2j86n0K14J69l49m9L15L0k59q5K44J52
3553B17k38k04K82Q2r4k74K18J49r0k35Q4L24j05k70j4L44Ok70r5K73O6l17l4
3576a95K89P2j93k99K52L10k82k39K42K55j76l28J66L05j61j41NK66ok74P2K68
3598B08p3k56J8L02L6k53j53K26J59j62k54K02K94k62j56Q6K33j35k05K1K89J5
3620A80k20q7J46K30l87j5J85J86k33j84K74O1k30j3M6J87j62j85J16L28j57k34
3642a68j5K36n6j67K9L10j2j73j10K54N8j62k03J99J53j71j76N8K90q3k49Q4J76
3665A02r1j92J89K00j15k63K7K75m1k06J9K58Qj77j72J95J21j63j34J40J93j49
3687B4j35J47O9q3k09Q5J40J0j80qJ49R5j90q3K39P6k01K8L1J73k20n6M1M9j6
$$ plain form
3712 -25 -83 -50 100 80 -168 0 102 -29 -72 -112 145 61 -60 -100 76 103 8 -80 14 156 49 -50 -52 117 3
3737 3 -78 -60 1 -19 -99 25 41 55 -131 -97 -15 14 -110 -46 -16 29 4 -49 29 80 -9 -179 30 108 1 -138 42
3764 42 68 -26 -53 1 3 -31 -158 -66 104 32 -56 -89 118 11 27 -77 41 57 35 -24 26 78 -49 -4 -16 53 28
3791 28 -92 -17 88 93 -132 -118 112 124 -49 -80 90 56 -90 -185 -13 56 -119 -129 77 -2 -19 -111 34 98 -47
3816 -47 -76 -25 105 44 -34 -71 71 74 -125 -58 21 -14 -107 -109 50 -25 -61 -41 -10 111 -47 -207 -5 85 -64 -72 -43
3843 -43 10 14 -7 -36 9 48 -147 -42 27 12 24 -83 -33 31 -88 -192 -65 55 -55 -25 31 70 31 75 12 -10 121
3870 121 -50 -51 18 22 -55 17 -20 35 -33 5 37 -33 32 -3 -21 -61 -85 -72 -19 53 -59 -124 67 -37 -51 -98 -67 -21 31
3899 31 23 18 92 72 -3 -107 -76 -64 -44 -16 122 95 -102 -40 1 -50 -18 13 85 38 37 -66 1 51 63 -98 -36 -1 108
$$ packed form
3712b5n8L3J50k0k48J68J02j31m3m0K57q4j21m0J76K7r5q8R4J42j07r9kJ69j14
3737Cq1J8O1k0q0J24J6J4j86L4Q2K9j24O4L0M5k5n3P8N1q9j70K09P8j07j39J80
3764D2K6r4k7N4Kl4j27R2J70p2q8l3K07j07J6j04J18J6k2n9N0N2j27M5j2O9k5
3791B8j20P5J05Nk25J4K30J2j73l1J70l4j46r5J72O9j75j0K06p9j7r2J45O4j45
3816d7k9N1J30o1p8l7J42Lj99O7P9l5r3kJ59p5l6K0L1J21j58j60K02R0j49qK9
3843d3N3Mk1k9M5L9j95J05O9j5J2j07N0O4j19j04J27J20j10L0N6L9l9M4o3k2J31
3870A21j71jO9Mp7P2l7N5o8L8L2p0O5l5j8m0k4J3N3P2j12o5J91j04j4m7L1M6N2
3899C1qnP4k0p5j04L1J2K0K8J38k7j97O2M1n1L2L1P2m7jj03O7N0J2j61O2L5J09
$$ plain form
3928 108 -90 -10 -72 -35 -78 -62 43 -32 -12 -42 2 65 -117 -118 -4 58 -65 -122 21 63 -14 -68 -76 50 -25 -105 -52
3955 -52 107 34 -55 -52 74 40 -97 -115 128 41 48 -29 104 9 -130 -6 -23 34 -63 -203 45 1 -19 -96 -7 112
3981 112 -23 -174 -25 79 54 -132 -70 76 -20 -67 -158 33 120 -101 -163 3 112 -29 -149 -39 -13 33 -124
4004 -124 -10 42 20 -78 20 124 12 -119 -23 177 -14 -30 -3 93 -15 22 -49 -18 59 -9 -129 -108 132 -16 -141
4029 -141 -104 110 2 -120 0 95 31 -127 -45 84 65 -90 -106 76 104 -124 -103 61 139 -44 -80 -16 55 -78
4053 -78 -95 51 153 33 -106 -2 64 11 -111 -61 133 108 -111 -28 78 126 -16 -80 132 166 -43 -75 38 150
4077 150 -38 -142 63 75 -4 -96 77 97 11 25 -39 106 115 -139 30 196 -64 -16 -58 148 73 -116 -120 10 79
4102 79 -75 -70 -39 128 -9 -77 14 171 19 -102 -6 144 107 -177 -14 218 37 0 -4 81 9 -56 -136 91 86 -119
$$ packed form
3928A08j98Q0o2L7m3J6J05p5K0l0M4O3j82jJ14O2j23n7J43M2p7n4qJ26p5q0N3
3955e2J59p3q9LJ26l4j37j8K43q7Pp7J33r5j39J24j7N7r7j40K48m4k0p7Q9J19
3981A12j35j51J49J04k5j86O2J46r6m7r1J91Q7k21o2J66J09j41j20J10K6M6j57
4004a24J14N2k2r8R8J04j12j31R6K00j91j6K7R6j08L7p1L1P7o8j20K1K40j48j25
4029a41L7K14j08j22J20R5o4j58Q2J29j9j55j6J82K8k28K1J64P8j83l6O4P1j33
4053g8j7J46J02j20j39J04O6n3j22N0J94k5k19Q3J06M8j42o4K12L4k09l2J13J12
4077A50j88j04K05J2p9r2J73K0q6J4o4J45Rk54J69J66k60M8m2K06p5j89mJ30O9
4102G9j54NL1J67j37o8R1J57j52j21R6J50l7k84J63K32j81l7mQ5p2o5q0K27nk05
$$ plain form
4128 -119 -133 111 109 -48 -87 63 116 -60 -148 -55 57 -38 -130 -98 86 117 -143 -50 79 44 -56 -128 72 118 -80
4153 -80 -53 -11 13 -54 -121 33 48 2 -169 -40 95 -64 -227 -93 103 -12 -100 -107 43 116 -6 -80 -16 132 -50
4178 -50 -145 59 68 -97 -27 114 65 -15 -44 32 97 139 -26 -46 99 43 -158 -78 102 125 -118 -94 109 68 -32 -98
4204 -98 34 137 66 -80 57 106 -3 -212 -22 138 13 -111 -29 82 40 -114 -8 52 125 -33 -24 -47 130
4227 130 -4 -53 22 111 24 -73 74 64 61 6 70 47 -16 -12 -89 43 7 39 -60 83 36 -35 -93 71 129 -157 -91 16
4255 16 39 18 -113 -99 71 23 -99 -24 -5 71 -78 -30 129 49 -29 -144 87 24 -5 -96 -44 41 23 -35 58 84 7
4282 7 -85 -44 67 -63 6 70 62 16 -41 -159 -16 5 -16 -3 -31 162 -80 -18 -35 -10 -14 12 78 -14 -8 -20 -26 -140 -10
4311 -10 -93 -37 16 -49 -50 22 50 -16 -46 25 -4 -58 -61 -56 -14 26 -73 -1 25 -60 -56 46 24 145 0 6 29 -17 -61 32 -76
$$ packed form
4128a19j4K44kj57l9J50N3j76q8R3J12r5r2L2J84L1k60R3J29l5j00p2K00M6j98
4153h0K7M2K4o7o7J54J5m6j71J29J35j59j63J34J96j15q8pJ50P3j22p4O4J48j82
4178e0r5K04Rj65P0J41m9q0k9P6O5M2j65k0J45n6k01Q0J80K3k43K4K03m1j00o6
4204i8J32J03p1j46J37M9j09k09J90J60j25j24Q2J11m2j54J06O0P3j58Rk3J77
4227A30j34m9P5Q9q7r7J47j0ln5O4k3o3Mp7J32l6L2r9J43m7p1n8J64N8k86O6J07
4255A6K3k1j31J4J70m8j22P5J9P6j49M8J59q0p8j15K31o3k9r1N2Q5j8n8R3K6p7
4282Gr2M1J11j30O9O4qm6n7j18J43K1k1J3k8J93k42O2j7K5mK6O6r2Oj2oj14J30
4311a0q3N6N3o5jP2K8o6l0P1k9n4lNM2M0r9P2K6q5MJ02k2J21j45OK3m6m4R3j08
$$ plain form
4342 -76 94 49 85 8 -24 60 24 79 43 -81 -39 116 0 -83 -23 -72 11 31 -59 -5 73 64 -146 -74 -5 55 -40 -27
4370 -27 18 90 -130 -135 50 149 81 -78 -31 32 57 -85 -72 48 77 -83 -130 20 16 26 -109 30 58 -8 -10 7 104
4397 104 34 -78 -19 35 7 -55 -92 182 111 -169 -79 31 25 -29 -35 39 62 70 -165 -15 66 -39 -116 -19 112 18 -49
4424 -49 -37 47 57 -63 -163 40 86 0 3 93 84 -47 -94 -33 73 -79 -18 25 70 94 -62 -96 -48 67 -175 -73
4450 -73 130 106 9 -157 20 75 -70 -84 74 48 -37 13 -14 38 112 -87 -90 81 71 45 80 18 12 3 -49 -32 1 -70
4478 -70 -74 37 155 73 -17 -51 43 -2 -90 -31 113 21 -45 -39 12 60 43 -25 19 -51 6 -44 -1 74 75 33 -74 -94 -89 -48
4508 -48 -18 -7 -11 -54 -29 18 4 12 -57 50 17 24 26 -108 -61 -14 59 1 -108 -25 -3 -61 -50 -46 64 18 29 -22 -40 -46 4
4539 4 14 46 -17 46 -47 -85 105 -6 -119 22 -17 19 -52 -9 60 -10 -145 -33 -11 -8 -52 -104 31 62 -50 -43 -15 8
$$ packed form
4342g6J70m5L6p7l2Q4l6N5l6j24M2J55j16q3O0m9Q3K0r0N4P8rk10P2O9O0r5J3
4370b7M5P2k20nJ85R9o8j59M7O3K5j42J3J20K9j60m7J50mJ0j35J39K8o6kJ7R7
4397A04p0j12N9N4k8o2l7K74p1k80R0J10on4oP4K3Qk35J50Q1j05p7R7J31r4o7
4424d9J2Q4J0j20j00K03M6q6LR0rj31m7O1J06j52O1M3M5K4j56l4M8J15k42J02
4450g3K03k4r7j66J77N5j45j4J58k6q5N0k7N2P4j99lJ71j0k6L5o2orn2J7L3p1
4478g0mJ11J18q2r0l4R4m5q8N9J44r2o6ON1M8j7o8M4p0N7n0M3P5Jm2j07k0NM1
4508d8L0J1mm3K5M7j4Qo9J07l3PKj34M7M7P3n8j09Q3K2n8J1MJ10m6J1n1j8oN0
4539DJ0L2o3O3r3l8J90j11j13J41l9L6p1M3O9p0j35J12K2Lm4n2J35L1j12PK8K3
$$ plain form
4567 8 59 40 -28 63 70 -51 -3 -28 59 -47 9 34 92 -31 -60 8 148 57 -85 -21 113 -20 -29 -43 121 -2 -15
4594 -15 53 57 49 -74 -25 104 94 8 -1 -5 56 -27 -27 -29 20 -16 -49 9 7 -12 -113 0 18 75 1 41 -42 43 -41 -57 86
4625 86 68 -7 -104 36 64 79 -44 51 130 58 43 -39 140 6 -107 -27 2 24 -59 -8 10 57 -14 -49 33 14 -43 -59
4653 -59 13 4 2 -76 52 45 67 -86 2 -3 -32 -36 -51 5 64 -43 -137 29 74 -75 -87 101 10 19 -26 -27 109 35 -6 1 47
4684 47 10 -60 11 1 -126 -66 -43 -23 -27 32 80 2 36 -81 -14 -1 83 13 9 72 -6 -64 -113 -17 48 -52 -84 -19 -15 0
4714 0 -55 0 69 -55 41 -7 47 -53 -52 -58 19 26 -11 96 35 65 -20 5 30 2 -18 50 149 32 52 -44 0 48 -18 -11 -125
4745 -125 65 3 -93 -49 100 16 -8 -32 24 21 -101 -6 74 44 -48 -90 -2 44 -70 -47 4 21 22 -25 -17 -13 -9 -28 -39 15
4775 15 -7 -17 -2 -18 -69 -51 0 95 62 -31 -51 21 160 -23 -43 69 1 -15 -11 4 -46 20 -27 37 40 -38 -38 -27 43 -26
$$ packed form
4567HN1j9o8R1Pj21M8k5Q7j06N6K5N8j23k9O8J40r1j42O4J34j33rj4J64j23j3
4594a5O8Mqj23M9J29j0q6rmO1q3%kM9l6l3N8kj9j01J13J8N7p4M0q3Q5q4j6J43
4625H6j8p5r7J40K8J5j23R5P9p2j5q2J79j34j13Q0K9K2q3N1J8M7p1l5Q2j9n7j6
4653e9P2rkp8J28pK2j53Q8nk9mj5N6N9j07r4J66M5j49j2J88r1Rm5jJ36p4m1PM6
4684D7l7p0P1j0j27O0K3K0mN9M8p8L4j17O7J3Q4p0mO3p8n8m9R6O5j00l2O5MJ5
4714@n5N5O9j24R6m8N4j00JoP7Pl7J07o1L0q5K5K5k8k0O8R9j17K0r6M4M8o6Pj14
4745a25J90o2r6M4J49q4k4k4N6lj22R5Q0l0r2m2Q8M6j14K3N1J7Jm7QMMj9j1N4
4775A5k2j0J5j6n1J8N1R5l3r3k0P2J39j83k0J12o8j6MJ5n0O6m7O4Lp8%J1P0o9
$$ plain form
4805 -26 -30 -21 -58 44 37 7 33 42 34 -34 64 -68 43 -27 -89 127 -65 -48 15 74 64 -18 19 -74 59 -49 -2 -14 16
4834 16 -29 10 59 63 -28 2 -57 -15 -20 -24 20 93 22 12 69 84 45 -19 28 107 -3 -15 1 44 34 -89 -25 -61 -14 -28 -51
4865 -51 -58 35 -41 -104 25 79 19 -85 -17 -8 86 47 -34 -44 67 -18 -39 -4 -32 -2 -88 -37 -7 -56 -2 -48 -38 0 -57 77
4895 77 7 22 64 -12 -12 80 31 -52 1 80 -53 -18 -37 40 -81 21 -5 -43 -7 -82 -9 83 112 2 -110 -71 142 26
4923 26 13 13 80 -18 7 89 -67 5 62 88 -56 80 46 45 41 14 91 -58 -45 -15 -48 68 -49 -17 -29 -114 -60 -28 27
4952 27 16 33 -84 -27 9 44 -31 -53 65 -3 -55 27 -55 -28 -35 -54 41 -34 12 -137 -46 93 3 15 -7 74 84 -36
4980 -36 69 101 10 -149 56 121 29 23 -59 -12 70 -4 -114 -66 94 -66 -59 -69 4 27 -75 -35 100 70 -32 -81 10
5007 10 25 -30 -86 9 37 -14 -24 -20 52 -13 -138 -32 3 56 -91 -97 -8 -98 -46 -102 19 94 -56 6 -13 -30 -25 -81 -66
$$ packed form
4805b6mRl7J02pl0K6Rqo8R8j32J11p0o2K16j92J7O3N9j0q2L7r3J33j08M7j2L0
4834A6m5L9M9Mr1L0n9M2nmM4P3p1j0N7J5l9o4M7P9j10j2J6M3j0j23O4l6M7j4k3
4865e1pR3p6o3J29N4o0j04O8RR4l9q1j0J11q5k1L5k8L0q6N1L0m9N4m6J0L8n7J34
4895G7p0J5M2p6%R2m9q3N3P9j33L5j9P7j21J02k6l8L6p5P3R2K9j10j12L9K13j16
4923B6j3%O7r8K5Q2j56P2N7K6j44J36l4jmk7P7j49J3L0l3J16j17L2j2q5N4L2N5
4952B7j1J7j17N7L6L5p5k2J18o8n2Q2q2K7pj9R5p5M6j49R1J39r0J2k2Q1J0j20
4980c6J05L2r1j59K05O5r2oq2M7Q2p4j10M8J60j60Pj0P3K3j02M0J35l0j02m9R1
5007A0J5n5n6R5K8n1j0MP2o5j25J06L5N3j47oQ9r0N2n6J21P5j50O2j9j7Nn6J5
$$ plain form
5036 -66 165 72 -83 24 118 37 -4 -28 14 99 -97 -168 30 128 -23 -115 -61 -25 51 -174 -3 149 76 -101 -73
5061 -73 160 -5 -65 -76 66 74 -41 -144 46 81 -17 12 41 -36 30 -18 2 39 -13 -33 -75 13 47 -62 -76 23 92
5088 92 -88 -87 88 124 16 17 8 190 -41 -50 -55 42 3 20 -84 25 30 -3 -32 37 -47 -34 -46 17 23 -37 2 7 96 27 -44
5119 -44 -51 -103 25 -17 -8 31 22 15 -73 -19 25 62 105 -14 20 8 -9 13 -64 41 -3 8 -64 -18 58 49 44 52 -7 71 -4 -3 85
5152 85 -12 -28 -16 117 -29 -34 -18 -84 1 6 -82 27 71 -12 -15 -48 78 -6 -124 -58 39 -47 -86 74 44 75 -28 -84
5180 -84 -75 52 -45 -42 61 54 -75 -99 -67 112 -29 -55 28 134 82 -22 -87 129 1 -50 -13 93 70 -61 -35 112
5206 112 47 -9 -88 -50 -3 12 -80 -18 93 73 -51 -51 48 -27 -79 -94 -20 166 45 -96 14 36 -102 -56 66 109
5232 109 65 18 46 75 -38 -83 27 22 39 -95 16 151 90 -70 -130 -16 13 -23 -77 75 67 -32 -44 75 95 -51
$$ packed form
5036f6K31r3j55J07R4q1m1k4M2Q5j96p1J98R8j51r2N4L6P6k25J71J52p3j77K8
5061g3K33j65o0j1J42Qj15j03J90L5r8K9K9p7O6m8K0L7n2k0m2Q8L4j09j4R9O9
5088I2j80JJ75L6j08JrJ82k31rnR7l9J7j04J09Nl3k9O9q4J3j2O3Oo0L9NQ9o9p1
5119d4pn2J28m2RL9rpq8N4M4L7M3j19L4j2j7K2p7J05m4J1p2M6P6rnQn9P8p5JQ8
5152H5r7j6J2J33j46nJ6o6Q5Nq8J09M4q3ll3J26q4j18O6R7q6l9J60l0L1j03n6
5180h4RJ27r7LJ03pj29k4L2J79j41k6Q3J06n2j04o5K16j28n1L7J06k3j31K6J47
5206A12o5n6p9L8M7J5r2O2J11k0j24%R9p5n2j5P4J86j21j41J10K2j38M6J22M3
5232A09m4m7K8K9j13m5J10nJ7j34J11J35o1j60o0J14K9l6n4J52qr9j2J19K0j46
$$ plain form
5258 -51 -31 -12 55 -23 -31 -130 80 -10 -63 -45 93 23 -77 -26 81 22 -87 -53 -40 34 -22 26 3 147 2 4 59 58
5286 58 37 28 0 31 -37 33 29 144 -81 -140 -6 39 7 -78 -30 59 85 -34 -31 41 29 -8 -14 -34 67 -110 0 -46 53
5315 53 -43 -17 -7 64 -52 -133 19 59 -70 -70 -90 -2 -20 -89 -24 0 69 -62 -51 56 31 -81 20 53 47 41 23 54
5343 54 -2 -15 -58 -5 108 23 -69 51 1 -2 -28 -6 71 -107 -15 -24 45 -8 -48 -61 5 -3 21 59 94 -2 50 -32 56 -4
5373 -4 -140 -84 9 44 12 -13 -71 35 46 -80 38 72 -54 -89 9 111 -29 -20 -55 83 18 11 12 21 64 70 74 28 60 48
5403 48 -56 34 47 -17 -26 -129 -19 -34 2 -97 34 71 -77 -133 -46 7 -90 10 7 49 -22 -107 -13 -58 -12 -46 32 -29
5431 -29 -38 -90 -6 -28 -26 -136 -2 95 64 -71 -93 -41 -73 -77 -45 6 31 42 -37 85 62 -49 -73 -11 -8 22 26 24 -57 4 -15
5462 -15 -148 -26 -40 3 70 73 55 32 -16 94 24 -28 21 34 46 -32 -57 -1 73 -9 12 21 -27 -7 -45 1 25 8 1 -31
$$ packed form
5258e1K0J9O7p8qr9K10r0n3J8J38p0j00N1J07n9j09L4J3P4n6M8k3J44j45KN5j
5286E8k1rk8L1o8P0mJ15k25n9J34M5l2q5M8Q9K6j19LP2j2l7ok0J01j77J10m6R9
5315E3r6K6J0P1j16q1J52M0j29%k0Q8j8o9O5K4O9j31J1J07k5j12J01L3ooj8L1
5343E4n6j3m3N3J13q5r2J20n0lk6K2P7j78R2rO9n3m0j3O6qK4L8L5r6N2q2Q8o0
5373dj36N6R3L5l2k5n8J06J1j26J18L4j26l5R8J02j40Rl5J38o5pJRM3OMm6L2j2
5403D8j04R0J3o4rj03J10j5L6r9J31L7j48n6Q7N3r7J00lM2p1q5R4m5M6l4P8o1
5431b9rn2Q4k2Kj10J34R7l1j35k2N2l2mL2N1K5J1p9J22k3j11k4O2LL0Mkq1O1j9
5462a5j33J22j4M3O7Lj8k3m8J10p0n2M9J3J2p8k5N6P4q2K1Rm8K0l8M6K4j7pl2
$$ plain form
5492 -31 53 -26 -32 -39 39 68 -66 -79 -80 58 3 -49 -27 18 50 64 -53 14 -12 30 36 -75 63 8 -59 22 2 -25 -35 -70
5522 -70 -31 -39 -17 -14 24 23 -28 42 64 -33 -10 17 -22 43 22 2 -8 -52 43 -46 -36 26 20 -41 -80 -18 126 -79 28 44 -20
5553 -20 22 5 -28 -22 -15 48 -14 -17 68 -21 -58 91 100 -11 -21 7 -67 -77 33 -38 -14 21 -92 -66 -77 -54 0 -88 -5 -44
5583 -44 55 -12 -112 -96 58 6 90 -17 1 -52 -114 -10 -13 -69 97 106 66 -2 10 69 4 87 48 0 15 66 6 -31 -41
5612 -41 -77 -28 39 -39 84 -31 -10 -50 65 -9 -11 13 52 -41 -20 53 -41 15 -70 -48 -48 -1 -39 -42 -4 39 31 -87 5 109
5642 109 -13 -29 -41 23 -7 -20 -8 -32 37 126 -86 23 -74 -3 29 7 46 -15 -27 -16 57 -114 -53 -23 -14 -29 -15 42
5670 42 -64 32 8 -45 55 36 12 23 91 47 -40 -63 -94 -132 -129 -118 18 6 -26 -33 -52 100 59 -18 6 89 15 -23 44
5699 44 -27 -55 67 -42 -68 50 42 -23 126 42 -6 -88 19 -7 -33 76 76 14 28 -5 -108 -9 -26 -42 -48 82 -2 -27
$$ packed form
5492c1Q4p9opP8K9j34j3jJ38n5n2K2M5L2J4j17O7k6M2Oj11J38n5o7Q1k0k7j0l5
5522g0L9qK2LL8jn1P0K2r7K3K7l9O5k1k0j0m4R5q9J0O2oo1l9O2J44k05J07J6o4
5553b0M2j7l3OPO3o2lQ5q9l7J49Rj11j0K8p4j0J10p1K4L5j13K6j1K3N4q8Q3l9
5583d4R9o7j00J6J54n2Q4j07J8n3o2J04ln6J66Rm0o8J2N9o5Q3l9m8J5N1o0l7j0
5612d1l6M9O7p8J23j15K1m0J15p4kK4L9r3K1P3r4N6q5K2%M7l8lL8M3qj18R2J04
5642A09j22j6j2O4l0j3J2k4O9Q9k12J09r7P1L2k2L9o1j2J1P3j71O1L0Rj5J4N7
5670D2j06R6k4n3J00j9k4J1O8m4q7k3l1l8LJ1J36j2l2pj9J52m1p7K4Q3p4l8O7
5699D4p1k8J22j09k6J18qo5J49q4m8q2J07k6k6J09%o2J4l3j03R9j7j6oJ30q4k5
$$ plain form
5727 -27 -147 -36 74 -48 41 76 10 -72 87 -3 -22 -6 -15 -37 55 8 -19 82 4 -41 -29 52 -34 -39 -58 -19 12 -79
5755 -79 74 -77 43 -57 -61 -25 79 28 -37 -12 0 -35 -70 41 15 -57 20 54 -5 27 72 55 0 -36 56 7 -10 -11
5783 -11 -32 -71 40 -12 -1 12 -8 -40 20 103 -6 7 52 -39 10 43 46 8 1 19 -49 -8 -54 23 -16 25 -59 -6 94 67
5813 67 -80 61 5 -61 -90 16 -84 -57 -64 -1 11 53 -75 -91 47 17 -24 -81 -12 58 51 40 47 74 -114 26 33 -59
5841 -59 11 -84 -89 37 -30 37 39 -51 71 -6 -54 49 83 73 -7 -20 10 -19 5 41 49 94 12 -1 58 5 45 -13 -32 -7
5871 -7 -78 0 -36 37 -48 -11 11 -29 1 34 -26 -11 9 -16 60 -48 -105 52 -9 5 -45 5 6 -68 22 -63 2 110 29 -41
5901 -41 -43 -2 32 11 -34 -7 41 79 27 -11 -32 26 -44 13 40 10 22 8 23 -143 -25 -52 13 -78 -30 -11 -75 -5 68 -58
5931 -58 -20 43 -76 -31 -8 -51 37 6 38 -6 -6 28 38 -27 5 -23 47 26 -42 -7 -109 67 -16 -56 17 42 -4 42 47 23
$$ packed form
5727b7j20J11J10j22Q9L5o6q2J59r0j9J6rk2R2m7k7J01p8m5J2Q1q6nj9L9L1r1
5755g9J53j51J20j00mL6J04n1o5K5J2l5l5J11k6p2P7L4n9L2M5j7n5l6R2m9j7j
5783a1k1l9J11n2J1J3k0l2O0Q3j09J3M5r1M9L3Ll8pJ8o8M1m6P7l9M1q4N3J00k7
5813F7j47J41n6o6k9J06j00K7pO3J2M2j28j6J38l0m1n7O9P0pj1PK7j88J40Pr2
5841e9P0r5nJ26o7O7Kr0J22p7m8J03L4j0q0j3L0k9K4L6QM5q2j3N9n3M0n8j9K5
5871gp1P8l6P3q5L7K2m0L0L3o0J5K0k5P6j08n7J57o1J4n0N0Jp4R0q5O5J08q1p0
5901d1kM1L4k1m5K7M8L8n2l8k1N8p0N7K7l0J2j4J5j66J18k7O5r1M8J9o4P0P3j26
5931e8L8O3j19M5K3m3Q8l1L2m4%L4J0o5L2k8P0k1o8L5j02J76q3m0P3K5m6M6Nk4
$$ plain form
5961 23 -55 -33 -55 -27 -7 -44 17 22 -46 -64 20 -17 46 -43 -60 15 45 21 10 -137 39 64 -89 -118 106 28 7 -48 28
5990 28 34 20 -34 -11 25 22 37 -28 -141 -80 -24 49 -25 -76 62 -70 -62 -129 2 31 5 8 9 21 -5 -15 -52 -49 -25 61 -41
6021 -41 -11 18 -19 -6 47 23 22 -35 -8 45 -43 -53 73 -29 33 18 -113 -52 -68 1 -9 2 10 -55 -11 -24 32 -2 -11 -96
6051 -96 46 -4 22 37 66 12 70 7 -46 -33 28 -2 32 -1 -14 54 67 44 -13 4 -5 7 -47 -54 28 -22 -5 42 -19 -60 -16
6082 -16 144 -57 -50 34 1 -82 6 -40 48 -1 -10 30 76 -18 -10 -95 -23 33 13 1 -58 27 -71 -44 -105 -47 -60 21 -50 -25 12
6113 12 28 42 80 79 1 -2 -75 -41 25 22 22 -13 67 40 39 -63 26 -62 54 -81 -142 13 48 -4 15 54 -44 -61 -29 32 24
6144 24 32 44 55 -22 -12 -60 -3 -11 -33 -16 56 7 -39 -14 -8 27 90 -7 -12 1 1 40 29 65 62 48 -61 38 -1 8 -8 41 22
6177 22 29 -5 -32 67 4 -5 -101 68 8 -26 -39 6 77 -30 -62 -86 -26 18 1 -66 49 52 -76 46 26 43 40 -3 105
$$ packed form
5961B3p8K2k2K8K0l7O1No8j8Q4l7O3q9j7P5L0k4j1j47J76K5j53k9K24p8k1n5P6
5990B8Oj4n4K3L6lJ5o5j13O1N6P3p4n1J38j32Qo7J31K9k6LJJ2k6j0l7LK4Q6j02
6021d1L0K9l7J3N3k4jn7K7N3q8j0J26j02O2j5j31O1j6O9j0J1Qo5M4j3N6l4rq5
6051i6J42n0K6J5K9n4N8o3n3J3O1l0L4l3j3O8J3k3n7J7rJ2n4pQ2n0J7M7o1m1M4
6082a6J60k01PQ4l3q3Q8m6Q8m9rM0M6r4Qq5P2N6k0j2n9Q5r8K7o1N8j3Q1p1K5L7
6113A2J6J4L8jp8lp3L4O6l%l5Q0k7jj02Q9q8J16j35o1J55L5n2J9L9r8j7L2O1q
6144B4QJ2J1p7J0m8N7qk2J7P2m9m6K5OL5O3r7nJ3%L9j1L6lj4j09R9l9Rj6M9j9
6177B2Pl4k7R9o3rr6J69o0l4j3M5P1j07l2k4O0M4j7o7J15Lj28J22k0J7lm3J08
$$ plain form
6206 105 70 -47 -71 22 34 26 2 68 -1 43 -41 -98 63 93 0 52 119 41 15 -19 -45 107 76 -55 -40 118 -36
6233 -36 -96 17 55 52 13 44 60 100 37 6 -56 146 -5 -60 84 60 7 25 -41 70 31 28 -25 107 55 23 -62 3
6261 3 30 16 -45 60 137 -26 -48 12 106 16 -28 40 53 66 -9 -38 102 138 35 -74 -54 19 -23 -138 -31 -39 98
6288 98 -63 -42 75 94 -51 -107 90 23 -55 -143 53 92 -36 -48 56 45 24 -102 -10 103 8 -81 -135 65 15
6313 15 -24 -49 40 37 -37 6 -43 88 -40 -94 37 14 118 34 -63 122 40 -36 24 70 78 19 -13 48 23 -56 -35 15 29
6342 29 18 -111 -15 81 -14 -39 -68 -5 -53 -54 32 -28 3 -9 -137 -73 67 13 -64 -62 72 37 9 -11 -43 105 7 58 -18
6371 -18 30 29 -51 31 46 107 -40 4 64 35 0 -113 67 79 -73 -161 61 125 72 -61 -52 -38 18 -130 21 172 21
6398 21 -90 -36 -7 58 -54 25 8 60 -5 -144 64 44 -65 -113 -59 -10 -34 6 -18 -84 88 36 -86 -1 85 0 -29
$$ packed form
6206A05l5j17k4R3J2qk4O6o9M4q4n7J61L0r3N2O7p8k6l4k6J52l1j31J5J58j54
6233c6o0J13L8ll9L1J6M0o3l1o2K02j51n5J44k4n3J8o6J11l9ln3J32n2l2q5O5
6261CK7j4o1J05P7j63k2O0R4r0m4O8J3J3p5k9J40L6j03j09K0P3m2j15J07qJ37
6288I8j61K1J17J9j45n6J97o7p8q8J96L9j28j2J04j1k1j26R2J13r5q9n4K00n0
6313A5l9k5Q9lp4M3m9J31j28n4J31k3J04q4r7J85q2p6O0M6Qn9l2O1k5p9K1N0J4
6342B9j1j29R6R6r5k5k9O3m8jQ6o0L1j2j28O4J40n4p7KJ34l5k8k0l2J48r8N1p6
6371a8M8jq0Q2J5O1j47M4O0k9l5j13J80J2j52q8K22O4n3j33RJ4N6j48J51J51j51
6398B1j11N4K9O5j12P9j7N2o5j39K08k0j09m8N4M9k4M0k4o6J72n2j22Q5Q6q5k9
$$ plain form
6425 -29 -29 53 -61 -84 -61 81 74 16 41 -6 72 75 -73 16 68 -10 -10 135 -16 -4 13 62 86 42 -75 -70 33 -35 -53
6454 -53 61 89 101 -92 -61 51 47 -19 -34 97 -15 57 -24 45 -63 96 -91 -101 31 25 -115 -86 69 1 14 -26
6480 -26 -9 50 28 13 29 -64 20 -87 37 58 -39 -22 2 6 -25 -33 5 -62 39 31 -6 -22 36 -46 -100 -17 92 -38 35
6509 35 25 10 -66 21 -8 22 -12 7 -69 -94 -23 52 -37 -3 -25 -56 8 15 -115 44 32 -12 -40 -52 60 87 -39 4 -49
6538 -49 7 -43 -26 18 92 26 -99 35 99 -5 -84 7 -57 48 -11 62 -28 46 -33 -10 77 19 -58 -31 1 76 -113 -55
6566 -55 46 49 19 70 -86 -61 0 -106 -45 4 -43 -4 -108 29 108 -20 -10 -5 -5 -25 -25 -20 -67 22 -54 30 24 -80 -17 8
6596 8 46 -34 -18 -2 24 -65 3 -166 -34 72 -96 -115 30 74 44 -62 -76 -22 -23 -3 34 59 29 -6 0 6 37 -79 -72
6625 -72 47 -21 -32 -47 8 -26 -50 -118 22 -35 -64 9 -20 42 -6 -42 -32 37 -37 -17 16 48 -19 -91 -12 -2 30 -121 -5
$$ packed form
6425b9%Q2j14k3K3J42pn8K5m7P8Lj48Q9N2p8%J45j51J2J7M9K4m4j17NJ03o8j8
6454e3J14K8J2j93L1J12mo6j5J31j12P2q1O9j08J59j87j0J32oj40K9J55o8J3m0
6480b6J7N9k2j5J6r3Q4j07J24K1r7J7K4Ml1qL8o7J01ql7j6N8q2n4Q3J09j30P3
6509C5j0j5p6Q7k9L0l4J9p6k5P1P5q9L4k2l1O4Pj30J59j2m4k8j2J12K7j26M3n3
6538d9N6n0J7M4P4o6j25J34O4j04p9R1o4J05n9P3r0P4p9K3Q7n8p7K7L2P5j89N8
6566e5J01Ll0N1j56K5O1j06O1M9m7L9j04J37P9j28J0N%k0%Nm7Q9p6Q4oj04O3K5
6596HL8q0J6J6K6q9O8j69J32J06j68j9J45M4l0j06j4N4jK0L7K5l0l5OOL1j16P
6625g2J19o8j1j5N5l4k4o8J40n7k9P3k9O2m8l6J0O9p4K0L3L2o7p2P9J0L2j51J16
$$ plain form
6654 -5 60 10 -23 -28 1 -25 -3 -40 -41 -15 30 27 -36 -17 -94 31 -57 -25 52 -39 -50 -11 110 -12 -28 25 45 3 -96 74
6684 74 9 -15 12 -150 34 -28 -6 -50 -16 -11 -54 -52 23 70 -61 -147 17 19 -80 -120 1 -4 2 -98 8 -26 46 -93 -32
6713 -32 147 32 -75 -76 -20 -1 -36 3 -12 22 1 15 76 -4 -2 27 -50 82 -9 53 75 80 23 18 -58 -36 -18 66 -39 43
6743 43 111 66 29 -62 -8 38 -10 14 -18 20 17 37 -25 26 49 -74 -21 -19 -22 -65 -20 15 46 -30 67 -29 -69 -49 -41 -122 32
6774 32 92 17 22 50 -58 4 -32 5 86 53 -10 -13 76 37 -92 -65 114 -99 7 -28 38 40 -36 -62 8 -14 29 18 23 -101
6804 -101 -33 16 -62 65 -45 -129 -51 39 70 14 -141 -10 49 -54 -75 39 127 -16 -20 8 36 -22 -74 55 -1 36
6830 36 -43 -23 19 -4 -19 -28 11 132 24 -63 -17 37 -3 -101 -21 25 -59 -41 12 56 -32 -9 19 15 71 -34 30 42 52 -33
6860 -33 -48 -16 123 -14 -96 26 115 60 -118 45 43 59 -23 64 62 33 -86 -100 -8 104 35 -38 15 95 -36 -104 -77
$$ packed form
6654eO5n0l3nK9k6K2l7jK6M5lo3J9p7J25q8L2P7r1j1L9J21j22j6N3K0m2r9J70
6684G4o5k4K7j62J84o2K2m4L4Nm3KP5M7j31q6J64Kr9m0J21nOj00J06l4P2j39O1
6713c2J79j15j07jN6J9l5L9j5L4k1J4O1q0KK9p7J32r1O2K2Nn7np6K2J8Q4j05Q2
6743D3O8m5l7r1N4M6m8K4l2L8lK0o2N1K3j23N3Klm3M5L5L1p6R7r6m0K0Qq1J54
6774C2O0p5NK8j08O2l6L7Q1l3o3lQ9l9j29K7J79k13J06l5O6Kp6k6P0k2M3j1Nj24
6804a01O8M9p8J27j10q4P8R0L1n6j55J31N9j03k1J14Q8j43mK8K8n8n2J29n6L7
6830C6p9K0M2k3j5rL9J21j08q7M6N4m0r8Q0M6q4J8N3M4q8K3K8mN6j05O4J2J0q5
6860c3j5L2J39j37q2J22Q9n5j78J63kJ6q2Q7kk9j19j4R2J12o9p3N3Q0j31o8K7
$$ plain form
6887 -77 17 -52 -35 -21 59 -9 -109 -24 47 38 8 -85 38 58 20 -134 49 77 -29 -107 17 87 -45 -66 -21 65 54
6914 54 -30 -48 71 45 -98 -105 -7 41 -12 -8 31 63 -28 -62 -82 -28 -20 -31 19 27 91 41 -21 20 25 34 -80 23 1 -8 -33 74
6946 74 66 -37 -33 36 126 37 -115 -64 -65 38 5 -70 -94 -12 -28 22 35 -26 42 27 -27 -10 13 29 -78 19 -27 -49 40 -10
6976 -10 50 47 -6 -13 48 -1 1 16 -32 25 -67 13 -56 41 96 3 41 17 87 -31 -32 60 9 -46 -63 144 67 50 -107 -45 48
7007 48 -108 -53 -42 89 -22 -7 -50 33 81 -24 -42 25 89 -30 -57 36 120 -40 9 32 134 93 -72 13 173 47
7033 47 -21 -62 5 28 -69 -28 59 97 -37 -141 21 134 115 -99 -56 41 34 -6 -45 46 23 -170 13 29 49 -29 -21 11
7061 11 52 17 -166 -9 58 -43 -46 33 76 24 -5 -77 56 43 27 2 -57 14 4 -63 -25 67 1 -57 7 -40 -42 -15 18
7090 18 64 16 -6 -10 9 42 -37 -54 69 8 -132 -12 24 18 -36 -75 -37 25 -3 -36 -5 44 77 -83 -48 -17 -51 23 64
$$ packed form
6887g7R4o9J7J4Q0o8j00Q5P1rl0r3J23K0l8j54J83K8j06p8J24P0j32k1M5Q6j1
6914E4q4j8J19k6j43pR8M8n3ML9L2r1l4k0N4Qj1N0QO4n0o2M1NRj14J03k2rk5J07
6946G4qj03MO9R0q9j52N1jJ03l3p5k4Q2j6N0J3o1O8j5n4J7K3J6j07R7m6k2Q9n0
6976a0O0ln3pO1m9KJ5m8N7r2Q0o9R7N5r3L8k4P0j18jR2n1n5j7K07p7j7j57O2R3
7007D8j56N5J1J31j11J5m3Q3M8j05j8O7O4j19k7R3Q4j60M9K3J02m1j65Q5J60j26
7033D7o8m1O7K3r7M1Q7L8j34j04J62J13j9k14M3R7pm0l9R1k3j93J83J6K0p8QL2
7061A1M1l5j83J57O7j01lP9M3n2k9p2J33j3j6k5n9P1j0o7L8R2o6n8O4m7kK7L3
7090A8M6m8k2mJ9L3p9j7J23o1j40J20L6on4l9L8O2k8l3L1M9L3j60L5L1l4P4M1
$$ plain form
7119 64 2 17 -44 75 27 58 31 16 -57 17 89 -26 -47 16 11 10 47 -10 3 -100 -28 -9 -29 51 -23 -34 -25 43 -16 2
7149 2 -81 -122 -34 -10 -131 -66 30 8 -75 -8 66 -46 -20 98 -73 -40 -7 -21 -11 73 67 18 -92 -25 -6 3 -4 52 4 -26
7179 -26 1 -12 -33 -29 21 35 38 1 -13 14 71 -43 -68 69 38 -9 0 64 -15 -61 42 -78 49 63 14 16 74 20 -59 15
7209 15 95 7 79 -12 -70 34 53 -9 -64 74 1 6 -67 31 28 -31 -20 54 -35 24 -70 32 28 -37 23 -23 47 -11 -16 -4 133
7240 133 32 -52 -5 61 -21 36 31 71 -9 -48 -30 -11 -15 12 -105 -40 -30 -6 -9 70 -64 -34 -20 -33 57 32 64 -12 30 5
7270 5 -92 23 43 40 -53 -50 -2 32 47 -7 -34 66 82 38 1 20 84 -30 -66 -32 -16 -15 85 85 50 -69 3 23 -29 -62
7300 -62 -10 -23 51 32 0 13 13 33 -62 1 -19 14 0 50 22 87 -98 19 46 -4 -50 -54 -22 139 34 42 9 36 -11 -46
7330 -46 34 -24 78 -35 36 11 -8 3 -67 -8 52 -1 -13 -37 36 -43 -15 -21 -101 -17 -10 -74 -1 -26 12 4 6 -71 -43 -3 -29
$$ packed form
7119F4o2J5o1J19m8L1k7j5p3P4P2j15k1O3njL7n7J3j03P2J9k0Q0p4j1RO8n9J8
7149Bq3m1Q8K4j21O5R6k2q3O7P4j12K6J18j71L3L3j4J0Q4om9j10O7J9RpN6m8l0
7179b6K7j3k1MN0J4Ll7j4K7N7j14k5J37l1m7RO4p9m6J03j20J27J4m9KN8n4p9P4
7209A5Q0q8P2r1n8J04J9o2n5J38p3Np3R8ln9J1P4q9N9r4J02mo5O0m6P0n8nJ2J37
7240A33j01q4M7O6q2N7nM0q0l9J8J9mK7j17O5J0K4lP9j34L0J4j3R0k5L2p6M2k5
7270Er7J15K0lr3LM8L4J5n4k7J00J6m4l7J9O4j14l6L4J6JJ00%l5j19P2K0n2l3
7300f2N2j3P4j9l2J3%K0r5O3k0L3j4N0k8O5j85J17K7n0m6mL2J61j05Ql3K7m7l5
7330d6Q0n8J02j13P1k5j9J1p0N9O0n3j2k4P3p9K8oq0Q4Po4P3k5L8qKp7K8M0k6
$$ plain form
7361 -29 28 -27 38 6 -81 -1 -10 -17 -19 57 -84 40 31 46 48 11 -102 -50 14 -74 23 -12 0 -6 -79 -31 29 -23 -13 -40 54 17
7393 17 28 34 -79 -40 113 -21 -40 15 43 8 10 -36 88 -43 -2 35 67 8 -37 63 32 -10 -73 -1 -54 -20 -85 21
7421 21 46 60 5 50 94 16 22 -80 -29 151 4 -68 -26 -4 3 -43 8 60 45 -11 -65 -8 -11 -9 -25 -12 30 -13 -74 59
7451 59 71 -1 27 39 21 45 -104 51 -9 52 -54 -47 57 111 -33 -76 95 69 13 -50 62 34 -42 -58 -48 79 -15
7478 -15 -26 23 20 27 -89 -30 -111 -4 -42 -78 19 8 93 25 96 0 115 37 -30 37 -1 -36 -72 6 -10 12 -37 -49 -8 -49
7508 -49 -64 10 3 -1 -48 8 25 26 -11 -17 68 2 -75 63 -72 19 -7 10 45 -60 15 -26 73 111 -1 18 -72 -7 -94 17
7538 17 -45 -27 64 54 -84 25 -5 -5 -70 34 43 126 33 64 39 -91 1 -96 0 -28 13 -27 -43 -28 -48 -18 -44 72 74
7567 74 -36 -61 -10 44 17 -74 -58 -19 13 -111 -47 169 3 -85 -10 -16 35 10 -42 -67 15 68 -18 -15 8 -49 -34 13 -12
$$ packed form
7361b9N7n5O5l2q7Q0rpkP6j41J24rJ5Kl7j13N2O4q8R7l5J2op3M8O0n2J0k7R4l7
7393A7J1Oj13L9J53j34j9N5K8l5Km6J24j31M1L7L2n9m5J00l1m2o3P2n3L4o5J06
7421B1K5J4n5M5M4p8Oj02N1J80j47p2M2K2Pm6N1N2j5n6n4N7lKj6J3M2m3o1J33
7451E9J2p2K8J2j8K4j49J55o0O1j06PJ04N4j44m3J71k6n6o3J12k8p6j6J0J27r4
7478a5j1M9lPj16N9q1J07l8l6R7j1Q5o8P1r6J15p8o7O7l8l5l6P8j6K2m9j2M1m1
7508d9j5P4pmm7N6J7Jl7oQ5o6p7J38j35R1k6J7L5j05P5m1R9L8j12J9r0O5q7J11
7538A7o2J8R1j0j38J09l0%o5J04RQ3r3L1k5j30R2r7R6k8M1m0j6J5k0L0k6J16K
7567G4j10k5N1N4k7r1J6L9L2j24O4K16j66q8P5oN1k5n2k5Q2N3q6LK3n7J5M7k5
$$ plain form
7596 -12 49 53 33 -65 3 3 -22 -50 28 154 -71 -50 70 8 2 -45 -20 51 -49 -59 19 2 17 -50 -30 53 -1 30 -4 56
7626 56 75 -98 -8 89 -9 -47 -31 -44 1 32 -28 -42 73 -51 -25 54 15 -6 -74 44 -39 8 -21 3 -42 48 10 -68
7654 -68 -3 -5 -12 -86 39 20 -23 -72 -30 42 -16 -65 -56 50 -23 -40 -12 -67 -14 -16 5 13 33 -11 21 43 -35 75 -25 33 -28
7685 -28 38 -22 57 15 30 -108 -41 -77 70 -18 -30 51 -53 24 25 -49 18 -68 -1 56 61 -7 4 25 -74 -47 -34 68 -33
7714 -33 -8 38 24 -64 -14 70 -37 12 1 -33 -68 -22 34 23 -89 -30 22 -35 -34 -6 9 68 14 6 56 5 9 41 18 -73 -35
7745 -35 45 111 -122 -5 -31 -24 -31 14 -66 13 -72 -49 -85 26 12 -49 -80 10 65 -36 122 7 -37 -75 90 16 -51 66
7773 66 -32 57 -15 -75 50 47 -12 27 -24 69 62 -4 45 34 -53 -15 -67 7 41 92 -15 -98 28 -21 -12 -70 120 -35 -73
7802 -73 59 -42 23 -36 26 16 -53 60 -39 -52 49 24 59 7 -33 96 -74 -79 38 38 48 -3 -41 18 57 -35 -6 7
$$ packed form
7596a2O1Mk0r8O8%k5k8P8J26k25K1J20o2om7K5P1j00j0P8j7J5o7K0Q3n4L1l4O0
7626E6J9j73R0R7r8l8J6j3M5L1o0j4J15j24K6P9l9k1o8J18q3M7k9K4m5R0l8p8
7654f8O5kpp4J25j9m3m9M2P2n8m9RJ06p3j7K8n5N3kK1QK0m4L2K2p8J10j00N8o1
7685b8O6o0P9m2J5j38O7l6J47q8j2Q1j04P7Jp4O7q6O7N7No8J1K1r9K7J3J02j01
7714c3K5M6j4q8N0Q4j07M9j1l4l5M6N6j1j12N9N2n7JK8J5N9n4qN0n1ML2k3r1L8
7745c5Q0O6k33J17k6PpM5q0P9q5K3l6J11j4o1l1R0N5j01J58j15m4l8J65p4o7J17
7773F6r8Q9p2o0J25ln9L9n1R3po6M9j1q7L8n2P4L4N1j07q3J26m9Rn8J90j55l8
7802g3J32j01O5n9O2j0o9J13r9j3J01k5L5n2m0J29j70nJ17%J0n1l8N9L9r2K9J3
$$ plain form
7830 7 -13 -27 -12 99 55 34 30 -9 -41 32 -23 -20 -6 31 -82 -33 -17 26 2 -13 119 7 29 -50 -26 -44 0 59 17 34
7860 34 -1 12 47 -25 -89 -23 37 22 5 4 -30 -6 9 -40 -40 -55 15 78 -17 37 18 40 0 -18 95 54 -71 3 2 -13 24
7891 24 -16 -8 17 -39 -10 16 27 -13 11 40 -113 7 -10 -12 -42 -2 75 -104 69 -6 47 87 -10 -37 -24 -21 -8 23 7 0
7921 0 65 51 -29 -30 15 54 8 -5 45 -12 -20 -53 40 -108 -61 -68 15 44 31 -27 24 -61 36 -63 26 132 79 11 -62 62 -62
7952 -62 16 -1 22 -3 -62 96 -50 32 -66 -16 -93 65 5 58 92 98 -1 15 19 -23 48 43 -17 -36 51 41 62 21 3 -3 17
7983 17 6 -56 -15 21 -27 23 -167 19 -107 -32 48 86 -32 -21 8 48 62 -3 -74 -12 42 -68 -16 -42 103 -13 -74
8010 -74 44 68 -78 -42 53 37 -10 -7 -57 -35 23 3 -43 -8 -32 -57 -45 -46 -12 15 46 45 3 89 52 27 -15 -38 62 -31
8040 -31 80 55 -92 44 -42 -33 69 -103 -18 27 -33 -22 38 6 14 -19 -26 45 17 94 30 30 -13 26 -128 -25 39 -43 -25
$$ packed form
7830Gk0j4J5J11m4k1ml9l2P3n5LJ4L7j13M9J6M3k4j5J32j12K2p9K4j8M4N9m2J7
7860C4l5J3L5p2o4O6O0j5j7jl4K4J5m9%j5P0O3r5N4j9K2m0j8J13m1j25P4jj5L7
7891B4m0QK5n6K9K6J1m0K4K9j53J20j7kl0M0P7j79J73p5N3M0r7k7J3LJ3L1j6p
7921@O5j4q0jM5L9m6j3N0n7ql3R3j48M7pQ3K9j3n8N1q5R7r9Q9J06n3o8p3J24j24
7952f2P8j7K3k5n9J58j46Q2r8N0p7J58o0N3L4Or9J6Mm2P1no0j9Q7j0K1m1j8oK0
7983A7j1o2M1L6m8N0j90J86j26P5Q0L8j18J1K9M0J4o5p1O2N4j10N2k6J45j16o1
8010g4J18K4j46L6R5j6m7Ln0K2N8k0m6L5k4k5J2jL4K7L1jm2Q6l7k5m2k3J00r3
8040c1J11k5j47J36q6RJ02j72Q5M5o0J1O0l2Ql3pP1k8P7o4%m3L9j54J03O4q2J8
$$ plain form
8069 -25 14 6 -65 4 -31 -66 -36 10 -17 27 -1 105 0 -21 35 88 -66 2 99 37 -7 -23 -17 -1 38 47 -31 26 -42 -91
8099 -91 -50 -39 -12 -56 -10 75 62 -139 13 -27 0 -44 31 28 116 71 -3 -92 -6 -64 -59 66 47 75 76 7 21 -34 60 43
8129 43 51 58 -64 -77 -33 -52 -36 83 90 -17 -59 17 92 -48 23 50 -9 -48 -36 37 70 -113 1 74 -39 -1 -42 10
8157 10 38 17 -43 85 0 -13 72 35 25 27 96 63 37 -20 -75 -61 0 42 -67 20 13 -33 11 0 0 -7 88 2 1 -7 -10 -49 11
8190 11 -34
$$ packed form
8069b5L9qp1O9l5l5L0M6k7M4k8J06j05k1N6N3j54O8R7o2m4j6OJ6L9Rp8N7o8m9
8099i1M1J1K7m4M6Q5j3k01J52m0K7m4P5lQ8m5p4q9Q6n8NJ25j9K8Jo9J4n5R4j7
8129D3QPj22j3M4j9J6J19Pj07m2P6P5j40P1K7n9l9J2P3L3j83J14P3j13L8m1N2
8157A0K8k1o0J28q5j3Q5l7j0KO9l3k6n7n5J4O1M2j09Q7pm6M4j1%pR5q6jqll9O0
8190A1m5
8191c4
$$ Imaginary data points
##PAGE= N=2
##DATA TABLE= (X++(I..I)), XYDATA
$$ plain form
0 0 0 0 0 0 0 0 0 0 0 0 16 -16 16 -16 17 -32 32 -48 48 -64 65 -90 97 -113 144 -161 192 -217 252 -289 324
31 324 -369 422 -480 539 -604 683 -763 847 -945 1052 -1169 1294 -1433 1585 -1748 1930
47 1930 -2125 2344 -2584 2842 -3134 3457 -3812 4217 -4675 5201 -5804 6510 -7354 8371
61 8371 -9635 11255 -13405 16414 -20922 28424 -43178 83055 -415599 -1165604 -28120
72 -28120 673964 118876 -365882 391759 955246 234122 -670615 -338478 277697 -162545
82 -162545 -900326 -320545 875853 821955 -315740 -605625 197658 495013 -214004 -541574
92 -541574 116032 617562 182694 -280771 -3267 251641 -309253 -835987 -300132 569493
102 569493 479830 -151059 -71250 505160 387695 -336476 -509046 1882 178043 -203112
$$ packed form
0@%%%%%%%%%%J6l2L2l2L3m9O4q0R6j12J29j55J87k10K57l05L53m09M69n41O13
31C24o93P91r02J019j143J287j446J610j792J997k221K463k727L018l333L678
47A930m055M469m928N426n976O591p269Q029q892R876j1005J2314j3864J5725
61H371j8006K0890k4660K9819l7336M9346p1602J26233m98654p50005J137484
72b8120P02084n55088m84758P57641N63487p21124r04737L32137O16175m40242
82a62545p37781N79781J196398n3898j137695k89885Q03283K97355p09017l27570
92e41574O57606N01530m34868m63465K77504K54908n60894n26734N35855Q69625
102E69493q9663o30889P9809N76410j17465p24171j72570N10928J76161l81155
$$ plain form
112 -203112 -216130 373233 521996 -194737 -662043 -127186 447703 114953 -395074 -78677
122 -78677 538000 416319 -193909 -341394 -30032 -7590 -312563 -251104 253620 436524
132 436524 31719 -245706 24849 260090 -18116 -345626 -192154 163170 214415 38567
142 38567 -5652 58253 -36684 -218940 -153060 117235 161107 -75276 -127112 144378 263455
153 263455 -19594 -287922 -176891 70514 88386 -30191 16121 176306 138804 -87373
163 -87373 -143975 39295 94258 -113276 -215441 6341 233474 142366 -103659 -152574 18326
174 18326 123217 23486 -76524 4160 109104 44949 -64911 -38826 14775 -63922 -155247
185 -155247 -68729 111294 146662 17897 -48494 47422 109413 -2059 -102040 -31072 36144
$$ packed form
112b03112j3018N89363J48763p16733m67306N34857N74889l32750n10027L16397
122g8677O16677j21681o10228j47485L11362K2442l04973O1459N04724J82904
132D36524m04805k77425K70555K35241k78206l27510J53472L55324N1245j75848
142C8567m4219O3905r4937j82256O5880K70295M3872k36383n1836K71490J19077
153B63455k83049k68328J11031K47405J7872j18577M6312J60185l7502k26177
163h7373n6602J83270N4963k07534j02165K21782K27133r1108k46025m8915J70900
174A8326J04891r9731j00010Q0684J04944o4155j09860K6085N3601p8697r1325
185a55247Q6518J80023L5368j28765o6391R5916O1991j11472r9981P0968O7216
$$ plain form
196 36144 -49082 -98360 27392 106886 -32877 -164720 -41295 164798 132307 -72838 -96830
207 -96830 99229 156153 -50205 -175321 -30178 83943 -43419 -145907 1266 162123
217 162123 70775 -102455 -54612 131634 129685 -69682 -136996 21258 103587 -29963 -119491
228 -119491 -15146 62174 -22696 -73338 33752 112447 21781 -74049 -1770 105291 34946
239 34946 -113610 -86677 60814 56396 -76892 -65161 85291 98000 -46641 -78905 58705
250 58705 114145 -21979 -127344 -29780 96762 29758 -112048 -75509 73522 78174 -40193
261 -40193 -46887 61481 78483 -20999 -61693 4710 38074 -28970 -80062 -23310 46090 17050
273 17050 -34024 8451 70820 36825 -21487 5493 46443 -1409 -69195 -48642 12701 3389
$$ packed form
196C6144q5226m9278J25752P9494j39763j31843J23425K06093l2491k05145k3992
207i6830J96059N6924k06358j25116J45143J14121j27362j02488J47173J60857
217A62123r1348j73230M7843J86246j949j99367o7314J58254Q2329j33550q9528
228a19491J04345P7320q4870n0642J07090P8695r0666r5830P2279J07061p0345
239C4946j48556K6933J47491m418j33288J1731J50452J2709j44641l2264J37610
250E8705N5440j36124j05365R7564J26542o7004j41806L6539J49031M652j18367
261d0193o694J08368J7002r9482m0694O6403L3364o7044n1092N6752O9400k9040
273A7050n1074M2475O2369l3995n8312K6980M0950m7852o7786K0553O1343r312
$$ plain form
285 3389 -58808 -56177 28768 71670 14982 -24242 34174 81598 23899 -45612 -27359 14619
297 14619 -9360 -60851 -56360 -2867 25249 2276 -11542 26227 61872 41088 5664 6154 11903
310 11903 -9926 -32260 -34579 -34134 -34209 -23454 -5855 8361 16831 22822 34312 44887 31761 2941
324 2941 -3685 6023 -9708 -41971 -44453 -19638 -6565 -11142 -10294 8970 34855 39454 18188 5933
338 5933 17251 17598 -10150 -32828 -29623 -19524 -17981 -20361 -17678 -1341 21165 26596 15860 15562
352 15562 25610 22138 5255 -8529 -14465 -14056 -11497 -16158 -22183 -12005 6090 10260 5623 8073
366 8073 14006 15391 11206 517 -9602 -7465 -2152 -9098 -17399 -11447 193 4803 3995 2270 4659
381 4659 12931 15110 2893 -5923 674 5747 -2637 -10485 -7950 -792 2908 -1069 -7021 -2882 7477
$$ packed form
285C389o2197K631Q4945M2902n6688l9224N8416M7424n7699o9511J8253M1978
297A4619k3979n1491M491N3493K8116k2973j3818L7769L5645k0784l5424M90N749
310A1903k1829k2334k319M45p5J0755J7599J4216Q470N991J1490J0575j3126k8820
324B941o626R708j5731l2263k482K4815J3073m577Q48J9264K5885M599k1266j2255
338E933J1318L47k7748k2678L205J0099J543k380K683J6337K2506N431j0736k98
352A5562J0048l472j6883j3784n936M09K559m661o025J0178J8095M170m637K450
366H073N933J385m185j0689j0119K137N313o946q301N952J1640M610q08j725K389
381D659Q272K179j2217q816O597N073q384p848K535P158L700l977n952M139J0359
$$ plain form
396 7477 5240 -5710 -6014 2600 3952 -976 -2724 -785 2946 5993 3569 -1266 -596 2331 1246
411 1246 -1360 -3756 -6294 -3093 3857 2039 -5203 -1318 9098 7538 -2843 -4504 3101 4834 -4928
426 -4928 -13800 -8026 4640 2853 -9429 -6638 10014 14162 3056 84 8508 9622 398 -5322
440 -5322 -2158 -963 -7965 -12659 -4876 4377 -222 -6862 1949 12496 6016 -3912 1985 9311 -387
455 -387 -12708 -6770 6656 2332 -14303 -13160 8931 18045 966 -9248 7216 19963 5248
468 5248 -10887 -2989 7723 -2903 -16696 -8191 8636 4056 -13429 -10845 9988 14202 -3567
481 -3567 -9903 5689 12348 -1307 -8521 1991 5588 -8266 -13791 2997 15801 3140 -11735
494 -11735 -1082 17372 10413 -10898 -11180 5401 6335 -8265 -8620 5797 6315 -10152 -13624 3996
$$ packed form
396G477k237j0950l04Q614J352m928j748J939L731L047k424m835O70K927j085
411A246k606k396k538L201O950j818p242L885J0416j560j0381j661P605J733r762
426d928q872N774J2666j787j2282K791J6652M148j1106k972Q424J114r224n720
440e322L164J195p002m694P783R253m599o640Q811J0547o480r928N897P326r698
455c87j2321N938J3426m324j6635J143K2091R114j7079j0214J6464J2747j4715
468E248j6135P898J0712j0626j3793Q505J6827m580j7485K584K0833M214j7769
481c567o336J5592O659j3655p214J0512L597j3854n525J6788J2804j2661j4875
494a1735J0653J8454o959k1311k82J6581R34j4600l55J4417N18j6467l472J7620
$$ plain form
508 3996 13286 -938 -12277 491 15978 8755 -7719 -7372 2891 1540 -6084 -1522 9054 5998
522 5998 -5622 -4314 7747 7357 -7055 -12258 -111 8899 2776 -5089 -2583 861 -4037 -7527
536 -7527 -618 5944 1222 -4507 2152 11684 7243 -5530 -8315 -232 4506 1555 -686 1498 1938
551 1938 -1596 -2776 769 1369 -3896 -5291 2422 8415 4083 -3577 -5310 -2607 -1451 -1852 -1436 -164
567 -164 786 1131 2729 4622 2618 -2156 -2094 3591 6212 2447 -1651 -2292 -2264 -3147 -3495 -2682 -1300 -605
585 -605 -470 1891 4837 2150 -4375 -4061 2771 4472 -1164 -4396 -1027 1804 -1002 -4758 -2151 4590
601 4590 5510 951 2177 8352 5052 -6313 -7899 1255 3625 -4676 -7607 1020 6607 -942 -9746
616 -9746 -4530 6112 3554 -4971 1417 13148 5990 -10261 -7712 6591 3619 -11958 -9820 11148
$$ packed form
508C996R290j4224j1339J2768J5487p223j6474L47J0263j351p624M562J0576l056
522E998j1620J308J2061l90j4412n203J2147R010o123p865K506L444m898l490
536g527O909O562m722n729O659R532m441j2773k785Q083M738k951k241K184M40
551A938l534j180L545O00n265j395P713N993m332p660j733K703J156m01M16J272
567a64R50L45J598J893k004m774O2N685K621l765m098o41K8q83l48Q13J382O95
585f05J35K361K946k687o525L14O832J701n636l232L369K831k806l756K607O741
601D590R20m559J226O175l300j1365j586R154K370q301k931Q627N587p549q804
616i746N216J0642k558q525O388J1731p158j6251K549J4303k972j5577K138K0968
$$ plain form
630 11148 18271 -274 -13007 678 12736 -2726 -18062 -1868 18463 6114 -14960 -4769
642 -4769 15795 4428 -22737 -17763 13784 21057 -5029 -15230 9171 20927 -6110 -24211 -481
655 -481 19794 165 -17139 6563 29256 5232 -28939 -17220 16861 11932 -21530 -18802 20322
668 20322 26308 -11790 -23755 9772 20163 -15522 -28414 12012 37170 2365 -32439 -8672
680 -8672 27396 7919 -33689 -20672 27427 27882 -12594 -13609 24105 21668 -24833 -33457 11006
693 11006 28973 -9486 -32793 2835 34379 4553 -34439 -14136 26278 14054 -20254 -4372
705 -4372 33970 18688 -28408 -26584 15983 19682 -22432 -32715 12609 39911 5998 -26395 -2560
718 -2560 26106 1848 -29440 -7052 28160 11181 -26169 -17242 19350 15801 -23375 -29928 10247
$$ packed form
630A1148P123j8545j2733J3685J2058j5462j5336J6194K0331j2349k1074J0191
642d769K0564j1367k7165M974L1547P273k6086j0201K4401J1756k7037j8101K3730
655d81K0275j9629j7304K3702K2693k4024l4171J1719L4081m929l3462K728L9124
668B0322N986l8098j1965L3527J0391l5685j2892M0426K5158l4805l4804K3767
680h672L6068j9477m1608J3017M8099M55m0476j015L7714k437m6501q624M4463
693A1006J7967l8459k3307L5628L1544k9826l8992K0303M0414j2224l4308J5882
705d372L8342j5282m7096J824M2567L699m2114j0283M5324K7302l3913l2393K3835
718b560K8666k4258l1288K2388L5212j6979l7350Q927L6592l549l9176o553M0175
$$ plain form
731 10247 32387 5916 -15063 6586 23777 -1797 -26003 -7272 15799 577 -21298 -5776
743 -5776 23703 17351 -15688 -21542 7182 19497 -3501 -15917 6118 19616 -2114 -20308 -5078
756 -5078 10777 -3055 -20495 -6346 22219 22407 -4877 -14798 5784 16364 -4482 -19626 -3228
769 -3228 13654 3786 -10266 -2509 10723 3554 -14218 -12164 10011 17821 -1539 -13739 2119
782 2119 14828 -1112 -18366 -8750 8066 4746 -6212 -156 15229 11845 -8981 -13674 6421
795 6421 14236 -7029 -19128 1760 19098 2655 -16755 -6456 11825 5386 -12408 -7188 14877
808 14877 14942 -10268 -17085 6757 15937 -9263 -23288 425 21020 6292 -12657 -1970 16699
821 16699 8605 -13219 -10638 11291 11094 -13062 -16289 9079 15956 -9057 -19366 3406 18055
$$ packed form
731A0247K2140k6471k0979K1649J7191k5574k4206J8731K3071j5222k1875J5522
743e776K9479o352l3039n854K8724J2315k2998j2416K2035J3498k1730j8194J5230
756e078J5855j3832j7440J4149K8565J88k7284r921K0582J0580k0846j5144J6398
769c228J6882r868j4052P757J3232p169j7772K054K2175P810j9360j2200J5858
782B119J2709j5940j7254R616J6816l320j0958O056J5385l384k0826m693K0095
795F421P815k1265j2099K0888J7338j6443j9410J0299J8281o439j7794N220K2065
808A4877O5k5210o817K3842R180k5200j4025K3713K0595j4728j8949J0687J8669
821A6699q094k1824K581K1929j97k4156l227K5368O877k5013j0309K2772J4649
$$ plain form
834 18055 952 -14009 150 16940 5098 -15842 -9175 12534 7533 -16694 -13601 13970 17199
847 17199 -7945 -13879 8934 18271 -1636 -15566 -1185 14011 2188 -16473 -7887 12440 6636
860 6636 -14572 -10548 11969 12288 -7561 -9851 7739 12529 -3175 -12164 -324 10231 -228
873 -228 -12703 -2827 12639 5048 -10705 -3860 12305 7460 -8973 -7822 6502 8014 -5604 -10613
887 -10613 1467 9560 -1518 -11909 -1328 11417 3078 -9672 -2685 9884 5471 -6800 -5756
900 -5756 4705 6479 -2904 -6850 1732 8109 53 -7598 -497 7050 193 -7231 -1705 5277 1570
915 1570 -4677 -2970 2998 3341 -2635 -4511 2217 5628 -1328 -5640 1354 5797 -812 -5072 391
930 391 5114 1792 -2599 -1512 3138 3616 -2158 -4729 559 3596 -1939 -4993 111 2800 -862 -2671
$$ packed form
834A8055j7103j4961J4159J6790j1842k0940O667K1709n001k4227L093K7571L229
847A7199k5144n934K2813R337j9907j3930J4381J5196j1823j8661Q586K0327n804
860F636k1208M024K2517L19j9849k290J7590M790j5704q989J1840J0555j0459
873b28j2475R876J5466p591j5753O845J6165m845j6433J151J4324J512j3618n009
887a0613J2080Q093j1078j0391J0581J2745q339j2750O987J2569m413j2271J044
900e756J0461J774r383l946Q582O377q056p651P101P547o857p424N526O982l707
915A570o247J707N968L43n976j876O728L411o956m312O994M443o609m260N463
930C91M723l322m391J087M650M78n774k571N288L037n535l054N104K689l662j809
$$ plain form
946 -2671 142 1926 1299 -176 -679 941 1830 -901 -2174 692 1576 -1352 -1212 1771 1210 -740 268
963 268 1596 393 -323 -388 -704 -128 -74 -1936 -1805 580 290 -1415 -181 1531 680 561 1494 504 -342
982 -342 1076 1046 -1194 -984 835 297 -844 -701 11 912 1228 -836 -1852 1169 2167 -1516 -2843 528
1000 528 1027 -1791 -1743 597 852 -341 -599 710 2269 1540 -1131 -559 2529 1422 -2348 -949 2084
1017 2084 -117 -2919 24 2686 14 -2910 -1301 2566 2438 -1765 -3808 642 3524 -1205 -4133
1032 -4133 651 3506 -1496 -3421 2320 4856 -383 -3730 318 4662 1876 -3797 -3080 2608 2213
1047 2213 -3709 -2599 3762 1780 -5488 -2764 5925 4399 -4733 -5302 3337 6194 -1377 -6502 -269
1062 -269 5576 -69 -5998 1024 8387 725 -8076 -789 9365 3286 -8484 -5812 5537 6031 -4141
$$ packed form
946b671K813J784o27j475n03J620Q89k731j273K866Q84k928J40K983n61j950J008
963B68J328j203p16o5l16N76N4j862J31K385k90j705J234J712q51j19R33r90q46
982c42J418l0k240K10J819n38j141J43P12R01L16k064j016L021R98l683j327L371
1000E28M99k818M8K340K55j193k58J309J559p29k671N72L088j107l770J399L033
1017B084k201k802K943K662k672k924J609L867j28m203k043M450K882m729k928
1032d133M784K855n002j925N741K536n239l347M048M344k786n673P17N688l95
1047B213n922J110O361j982p268K724Q689j526r132n69Q639K857p571n125O233
1062b69N845n645n929P022P363p662q801P287J0154o079j1770K672J1349M94j0172
$$ plain form
1077 -4141 -6765 2334 4984 -4376 -6822 4607 8625 -3917 -9534 3412 11510 -150 -11189 -3494
1091 -3494 8183 4003 -6414 -3097 7728 4692 -7624 -5135 8941 7231 -9305 -10340 7157
1104 7157 12511 -2948 -11908 -1182 8247 400 -8421 -1022 8939 2286 -8566 -1332 11486 4049
1118 4049 -12418 -8738 8659 10317 -3780 -7854 2907 7218 -2125 -7146 1388 6387 -3140 -8693
1132 -8693 3132 12309 904 -13006 -6618 7371 5709 -5278 -5069 4476 6263 -1275 -3259 2983
1146 2983 2908 -6406 -7653 4633 11051 1007 -8182 -2808 5662 3061 -4175 -4321 564 2439 764
1161 764 1544 3276 -620 -7352 -6096 2480 5665 127 -3274 405 4805 4101 44 -3892 -4714 -1779
1177 -1779 2283 4105 2981 137 -2550 -2438 -262 1062 106 -2206 -2740 1893 7893 5756 -4406
$$ packed form
1077d141k624R099K650r360k446J1429M018j2542n617J2946Q098j1660j1039P695
1091c494J1677m180j0417L317J0825l036j2316K489J4076j710j6536j035J7497
1104G157N354j5459q960J0726R429p847q821P399R961o653j0852P234J2818p437
1118D049j6467L680J7397J658j4097m074J0761M311r343n021Q534M999r527n553
1132h693J1825R177j1405j3910O388J3989j662j0987K09R545J787p538j984O242
1146B983p5r314j247J2286O418j0044r189N374Q470k601p236j46M885J875j675
1161G64P80J732l896o732J256Q576L185n538l401L679M400p04m057l936q22K935
1177a779M062J822j124k844k687J12K176J324r56k312n34M633O000k137j0162
$$ plain form
1192 -4406 -9420 -3504 2849 971 -2175 1005 4616 2146 -1229 896 3271 -2682 -9389 -2797 10429
1207 10429 10019 -3976 -9010 447 5218 -3309 -8385 -247 6363 1707 -2235 4773 8790 -3431
1221 -3431 -15542 -6569 10133 7628 -7127 -6084 8841 10131 -4663 -9773 952 4987 -4735
1234 -4735 -5864 9255 15022 -2247 -16064 -4198 10849 1894 -13994 -6306 12771 11785 -4258
1247 -4258 -6098 5374 3107 -11852 -10727 8794 14875 -2609 -11902 3425 14433 -841 -16895
1260 -16895 -6783 10662 6928 -5613 -430 11465 4032 -13420 -10881 7119 8587 -8279 -10731
1273 -10731 8475 16703 -475 -13957 -3825 7482 -827 -9715 929 13509 5028 -9734 -4723
1286 -4723 9326 4713 -12339 -11319 7695 13665 -573 -8187 1937 7162 -4241 -11038 -281
$$ packed form
1192d406n014N916O353j878l146L180L611k470l375K125K375n953o707O592J3226
1207A0429m10j3995n034R457M771q527n076Q138O610m656l942P008M017j2221
1221c431j2111Q973J6702k505j4755J043J4925J290j4794n110J0725M035r722
1234d735j129J5119N767j7269j3817J1866J5047q955j5888P688J9077r86j6043
1247d258j840J1472k267j4959J125J9521O081j7484r293J5327J1008j5274j6054
1260a6895J0112J7445l734j2541N183J1895p433j7452K539J8000J468j6866k452
1273a0731J9206Q228j7178j3482J0132J1307q309q888J0644J2580q481j4762N011
1286d723J4049m613j7052J020J9014N970j4238p614J0124N225j1403o797J0757
$$ plain form
1299 -281 9093 1087 -7764 678 11664 4083 -11161 -9430 4843 7366 -3108 -4840 5581 7857
1313 7857 -2513 -7049 1015 5124 -3186 -7935 1353 10201 3816 -7034 -5108 3947 3036 -5245 -4962
1328 -4962 3508 5177 -1333 -2870 2937 3793 -3351 -6837 -222 6114 2603 -3518 -1507 4316 3063
1343 3063 -3011 -3531 899 1605 -1676 -1443 2632 3004 -1384 -3842 -661 2820 751 -2991 -1644 2599
1359 2599 2756 -825 -1679 407 589 -1227 -1263 1093 2265 433 -1333 -8 2392 1118 -2302 -2438
1375 -2438 581 1616 -294 -1226 13 888 -10 -1084 -565 827 511 -1155 -684 1797 1818 -804 -1876
1392 -1876 39 1084 -24 -826 -116 1165 1177 -238 -610 602 421 -1380 -1621 582 1226 -403 -1114
1409 -1114 95 1007 325 -912 -798 574 1051 -286 -760 613 1116 -853 -1317 396 1176 170 -455
$$ packed form
1299b81R374q006q851Q442J0986p581j5244J731J4273K523j0474j732J0421K276
1313G857j0370m536Q064M109q310m749R288Q848o385j0850J926R055r11q281K83
1328d962Q470J669o510j537N807Q56p144l486O615O336l511o121K011N823j253
1343C063o074n20M430P06l281K33M075L72m388k458L181L481k069l742J347M243
1359B599J57l581q54K086J82j816l6K356J172j832j766J325K400j274l420j36
1375b438L019J035j910r32J239Q75q98j074N19J392l16j666M71K481K1k622j072
1392a876J915J045j108q02P10J281J2j415l72J212j81j801k41K203O44j629p11
1409a114J209R12o82j237J14J372M77j337m74J373N03j969m64J713P80j006o25
$$ plain form
1426 -455 211 1034 844 -492 -1434 -383 449 -814 -1469 33 968 -94 -667 186 963 589 -158 -402
1444 -402 515 1115 -181 -1480 -411 773 -382 -1105 334 1398 795 100 325 756 671 -512 -1626
1461 -1626 -459 418 -877 -1995 -251 1116 35 -755 553 1632 1215 253 -187 528 827 -787 -2094
1478 -2094 -672 750 -626 -1777 202 1698 802 -81 410 1034 811 -398 -1365 -395 474 -1084 -2345
1495 -2345 -305 1134 -139 -862 970 1967 1110 203 267 840 705 -817 -1687 -298 529 -1101 -1712 365
1513 365 1378 -221 -680 703 1160 413 -489 -655 241 479 -1025 -1694 130 994 -558 -1004 836 1394
1531 1394 107 -139 520 691 342 -303 -734 176 587 -761 -1299 316 523 -972 -963 473 471 -365 -48
1550 -48 414 559 638 114 -308 558 696 -694 -813 357 182 -999 -500 385 70 60 528 403 540 853
$$ packed form
1426d55O66Q23j90j336r42J051Q32j263o55J502R35j062n73Q53P77l74p47k44
1444d02R17O00j296j299J069J184j155p23J439J064o03o95K25M31q5j183j114
1461a626J167Q77j295j118J744J367j081p90J308J079m17r62m40P15K99j614j307
1478b094J422J422j376j151J979J496q96q83M91O24k23j209r67R70Q69j558j261
1495b345K040J439j273p23J832R97q57r07O4N73j35j522q70J389Q27j630o11K077
1513C65J013j599m59J383M57p47r02j66Q96K38j504o69J824Q64j552m46J840N58
1531A394j287k46O59J71l49o45m31R10M11j348n38J615K07j495RJ436kq36L17
1550d8M62J45P9n24m22Q66J38j390j19J170j75j181M99Q85l15j0M68j25J37L13
$$ plain form
1570 853 148 -520 52 -65 -1231 -1125 -404 -684 -643 314 564 403 1240 1535 751 555 1010 250 -998 -767
1590 -767 -953 -1213 -1004 -777 -783 124 1151 536 477 1686 1279 -446 -400 270 -665 -1668 -1401 -870 -410 -231
1610 -231 -182 483 1927 1715 282 1009 2175 376 -1650 -814 97 -1171 -2274 -1309 47 483 64 52
1628 52 1383 2345 586 -807 941 1558 -1238 -2797 -362 639 -1135 -1706 114 1462 928 -8 512
1645 512 2086 1339 -1584 -1598 1309 504 -3145 -2571 1131 1193 -1672 -979 1809 2229 26 -927 1231 2306
1663 2306 -459 -3126 -623 2732 -140 -3558 -514 3189 1115 -1808 -36 2863 1182 -2032 -1629
1678 -1629 1692 1476 -2920 -3739 1350 3431 -1294 -3168 1924 4125 -573 -2951 934 2923 -979
1693 -979 -4026 -874 3352 1000 -4066 -2228 4143 3479 -2740 -2303 3800 3248 -2864 -3255 1917 2173
$$ packed form
1570H53p05o68N72j17j166J06P21k80M1R57K50j61Q37K95p84j96M55p60j248K31
1590g67j86k60K09K27oR07J027o15n9J209m07j725M6O70r35j003K67N31M60J79
1610b31M9O65J444k12j433P27J166j799k026Q36R11j268j103R65J356M36m19j2
1628E2J331R62j759j393J748O17k796j559K435J001j774n71J820J348n34r36N20
1645E12J574p47k923j4K907q05l649N74L702O2k865O93K788M20k203r53K158J075
1663B306k765k667K503L355k872l418L044L703k074k923J772K899j681l214M03
1678a629L321k16m396q19N089K081m725j874N092K201m698k378L885J989l902
1693i79l047L152M226k352n066J838O371o64o219M37O103n52o112l91N172K56
$$ plain form
1709 2173 -3360 -4765 981 4722 328 -3945 506 5908 1957 -4173 -1198 4070 666 -4752 -1894
1724 -1894 3583 1316 -4518 -3463 3082 4540 -1291 -3490 2581 5629 -366 -4651 -205 2578 -2527
1739 -2527 -5407 5 4451 995 -3441 -718 4397 3081 -2650 -2938 2671 3467 -1746 -2462 1908 1516
1755 1516 -3841 -4097 1275 3105 -286 -1861 1662 4423 1843 -2682 -2402 564 -331 -2535 -52 2899
1771 2899 744 -2353 -650 1690 227 -1914 -1123 1308 2565 1745 399 -107 -1144 -2754 -1800 578
1787 578 539 -1225 366 2973 1435 -1519 -1349 -566 -1553 -1262 1846 3847 1760 -1540 -1151 1567 506
1804 506 -4100 -3708 1853 3708 -190 -837 3044 1982 -3973 -4365 2107 4477 -617 -3570 1630 5937
1820 5937 244 -7216 -4317 2755 884 -4570 -9 8062 4624 -4448 -3484 4639 3579 -5958 -7032
$$ packed form
1709B173n533j405N746L741m394m273M451N402l951o130K975N268l404n418K858
1724a894N477k267n834J055O545J458n831k199O071L048n995m285M446K783n105
1739b527k880N412M446l456m436K723N115j316n731k88N609P96n213p16M370l92
1755A516n357k56N372J830l391j575L523K761k580m525K80K966q95k204K483K951
1771B899k155l097J703K340j463k141P91K431J257q20j346n06j037j610R54K378
1787E78l9j764J591K607j538k954J70P83r87K91L108K001k087l300L89K718j061
1804E06m606L92N561J855l898o47L881j062n955l92O472K370n094k953N200M307
1820E937n693p460K899P072j871n454M561Q071l438r072R64Q123j060r537j074
$$ plain form
1835 -7032 3238 7921 -1007 -7223 -58 5858 -2015 -8379 626 9687 3098 -6067 -653 8673 2928
1850 2928 -9866 -8853 3893 6132 -4594 -6137 5941 9374 -3006 -8347 2974 8993 -1927
1863 -1927 -9579 874 10895 2166 -10626 -6022 6472 3763 -8514 -5833 8794 9379 -4266
1876 -4266 -6109 6606 8358 -6170 -11808 1222 9609 -468 -9978 -1149 9951 3000 -9317
1889 -9317 -4048 8999 5391 -7410 -4730 8638 7383 -7335 -10042 2765 7507 -3673 -9552
1902 -9552 1517 10802 2136 -7791 -784 8965 1743 -9634 -4182 8050 5155 -6954 -6260 5555
1916 5555 7143 -4451 -8291 2365 8366 -539 -6805 1535 8449 -21 -8904 -2941 6267 2241
1930 2241 -7004 -3859 6479 6477 -3486 -5802 2779 5580 -2841 -6428 1787 6955 -71 -5963 -505
$$ packed form
1835g032J0270M683q928o216P165N916p873o364R005R061o589r165N414R326n745
1850B928j2794J013J2746K239j0726j543J2078L433j2380n341J1321O019j0920
1863a927p652J0453J0021q729j2792M604J2494k709j2277K681J4627N85j3645
1876d266j843J2715J752j4528n638J3030Q387j0077r510Q829J1100o951j2317
1889i317N269J3047l608j2801K680J3368j255j4718k707J2807M742j1180n879
1902i552J1069R285q666r927P007R749p222j1377N452J2232k895j2109O94J1815
1916E555J588j1594l840J0656O001q905o266Q340O914q470q883N963R208m026
1930B241r245L145J0338kr963k316Q581K801q421l587Q215N168p026n892N458
$$ plain form
1945 -505 5677 1104 -6194 -3356 4818 4741 -2661 -3878 2751 4275 -2709 -5693 560 4534 -151 -3911
1961 -3911 452 5297 1835 -4307 -3297 2562 2937 -2585 -3466 2330 4344 -1019 -3937 154 3347
1976 3347 -186 -3510 -386 4123 2406 -2926 -3094 1715 2320 -2567 -3913 1283 4211 273 -2651
1991 -2651 426 3545 575 -3627 -1881 2940 2443 -2444 -2870 2182 3292 -1906 -4082 658 3644
2006 3644 76 -2957 224 3873 1169 -3768 -2573 2445 2123 -2897 -2949 2656 3993 -1125 -3436 825
2022 825 3520 -401 -3601 -229 3873 1478 -3344 -1864 2846 1955 -3336 -3166 2404 3462 -1303 -3074
2038 -3074 1260 3359 -737 -3912 -563 3387 1078 -3012 -983 3523 2026 -3043 -2806 2152 2439
2053 2439 -1906 -2729 1595 3386 -567 -3209 -165 2940 180 -3189 -754 3206 1549 -2677 -1822
$$ packed form
1945e05O182m573p298K838Q174p7p402j217O629J524o984k984O253L974m685l760
1961c911M363M845l462o142J010N859L75n522q81N796K014n363k918M091L193
1976C347l533l324L124M509j717n332j68M809O05m887j346N196K928l938k924
1991b651L077L119k970m202J746M821m97m887m26N052J110n198k176M740K986
2006C644l568l033L181L649k704m937J195N018l22n020n2N605J337n118k311M261
2022H25K695l921l200L372M102k395m822J480M710q91n291J70N570J058m765j771
2038c074M334K099m096l175L349L950k309m090K029M506j497n069K37M958K87
2053B439m345q23M324J791l953k642L044L105k760l369K435L960j657m226Q55
$$ plain form
2068 -1822 2061 1582 -2227 -2423 1610 3030 -240 -2021 758 2766 -63 -3045 -840 2478 828
2083 828 -2515 -1216 2091 1462 -1982 -1943 1337 2263 -750 -1847 902 2359 -390 -2608 -683 1635
2099 1635 24 -2153 -505 2081 1458 -1182 -994 1359 1510 -1079 -1557 771 1654 -539 -1997 -96
2115 -96 1334 -278 -1750 -249 1751 984 -925 -465 1215 870 -1131 -1298 575 1013 -688 -1286 365
2132 365 1168 -305 -1183 144 1228 394 -840 -175 987 324 -1065 -896 378 310 -690 -510 661
2149 661 770 -189 -499 353 649 -203 -462 199 613 -38 -693 -187 257 -27 -480 0 439 220 -240 -26
2169 -26 263 33 -459 -320 166 124 -210 -52 168 -3 -175 -1 272 169 -182 51 360 251 -285 -199 172
2190 172 -6 -282 -155 425 180 -478 -260 314 155 -472 -405 217 445 -206 -457 219 507 -207 -541 261
$$ packed form
2068a822L883m79l809j96M033J420l270j781K779K008k829k982K205L318j650
2083H28l343J299L307o29l444L9L280R26l013j097K749J457k749k218J925K318
2099A635j611k177J648K586o23k640J88K353J51k589m78K328Q83k193j458J901
2115i6J430j612j472J501K000p67j909M60J680l45k001j67J873M38j701n98J651
2132C65Q03j473q78J327J084q34j234O65J162o63j389J69J274o8j000J80J171
2149F61J09r59l10Q52K96q52k59O61M14o51o55N06M44k84m53M80M39k19m60K14
2169b6K89k30m92J39M86m2l34J58K20j71j72J74K73j03l51K33L09j09n36Q6L71
2190A72j78k76J27N80k45o58K18N74j59o27O7O22K28o51k51O76K88p14l34Q02
$$ plain form
2210 261 590 -110 -642 110 679 128 -589 -166 562 211 -569 -248 615 330 -659 -512 583 591 -676 -722
2230 -722 537 727 -380 -650 189 652 -126 -601 139 902 69 -755 -47 1037 277 -839 -409 719
2248 719 386 -699 -505 430 408 -465 -603 484 707 -579 -831 421 881 -152 -823 99 848 -83 -695
2267 -695 -21 702 86 -691 -43 822 362 -858 -538 790 590 -647 -614 486 480 -403 -468 336 491 -309
2287 -309 -610 288 949 -27 -931 -146 916 255 -759 -235 775 84 -639 -95 582 313 -724 -490 508
2306 508 606 -487 -863 202 680 -102 -646 239 646 -144 -497 337 639 5 -589 -67 655 377 -481 -420
2326 -420 406 508 -344 -161 524 369 -479 -449 457 212 -427 -556 22 371 179 -366 -112 404 176 -313
2346 -313 51 459 -46 -432 -10 382 -22 -370 -272 71 443 138 -201 122 402 -116 -282 129 169 -498 -412
$$ packed form
2210B61L29p00n32P52N69n51p17M23P28l51p80L21Q63k85r89J47J095Qj267m6
2230g22J259J90j107k70Q39M63p78m75P40P63q33q24P08J084p60j116M30J128
2248G19l33j085J94R35k2q73j38J087K23j286k52J252M60j033o71R22P49r31o12
2267f95O74P23o16p77O48Q65m60j220L20J328k00j237L3J100oq83o5Q04J55q00
2287c09l01Q98O61r76r04P85J062o61j014N24J010o91p23N44O77k69j037K34R98
2306E08R8j093l76J065M78p82n44Q85M07p90l53Q34L02o34n94N22P22k78q58O1
2326d20Q26J02q52J83O85j55q48L0R06k45o39j29N78L49j92n45K54N16k28m89
2346c13L64M08n05l86M22L92m04l48R8L43L72l05l39L23K80n18j66M11M0o67Q6
$$ plain form
2367 -412 151 189 -76 -93 -139 139 374 149 -41 196 228 -191 -91 184 -41 -427 -261 132 -13 -6 13 -56 103
2390 103 240 -32 -93 151 -17 -481 -189 301 -62 -318 -167 165 72 102 119 82 303 199 -143 -105 172 -195
2412 -195 -605 -197 295 -206 -380 -106 234 258 51 -29 75 419 65 -356 52 546 -96 -668 162 547 -74
2433 -74 -400 -90 511 374 -182 -275 287 459 -336 -805 140 448 -375 -740 201 753 -98 -665 -29 591 258
2454 258 -528 -436 614 585 -563 -728 656 825 -635 -873 467 977 -292 -758 222 897 84 -1008
2472 -1008 -389 1006 559 -1040 -524 1129 667 -1003 -828 806 930 -490 -679 559 1207 -44 -1116
2489 -1116 -51 1269 99 -1478 -401 1394 526 -1365 -711 1048 622 -893 -1009 742 1267 -393
2505 -393 -1155 239 1436 -250 -1606 -73 1425 149 -1297 -188 1337 697 -932 -707 810 1025
$$ packed form
2367d12N63L8k65j7m6K78K35k25j90K37L2m19J00K75k25l86J66L93j45PJ9o9J59
2390A03J37k72o1K44j68m64K92M90l63k56J51L32r3L0J7l7K21j04l42L8K77l67
2412a95m10M08M92n01j74K74L40K4k07q0J04L44l54m21M08M94o42n72Q30L85o21
2433g4l26L10O01j37n56r3N62J72p95m69R45L08q23l65R41N52q51n67O36O20l33
2454B58p86R2J050k9j148j65J384J69j460k38J340N10j269m66R80O75q13j092
2472a008O19J395m47j599N16J653m62j670J75J634J24j420j89J238O48j251j072
2489a116J065J320j170j577J077J795q68j891O54J759m26j515j16J751N25j660
2505c93p62J394J197j686j356J533J498j276j446J109J525o40j629K25J517K15
$$ plain form
2521 1025 -677 -1210 546 1298 -508 -1605 236 1214 -264 -1329 3 1268 493 -830 -452 980
2537 980 798 -929 -1152 625 1136 -641 -1037 586 1275 -366 -1165 -21 951 168 -843 -401 893
2554 893 724 -873 -1039 531 732 -770 -862 575 1090 -106 -603 24 742 47 -868 -458 818 733 -470
2573 -470 -604 688 581 -608 -835 236 716 2 -445 -42 691 236 -847 -668 571 633 -466 -351
2591 -351 758 865 -270 -776 -48 446 -18 -573 -244 890 622 -637 -588 434 475 -644 -636 503 884
2610 884 -84 -761 -122 504 64 -853 -505 918 840 -490 -501 689 548 -757 -830 252 762 -2 -574
2629 -574 -22 672 182 -952 -541 826 708 -697 -554 715 585 -600 -946 256 625 -87 -629 76
2647 76 1037 313 -961 -513 876 477 -749 -419 880 709 -617 -897 87 659 -247 -882 65 1179
$$ packed form
2521A025j702n33J756P52j806j097J841R78j478j065J332J265p75j323L78J432
2537I80j82j727k23J777N11j777l96J623O89j641p99J144R72p83j011M42J294
2554H93j69j597j66J570K01j502r2J437N15j196m97O27P18o95r15M10J276q5j203
2573d70j34J292j07j189k27J071M80p14m47M03P33m55j083J79J239O2j099J15
2591c51J109J07j135n06P28M94m64n55L29J134k68j259M9J022M1j119QJ139L81
2610H84r68o77O39O26m40r17L48J423p8j330j1J190j41j305p3J082N10p64n72
2629e74N52O94m90j134M11J367j18j405J43J269j30j185l46J202L69p12n42P05
2647G6R61p24j274M48J389l99j226L30J299j71j326k80R84N72r06o35R47J114
$$ plain form
2665 1179 344 -1003 -397 846 249 -828 -432 918 735 -393 -615 191 573 -341 -900 239 1166 321
2683 321 -799 -212 854 25 -1026 -511 701 658 -346 -459 347 646 -442 -1095 55 918 78 -731
2701 -731 191 983 60 -996 -524 420 362 -510 -244 750 823 -386 -917 76 531 -327 -788 375 931 159
2721 159 -655 -229 349 -72 -676 -368 815 791 -187 -398 406 422 -611 -698 250 723 4 -310 141 373
2741 373 -192 -651 -292 424 248 -305 -62 566 329 -518 -455 304 95 -317 -149 431 332 -13 -183 -20 254
2762 254 -155 -327 105 518 88 -293 -31 247 -215 -355 -9 139 65 -35 153 202 -97 -236 -78 225 227
2783 227 -284 73 419 104 -378 -110 295 -50 -207 -12 377 202 -258 -169 190 162 -374 -396 247 308 -284
2804 -284 -432 194 299 -331 -514 238 351 -97 -320 83 486 -101 -468 -132 534 152 -600 -150 634 174
$$ packed form
2665A179q35j347O06J243n97j077L96J350j83j128k22Q06L82r14n59J139R27q45
2683C21j120N87J066q29j051N15J212m3j004j13Q06K99j088o53J150Q63q40q09
2701g31R22P92r23j056M72R44n8q72K66R94P3j209n31R93M55q58m61J163N56p72
2721A59q14M26N78m21o04L08J183k4r78k11Q04J6j033q7R48M73p19l14M51K32
2741C73n65m59L59P16j76n53K43O28k37q47O3P59k09m12J68N80r9l45j70J63K74
2762B54m09j72M32M13m30l81K62K78m62j40L46J48p4j00J88M9k99j39J58L03K
2783B27n11L57L46l15m82K68M05l45j57J95L89j75m60Q9L59k8n36k2O43O1n92
2804b84j48O26J05o30j83P52J13m48k23M03M03n87l67L36O66l82p52M50P84m60
$$ plain form
2824 174 -644 -313 551 375 -478 -412 418 548 -381 -480 355 675 -188 -648 306 752 7 -681 67 745 71
2845 71 -626 -86 601 158 -701 -302 679 436 -645 -658 562 672 -541 -673 409 611 -442 -792 306
2864 306 792 -45 -756 130 822 115 -867 -204 866 307 -968 -333 851 439 -711 -490 648 511
2882 511 -577 -696 442 775 -426 -841 331 915 -216 -853 224 965 -63 -860 45 848 164 -910
2900 -910 -325 747 481 -828 -554 683 561 -780 -680 615 761 -628 -861 451 824 -353 -918
2917 -918 173 921 -71 -859 20 978 198 -915 -278 889 424 -851 -335 883 597 -701 -629 574
2935 574 703 -496 -822 428 938 -294 -819 189 897 -147 -910 -4 835 153 -862 -207 738 373
2953 373 -788 -484 613 466 -542 -624 624 609 -645 -741 356 619 -315 -697 209 674 -217 -756 -38
$$ packed form
2824A74q18L31Q64j76q53O6Q30J30r29r9Q35L20q63m60R54M46p45o88P48O78o74
2845G1o97N40O87m43q59L99R81k43j081j3J220J10j213j32J082K02j053l50J098
2864C06M86q37p11Q86O92p07r82O63J070n59j275O35J184m12j150K21J138j37
2882E11j088j19J138L33j201m15J172N84j131o37J077P41j028p97R05Q03o84j074
2900i10N85J072k66j309K74J237j22j341J00J295J46j389k33J312L73j177n65
2917i18J091P48r92p88Q79R58p80j113O37J167m65j275N16J218k86j298P2J203
2935E74J29j199l26J250N10j232n25J008P08j044p63R06Q39o82j015O55R45l65
2953C73j161L04J097j47j008q2J248j5j254r6J097K63r34l82R06M65q91n39P18
$$ [...]
8191G4
##END NTUPLES=NMR FID
##END=
