##TITLE=1H ikalashn
107-2024
11.12.2024
##JCAMPDX= 6.0         $$ Bruker NMR JCAMP-DX V2.0
##DATA TYPE= NMR FID
##DATA CLASS= NTUPLES
##ORIGIN= UXNMR, Bruker Analytische Messtechnik GmbH
##OWNER= root
$$ TOPSPIN		Version 1.3
$$ 2024-12-11 11:18:28.062 +0400  Irina@DPX200
$$ Compression mode = diff/dup
##.OBSERVE FREQUENCY= 200.131300845
##.OBSERVE NUCLEUS= ^1H
##.DELAY= (6, 6)
##.ACQUISITION MODE= SIMULTANEOUS
##.ACQUISITION SCHEME= undefined
##.AVERAGES= 16
##.DIGITISER RES= 18
##SPECTROMETER/DATA SYSTEM= spect
##.PULSE SEQUENCE= zg
##.SOLVENT NAME= CDCl3
##.SHIFT REFERENCE= INTERNAL, CDCl3, 1, 17.49637
##AUDIT TRAIL= $$ (NUMBER, WHEN, WHO, WHERE, WHAT)
$$ ##TITLE= Audit trail, TOPSPIN		Version 1.3
$$ ##JCAMPDX= 5.01
$$ ##ORIGIN= Bruker BioSpin GmbH
$$ ##OWNER= Irina
$$ $$ F:/spectra/data/iren/nmr/1H/4/audita.txt
$$ ##AUDIT TRAIL=  $$ (NUMBER, WHEN, WHO, WHERE, VERSION, WHAT)
(   1,<2024-12-11 11:17:59.234 +0400>,<Irina>,<DPX200>,<TOPSPIN 1.3>,
      <created by zg
	started at 2024-12-11 11:16:51.031 +0400,
	POWCHK disabled, PULCHK disabled
       configuration hash MD5:
       BE 6D 3F 07 2A EA 11 49 91 17 2B D3 AF B3 58 0D
       data hash MD5: 16K
       81 04 82 30 B7 AD 0E 65 AF CD 68 BF AF F1 A5 ED>)
$$ ##END=
$$ 
$$ $$ hash MD5
$$ $$ 7C F6 91 53 DC 09 04 B3 93 36 39 71 43 DF 8F 44
##$RELAX= 
##$RELAX= 
##$RELAX= 
##$RELAX= 
##$RELAX= 
##$RELAX= 
##$RELAX= 
##$RELAX= 
##$RELAX= 
$$ Bruker specific parameters
$$ --------------------------
##$DU= <F:/spectra>
##$EXPNO= 4
##$NAME= <1H>
##$PROCNO= 1
##$TYPE= <nmr>
##$USER= <iren>
##$AMP= (0..31)
100 100 100 100 100 100 100 100 100 100 100 100 100 100 100 100 100 100 
100 100 100 100 100 100 100 100 100 100 100 100 100 100 
##$ANAVPT= -1
##$AQSEQ= 0
##$AQ_mod= 1
##$AUNM= <au_zg>
##$AUTOPOS= <>
##$BF1= 200.13
##$BF2= 200.13
##$BF3= 200.13
##$BF4= 200.13
##$BF5= 200.13
##$BF6= 200.13
##$BF7= 200.13
##$BF8= 200.13
##$BYTORDA= 1
##$CFDGTYP= 0
##$CFRGTYP= 5
##$CHEMSTR= <none>
##$CNST= (0..63)
1 1 145 1 1 1 1 1 1 1 1 1 1 1 1 1 1 1 1 1 1 1 1 1 1 1 1 1 1 1 1 1 1 1 
1 1 1 1 1 1 1 1 1 1 1 1 1 1 1 1 1 1 1 1 1 1 1 1 1 1 1 1 1 1 
##$CPDPRG= <>
##$CPDPRG1= <>
##$CPDPRG2= <>
##$CPDPRG3= <>
##$CPDPRG4= <mlev>
##$CPDPRG5= <mlev>
##$CPDPRG6= <mlev>
##$CPDPRG7= <mlev>
##$CPDPRG8= <mlev>
##$CPDPRGB= <>
##$CPDPRGT= <>
##$D= (0..63)
0 2 0 0 0 0 0 0 0 0.06 0 0.03 0 0 0 0 0.0002 0 0 0 0 0 0 0 0 0 0 0 0 0 
0 0 0 0 0 0 0 0 0 0 0 0 0 0 0 0 0 0 0 0 0 0 0 0 0 0 0 0 0 0 0 0 0 0 
##$DATE= 1733901476
##$DBL= (0..7)
120 120 120 120 120 120 120 120 
##$DBP= (0..7)
150 150 150 150 150 150 150 150 
##$DBP07= 0
##$DBPNAM0= <>
##$DBPNAM1= <>
##$DBPNAM2= <>
##$DBPNAM3= <>
##$DBPNAM4= <>
##$DBPNAM5= <>
##$DBPNAM6= <>
##$DBPNAM7= <>
##$DBPOAL= (0..7)
0.5 0.5 0.5 0.5 0.5 0.5 0.5 0.5 
##$DBPOFFS= (0..7)
0 0 0 0 0 0 0 0 
##$DE= 6
##$DECBNUC= <off>
##$DECIM= 32
##$DECNUC= <off>
##$DECSTAT= 4
##$DIGMOD= 1
##$DIGTYP= 9
##$DL= (0..7)
0 120 120 120 120 120 120 120 
##$DP= (0..7)
150 150 150 150 150 150 150 150 
##$DP07= 0
##$DPNAME0= <>
$$ [...]
##$SW= 21.9926040160658
##$SWIBOX= (0..15)
0 0 2 0 0 0 0 0 0 0 0 0 0 0 0 0 
##$SW_h= 4401.40845070422
##$TD= 16384
##$TD0= 1
##$TE= 300
##$TE2= 300
##$TE3= 300
##$TEG= 300
##$TL= (0..7)
0 120 120 120 120 120 120 120 
##$TP= (0..7)
150 150 150 150 150 150 150 150 
##$TP07= 0
##$TPNAME0= <>
##$TPNAME1= <>
##$TPNAME2= <>
##$TPNAME3= <>
##$TPNAME4= <>
##$TPNAME5= <>
##$TPNAME6= <>
##$TPNAME7= <>
##$TPOAL= (0..7)
0.5 0.5 0.5 0.5 0.5 0.5 0.5 0.5 
##$TPOFFS= (0..7)
0 0 0 0 0 0 0 0 
##$TUNHIN= 0
##$TUNHOUT= 0
##$TUNXOUT= 0
##$USERA1= <user>
##$USERA2= <user>
##$USERA3= <user>
##$USERA4= <user>
##$USERA5= <user>
##$V9= 5
##$VALIST= <valist>
##$VCLIST= <CCCCCCCCCCCCCCC>
##$VD= 0
##$VDLIST= <DDDDDDDDDDDDDDD>
##$VPLIST= <PPPPPPPPPPPPPPP>
##$VTLIST= <TTTTTTTTTTTTTTT>
##$WBST= 1024
##$WBSW= 25
##$XGAIN= (0..3)
0 0 0 0 
##$XL= 0
##$YL= 0
##$YMAX_a= 527289
##$YMIN_a= -695338
##$ZGOPTNS= <>
##$ZL1= 120
##$ZL2= 120
##$ZL3= 120
##$ZL4= 120
##$ABSF1= 10
##$ABSF2= 0
##$ABSG= 5
##$ABSL= 3
##$ALPHA= 0
##$AQORDER= 0
##$ASSFAC= 0
##$ASSFACI= 0
##$ASSFACX= 0
##$ASSWID= 0
##$AUNMP= <proc_1d>
##$AXLEFT= 0
##$AXRIGHT= 0
##$AXTYPE= 0
##$AXUNIT= <>
##$AZFE= 0.1
##$AZFW= 0.1
##$BCFW= 1
##$BC_mod= 2
##$BYTORDP= 1
##$COROFFS= 0
##$CY= 7568.61572265625
##$DATMOD= 1
##$DC= 2
##$DFILT= <>
##$DTYPP= 0
##$F1P= 17.9538593292236
##$F2P= -4.03888763876832
##$FCOR= 0.5
##$FTSIZE= 32768
##$FT_mod= 4
##$GAMMA= 1
##$GB= 1
##$INTBC= 1
##$INTSCL= 1
##$ISEN= 128
##$LB= -0.5
##$LEV0= 0
##$LPBIN= 0
##$MAXI= 945.577
##$MC2= 0
##$MEAN= 0
##$ME_mod= 0
##$MI= -402.1523
##$NCOEF= 0
##$NC_proc= 0
##$NLEV= 6
##$NOISF1= 8.587773
##$NOISF2= 6.764455
##$NSP= 1
##$NTH_PI= 0
##$NZP= 0
##$OFFSET= 17.49637
##$PC= 1
##$PHC0= 341.3103
##$PHC1= -13.36521
##$PH_mod= 0
##$PKNL= yes
##$PPARMOD= 0
##$PPDIAG= 0
##$PPIPTYP= 0
##$PPMPNUM= 100
##$PPRESOL= 1
##$PSCAL= 0
##$PSIGN= 0
##$REVERSE= no
##$SF= 200.13
##$SI= 32768
##$SIGF1= 18.5376
##$SIGF2= -6.396296
##$SINO= 400
##$SIOLD= 32768
##$SREGLST= <1H.CDCl3>
##$SSB= 3
##$STSI= 0
##$STSR= 0
##$SW_p= 4401.40845070422
##$SYMM= 0
##$S_DEV= 0
##$TDeff= 0
##$TDoff= 0
##$TI= <>
##$TILT= no
##$TM1= 0
##$TM2= 0
##$TOPLEV= 0
##$USERP1= <user>
##$USERP2= <user>
##$USERP3= <user>
##$USERP4= <user>
##$USERP5= <user>
##$WDW= 1
##$XDIM= 8192
##$YMAX_p= 0
##$YMIN_p= 0
$$ End of Bruker specific parameters
$$ ---------------------------------
##NTUPLES= NMR FID
##VAR_NAME=  TIME,          FID/REAL,        FID/IMAG
##SYMBOL=    X,             R,               I
##VAR_TYPE=  INDEPENDENT,   DEPENDENT,       DEPENDENT
##VAR_FORM=  AFFN,          ASDF,            ASDF
##VAR_DIM=   8192,          8192,            8192
##UNITS=     SECONDS,       ARBITRARY UNITS, ARBITRARY UNITS
##FACTOR=    0.0002272,     1,               1
##FIRST=     0,             0,               0
##LAST=      1.8609952,     187,             100
##MIN=       0,             -695338,         -695338
##MAX=       1.8609952,     527289,          527289
$$ Real data points
##PAGE= N=1
##DATA TABLE= (X++(R..R)), XYDATA
$$ [...]
$$ plain form
2229 -1660 -4848 -4629 -1308 1464 4376 5045 1795 -2735 -4289 -3285 -1617 1822 4652 4044 1087 -1370
2245 -1370 -3759 -4631 -1644 2621 3760 3162 1318 -1945 -4311 -3306 -891 731 3270 4262 1286 -2556
2261 -2556 -3497 -2814 -1270 1766 3820 2829 1041 -569 -2973 -3567 -982 1842 2828 2932 1421 -1917
2277 -1917 -3518 -2180 -715 639 2602 2909 665 -1306 -2387 -2794 -1211 2137 3240 1708 475
2292 475 -595 -2163 -2350 -605 1246 2179 2836 1140 -1844 -2483 -1225 -875 528 2441 2081 -115 -1002
2309 -1002 -1480 -2172 -1241 1036 1877 1575 844 -987 -2066 -945 410 -98 677 2269 1505 -1030 -1664
2326 -1664 -785 -117 684 1101 85 -26 298 -861 -1934 -433 1322 747 40 391 -252 -1398 -963 107
2344 107 485 944 877 41 -13 138 -982 -1473 469 2137 387 -789 222 664 -380 -953 -939 -224 1157
$$ packed form
2229a660l188K19L321K772K912O69l250m530j554J004J668L439K830o08k957k457
2245a370k389q72K987M265J139n98j844l263k366J005K415J622K539R92k976l842
2261b556r41O83J544L036K054r91j788j610k404n94K585K824R86J04j511l338
2277a917j601J338J465J354J963L07k244j971j081m07J583L348J103j532j233
2292D75j070j568j87J745J851R33O57j696k984o39J258L50J403J913l60k196q87
2309a002m78o92R31K277Q41l02p31j831j079J121J355n08P75J592p64k535o34
2326a664Q79O68Q01M17j016j11L24j159j073J501J755n75p07L51o43j146M35J070
2344A07L78M59o7q36n4J51j120m91J942J668j750j176J011M42j044n73J4P15J381
$$ plain form
2363 1157 551 -922 -421 1059 358 -1564 -721 683 82 -426 378 931 461 -51 -805 -605 608 645
2381 645 -786 105 1776 339 -1866 -821 1135 798 -549 -612 21 171 -244 -1573 -631 2124 2168 -652
2399 -652 -1790 30 61 -1290 -497 1896 2227 930 -647 -1801 -1025 -510 -884 82 2939 2507 -1306
2416 -1306 -2426 -620 -310 -1235 -611 1713 2522 811 -2137 -2638 -282 1541 170 -478 1841 2258 -1224
2433 -1224 -3248 -696 1704 1896 763 335 174 -457 -2380 -2670 704 3543 1725 -531 -153 -325 -3059
2450 -3059 -3436 62 3251 3325 824 -1100 -1139 -659 -2308 -2519 1998 5194 2487 -1888 -2186 -636 -960
2467 -960 -1534 305 2899 3139 -120 -3357 -2850 -43 567 -383 1679 3372 480 -3805 -3366 -233 1441
2484 1441 1498 1546 2240 1501 -1832 -4899 -2587 2659 3634 877 649 1609 -654 -4372 -4062 202 3829
$$ packed form
2363A157o06j473N01J480p01j922Q43J404o01n08Q04N53m70n12p54K00J213L7
2381F45j431Q91J671j437k205J045J956l37j347o3O33J50m15j329R42K755M4k820
2399f52j138J820L1j351P93K393L31j297j577j154P76N15l74R66K857m32l813
2416a306j120J806L10r25O24K324Q09j711k948n01K356J823j371o48K319M17l482
2433a224k024K552K400J92j133m28j61o31j923k90L374K839j818k256L78j72k734
2450c059l77L498L189P4k501j924l9M80j649k11M517L196k707m375k98J550l24
2467i60n74J839K594K40l259l237N07K807O10r50K062J693k892m285M39L133J674
2484A441N7M8O94p39l333l067K312N246R75k757k28R60k263l718L10M264L627
$$ plain form
2501 3829 3392 667 -1153 -780 -1773 -3896 -1664 3563 4958 988 -1416 -1340 -1440 -2546 -1200 2244
2517 2244 4726 3025 -1571 -3712 -1841 -454 -1486 282 4337 4351 -1123 -4677 -3286 -476 527
2532 527 810 1939 3415 1568 -3334 -5285 -1450 2653 2112 1234 2359 1573 -2459 -4726 -2476 1617
2548 1617 3755 2487 544 41 -1085 -4185 -4446 801 5165 3458 -70 -995 -1252 -2903 -3702 -893
2564 -893 3673 5612 2611 -2218 -3007 -1406 -1993 -1958 1946 5329 3269 -1309 -3329 -2485 -1168 -255 859
2581 859 2875 3294 -144 -4550 -3627 215 1612 920 2172 3110 196 -4103 -4588 -953 2691 3621 2025
2598 2025 1135 998 -1980 -5517 -3487 2343 4761 2871 1079 157 -2014 -4066 -3807 -449 3802 4578
2614 4578 1436 -1149 -1102 -2095 -3475 -1181 3448 4362 1322 -1485 -1760 -1233 -1096 -500 1383 3854 2783
$$ packed form
2501C829m37k725j820L73r93k123K232N227J395l970k404P6j00j106J346L444
2517B244K482j701m596k141J871J387j032J768M055J4n474l554J391K810J003
2532E27K83J129J476j847m902j951L835M103n41q78J125p86m032k267K250M093
2548A617K138j268j943n03j126l100k61N247M364j707l528r25k57j651p99K809
2564h93M566J939l001m829p89J601n87L5L904L383k060m578k020Q44J317R13J114
2581H59K016M19l438m406R23L842J397o92J252R38k914m299m85L635L644R30j596
2598B025q90j37k978l537K030N830K418j890j792r22k171k052K59L358M251P76
2614D578l142k585M7r93j380K294M629R14l040k807k75N27J37N96J883K471j071
$$ plain form
2631 2783 -1979 -4557 -2195 690 519 1311 3288 2572 -1128 -4559 -4292 -1052 2225 3030 2472 2287 719
2648 719 -3295 -5246 -1819 1917 2835 2468 2448 769 -2260 -4079 -3011 501 3494 2682 445 -251 -404
2665 -404 -2532 -3275 23 3258 2807 208 -1512 -1811 -1442 -890 138 2471 3695 1524 -2323 -3245 -1652
2682 -1652 -653 482 2830 3620 1751 -1718 -3609 -3139 -1026 1071 1828 2911 3165 -199 -3798 -3518
2698 -3518 -670 905 1460 2085 2097 565 -1677 -2949 -1770 1123 2652 1457 328 331 -973 -2622 -1513
2715 -1513 973 2235 1753 518 -895 -1744 -1870 -1022 498 2769 2798 226 -1632 -1455 -1503 -1594 302 2829
2733 2829 3004 1358 -1158 -2466 -2041 -643 235 852 2258 2265 -537 -2454 -1962 -900 137 1237 1677
2750 1677 1104 -337 -1450 -1933 -632 852 1427 1061 773 140 -1617 -1905 -345 1181 1481 1233 560
$$ packed form
2631B783m762k578K362K885j71P92J977p16l700l431K67L240L277Q05n58j85j568
2648G19m014j951L427L736R18l67k0j679l029j819J068L512K993q12k237o96j53
2665d04k128p43L298L235m51k599j720k99L69N52J028K333J224k171l847r22J593
2682a652R99J135K348P90j869l469j891M70K113K097P57J083K54l364l599K80
2698c518K848J575N55O25J2j532k242j272J179K893J529j195j129Lj304j649J109
2715a513K486J262m82j235j413q49j26Q48J520K271K9k572j858J77m8r1J896K527
2733B829J75j646k516j308M25J398Q78O17J406Pk802j917M92J062J037J100M40
2750A677n73j441j113m83J301J484N75l66k88o33j757k88J560J526L00k48o73
$$ plain form
2767 560 -569 -1152 -1586 -1266 410 2212 1814 -45 -864 -1247 -1567 -1060 399 1321 1331 1062 -268 -1540
2785 -1540 -1162 -478 -62 1028 1824 686 -735 -868 -603 -534 -118 1102 1196 468 -372 -1259 -1303 -258 671
2804 671 405 466 686 -15 -1262 -987 -253 523 1118 1104 299 -321 -358 -590 -487 371 1105 659 163 238 -802
2825 -802 -1160 -215 492 371 398 421 -218 -538 -472 -460 -312 857 752 207 -299 -220 -390 -216 364 208 255 354
2847 354 24 -646 -671 -58 281 114 364 178 -356 -491 -48 -625 -236 318 339 66 226 -169 -367 55 403
2868 403 20 -297 223 309 -46 -53 148 -216 161 428 110 -178 184 365 -191 -366 12 -108 -152 461 134
2889 134 -209 22 271 -252 -463 157 262 240 420 169 -502 -266 179 6 -69 569 215 -170 -279 -481 -579
2910 -579 82 666 321 -59 188 -163 -790 -437 221 54 628 728 78 -463 -493 -262 19 552 821 307
$$ packed form
2767E60j129n83m34L20J676J802l98j859q19l83l20N07J459R22J0k69j330j272
2785a540L78O84M16J090P96j138j421j33K65O9M16J220R4p28q40q87m4J045R29
2804F71k66O1K20p01j247K75P34P76N95j4q05o20l7k32J03Q58P34m46m96P5j040
2825h02l58R45P07j21K7K3o39l20O6J2J48J169j05n45n06P9j70J74N80j56M7R9
2847C54l30o70k5O13L39j67K50j86n34j35M43n77L89N54K1k73J60l95j98M22L48
2868D03l83l17N20Q6l55pK01l64L77K67l18k88L62J81n56j75L78j20m4O13l27
2889A34l43K31K49n23k11O20J05k2J80k51o71K36M45j73p5O38l54l85j09k02r8
2910e79O61N84l45l80K47l51o27L53O58j67N74J00o50n41l0K31K81N33K69n14
$$ plain form
2930 307 -315 -282 -708 -749 -57 691 802 446 -84 -811 -883 -333 -132 98 860 945 -125 -820 -733 -451 2
2951 2 771 894 587 -23 -475 -958 -809 92 653 741 880 277 -892 -1104 -500 124 253 672 765 65 -517
2972 -517 -1133 -1088 24 1322 1088 355 -53 -253 -1053 -867 -126 822 1303 1061 -15 -981 -1151 -630 -354
2991 -354 815 1451 809 -246 -878 -924 -1135 -475 877 1319 1052 -84 -1095 -1269 -513 38 204 1132 1600
3010 1600 388 -1174 -1573 -593 143 881 1143 671 61 -690 -1578 -1225 433 1311 1125 753 426 -967
3028 -967 -1801 -1054 272 1210 1430 887 -16 -600 -1052 -1503 -356 1544 2089 523 -637 -844 -895 -1092 -352
3047 -352 1008 1585 1197 -239 -1519 -1366 -374 -68 584 1623 1387 -502 -1319 -1254 -601 272 925 1207 1204
3066 1204 255 -1283 -2010 -739 778 711 551 1050 499 -945 -2156 -1087 412 1397 1102 232 -103 -460
$$ packed form
2930C07o22L3m26m1O92P48J11l56n30p27p2N50K01K30P62Q5j070o95Q7K82M53
2951BP69J23l07o10m52m83J49R01N61Q8J39o03j169k12O04O24J29M19R3p00n82
2972e17o16M5J112J298k34p33m08k00q00J86P41R48M81k42j076r66j70N21K76
2991c54J169O36o42j055o32m6k11O60J352M42k67j136j011j74P56N51J66R28M68
3010A600j212j562l99R80P36P38K62m72o10p51q88L53J658Q78j86l72l27j393
3028i67q34P47J326R38K20n43r03n84m52m51J147J900N45j566j160k07n1j97P40
3047c52J360N77l88j436j280J53R92L06O52J039k36j889q17O5O53Q73O53K82l
3066A204r49j538p27J271J517o7j60M99n51j444j211J069J499R85k95q70l35l57
$$ plain form
3084 -460 -1215 -1436 25 1688 1663 472 -255 -926 -1356 -1031 -31 1497 1941 712 -614 -1163 -948 -974
3102 -974 -675 1063 2117 1030 -788 -1369 -966 -607 -129 580 1346 1662 251 -1609 -1543 -180 694 657
3120 657 940 1174 94 -1162 -1623 -423 457 1342 818 375 -78 -1080 -1908 -1148 918 1687 1036 209
3138 209 -90 -960 -1689 -1314 380 1715 1779 309 -597 -559 -858 -1325 -505 1461 1954 705 -516 -938 -864
3157 -864 -490 -59 722 1259 874 -593 -1301 -637 -5 -76 309 1119 902 -704 -1662 -1110 207 1034 912
3176 912 618 649 -22 -1457 -1937 -318 1106 1273 743 384 -82 -955 -1581 -1085 319 1375 1295 234 -98
3195 -98 -646 -1354 -1207 66 1142 1082 250 -168 -355 -385 -598 -105 711 1239 129 -946 -853 126 -25 125
3215 125 652 960 358 -861 -1341 -1040 144 778 855 843 698 -369 -1505 -1337 115 792 837 933 803 1
$$ packed form
3084d60p55k21J461J663k5j191p27o71m30L25J000J528M44j229j326n49K15k6
3102i74K99J738J054j087j818n81M03L59M78P09P66L16j411j860O6J363Q74l7
3120F57K83K34j080j256m61J200Q80Q85n24m43m53j002q28P60K066P69o51q27
3138B09k99q70p29L75J694J335O4j470r06L8k99m67Q20J966M93j249j221m22P4
3157h64L74M31P81N37l85j467p08O64O32p1L85Q10k17j606r58N52J317Q27j22
3176I12k94L1o71j435m80J619J424J67n30l59m66q73o26M96J404J056q0j061l32
3195i8n48p08J47J273J076o0q32m18j87l0k13M93Q16N28j110j075R3R79j51J50
3215A25N27L08o02j219m80L01J184O34P7j2j45j067j136J68J452O77M5R6j30q02
$$ plain form
3235 1 -1032 -1400 -534 499 709 302 293 433 -268 -1336 -726 456 703 133 -317 -57 -77 -128 -195 174 938
3256 938 682 -369 -864 -573 -225 -59 295 1093 649 -184 -843 -722 -599 -52 253 543 1160 649 -604
3275 -604 -1136 -385 38 -5 129 776 800 197 -613 -889 -188 270 208 32 238 142 -407 -706 -76 198 401
3296 401 -26 -231 -209 -369 -254 -139 417 657 75 -333 -360 -269 -377 -365 398 876 493 -154 -582 -353 -229
3317 -229 63 40 407 762 195 -416 -476 -97 -188 -138 171 86 6 -12 -250 -236 -31 73 111 95 181 -107 -331 -4
3341 -4 409 268 225 -96 -3 -82 -227 -312 -219 436 427 -278 -277 -239 -80 -199 -45 93 14 124 88 -207 -235 -124 -238
3366 -238 -4 236 245 28 -136 -55 -253 -203 64 63 227 -60 -190 -77 168 21 -309 -316 -33 183 -96 -139 -64
3389 -64 105 160 -156 44 97 -113 -51 -212 17 -24 -13 -109 108 70 33 10 -48 58 -156 -128 45 145 167 -26
$$ packed form
3235Aj033l68Q66J033K10m07rJ40p01j068O10J182K47n70m50K60k0n1o7L69P64
3256I38k56j051m95K91L48J66L54P98m44q33o59J21J23N47L05K90O17n11j253
3275f04n32P51M23m3J34O47K4o03q10k76P01M58o2j76K06r6n49k99O30K74K03
3296D01m27k05K2j60J15J15N56K40n82m08k7R1j08J2P63M78l83o47m28K29J24
3317b29K92k3L67L55n67o11o0L79r1N0L09q5q0j8k38J4K05J04L8j6Q6k88k24L27
3341dM13j41m3l21R3p9j45q5R3O55rp05JL8J59j19J54J38p9J10l6k95k8J11j14
3366b38K34K40Rk17j64Q1j98N0K67jJ64k87j30J13K45j47l30pK83K16k79m3P5
3389f4J69N5l16K00N3k10O2j61K29m1J1r6K17l8l7k3n8J06k14K8J73J00K2j93
$$ plain form
3413 -26 -301 -89 124 -59 -46 28 261 115 -41 -193 -163 157 104 133 134 104 118 -154 -167 -84 -22 91 229 94
3437 94 -73 -144 -81 -99 231 137 38 102 24 -165 -172 -124 201 233 57 -156 -62 -48 64 -85 -78 213 175 13 -301 -275
3463 -275 -261 -108 220 384 -15 96 -80 -71 -363 -172 306 271 257 48 -323 -50 -141 -60 79 46 107 -2 -6 -264
3487 -264 -345 59 359 168 17 9 -38 -204 -125 55 -55 357 297 94 -303 -185 -96 -43 60 212 307 26 139
3510 139 -210 -276 -75 275 152 128 6 -167 -234 -315 2 157 75 142 74 -329 -393 -222 115 321 476 144 11
3533 11 -167 -247 -227 -43 245 292 379 -38 -393 -330 -206 68 149 296 232 -18 -155 -182 -189 95 256 383 74 -107
3557 -107 -235 -220 -176 77 220 180 168 5 -324 -447 -67 96 364 346 47 -125 -299 -252 -405 104 460 337
3579 337 116 -176 -247 -424 -105 182 217 256 303 -49 -369 -428 -215 273 440 389 122 -112 -210 -243 -150 211 230
$$ packed form
3413b6k75K12K13j83J3P4K33j46j56j52L0L20n3K9Jl0J4k72j3Q3O2J13J38j35
3437I4j67p1O3j8L30r4r9O4p8j89pM8L25L2j76k13R4J4J12j49PK91l8j62l14K6
3463b75J4J53L28J64l99J11j76Rk92J91M78l5j4k09l71K73r1Q1J39l3O1j09mk58
3487b64q1M04L00j91j51qm7j66P9J80j10M12o0k03l97J18Q9N3J03J52R5k81J13
3510A39l49o6K01L50j23k4j22j73o7q1L17J55q2O7o8m03o4J71L37K06J55l32j33
3533A1j78q0K0J84K88M7Q7m17l55O3J24K74Q1J47o4k50j37k7pK84J61J27l09j81
3557a07j28J5M4K53J43m0j2j63l29j23L80J63K68j8k99j72j74M7j53N09L56j23
3579C37k21k92p1j77L19K87L5L9M7l52l20n9K13M88J67n1k67k34r8l3R3L61J9
$$ plain form
3602 230 226 -54 -166 -307 -405 -27 204 252 282 118 -212 -43 -33 -98 200 354 306 -49 -343 -376 -59 -139 66
3625 66 292 366 36 -110 -120 -376 75 234 238 313 142 -156 -120 -157 -177 43 265 429 95 -71 -318 -427 -117
3648 -117 250 187 320 118 -45 -295 -506 -75 185 283 121 63 -326 -236 -261 -83 242 453 237 36 -65 -336
3670 -336 -426 -72 208 337 268 41 -346 -189 -117 -133 24 601 327 28 -288 -346 -161 80 112 322 424 50
3692 50 -114 -312 -248 190 263 259 92 87 -232 -245 -177 76 199 170 62 116 -97 -413 -182 333 533 141 61 -106
3716 -106 -144 -142 -275 165 307 453 158 -163 -291 -305 -172 -151 132 464 289 121 -145 -318 -176 64 270 55
3738 55 110 -139 -197 -214 30 -119 -35 187 318 -53 -488 -272 13 271 246 134 0 -78 -82 -391 -268 274 199
3761 199 -10 13 74 -129 -557 -182 -3 374 506 118 108 -151 -387 -259 -185 371 374 81 -117 58 43 -145
$$ packed form
3602B30mk80j12j41r8L78K31M8L0j64l30J69J0o5K98J54m8l55k94l3L17q0K05
3625F6K26P4l30j46j0k56M51J59MP5j71k98L6l7k0K20K22J64l34j66k47j09L10
3648a17L67o3J33k02j63k50k11M31K60R8j62n8l89R0k5J78L25K11k16k01j01k71
3670c36r0L54K80J29o9k27l87J57P2j6J57N77k74k99l16n8J85K41L2K10J02l74
3692E0j64j98O4M38P3mj67nl19j3O8K53J23k9j08N4k13l16K31N15K00l92q0j67
3716a06l8Kj33M40J42J46k95l21j28j4J33K1K83L32j75j68k66j73J42K40K06k15
3738E5N5k49n8j7K44j49Q4K22J31l71m35K16K85K58k5j12j34p8ml09J23N42p5
3761A99k09K3O1k03m28L75J79L77J32l88j0k59k36J28P4N56Lk93j98J75j5j88
$$ plain form
3783 -145 -32 200 157 156 -90 -282 -7 35 -16 0 176 132 -240 -230 -194 -133 273 243 179 -61 -265 -281 -158 107
3807 107 395 59 10 180 -221 -343 -468 -173 296 321 203 136 13 38 -347 -422 -5 169 10 64 -29 -26 96
3830 96 61 -195 -59 117 -124 -144 52 189 119 -87 8 223 -105 -189 -157 -98 207 70 117 340 192 -396 -395 -329
3854 -329 148 33 -86 235 196 7 -164 -84 -170 119 48 161 291 304 102 -109 -111 -29 -117 -84 -152 245 241 282 -120
3879 -120 96 93 -110 -216 -286 54 179 81 -21 226 117 -160 -206 -216 125 137 173 302 402 354 -98 -167 -85 -176
3903 -176 -198 76 169 273 168 -69 -157 -84 -49 -220 -145 315 451 -182 9 27 -226 -281 -177 -97 -44 7 74 24
3927 24 41 22 0 -111 82 141 88 -42 97 16 -125 120 49 -14 -59 -135 -201 85 200 7 -24 306 116 -200
3951 -200 -443 -97 163 192 71 275 3 -19 23 -205 68 92 123 206 108 -90 34 -136 -51 -22 199 112 160 -106
$$ packed form
3783a45J13K32m3jk46j92K75M2n1J6J76m4l72J0L6O1M06l0o4k40k04j6J23K65
3807A07K88l36m9J70m01j22j25K95M69K5j18o7j23K5l85p5M17J74j59N4r3LJ22
3830I6l5k56J36J76k41k0J96J37p0k06R5K15l28q4L2N9L05j37M7K23j48n88JO6
3854c29M77j15j19L21l9j89j71Q0q6K89p1J13J30J3k02k11kQ2q8L3o8L97mM1m02
3879a20K16lk03j06p0L40J25r8j02K47j09k77m6j0L41J2L6J29J00m8m52o9Q2r1
3903a76k2K74R3J04j05k37q8P3L5j71P5M60J36o33J91J8k53n5J04Q0N3N1O7n0
3927B4J7j9k2j11J93N9n3j30J39q1j41K45p1o3m5p6o6K86J15j93l1L30j90l16
3951b00k43L46K60K9j21K04k72k2M2k28K73K4L1Q3r8j98J24j70Q5K9K21q7M8k66
$$ plain form
3975 -106 65 -88 -28 213 180 154 -120 -65 -52 -53 -77 201 37 73 192 -119 -283 -231 71 8 201 297 88 -165
3999 -165 -187 -316 -19 75 405 24 156 90 -297 -289 -137 254 160 269 105 -128 -462 -226 -271 112 344 89
4021 89 -134 79 -31 -411 -135 151 267 272 14 -132 -211 -254 -7 139 184 237 28 42 -336 -210 -228 89 346
4044 346 217 7 -179 -104 -319 -192 111 291 226 53 -268 -410 -95 -70 -2 347 390 -40 -269 -336 -194 -145
4066 -145 246 600 311 -21 17 -370 -409 -55 156 343 314 301 -284 -253 -378 -58 255 446 449 -122 -324 -254 -214
4089 -214 -182 142 420 217 46 -292 -527 -345 113 337 229 326 68 -228 -547 -194 -20 -17 327 514 113
4110 113 -447 -271 -276 -253 235 526 509 349 -83 -345 -454 -116 291 475 565 94 -221 -325 -322 -170 213 554
4132 554 496 40 -209 -478 -428 -300 395 319 343 225 -92 -499 -372 74 211 428 344 -78 -238 -480 -490 -248
$$ packed form
3975a06J71j53O0K41l3k6k74N5J3jk4K78j64L6J19l11j64N2L02o3J93R6k09k53
3999a65k2j29K97R4L30l81J32o6l87QJ52L91r4J09j64k33l34K36m5L83K32k55
4021H9k23K13j10l80K76K86J16Nk58j46p9m3K47J46M5N3k09J4l78J26j8L17K57
4044C46j29k10j86P5k15J27L03J80o5j73l21j42L15K5O8L49M3m30k29o7J42M9
4066a45L91L54k89l32L8l87l9L54K11J87k9j3n85L1j25L20L13J91Ln71k02P0M0
4089b14L2L24K78k03j71l38k35J82M58K24j08R7k58k96l19L53J74LL44J87m01
4110A13n60J76nK3M88K91j7j60m32k62j09L38M07J84R0m71l15j04LJ52L83L41
4132E54n8m56k49k69N0J28O95p6K4j18l17m07J27M46J37K17q4m22j60k42j0K42
$$ plain form
4154 -248 180 489 342 -19 -300 -278 -459 66 261 417 428 59 -155 -478 -365 113 205 554 478 -17 -207
4175 -207 -372 -304 -15 318 508 306 139 -27 -626 -581 -279 341 358 324 0 -278 -490 -243 -199 152 593 482
4197 482 150 -471 -396 -454 22 271 402 312 148 -119 -707 -245 -42 301 372 505 204 -370 -506 -365 -335 225
4219 225 591 223 56 -418 -393 -558 -4 379 427 260 37 -142 -571 -401 17 144 455 468 -103 -414 -210
4240 -210 -369 -279 406 692 314 36 -187 -398 -286 -190 381 441 313 -35 -342 -503 -141 -19 202 661 671
4261 671 32 -489 -466 -418 -7 263 494 290 167 -172 -463 -367 -96 460 346 244 74 -252 -459 -337 36
4282 36 106 464 180 -24 -88 -343 -355 42 507 466 55 252 -194 -430 -489 -92 113 340 372 -132 -312 -314 -208
4305 -208 -124 134 663 383 40 -305 -217 -345 -190 59 382 616 162 -279 -270 -198 -9 -187 -129 353 66 -316
$$ packed form
4154b48M28L09j47l61k81K2j81N25J95J56J1l69k14l23J13M78R2L49p6m95j90
4175b07j65O8K89L33J90k02j67j66n99M5L02O20J7l4l24k78k12K47M4L51M41j11
4197D82l32o21P5n8M76K49J31r0j64k67n88M62K03L43P1J33l01n74j36J41L0N60
4219B25L66l68j67m74K5j65N54L83M8j67k23j79m29J70M18J27L11J3n71l11K04
4240b10j59R0O85K86l78k78k23k11J12R6N71O0j28l48l07j61L62J22K21M59J0
4261F71o39n21K3M8M11K70K31k04j23l39k91R6K71N56j14j02j70l26k07J22L73
4282C6P0L58k84k04o4k55j2L97M65m1m11J97m46k36n9L97K05K27L2n04j80kJ06
4305b08Q4K58N29k80l43l45Q8j28J55K49L23K34m54m41RP2J89j78N8M82k87l82
$$ plain form
4327 -316 -165 -10 177 285 76 136 73 -57 -367 -261 424 338 59 116 74 -133 -419 -262 -82 360 349 187
4349 187 77 -264 -288 -401 -584 170 289 217 30 262 -157 -130 -235 -233 56 161 140 -178 166 173 -98 -151 -69
4372 -69 133 -95 -94 11 197 174 256 -134 -37 54 -235 -488 8 337 122 247 283 183 -157 -506 -300 -167 263
4395 263 199 212 268 293 -29 -741 -466 -174 -63 17 225 455 344 114 -164 -429 -330 -122 -179 -24 465 376 -13
4418 -13 -36 -5 -104 -94 -76 119 203 143 256 -79 204 7 -406 -306 91 72 -152 48 375 276 281 143 -229 -483
4442 -483 -304 -234 -18 472 600 123 -209 -155 -426 -547 -118 322 327 499 332 -156 -274 -247 -274 -295 315 411 274
4465 274 35 87 -17 -182 -277 -41 83 207 -106 -326 -52 140 85 -139 132 -148 -173 -380 -240 148 258
4486 258 412 253 -16 -364 -544 -459 -17 439 450 242 325 142 -531 -655 -314 87 485 429 190 -99 -267
$$ packed form
4327c16J51J55J87J08k09O0o3j30l10J06O85q6k79N7m2k07k86J57J80M42j1j62
4349A87j10l41k4j13j83P54J19p2j87K32m19K7j05KK89J05k1l18L44Pk71n3Q2
4372f9K02k28JJ05J86k3Q2l90R7R1k89k53M96L29k15J25L6j00l40l49K06J33M30
4395B63o4J3N6K5l22p12K75K92J11Q0K08K30j11k30k78k65R9K08n7J55M89q9l89
4418a3k3L1r9J0J8J95Q4o0J13l35K83j97m13J00L97j9k24K00L27r9Nj38l72k54
4442d83J79P0K16M90J28m77l32N4k71j21M29M40NJ72j67m88j18K7k7k1O10R6j37
4465B74k39N2j04j65r5K36J24J24l13k20K74J92n5k24K71k80k5k07J40L88J10
4486B58J54j59k69l48j80Q5M42M56J1k08Q3j83o73j24L41M01L98n6k39k89j68
$$ plain form
4507 -267 -288 -508 -9 490 278 176 -96 -51 -199 -118 225 173 54 -167 -237 -370 -84 168 155 392 413 233
4529 233 -434 -720 -408 -65 450 455 435 199 -162 -589 -625 -104 432 562 625 74 -32 -585 -450 -193 125 462
4551 462 426 -34 -65 -244 -350 -489 255 358 164 117 -306 -473 -520 -72 123 347 337 150 -459 -684 -289 -288
4573 -288 180 752 621 -55 -290 -486 -472 -90 301 485 422 406 -106 -715 -417 102 111 649 597 156 -311 -446
4595 -446 -441 -325 202 465 203 -91 -145 -415 -593 -210 364 424 254 15 -259 -550 -554 10 213 561 623 261
4617 261 -277 -589 -351 -375 155 513 439 141 -251 -460 -738 42 141 300 610 318 -371 -666 -423 104 224
4638 224 681 612 50 -171 -431 -497 -216 387 551 493 210 -223 -549 -642 -72 320 323 414 41 -458 -670 -506
4660 -506 -131 498 680 485 265 -177 -441 -494 -306 374 566 329 142 -286 -680 -497 -56 247 449 461 107
$$ packed form
4507b67k1k20M99M99k12j02k72M5j48Q1L43n2j19k21p0j33K86K52j3K37K1j80
4529B33o67k86L12L43N15Nk0k36l61m27l6N21N36J30O3n51j06n53J35K57L18L37
4551D62l6m60l1j79j06j39P44J03j94m7m23j67m7M48J95K24j0j87o09k25L95J
4573b88M68N72j31o76k35j96J4L82L91J84o3j6n12o09K98N19RN38n2m41m67j35
4595d46NJ16N27K63k62k94n4k70j78L83N74O0j70k39k74k91mN64K03L48O2l62
4617B61n38l12K38k4N30L58p4k98l92k09k78P80R9J59L10k92o89k95K43N27J20
4638B24M57o9n62k21k60o6K81O03J64n8k83m33l26r3N70L92LR1l73m99k12J64
4660e06L75O29J82j95k20m42k64n3J88O80J92k37j87m28l94J83M41L03K02J2l54
$$ plain form
4681 107 -457 -723 -485 -97 246 422 333 -32 -31 -503 -473 -133 390 547 465 386 -201 -493 -504 73 167 541 510
4704 510 -85 -391 -604 -630 -140 383 525 208 170 -292 -425 -434 -114 456 324 352 241 -369 -566 -267 -60 211
4726 211 483 680 157 -403 -443 -579 -76 339 462 283 123 -187 -519 -375 -77 116 353 442 32 -254 -496
4747 -496 -433 82 149 752 422 27 -247 -282 -502 1 190 533 280 82 -148 -686 -237 -25 424 393 427 47
4769 47 -217 -416 -353 -70 212 506 208 -149 -106 -322 -404 44 231 304 406 199 -215 -600 -298 112 184 450
4791 450 435 -170 -254 -292 -261 -229 95 340 326 -11 -205 -262 -432 -26 -16 189 408 152 -280 -258 -153 53 67
4814 67 383 216 77 -255 -314 -508 -207 234 238 252 109 -7 -296 -116 -18 294 79 286 158 -51 -224 -284
4836 -284 -163 92 475 226 -98 -316 -245 -208 -229 188 122 264 130 -53 -390 -379 -150 -36 173 309 176 9
$$ packed form
4681A07n64k66K38L88L43J76q9l65Jm72L0L40N23J57q2p9n87k92j1N77R4L74l1
4704E10n95l06k13k6M90N23J42l17l8m62j33rL20N70j32K8j11o10j97K99K07K71
4726B11K72J97n23n60m0j36N03M15J23j79j60l10l32J44K98J93K37Q9m10k86k42
4747d96O3N15O7O03l30l95k74l5k20N03J89L43k53j98k30n38M49K12M49l1L4l80
4769D7k64j99O3K83K82K94k98l57M3k16q2M48J87P3J02k07m14l85L02M10P2K66
4791D50j5o05q4l8L1L2L24K45j4l37j94n7j70M06J0K05K19k56m32K2J05K06J4
4814F7L16j67j39l32n9j94L01M41MJ4j43j16k89J80R8L12k15K07j28k09j73o0
4836b84J21K55L83k49l24k18P1L7k1M17o6J42j34j83l37J1K29J14K09J36j33j67
$$ plain form
4858 9 -56 -3 -131 101 304 -22 126 155 -109 -184 119 315 -3 18 196 -145 -316 -221 53 210 121 42 -137
4881 -137 -332 26 16 -122 29 295 229 66 191 68 -61 -15 -73 234 228 49 77 -41 -64 -158 -240 64 159 8
4905 8 75 180 -105 49 -93 -104 -72 87 10 -133 -170 67 56 -67 19 30 -113 -27 11 31 145 286 118 137 170
4930 170 -180 -139 -46 42 68 -7 194 392 39 -316 -247 -112 -127 133 211 69 133 40 -192 -359 -269 40 -131 103
4954 103 108 183 169 -32 -151 -237 79 -149 -8 356 24 -102 61 85 -8 104 60 -45 -176 -179 237 -5 134
4977 134 386 -97 -231 -406 -364 -362 -194 248 449 513 100 -242 -400 -330 -253 -40 376 656 188 -122 -126 -211 -236
5000 -236 -170 98 231 102 14 -214 -270 71 -48 -121 83 143 78 -438 -125 167 242 339 217 -129 -236 -359 -341
5023 -341 -251 469 473 356 261 -168 -562 -530 -117 74 338 517 323 23 -306 -441 -803 -205 461 422 106 131
$$ packed form
4858Io5N3j28K32K03l26J48K9k64p5L03J96l18K1J78l41j71R5K74J57q9p9j79
4881a37j95L58j0j38J51K66o6j63J25j23j29M6n8L07oj79K8j18k3r4q2L04R5j51
4905HO7J05k85J54j42j1L2J59p7j43l7K37j1j23Q6J1j43Q6L8K0J14J41j68J9L3
4930A70l50M1R3Q8K6p5K01J98l53l55O9J35j5K60P8j42O4r3k32j67R0L09j71K34
4954A03NP5j4k01j19q6L16k28J41L64l32j26J63K4r3J12m4j05j31lM16k42J39
4977A34K52m83j34j75M2KJ68M42K01O4m13l42j58P0P7K13M16K80m68l10mq5k5
5000b36O6K68J33j29q8k28n6L41j19p3K04O0o5n16L13K92P5R7j22l46j07j23J8
5023c41R0P20Mj17r5m29l94L2M13J91K64J79j94l00l29j35l62N98O66l9l16K5
$$ plain form
5045 131 46 -200 -137 -99 -6 131 61 142 -227 -189 70 124 146 259 -31 -329 -270 -190 -46 126 322 314 -18 -288
5069 -288 -278 -510 -290 259 519 447 360 -38 -424 -640 -265 42 559 594 451 -99 -330 -299 -372 -261 63 388
5091 388 333 -153 -266 -385 -146 36 162 238 311 -91 -332 -192 -119 143 360 494 -108 -226 -391 -289 -194 155
5113 155 387 371 218 102 -566 -587 -204 112 146 534 551 -106 -242 -428 -393 -256 253 304 334 129 -245 -322 -306
5136 -306 -50 246 350 399 -15 -381 -610 -136 104 258 507 230 -157 -275 -396 -356 112 595 470 323 -130
5157 -130 -258 -618 -246 246 487 709 364 43 -495 -368 -303 -31 449 456 456 -12 -299 -291 -342 154 457 433 158
5180 158 39 -338 -523 -168 208 232 283 365 -37 -363 -421 -296 114 569 457 272 -268 -226 -426 -276 39 303
5202 303 386 204 150 -374 -661 -220 -59 160 537 305 -104 -322 -302 -370 -40 259 460 309 61 -223 -477
$$ packed form
5045A31q5k46O3L8R3J37p0Q1l69L8K59N4K2J13k90k98N9Q0J44J72J96ql32k70
5069b88J0k32K20N49K60p2q7l98l86k16L75L07N17L5j43n50k31L1p3J11L24L25
5091C88n5m86j13j19K39J82J26P6P3m02k41J40P3K62K17J34o02j18j65J02R5L49
5113A55K32j6j53j16o68k1L83L16L4L88J7o57j36j86L5J37N09N1L0k05l74p7J6
5136c06K56K96J04M9m14l66k29M74K40J54K49k77l87j18j21M0M68M83j25j47m53
5157a30j28l60L72M92K41K22l45l21n38J27O5K72M80P%m68k87Qn1M96L03k4k75
5180A58j19l77j85L55L76K4N1Q2m02l26n8J25M10M55j12j85n40M2k00J50L15K64
5202C03Q3j82n4n24k87M41J61K19L77k32m09k18K0o8L30K99K01j51k48k84k54
$$ plain form
5223 -477 -281 58 386 352 284 11 -453 -440 -107 -31 264 469 397 -89 -164 -235 -318 16 397 329 46 206 -180
5246 -180 -521 -324 93 335 389 264 -40 -461 -325 -405 14 296 487 292 -59 -467 -402 -301 254 330 391 135
5268 135 112 -182 -401 -86 15 74 344 422 -110 -392 -228 -69 -49 131 343 127 -117 -177 -452 -373 105 285
5290 285 242 336 254 -466 -253 -221 -216 240 227 172 -126 -227 -317 -328 -202 202 110 114 -86 -139 -336 -233 141 192 62
5315 62 344 263 -213 -325 -147 -108 174 440 304 34 -36 -90 -218 24 257 264 189 111 -176 -344 -228 -114 -2
5338 -2 168 24 55 -208 -118 -63 -199 37 414 135 197 -58 -249 -93 -8 110 84 158 196 -191 -247 -53 -32 -13
5362 -13 9 224 -66 -153 -154 -208 -330 126 170 109 -64 -151 -89 -46 39 164 117 122 127 -14 -137 -103 -154 -161 109 64 50 -116
5390 -116 78 -140 -96 -40 92 3 -29 84 -63 -189 217 -19 42 122 175 98 50 151 -108 16 27 112 8 -124
$$ packed form
5223d77J96L39L28l4o8k73m64J3L33P6K95K05p2m86p5p1q3L34L81o8k83J60l86
5246a80l41J97M17K42N4j25l04m21J36q0M19K82J91j95l51m08O5J01N55P6O1k56
5268A35k3k94k19L15J01N9K70P8n32k82J64J59K0J80K12k16k44o0k75P9M78J80
5290B85m3R4q2p20K13L2NM56j3n5k98j01r0j1J26M04r2Mk00n3j97J03L74N1j30
5315F2K82q1m76j12J78L9K82K66j36k70p0n4j28K42K33Pp5p8k87j68J16J14J12
5338bJ70j44L1k63R0N5j36K36L77k79O2k55j91J56Q5J18k6P4L8l87n6J94K1J9
5362a3K2K15k90q7jn4j22M56M4o1j73q7O2M3Q5J25m7NNj41j23L4n1pK70m5j4j66
5390a16J94k18M4N6J32q9l2J13j47j26M06k36O1Q0N3p7m8J01k59J24J1Q5j04j32
$$ plain form
5414 -124 -62 4 -33 111 162 23 134 10 -43 -148 -155 -111 -186 188 55 34 127 -219 -233 -15 -24 112 56 169 119
5439 119 18 -200 -144 28 18 218 179 56 13 6 -178 -37 123 3 -193 28 -12 -63 -106 -164 120 118 68 103 -175
5464 -175 -56 -32 60 -19 81 -98 124 215 -182 -238 -121 27 -53 193 327 -63 -218 -138 -78 -147 -60 286 123
5487 123 31 41 -196 -313 113 55 190 126 117 -60 -217 -167 -156 -24 256 75 6 -143 -115 -190 -152 98 -20 13
5511 13 39 -42 -227 -150 57 245 234 173 174 -228 -350 -177 -88 53 467 323 -133 -164 -318 -209 -269 8 217 302
5535 302 260 -68 -240 -283 91 -54 134 246 206 -122 -124 -110 -206 233 -24 251 -15 -17 -15 -207 37 46 370 190
5559 190 7 -211 -511 -268 -27 10 259 364 109 -232 -299 -149 -279 -3 367 197 168 8 -184 -332 -174
5580 -174 273 19 250 383 75 -172 -267 -108 -10 94 192 151 -167 -84 -174 -243 273 324 83 185 -224 -330 -401
$$ packed form
5414a24O2O6l7J44N1j39J11j24n3j05pM4p5L74j33k1R3l46j4K18rJ36n6J13n0
5439A19j01k18N6J72j0K00l9j23m3pj84J41J60j20j96K21m0n1m3n8K84kn0L5k78
5464a75J19K4R2p9J00j79K22R1l97n6J17J48q0K46J34l90j55Q0O0o9Q7L46j63
5487A23r2J0k37j17M26n8J35o4rj77j57N0J1J32K80j81o9j49K8p5L8K50j18L3
5511A3K6q1j85P7K07J88j1o1Jm02j22J73Q9J41M14j44m56l1j54J09o0K77K09Q5
5535C02m2l28j72m3L74j45J88J12m0l28kJ4r6M39k57K75k66kKj92K44RL24j80
5559A90j83k18l00K43K41L7K49J05k55l41o7J50j30K76L70j70k9j60j92j48J58
5580a74M47k54K31J33l08k47r5J59R8J04R8m1l18Q3r0o9N16N1k41J02m09j06p1
$$ plain form
5603 -401 88 281 248 209 62 -192 -355 -402 -448 116 406 387 190 -161 -244 -451 -314 46 247 387 334 244 -256
5626 -256 -432 -136 6 128 156 211 -258 -129 -14 -120 -14 111 206 -46 -110 -241 -258 -93 625 250 82 -90
5648 -90 -172 -534 -283 -170 167 475 564 348 -152 -284 -371 -332 -11 475 472 370 -70 -245 -404 -259 -67 88
5670 88 290 287 -33 -393 13 -237 -54 260 79 13 -97 -209 -355 -173 206 273 388 170 -35 -443 -469 12
5692 12 194 363 380 162 -83 -255 -358 -283 283 274 427 136 -71 -195 -341 -296 70 265 358 160 -16 -293
5714 -293 -192 -129 -98 188 389 321 -270 -211 -298 -111 -159 102 213 226 -100 -98 -397 80 134 306 425 205 -132
5737 -132 -334 -361 54 126 239 413 130 -106 -342 -307 -377 82 368 332 46 151 -246 -500 -80 67 59 313
5759 313 98 15 -140 -11 -53 59 218 369 -124 -208 -267 -357 -210 196 355 164 107 140 -283 -328 -114 78 189
$$ packed form
5603d01M89J93l3l9j47k54j63m7m6N64K90j9j97l51q3k07J37L60K01J40n3r0n00
5626b56j76K96J42J22K8N5m69J29J15j06J06J25R5k52o4j31j7J65P18l75j68j72
5648i0q2l62K51J13L37L08Q9k16n00j32q7L9L21M86lj02m40j75j59J45J92J55
5670H8K02ll20l60M06k50J83L14j81o6j10j12j46J82L79O7J15k18k05m08k6M81
5692A2J82J69J7k18k45j72j03P5N66rJ53k91k07j24j46M5L66J95R3j98j76k77
5714b93J01O3L1K86K01o8n91N9q7J87m8K61J11J3l26Kk99M77N4J72J19k20l37
5737a32k02k7M15P2J13J74k83k36k36L5p0M59K86l6k86J05l97k54M20J47qK54
5759C13k15q3j55J29m2J12J59J51m93q4n9r0J47M06J59j91n7L3m23m5K14J92J11
$$ plain form
5782 189 270 239 -83 -238 -191 21 -59 241 280 81 76 -264 -360 -216 219 132 69 90 118 -281 -197 -6 -143 -24
5806 -24 245 467 -22 -108 -104 -188 -144 226 230 188 188 -72 -177 -176 26 72 105 209 -61 -171 -175 -112 16 98 196 212 -86
5833 -86 -75 -165 -95 -15 146 242 142 11 -143 -55 -286 23 209 107 183 -7 -172 -150 37 -184 54 217 8
5856 8 -200 -28 -93 -250 51 7 159 36 240 -189 -213 -141 74 49 87 -28 -28 -43 -250 -180 -89 213 148 -65 83
5881 83 -146 -149 -158 -53 -14 127 142 33 -222 -122 -6 30 -113 207 181 -66 28 -128 18 -184 13 214 172 41
5905 41 67 -178 -221 -111 5 0 150 70 -30 -5 95 -62 -5 50 31 77 -108 -77 8 -24 329 -76 37 246 103
5930 103 -118 -121 -17 31 -44 249 33 32 -150 -229 -203 54 104 -57 -86 16 143 -181 -8 -117 -16 -22 115 -161
5954 -161 135 31 -70 -40 111 152 79 78 86 44 -272 -42 67 -178 -69 146 -24 -11 -99 -104 -151 114 155 -77 95
$$ packed form
5782A89Q1l1l22j55M7K12q0L00L9j99nl40r6J44M35q7o3K1K8l99Q4J91j37J19
5806b4K69K22m89q6Mq4M4L70Mm2%k60j05JK02M6L3J04k70j10mO3J28Q2R8J6k98
5833h6J1r0P0Q0J61R6j00j31j54Q8k31L09J86j02P6j90j65K2J87k21K38J63k09
5856Hk08J72o5j57L01m4J52j23K04m29k4P2K15k5L8j15%j5k07P0R1L02o5k13J48
5881H3k29lrJ05L9J41J5j09k55J00J16L6j43L20k6k47R4j56J46k02J97K01m2j31
5905D1K6k45m3J10J16nJ50q0j00K5J00j57N7N5j9M6j85L1Q5l2L53m05J13K09j43
5930A03k21lJ04M8p5K93k16jj82p9K6K57N0j61k9J02J27l24J73j09J01oJ37k76
5954a61K96j04j01L0J51M1p3jQm2l16K30J09k45J09K15j70J3q8nm7K65M1k32J72
$$ plain form
5979 95 57 -96 -211 -96 168 200 13 84 123 -277 -147 -88 -282 5 -19 10 -276 -11 -125 -157 19 79 144 166
6003 166 48 52 -211 -81 61 -115 294 187 16 -121 -87 -151 -66 232 117 -93 124 2 -140 -76 88 149
6025 149 314 -85 2 -275 -195 -116 -53 183 236 84 162 -158 -199 -240 -40 178 112 328 4 -161 -191 -160 32 31
6049 31 197 266 -75 -284 -110 -291 -213 186 332 192 27 -41 -366 -437 73 127 292 245 83 52 -473 -288 -47
6072 -47 -51 261 241 122 -217 -294 -218 -169 159 151 255 86 29 -183 -284 -172 200 346 415 150 -75 -394 -54 7
6096 7 103 452 314 29 -133 -156 -256 -153 179 277 182 -9 135 -302 -476 -97 48 234 541 127 -170 -151
6118 -151 -284 -148 75 213 278 78 -34 -246 -282 -89 176 175 171 289 56 -260 -277 31 68 236 337 41 -236
6141 -236 -277 -223 -156 32 254 336 101 56 -429 -417 -40 162 403 307 193 -210 -313 -235 -209 -131 319 383 242 -66
$$ packed form
5979I5l8j53j15J15K64L2j87P1L9m00J30N9j94K87k4K9k86K65j14l2J76O0O5K2
6003A66j18Mk63J30J42j76M09j07j71j37L4o4Q5K98j15k10K17j22j42O4J64O1
6025A49J65l99Q7k77Q0P9O3K36N3j52P8l20m1m1K00K18o6K16l24j65l0L1J92j
6049C1J66O9l41k09J74j81P8L99J46j40j65o8l25p1N10N4J65m7j62l1n25J85K41
6072d7mL12k0j19l39p7P6M9L28qJ04j69n7k12j01J12L72J46O9k65k25l19L40O1
6096GR6L49j38k85j62k3j00J03L32R8r5j91J44m37j74L79J45J86L07m14k97J9
6118a51j33J36K23J38O5k00j12k12l6J93K65jmJ18k33l16j7L08L7J68J01k96k77
6141b36m1N4O7J88K22Q2k35m5m85J2L77K02K41r6j14m03j03P8K6P8M50O4j41l08
$$ plain form
6165 -66 -179 -191 -236 71 348 299 154 -74 -333 -390 159 281 192 179 21 -163 -185 -228 -74 -19 339 428 -171 -134
6189 -134 -332 -286 -292 326 602 481 57 -166 -420 -266 -436 85 360 493 305 -137 -306 -298 -128 -202 201 292
6211 292 73 87 -148 -391 -59 102 -17 67 79 0 -242 -188 3 48 268 186 -70 -23 -418 -427 7 242 543
6234 543 465 137 73 -339 -417 -171 157 408 192 226 -14 -347 -447 -215 -193 301 483 -6 66 -72 14 -246
6256 -246 219 217 261 -75 -130 -222 -258 -79 141 225 281 138 -234 -477 -245 -89 89 102 297 204 -159 -250 -400 -277
6280 -277 280 396 199 103 68 -268 -517 41 98 109 265 318 -56 -263 -323 -249 -154 433 211 -32 79 -54 -197
6303 -197 -99 184 90 354 115 -151 -186 -188 181 -62 125 522 165 -307 -142 -233 -119 20 294 130 153 28
6325 28 -207 -322 -194 25 88 117 189 -61 -263 -110 18 -84 184 137 114 76 50 -163 -301 135 244 3 -7
$$ packed form
6165f6j13j2m5L07K77m9j45k28k59n7N49J22q9j3j58j84k2m3J54N5L58Q9n99L7
6189a34j98M6oO18K76j21m24k23k54J54j70N21K75J33j88m42j69QJ70p4M03R1
6211B92k19J4k35k43L32J61j19Q4J2p9k42N4J91M5K20q2k56M7l95rM34K35L01
6234E43p8l28o4m12p8K46L28K51k16L4k40l33j00K32K2M94J82m89P2j38Q6k60
6256b46M65kM4l36n5r2l6J79K20Q4N6j43l72k43K32J56J78J3J95r3l63r1j50J23
6280b77N57J16j97r6l5l36k49N58N7J1J56N3l74k07o0P4R5N87k22k43J11j33j43
6303a97R8K83r4K64k39k66l5kL69k43J87L97l57m72J65r1J14J39K74j64K3j25
6325B8k35j15J28K19O3K9P2k50k02J53J28j02K68m7k3l8k6k13j38M36J09k41j0
$$ plain form
6348 -7 22 -26 -246 -128 103 184 118 -53 146 80 -4 -203 -37 290 319 51 -50 -72 -99 -32 -173 214 162 -55
6372 -55 52 -267 -272 -34 1 27 225 109 -195 -257 -202 -84 81 131 23 144 183 52 -232 -86 146 74 112 191
6396 191 96 -119 -166 -151 -120 -45 208 44 26 -46 -201 -361 -260 200 158 -179 99 133 -48 -166 -2 164 175
6419 175 156 -28 -226 -8 63 -72 16 247 -34 -147 65 -6 -91 -65 153 194 27 127 -120 -100 -15 90 -176
6442 -176 7 104 65 1 -42 -249 -222 17 -53 -203 42 27 -201 -215 -167 -105 -205 35 250 149 5 -71 87 25
6466 25 49 174 -57 96 16 -309 -225 140 0 -101 233 213 -122 -162 -113 -116 -118 251 214 58 15 16 -160 -265 15
6491 15 37 48 19 32 -180 -121 -84 -113 1 137 180 -82 -86 -15 -54 -214 140 72 137 105 -28 -71 -161 -88 -70 80 238
6518 238 31 -248 -99 -49 121 105 -1 83 200 71 -180 -58 -87 84 108 138 107 -142 -147 -452 -98 -135 189
$$ packed form
6348gK9m8k20J18K31Q1o6j71J99o6q4j99J66L27K9k68j01k2k7O7j41L87n2k17
6372e5J07l19nK38L5K6J98j16l04o2N5J18J65N0j08J21L9j31k84J46K32p2L8P9
6396A91r5k15m7J5L1P5K53j64j8p2j55j60J01M60m2l37K78L4j81j18J64J66J1
6419A75j9j84j98K18P1j35Q8K31k81j13K12p1q5K6K18M1j67J00k47K0Q5J05k66
6442a76J83R7l9o4m3k07K7K39p0j50K45j5k28j4M8O2j00K40K15j01j44p6J58o2
6466B5K4J25k31J53q0l25Q4L65j40j01L34k0l35m0M9lkL69l7j56m3Jj76j05K80
6491A5K2J1k9J3k12N9L7k9J14J36M3k62mP1l9j60L54o8O5l2j33m3r0P3J8J50J58
6518B38k07k79J49N0J70j6j06Q4J17j29k51J22k9J71K4L0l1k49nl05L54l7L24
$$ plain form
6541 189 122 -72 -70 -168 -86 -362 -89 246 196 25 17 -179 -213 -172 164 19 230 223 -127 -310 -222 -92 -101 113 249
6566 249 57 -94 -70 -188 -130 15 153 241 147 123 -347 -324 71 -149 207 257 335 -11 -324 -83 -203 -82 294
6589 294 118 130 126 -14 -404 -225 -55 213 118 304 15 -125 -165 -142 48 40 357 312 -29 -53 -203 -360 46
6612 46 308 480 186 -30 -263 -379 -284 -19 16 317 498 -166 -362 -213 -263 -74 78 229 240 68 -93 -76
6634 -76 -185 32 383 330 386 -14 -228 -242 -123 161 223 300 429 93 -342 -358 -397 -71 153 255 190 -47 -143
6657 -143 -257 -215 173 190 308 260 91 -250 -309 -124 -125 127 435 341 -148 -290 -158 -315 -143 319 475 227
6679 227 -151 -51 -271 -331 94 120 290 255 260 -93 -259 -128 -37 109 207 233 32 -230 -339 -288 159 305 403
6702 403 154 256 24 -543 -355 21 -147 317 247 67 -297 -503 -288 -26 348 530 115 106 56 -205 -266 -45
$$ packed form
6541A89o7j94Kr8Q2k76K73L35n0j71qj96l4M1L36j45K11pl50j83Q8J30rK14J36
6566B49j92j51K4j18N8J45J38Q8r4k4m70K3L95k20L56N0P8l46l13K41j20J21L76
6589B94j76J2mj40l90J79J70K68r5J86k89j40m0K3J90qL17m5l41k4j50j57M06
6612D6K62J72k94k16k33j16R5K65L5L01J81o64j96J49n0J89J52J51J1j72j61J7
6634g6j09K17L51n3N6m00k14j4J19K84O2P7J29l36m35j6l9L26K24J02o5k37r6
6657a43j14M2L88J7J18m8j69l41n9J85jK52L08r4m89j42J32j57J72M62J56k48
6679B27l78J00k20o0M25K6J70l5Nl53j66J31R1J46R8K6k01k62j09N1M47J46R8
6702D03k49J02k32n67J88L76j68M64p0j80l64k06K15K62L74J82m15rn0k61o1K21
$$ plain form
6724 -45 275 379 111 217 -152 -407 -381 -129 -260 339 438 -52 -261 -496 -288 -168 1 409 365 90 -73
6745 -73 -291 -342 -76 130 87 225 165 -251 -419 -359 -2 193 248 535 130 -268 -266 -104 -185 114 351 253 171 -58
6769 -58 -266 -280 -203 245 277 315 304 -140 -340 -104 1 117 460 315 92 -140 -179 -216 -352 -65 291 388 268
6792 268 98 -120 -208 -66 159 45 273 185 -172 -119 -31 -177 25 236 296 1 -131 -320 -268 31 89 203
6814 203 315 183 -64 -312 -250 -42 11 132 302 102 -9 3 -182 -147 204 383 51 102 193 -65 -233 -96
6836 -96 152 221 288 209 -61 -90 -101 -73 28 321 520 -164 -286 50 -82 -123 86 168 379 137 -70 -228 -306
6859 -306 32 -48 38 199 123 -177 -324 -105 20 -120 47 79 137 -148 -176 -173 -38 273 203 -95 271 325 -209
6882 -209 -279 -4 92 102 217 70 -82 -23 -268 -357 -102 218 124 -212 29 101 -182 -158 -4 80 202 127 -241
$$ packed form
6724d5L20J04k68J06l69k55K6K52j31N99R9m90k09k35K08J20J69M08m4k75j63
6745g3k18n1K66K06m3J38o0m16j68O0L57J95N5K87m05l98KJ62q1K99K37r8q2k29
6769e8k08j4P7M48L2L8j1m44k00K36J05J16L43j45k23k32l9l7j36K87L56R7j20
6792B68j70k18q8J42K25j14K28q8l57N3Q8j46K02K11O0k95j32j89N2K99N8J14
6814B03J12j32k47k48O2K08N3J21J70k00j11J2j85L5L51J79l32N1R1k58j68J37
6836i6K48O9O7p9k70k9j1K8J01K93J99o84j22L36j32m1K09Q2K11k42k07j58p8
6859c06L38q0Q6J61p6l00j47K19J25j40J67L2N8k85k8LJ35L11p0k98L66N4n34
6882b09p0K75R6J0J15j47j52N9k45q9K55L20r4l36K41P2k83K4J54Q4J22p5l68
$$ plain form
6905 -241 -75 -32 -70 -130 37 246 192 -108 -54 -76 25 32 54 -39 358 72 -287 -244 -42 63 -97 58 191 16
6929 16 -277 -199 1 -22 5 59 110 397 114 -396 -117 173 38 -26 78 434 270 -24 -188 -273 20 153 -15
6952 -15 -76 192 207 -158 -212 121 29 50 -36 25 117 22 -89 230 248 269 131 -166 -145 140 -279 -78 173 342
6976 342 10 -90 -149 -131 -46 -221 -261 7 251 104 -184 -170 166 39 -310 283 232 155 123 -68 154 38 -122
6999 -122 -131 -69 248 -80 -166 -31 173 -218 56 92 53 27 -107 -260 42 216 182 55 -114 176 -78 -306 -128
7022 -128 125 55 262 127 -113 -113 -158 -361 -480 71 302 -2 10 -74 13 -311 -331 -125 60 330 -68 226 33
7045 33 -148 -147 -69 -30 32 -97 -170 -1 -17 -92 26 148 237 -11 -105 -485 -46 138 111 -18 268 130 -152 -454
7069 -454 -289 28 71 332 253 54 -11 13 -455 -180 -43 254 132 205 268 -217 -223 -107 -18 113 105 95 -99 -36
$$ packed form
6905b41J66M3l8o0J67K09n4l00N4k2J01PK2r3L97k86l59M3K02J05j60J55J33j75
6929A6k93P8K00k3K7N4N1K87k83n10K79K90j35o4J04L56j64k94j64q5K93J33j68
6952a5o1K68J5l65n4L33r2K1q6O1R2r5j11L19J8K1j38k97K1K85m19K01K51J69
6976C42l32j00n9J8Q5j75m0K68K44j47k88J4L36j27l49N93n1p7l2j91K22j16j60
6999a22rO2L17l28q6J35K04l91K74L6l9k6j34j53L02J74l4j27j69K90k54k28J78
7022a28K53p0K07j35k40%m5k03j19N51K31l04J2q4Q7l24k0K06J85K70l98K94j93
7045C3j81JP8L9O2j29p3J69j6p5J18J22Q9k48r4l80M39J84k7j29K86j38k82l02
7069d54J65L17M3K61p9j99o5K4m68K75J37K97j22P3O3m85oJ16Q9J31qj0j94O3
$$ plain form
7093 -36 -142 -368 -110 420 -7 51 -10 -33 -312 -231 126 264 363 124 73 -303 -208 -179 131 255 309 178 -74
7116 -74 -326 -230 -177 14 77 214 193 162 -357 -269 -83 239 189 477 316 -55 -125 -192 -32 -3 331 364 303 84
7140 84 -182 -417 -280 112 295 241 211 160 -277 -216 5 400 183 303 198 -216 -245 -151 -414 -14 259 301 11
7163 11 98 -216 -406 -372 -29 161 197 388 -143 -436 -401 -269 56 162 187 197 -66 -136 -173 -318 -154 332 130
7186 130 195 -110 -81 -434 -201 129 178 211 379 122 -200 -146 -153 -149 285 546 167 -83 -37 -217 -308 16 116 294
7210 294 125 62 -190 -390 -122 20 252 396 69 -216 -221 -201 -337 -106 101 463 185 72 -253 -371 -360 155
7232 155 150 110 239 -27 -302 -352 -253 -1 151 274 208 -214 -177 -176 -148 -78 246 269 136 20 -20 -281 -314 -105 153
7257 153 222 325 -11 -379 -302 -259 -175 87 363 222 -75 -175 9 -377 -121 190 351 104 110 -223 -370 -189
$$ packed form
7093c6j06k26K58N30m27N8o1k3k79Q1L57J38R9k39n1l76R5K9L10J24N4j31k52
7116g4k52R6N3J91O3J37k1l1n19Q8J86L22n0K88j61l71p0o7J60K9L34L3o1k19
7140H4k66k35J37L92J83n4l0n1m37O1K21L95k17J20j05m14k9R4k63M00K73M2k90
7163A1Q7l14j90L4L43J90L6J91n31k93L5J32L25J06K5J0k63p0l7j45J64M86k02
7186A30O5l05K9l53K33L30M9L3J68k57l22N4pMM34K61l79k50M6j80r1L24J00J78
7210B94j69o3k52k00K68J42K32J44l27k85nK0j36K31K07L62k78j13l25j18J1N15
7232A55nm0J29k66k75n0R9K52J52J23o6m22L7JK8P0L24K3j33j16m0k61l3K09K58
7257A53O9J03l36l68P7M3Q4K62K76j41k97j00J84l86K56L11J61k47Ol33j47J81
$$ plain form
7279 -189 -86 37 232 285 93 -163 -312 -203 -207 208 302 107 -122 -168 -109 -165 -113 285 70 157 123 79 -528 -137
7303 -137 82 208 244 381 -19 -118 -303 -135 -158 30 509 25 111 14 -117 -167 -85 249 298 140 136 -169 -373
7326 -373 -161 -244 92 321 416 26 -279 -175 -279 -162 99 221 166 258 -204 -229 -242 94 22 156 234 86 -228
7349 -228 -296 -264 -146 -97 301 278 76 -136 -343 -338 -133 350 107 171 244 23 -241 -256 -110 190 50 169 63
7372 63 16 118 -108 -364 57 115 117 99 24 -42 -185 -286 195 191 172 94 -254 -90 36 -61 -90 193 348 28 -316
7397 -316 -100 -49 -44 143 44 69 243 71 -244 -288 74 146 43 192 408 240 -226 -114 -82 -84 154 66 -35 130
7421 130 16 -346 -254 247 262 151 108 161 57 -289 -190 -135 166 112 -85 -51 128 -21 -212 -135 348 255 99
7444 99 86 -38 -66 14 -33 -23 193 20 -146 -126 57 -1 -59 -336 181 263 -34 2 3 26 34 -28 29 160 256 -116
$$ packed form
7279a89J03J23J95N3j92k56j49J09mM15R4j95k29m6N9n6N2L98k15Q7l4m4o07L91
7303a37K19J26L6J37m00r9j85J68k3J88M79m84Q6r7j31n0Q2L34M9j58ml05k04
7326c73K12q3L36K29R5l90l05J04j04J17K61J22n5R2m62k5j3L36p2J34P8j48l14
7349b28o8L2J18M9L98k3k02k12k07NK05M83k43O4P3k21k64j5J46L00j40J19j06
7372F3m7J02k26k56M21N8Kj8p5o6j43j01M81mj9p8l48J64J26r7k9K83J55l20l44
7397c16K16N1NJ87r9K5J74j72l15m4L62P2j03J49K16j68m66J12L2kK38q8j01J65
7421A30j14l62R2N01J5j11m3N3j04l46R9N5L01n4j97L4J79j49j91P7M83r3j56
7444I9j3j24k8Q0m7J0K16j73j66K0J83n8n8k77N17Q2k97L6JK3Qo2N7J31R6l72
$$ plain form
7470 -116 -406 -165 245 -117 -156 162 396 4 -232 -191 -147 98 -65 -76 95 171 4 -350 11 160 32 -78
7492 -78 -39 145 -16 -43 -233 -96 48 150 -221 -210 153 109 -271 -54 567 -32 -2 73 -75 68 10 -71 -29
7515 -29 314 318 36 -304 235 91 -256 -234 374 260 184 -143 -33 -87 -167 -239 -229 306 402 -58 -34 145 -46 -224
7539 -224 -161 275 270 -30 -180 -153 70 93 -68 -169 -13 244 -343 -380 153 268 43 -81 -89 10 -161 -384 -273
7562 -273 100 552 235 -59 99 161 -339 -460 -51 88 265 115 79 36 -31 -156 -270 -82 294 249 -152 -121
7584 -121 52 -128 -176 -33 217 295 82 -85 -171 117 199 -62 222 420 57 -269 -332 39 56 -7 364 265 79
7607 79 -191 -550 -406 83 203 -94 294 399 93 -345 -462 -91 191 158 209 94 147 19 -447 -240 248
7628 248 140 -119 -16 -73 16 -301 -274 81 192 -55 -53 -356 -242 -201 -57 -16 418 271 -166 -151 -384 -149 15
$$ packed form
7470a16k90K41M10l62l9L18K34l92k36M1M4K45j63j1J71P6j67l54L61J49j28j10
7492g8L9J84j61k7j90J37J44J02l71J1L63m4l80K17O21n99L0P5j48J43n8q1M2
7515b9L43Mk82l40N39j44l47K2O08j14p6l27J10n4q0p2J0N35R6m60K4J79j91j78
7539b24O3M36nl00j50K7K23K3j61j01J56K57n87l7N33J15k25j24qR9j71k23J11
7562b73L73M52l17k94J58O2n00j21M09J39J77j50l6m3o7j25j14J88L76m5m01L1
7584a21J73j80m8J43K50P8k13j67q6K88Q2k61K84J98l63l26o3L71J7o3L71r9j86
7607G9k70l59J44M89J20k97L88J05l06m38j17L71K82l3N1j15N3j28m66K07M88
7628B48j08k59J03n7Q9l17K7L55J11k47Kl03J14M1J44M1M34j47m37J5k33K35J64
$$ plain form
7651 15 109 271 375 195 -90 -564 -266 98 83 -20 391 457 -181 -269 -161 -300 -193 15 119 73 124 -20
7673 -20 -266 -15 330 201 18 33 54 -34 -169 -91 241 369 263 -104 -276 -189 -310 -297 125 440 140 -171
7695 -171 -121 -219 -386 -319 84 221 339 287 -208 -456 -148 -181 -128 327 417 51 -244 -323 -240 -116 227 155 100 232
7719 232 -29 -351 -357 91 41 105 369 178 141 -234 -543 -105 102 332 244 87 81 -144 -331 -337 285 472 211
7742 211 53 -89 -115 -354 37 -63 334 344 249 -212 -92 -114 -130 5 290 166 176 -62 -165 -308 -237 143
7764 143 88 337 265 -215 -509 -189 -17 38 146 458 35 9 -193 -272 -102 71 360 247 141 223 -341 -308
7786 -308 -144 33 226 506 101 -171 -228 -382 -266 -197 390 466 20 -2 -122 -340 -169 47 292 216 105 69
7808 69 -196 -190 -161 45 70 381 442 26 -250 -365 3 -136 106 43 107 -160 -76 -217 -165 255 262 237 135 161 -184
$$ packed form
7651A5R4J62J04j80k85m74K98L64j5j03M11O6o38q8J08j39J07K08J04m6N1j44
7673b0k46K51L45j29j83J5K1q8j35P8L32J28j06l67j72Q7j21J3M22L15l00l11
7695a71N0r8j67O7M03J37J18n2m95k48L08l3N3M55R0l66k95p9Q3J24L43p2n5J32
7719B32k61l22oM48n0O4K64j91l7l75l09M38K07K30q8j57ok25j87oO22J87k61
7742B11j58j42k6k39L91j00L97J0r5m61J20k2j6J35K85j24J0k38j03j43P1L80
7764A43n5K49p2m80k94L20J72N5J08L12m23k6k02p9J70J73K89j13j06Q2n64L3
7786c08J64J77J93K80m05k72n7j54J16O9N87P6m46k2j20k18J71K16K45p6j11l6
7808F9k65OK9K06K5L11O1m16k76j15L68j39K42o3O4k67Q4j41N2M20Pk5j02K6l45
$$ plain form
7833 -184 -249 199 46 116 414 40 -113 -104 -174 -247 10 261 253 106 61 -147 -212 -194 126 64 205 177 -58 -245
7857 -245 -59 -155 -181 216 400 259 -74 -124 -129 -67 2 69 231 35 100 -204 -265 -4 63 -2 190 176 108 -163 -277
7882 -277 -81 -75 83 -97 242 -160 -87 -335 -320 42 243 54 36 172 -113 -281 -48 -2 105 136 197 183 -24
7905 -24 -90 -160 -277 142 302 80 -30 20 -108 -289 54 -8 123 68 179 -68 -166 35 -152 -162 284 271 182
7928 182 -71 -125 -211 -51 88 115 124 121 -187 -329 -98 -73 -36 131 266 103 -210 -134 -36 -81 29 171 -92 45
7952 45 53 -83 -137 14 292 11 -112 169 -166 -248 -3 103 -68 23 235 -147 52 97 -280 -213 33 153 -11
7975 -11 167 1 -44 -167 -133 122 112 440 316 -101 -151 -134 -2 -71 147 289 88 -132 48 -58 -105 99 33
7998 33 -244 131 307 -223 -217 -70 81 -90 128 187 -29 -56 -33 -173 -111 92 15 100 116 201 -418 -59 20 20 6
$$ packed form
7833a84o5M48j53P0K98l74j53Rp0p3K57K51qj47m5k08o5J8L20o2J41k8k35j87
7857b45J86r6k6L97J84j41l33n0nO2O9O7J62j96O5l04o1K61O7o5J92j4o8k71j14
7882b77J96OJ58j80L39m02P3k48J5L62K01j89j8J36k85j68K33M6J07L1O1j4k07
7905b4o6p0j17M19J60k22j10N0j28j81L43o2J31n5J11k47r8K01j87j0M46j3q9
7928A82k53n4q6J60J39K7Rll08j42K31K5L7J67J35j63l13P6R8m5J10J42k63J37
7952D5Qj36n4J51K78k81j23K81l35q2K45J06j71R1K12l82J99M5l77O7K46J20j64
7975a1J78j66m5j23L4K55j0L28j24m17n0J7J32o9K18J42k01k20J80j06m7K04o6
7998C3k77L75J76n30OJ47J51j71K18N9k16k7K3j40O2K03p7Q5J6Q5o19L59P9%j4
$$ plain form
8023 6 -130 390 163 7 -285 -161 -105 124 19 -46 97 24 -236 -163 91 251 65 116 88 -52 6 -124 -101
8046 -101 -10 207 48 -60 45 -135 -245 -180 152 143 20 -127 -152 -53 -175 -5 -263 156 412 155 -332 -177
8068 -177 -15 -90 -336 123 203 92 -113 -165 -147 79 97 -118 180 151 8 -459 -56 101 -11 30 193 180 -116
8091 -116 -161 -147 -149 314 218 138 32 331 -66 -513 -284 305 231 242 168 -150 46 -393 -339 -150 385 196 -86
8114 -86 -81 113 -102 -372 -176 183 298 5 -151 -78 49 -50 -89 -170 220 308 -182 -223 203 20 79 31 92 213
8138 213 -42 -428 -527 278 425 302 196 254 149 -447 -611 -169 273 337 43 155 102 180 -326 -463 105 421
8160 421 190 -245 248 103 -141 -390 -65 207 255 115 -20 -125 369 -50 -112 359 392 -150 -387 -328 -114
8181 -114 0 -67 225 301 250 -164 -451 -399 -123 187
$$ packed form
8023Fj36N20k27j56k92J24N6K29j05o5J43p3k60P3K54J60j86N1k8j40N8j30K3
8046a01R1K17j59j08J05j80j10O5L32rj23j47k5R9j22J70k58M19K56k57m87J55
8068a77J62p5k46M59Q0j11k05n2J8K26J8k15K98k9j43m67M03J57j12M1J63j3k96
8091a16m5J4kM63r6q0j06K99l97m47K29N89p4J1p4l18J96m39N4J89N35j89k82
8114h6NJ94k15k70J96L59J15k93j56P3J27r9l9q1L90Q8m90m1M26j83N9m8O1J21
8138B13k55l86r9Q05J47j23j06N8j05n96j64M42M42O4k94J12n3P8n06j37N68L16
8160D21k31m35M93j45k44k49L25K72M8j40j35j05M94m19o2M71L3n42k37N9K14
8181a14J14o7K92P6n1m14k87N2K76L10
8191A87
$$ Imaginary data points
##PAGE= N=2
##DATA TABLE= (X++(I..I)), XYDATA
$$ plain form
0 0 0 0 0 0 0 0 0 0 0 0 0 0 0 -16 16 -16 16 -17 17 -32 33 -36 49 -49 65 -81 82 -98 114 -130 147 -171 195 -221
34 -221 245 -279 313 -350 393 -433 483 -539 595 -662 729 -806 891 -977 1078 -1188 1308
51 1308 -1443 1590 -1755 1946 -2152 2395 -2673 3001 -3389 3858 -4444 5195 -6190 7590 -9697
66 -9697 13220 -20212 39447 -205091 -695338 -350025 32805 121181 140259 358832 412935
77 412935 73192 -413175 -493832 -122259 203900 141522 63345 209805 199890 -182608 -393516
88 -393516 -109405 229639 189406 -16573 -61045 7398 -60333 -228911 -159752 231923 444928
99 444928 139152 -246816 -228435 -75596 -147588 -177301 137385 474185 389118 -34687 -343790
110 -343790 -304007 -131679 -89062 -24282 270129 474885 198845 -251973 -344630 -162247 -79263
$$ packed form
0@%%%%%%%%%%%%%j6L2l2L2l3L4m9O5o9Q5r8J14j46J63j80K12k44K77l18L66m16
34b21M66n24N92o63P43q26R16j022J134j257J391j535J697j868K055k266K496
51A308k751L033l345L701m098M547n068N674o390P247q302R639j1385J3780j7287
66i697K2917l3432N9659k44538m90247L45313L82830Q8376J9078K18573N4103
77D12935l39743m86367q0657L71573L26159o2378p8177J46460r915l82498k10908
88c93516K84111L39044m0233k05979m4472O8443o7731j68578O9159L91675K13005
99D44928l05776l85968J8381J52839p1992k9713L14686L36800q5067m23805l09103
110c43790L9783J72328M2617O4780K94411K04756k76040m50818r2657J82383Q2984
$$ plain form
121 -79263 -59011 110074 308304 253452 -56473 -291893 -194623 44585 72756 -22259 75775
132 75775 217146 40636 -259894 -222066 83808 225953 106960 -20366 -14733 -6059 -136493
143 -136493 -252408 -76640 261870 318211 59096 -109202 -84236 -129089 -237133 -136710
153 -136710 153874 322001 214926 -13910 -136267 -124787 -136451 -169093 -16556 262162
163 262162 294452 29485 -152621 -99196 -49716 -99514 -70575 95303 212886 114999 -111775
174 -111775 -198282 -55692 69748 20382 -6072 104104 116014 -76355 -206122 -101458 69078
185 69078 125114 90708 58181 38903 -36770 -169150 -184372 7417 181955 139426 34348
196 34348 31444 1533 -140512 -206333 -70399 119533 175541 83955 -22148 -37799 -33026 -105649
$$ packed form
121g9263K0252J69085J98230n4852l09925k35420R7270K39208K8171r5015R8034
132G5775J41371j76510l00530L7828L05874J42145j18993j27326N633Q674j30434
143a36493j15915J75768L38510N6341k59115j68298K4966m4853j08044J00423
153a36710K90584J68127j07075k28836j22357J1480j1664l2642J52537K78718
163B62162L2290k64967j82106N3425M9480m9798K8939J65878J17583r7887k26774
174a11775q6507J42590J25440m9366k6454J10176J1910j92369j29767J04664J70536
185F9078N6036l4406l2527j9278p5673j32380j5222J91789J74538m2529j05078
196C4348k904k9911j42045o5821J35934J89932N6008r1586j06103j5651M773p2623
$$ plain form
208 -105649 -134615 17986 180429 126907 -27152 -67290 -32482 -40094 -51414 2126 85466
219 85466 110816 27591 -87744 -94543 -14064 9478 -5032 57155 112740 24715 -104326 -110446
231 -110446 -31649 20122 34853 47172 66317 57137 -29880 -132227 -101337 35620 89152 39372
243 39372 28388 51516 2093 -82648 -92205 -23433 53770 80159 38990 -9506 -14169 -27867
255 -27867 -70582 -47840 43961 72945 19256 -10277 -6852 -29497 -50708 -23789 27403 62886
267 62886 51488 -10919 -51041 -19190 5932 -21398 -11639 56314 67774 -1100 -49422 -41928
279 -41928 -17887 5673 17118 12654 20968 27729 -14466 -58352 -31269 14259 13260 11032 30085
292 30085 16276 -21972 -27092 -10290 -324 13904 20972 8156 6822 11467 -17835 -39005 -200
$$ packed form
208a05649k8966J52601J62443n3522j54059m0138L4808p612j1320N3540Q3340
219H5466K5350q3225j15335o799Q0479K3542j4510O2187N5585q8025j29041o120
231a10446P8797N1771J4731J2319J9145r180q7017j02347L0890J36957N3532m9780
243C9372j0984K3128m9423q4741r557O8772P7203K6389m1169m8496m663j3698
255b7867m2715K2742R1801K8984n3689k9533L425k2645k1211K6919N1192L5483
267F2886j1398o2407m0122L1851K5122k7330R759O7953J1460o8874m8322P494
279d1928K4041K3560J1445m464Q314O761m2195m3886K7083M5528r99k228J9053
292C0085j3809l8248n120J6802R966J4228P068j2816j334M645k9302k1170L8805
$$ plain form
305 -200 34830 10740 -13368 -657 3984 -7961 -10398 -11338 -6870 16474 20072 -11910 -19801 7570
319 7570 9288 -8954 -686 9553 -2062 -192 13016 2996 -7619 4334 5409 -7485 -2421
332 -2421 3205 -6600 2743 20729 870 -26261 -12885 4894 -2617 -1456 10591 6011 1023 2367
346 2367 -15501 -27734 1708 28945 16608 4866 6869 -7859 -20761 -7262 1857 1946 21904
359 21904 32240 1259 -27867 -24048 -16842 -6760 19973 28490 7384 -2197 -5038 -28714 -36954
372 -36954 -2518 27507 30234 26457 7211 -28850 -35710 -10444 2058 10463 35718 38358 2906
385 2906 -25663 -34546 -35303 -8216 36356 42701 15026 -2128 -17761 -42866 -38661 -2403 24291
398 24291 38518 42786 8869 -42476 -50290 -21442 1640 26238 50131 37986 1483 -23635
$$ packed form
305b00L5030k4090k4108J2711M641j1945k437r40M468K3344L598l1982p891K7371
319G570J718j8242Q268J0239j1615J870J3208j0020j0615J1953J075j2894N064
332b421N626r805R343J7986j9859k7131J3376J7779p511J161J2047m580m988J344
346B367j7868j2233K9442K7237j2337j1742K003j4728j2902J3499R119Q9J9958
359B1904J0336l0981k9126L819P206J0082K6733Q517k1106r581k841k3676q240
372c6954L4436L0025K727l777j9246l6061o860K5266J2502Q405K5255K640l5452
385B906k8569q883p57K7087M4572O345k7675j7154j5633k5105M205L6258K6694
398B4291J4227M268l3917n1345p814K8848K3082K4598K3893j2145l6503k5118
$$ plain form
410 -23635 -43064 -49150 -7684 48767 56470 27646 -142 -33006 -57146 -39074 90 27537
422 27537 49138 50471 3707 -50296 -58154 -36392 -5583 40849 67884 38806 -7224 -32046
434 -32046 -49130 -48763 -5626 46585 63638 48370 6316 -52195 -71616 -31786 9354 27853
446 27853 50308 54867 7079 -51416 -68533 -47643 -1051 51958 65323 33318 -1219 -32569
458 -32569 -65156 -54740 8355 56702 59123 43438 9107 -47078 -75657 -47456 6617 54180
470 54180 72571 40183 -14764 -43914 -56259 -62831 -20244 61722 91990 43479 -18234 -52259
482 -52259 -62703 -45151 -4759 38784 74202 71191 4780 -67740 -71415 -30132 494 33849
494 33849 72371 61704 -3349 -58522 -68640 -41587 6911 45306 55088 47272 12326 -58783
$$ packed form
410b3635j9429o086M1466N6451P703k8824k7788l2864k4140J8072L9164K7447
422B7537K1601J333m6764n4003p858K1762L0809M6432K7035k9078m6030k4822
434c2046j7084L67M3137N2211J7053j5268m2054n8511j9421L9830M1140J8499
446B7853K2455M559m7788n8495j7117K0890M6592N3009J3365l2005l4537l1350
458c2569l2587J0416O3095M8347K421j5685l4331n6185k8579K8201N4073M7563
470E4180J8391l2388n4947k9150j2345o572M2587Q1966L0268m8511o1713l4025
482e2259j0444J7552M0392M3543L5418l011o6411p2520l675M1283L0626L3355
494C3849L8522j0667o5053n5173j0118K7053M8498L8395R782p816l4946p1109
$$ plain form
506 -58783 -97884 -44417 35480 58251 48224 42055 12316 -48418 -87986 -65657 10393 84035
518 84035 88292 30770 -14023 -33946 -68532 -80446 -12598 75632 90855 43028 -8349 -46485
530 -46485 -67500 -59965 -19493 45569 91338 58482 -24093 -59428 -39386 -30969 -23582 33539 90333
543 90333 62754 -22875 -77251 -62699 -10257 26354 35339 51734 63711 6110 -91868 -107537
555 -107537 -24351 46193 57265 57223 52061 5507 -69043 -107564 -66682 25938 83720 67944 37031
568 37031 21677 -28844 -100425 -88653 12090 81804 65621 25243 5562 -13636 -49562 -71454
580 -71454 -28178 60949 90885 19228 -49174 -36675 -13389 -31150 -20529 47797 86294 35148
592 35148 -49360 -83148 -48574 1188 21696 42306 83122 71492 -31558 -114587 -82568 -6463
$$ packed form
506e8783l9101N3467P9897K2771j0027o169k9739o0734l9568K2329P6050P3642
518H4035M257n7522m4793j9923l4586j1914O7848Q8230J5223m7827n1377l8136
530d6485k1015P535M0472O5062M5769l2856q2575l5335K0042Q417P387N7121N6794
543I0333k7579q5629n4376J4552N2442L6611Q985J6395J1977n7601r7978j5669
555a07537Q3186P0544J1072m2n162m6554p4550l8521M0882R2620N7782j5776l0913
568C7031j5354n0521p1581J1772J00743O9714j6183m0378j9681j9198l5926k1892
580g1454M3276Q9127K9936p1657o8402J2499K3286j7761J0621O8326L8497n1146
592C5148q4508l3788L4574M9762K0508K0610M0816j1630j03050q3029L2019P6105
$$ plain form
604 -6463 24500 40624 78283 83901 11090 -88911 -118526 -48618 35060 47842 31262 53383
616 53383 55763 -28699 -108364 -70271 25467 57719 28071 9091 15762 3295 -41945 -59186
628 -59186 3238 75835 54503 -22216 -40123 -12899 -24518 -43428 7913 84683 82735 490
640 490 -69879 -69401 -32914 -20237 -9497 56008 119576 67627 -57900 -104232 -52997 -13030 -9804
653 -9804 23505 85524 93712 14208 -78991 -87364 -21106 17703 4178 19404 66335 44548 -44169
666 -44169 -75735 -17117 31730 18676 -3576 7609 19080 -13872 -59175 -33255 53414 80128
678 80128 11608 -38373 -15328 -8131 -52125 -51915 31695 101847 74002 -10963 -56703 -40885 -29183
691 -29183 -48780 -25298 65628 109861 37734 -47667 -50825 -25838 -35842 -36562 17054 75484 64241
$$ packed form
604f463L0963J6124L7659N618p2811j00001k9615O9908Q3678J2782j6580K2121
616E3383K380q4462p9665L8093R5738L2252k9648j8980O671j2467m5240j7241
628e9186O2424P2597k1332p6719j7907K7224j1619j8910N1341P6770j948q2245
640D90p0369M78L6487J2677J0740O5505O3568n1949j25527m6332N1235L9967L226
653i804L3309O2019Q188p9504r3199q373O6258L8809j3525J5226M6931k1787q8717
666d4169l1566N8618M8847j3054k2252J1185J1471l2952m5303K5920Q6669K6714
678H0128o8520m9981K3045P197m3994K10Q3610P0152k7845q4965m5740J5818J1702
691b9183j9597K3482R0926M4233p2127q5401l158K4987j0004p20N3616N8430j1243
$$ plain form
704 64241 -7864 -52708 -24492 8875 -12226 -24972 27228 62578 6631 -57516 -33816 27920
716 27920 34946 -1102 -11766 12676 13407 -37051 -66668 -8247 67912 55847 -4728 -14025 4117
729 4117 -25670 -66703 -38186 37644 73756 41660 -4422 -12918 -7661 -37120 -61873 -11018 65503
742 65503 60796 -2130 -19981 4650 -5275 -43096 -37499 17949 54017 22582 -30661 -27692 16163
755 16163 15548 -25881 -18582 33772 33814 -23580 -44506 -4076 29479 18356 -2274 5375 22008
768 22008 278 -45920 -42549 15984 42192 10000 -4622 20113 14689 -34230 -54126 -14485
780 -14485 31030 31051 1549 -4938 17132 11971 -33909 -45418 7302 42928 12851 -17277 1226
793 1226 20199 431 -24787 -15693 15898 24373 -4600 -24447 -710 20404 -2536 -21960 4985
$$ packed form
704F4241p2105m4844K8216L3367k1101j2746N2200L5350n5947o4147K3700O1736
716B7920P026l6048j0664K4442P31n0458k9617N8421P6159j2065o0575r297J8142
729D117k9787m1033K8517P5830L6112l2096m6082q496N257k9459k4753N0855P6521
742F5503m707o2926j7851K4631r925l7821N597N5448L6068l1435n3243K969M3855
755A6163o15m1429P299N2354M2n7394k0926M0430L3555j1123k0630P649J6633
768B2008k1730m6198L371N8533K6208l2192j4622K4735n424m8919j9896L9641
780a4485M5515K1k9502o487K2070n161m5880j1509N2720L5626l0077l0128J8503
793A226J8973j9768k5218R094L1591Q475k8973j9847K3737K1114k2940j9424K6945
$$ plain form
806 4985 26684 -154 -28298 -13850 12398 11459 -6406 -7508 14827 23599 -7173 -33920 -8671
819 -8671 25711 10269 -18038 -2067 25371 12693 -17888 -20973 1181 14381 1436 -14999
831 -14999 -2828 20130 8874 -19452 -12406 13065 6019 -16194 -8534 13693 13525 -2714 -8925
844 -8925 698 10061 -231 -17097 -5669 22246 16492 -13606 -14194 9579 8453 -12460 -12721 6953
858 6953 16915 5187 -13465 -15773 2319 9281 -5558 -6819 14153 15378 -9483 -18167 -2758
871 -2758 5633 2580 4902 10192 9432 -225 -15683 -17522 2912 15761 4258 -1116 11151 6581
885 6581 -19073 -24982 -3556 14386 15588 6822 -2205 -4292 -4804 -15031 -17247 7336 28405 16608
899 16608 -3534 -7209 -9476 -15655 -8412 8987 19081 18585 6722 -11902 -19702 -12722 -7133 392
$$ packed form
806D985K1699k6838k8144J4448K6248r39j7865j102K2335Q772l0772k6747K5249
819h671L4382j5442k8307J5971K7438j2678l0581l085K2154J3200j2945j6435
831a4999J2171K2958j1256k8326P046K5471p046k2213P660K2227j68j6239o211
844h925R623R363j0292j6866J1428K7915n754l0098n88K3773j126k0913k61J9674
858F953R962j1728j8652k308J8092O962j4839j261K0972J225k4861q684J5409
871b758Q391l053K322N290p60r657j5458j839K0434J2849j1503n374J2267m570
885F581k5654n909K1426J7942J202q766r027k087n12j0227k216K4583K1069j1797
899A6608k0142l675k267o179P243J7399J0094m96j1863j8624p800O980N589P525
$$ plain form
913 392 19845 26859 4024 -18835 -19154 -12517 -7288 5399 18242 20492 12026 -7223 -27360 -23509
927 -23509 1457 16316 16008 17246 12569 -8794 -25192 -20978 -7015 10292 25752 22786 2931
940 2931 -13496 -22333 -25013 -9854 16192 25326 16881 7302 -7682 -27268 -27936 -5730 16128 27457
954 27457 25947 6554 -17201 -23585 -18194 -10384 8946 31301 28993 4939 -16243 -27633 -27202
967 -27202 -7515 17578 25399 20457 9784 -12146 -32169 -27457 -6051 13568 28968 30733 7638
980 7638 -19990 -27645 -21613 -8826 14245 32353 27060 8009 -12492 -31276 -32578 -6841 21078
993 21078 29062 23713 8836 -16904 -33565 -26750 -8180 12278 32418 33207 6571 -21756 -31222
1006 -31222 -26418 -8437 19603 34768 26036 8163 -12803 -33509 -33274 -5842 21848 32525 28712
$$ packed form
913C92J9453P014k2835k2859l19O637N229J2687J2843K250q466j9249k0137L851
927b3509K4966J4859l08J238m677k1363j6398M214J3963J7307J5460k966j9855
940B931j6427q837k680J5159K6046R134q445r579j4984j9586o68K2206K1858J1329
954B7457j510j9393k3755o384N391P810J9330K2355k308k4054k1182j1390M31
967b7202J9687K5093P821m942j0673k1930k0023M712K1406J9619J5400J765k3095
980G638k7628p655O032J2787K3071J8108n293j9051k0501j8784j302K5737K7919
993B1078P984n349j4877k5740j6661O815J8570K0458K0140P89k6636k8327r466
1006c1222M804J7981K8040J5165q732j7873k0966k0706K35K7432K7690J0677l813
$$ plain form
1019 28712 7806 -22031 -35017 -24857 -7885 13211 33934 32531 5357 -21323 -33434 -30688
1031 -30688 -7717 23074 34544 24503 7932 -14261 -34964 -30720 -4207 20159 32872 31997
1043 31997 8328 -23841 -35645 -25176 -6363 17508 35050 27574 3740 -17897 -33733 -34683
1055 -34683 -8225 26393 36541 24194 4861 -18456 -34196 -27333 -5239 17965 36381 34902
1067 34902 5230 -25889 -32889 -23438 -7130 18603 36632 27741 2486 -19759 -33771 -29967 -4899
1080 -4899 21029 31530 27683 7324 -24871 -38960 -21774 1693 16618 29558 30728 8080
1092 8080 -21972 -36304 -28488 -1756 27630 34340 19761 4140 -13143 -34808 -34936 -4701 25396
1105 25396 32802 23647 4551 -19848 -32724 -26793 -7928 18627 36701 25615 -2046 -17352
$$ packed form
1019B8712k0906k9837j2986J0160J6972K1096K0723j403k7174k6680j2111K746
1031c0688K2971L0791J1470j0041j6571k2193k0703M244K6513K4366J2713q75
1043C1997k3669l2169j1804J0469J8813K3871J7542p476k3834k1637j5836r50
1055c4683K6458L4618J0148j2347j9333k3317j5740O863K2094K3204J8416j479
1067C4902k9672l1119p000R451J6308K5733J8029q891k5255k2245j4012L804K5068
1080d899K5928J0501l847k0359l2195j4089J7186K3467J4925J2940J170k2648
1092H080l0052j4332P816K6732K9386O710j4579j5621j7283k1665j28L0235L0097
1105B5396P406r155j9096k4399j2876N931J8865K6555J8074j1086k7661j5306
$$ plain form
1117 -17352 -22354 -25552 -11050 21440 38356 23798 -3137 -22259 -27041 -16072 -777 12780
1129 12780 28610 31393 2713 -33287 -36459 -14237 3855 16253 28448 26563 4240 -23307
1141 -23307 -37410 -26570 3676 25311 26541 22066 12909 -14761 -39841 -28682 3998 21658
1153 21658 22149 18647 8971 -8673 -26395 -30347 -8863 23785 30584 7577 -7938 -6275 -13209
1166 -13209 -23823 -9268 21146 31982 14765 -10036 -22640 -17991 -8198 -1393 14013 34388
1178 34388 27099 -9893 -32658 -23240 -9890 -3142 13168 32687 30035 2073 -28690 -36406 -15752
1191 -15752 5417 8497 13315 28540 20823 -16976 -37876 -18425 7314 12690 9437 10861 11687
1204 11687 489 -19917 -23402 2274 24708 13785 -5344 -3374 -919 -15826 -19968 3675 26928
$$ packed form
1117a7352n002l198J4502L2490J6916j4558k6935j9122m782J0969J5295J3557
1129A2780J5830K783k8680l6000l172K2222J8092J2398J2195j885k2323k7547
1141b3307j4103J0840L0246K1635J230m475r157k7670k5080J1159L2680J7660
1153B1658M91l502r676j7644j7722l952K1484L2648O799k3007j5515J663o934
1166a3209j0614J4555L0414J0836j7217k4801j2604M649R793O805J5406K0375
1178C4388p289l6992k2765R418J3350O748J6310J9519k652k7962l0763p716K0654
1191a5752K1169L080M818J5225p717l7799k0900J9451K5739N376l253J424Q26
1204A1687j1198k0406l485K5676K2434j0923j9129J970K455j4907m142K3643K3253
$$ plain form
1217 26928 22804 319 -15830 -15380 -11082 -14679 -8235 22138 41982 16855 -19587 -23000 -10157
1230 -10157 -10933 -12371 7638 32300 31427 2167 -25225 -22036 -3203 -2195 -8385 8420 28597
1243 28597 13285 -17682 -19828 -857 5374 -2148 -2670 7344 10769 -4913 -20254 -6365 20618
1256 20618 18075 -6023 -8289 5949 -1744 -22267 -15559 14862 30242 15118 -7599 -12004 -3523
1269 -3523 -9094 -23716 -10493 25225 32392 4092 -12884 -4634 -3408 -16717 -17017 4346 24038
1282 24038 18231 -3241 -9985 2983 3836 -14771 -14339 12216 20141 -3270 -15410 1487 14220
1295 14220 2959 -11832 -6936 8837 6898 -14656 -18945 8054 24255 4831 -12145 469
1307 469 9410 -7951 -22025 -7342 15694 18686 3580 -4910 4020 6318 -13242 -23341 -518
$$ packed form
1217B6928m124k2485j6149M50M298l597O444L0373J9844k5127l6442l413J2843
1230a0157p76j438K0009K4662q73k9260k7392L189J8833J008o190J6805K0177
1243B8597j5312l0967k146J8971O231p522n22J0014L425j5682j5341J3889K6983
1256B0618k543k4098k266J4238p693k0523O708L0421J5380j5124k2717m405Q481
1269c523n571j4622J3223L5718P167k8300j6976Q250J226j3309l00K1363J9692
1282B4038n807k1472o744J2968Q53j8607M32K6555P925k3411j2140J6897J2733
1295A4220j1261j4791M896J5773j939k1554m289K6999J6201j9424j6976J2614
1307D69Q941j7361j4074J4683K3036K992j5106q490Q930K298j9560j0099K2823
$$ plain form
1320 -518 20772 8434 -8073 1751 13422 -80 -18812 -14964 5250 12890 -996 -11100 4162
1333 4162 19179 2722 -19248 -8466 12517 5640 -12763 -7074 12412 14977 -913 -10847 -1922
1346 -1922 8841 -793 -15651 -5458 15516 9884 -10631 -7137 10233 6501 -11479 -12098 3573
1359 3573 10733 -211 -11508 -1654 16025 9639 -12709 -11279 9111 8313 -11824 -11743 9921 18319
1373 18319 3377 -9919 -5998 3996 -21 -13205 -7662 14509 17639 -3724 -12815 320 3759
1386 3759 -9311 -10380 6627 16618 6492 -8939 -9601 2938 5223 -6560 -6463 12858 16961 -5773
1400 -5773 -18685 -3915 9371 3221 -4177 1770 10208 4416 -12913 -18186 -672 14665 6436
1413 6436 -3552 4156 7949 -8146 -18728 -5675 11375 12642 4398 -417 1060 -1045 -11806 -14554
$$ packed form
1320e18K1290j2338j6507R824J1671j3502j8732L848K0214P640j3886j0104J5262
1333D162J5017j6457k1970J0782K0983o877j8403N689J9486K565j5890r934Q925
1346a922J0763r634j4858J0193K0974n632k0515L494J7370l732j7980o19J5671
1359C573P160j0944j1297R854J7679o386k2348J430K0390p98k0137Q1K1664Q398
1373A8319j4942j3296L921R994m017j3184N543K2171L130k1363r091J3135L439
1386C759j3070j069J7007R991j0126j5431o62J2539K285j1783R7J9321M103k2734
1400e773j2912J4770J3286o150p398N947Q438n792j7329n273J7514J5337q229
1413F436r988P708L793j6095j0582J3053J7050J267q244m815J477k105j0761k748
$$ plain form
1427 -14554 4383 21076 10308 -7024 -5250 918 -7204 -13904 -2053 15258 17218 2436 -12656
1440 -12656 -11369 -1964 -2561 -5825 6906 20903 10753 -10929 -14904 -5890 -1147 601 6817 13385
1454 13385 11676 -2559 -17312 -14654 847 7022 2991 7539 13222 629 -18166 -17992 -2104
1467 -2104 9662 10523 6661 3253 1094 -7792 -18333 -11608 11028 20421 9709 -46 -2270 -8524
1481 -8524 -15199 -9412 5458 16934 16530 3856 -9309 -12121 -10939 -10290 -125 17596 20015 3331
1495 3331 -10103 -11609 -11059 -8027 1606 12758 17983 10904 -6924 -18996 -12532 105 4559 8161
1509 8161 15450 11436 -5821 -17837 -15415 -4812 7307 14433 12203 4971 -3899 -15251 -19365 -6285
1523 -6285 10306 14830 11815 7419 -3349 -16827 -18057 -6073 8367 17804 16150 4262 -6915
$$ packed form
1427a4554J8937J6693j0768j7332J774O168q122o700J1851J7311J960j4782j5092
1440a2656J287R405n97l264J2731J3997j0150k1682l975R014M743J748O216O568
1454A3385j709j4235j4753K658J5501O175m031M548N683j2593j8795J74J5888
1467b104J1766Q61l862l408k159q886j0541O725K2636R393j0712r755k224o254
1481h524o675N787J4870J1476m04j2674j3165k812J182O49J0165J7721K419j6684
1495C331j3434j506N50L032R633J1152N225p079j7828j2072O464J2637M454L602
1509H161P289m014j7257j2016K422J0603J2119P126k230p232q870j1352m114J3080
1523f285J6591M524l015m396j0768j3478j230J1984J4440R437j654j1888j1177
$$ plain form
1536 -6915 -11769 -14806 -11237 5502 20169 16772 3184 -7770 -14790 -15285 -6297 5843 13783 16083
1550 16083 8144 -8320 -18325 -13787 -4394 5333 15993 18128 5540 -8620 -14799 -14205 -6350 7548
1564 7548 16308 15074 7151 -5799 -18707 -17807 -3535 8684 13349 14172 7305 -7186 -17181 -15763
1578 -15763 -6913 6625 18423 16373 3421 -7875 -13944 -15581 -6697 8841 16768 14295 6735
1591 6735 -5955 -17772 -16316 -3780 7857 15326 15690 4918 -9469 -15666 -13637 -7038 5866
1604 5866 17686 15889 3447 -8112 -15516 -15492 -4130 9529 14728 13416 6992 -6422 -17070 -14521
1618 -14521 -3567 7545 15657 15638 3811 -9526 -14241 -12948 -6382 6614 16103 13343 3881 -6743
1632 -6743 -15907 -15845 -3312 9337 13710 12550 5730 -6985 -15106 -12333 -3946 6312 16140 15365 2782
$$ packed form
1536f915m854l037L569J6739J4667l397j3588j0954p020m95Q988J2140P940K300
1550A6083p939j6464j0005M538R393R727J0660K135j2588j4160o179N94P855J3898
1564G548Q760j234p923j2950j2908R00J4272J2219M665Q23o867j4491r995J418
1578a5763Q850J3538J1798k050j2952j1296o069j637Q884J5538P927k473p560
1591F735j2690j1817J456J2536J1637P469L64j0772j4387o197K029O599J2904
1604E866J1820j797j2442j1559p404K4J1362J3659N199j312o424j3414j0648K549
1618a4521J0954J1112Q112j9j1827j3337m715J293O566J2996R489k760r462j0624
1632f743r164O2J2533J2649M373j160o820j2715q121K773Q387J0258R828p75j2583
$$ plain form
1647 2782 -9018 -13175 -12235 -5109 7586 14665 11353 3637 -6219 -15383 -14538 -2804 8238 13018
1661 13018 12546 4217 -8610 -13732 -10054 -3766 5301 14667 14120 2916 -7650 -13110 -12068 -2749
1675 -2749 8777 12456 9253 4340 -4998 -14790 -13258 -2293 7239 11964 11293 3044 -8002 -11997
1689 -11997 -9962 -3972 5992 13576 10555 1827 -4756 -10316 -11998 -3371 8809 12243 8666 1898
1703 1898 -5617 -10843 -8825 -3034 4079 11811 11974 569 -10189 -10433 -6661 -2561 4757 11015 9611
1718 9611 2125 -6066 -11994 -9470 43 7219 8566 9233 5054 -6201 -12405 -7391 -62 4156 7754
1733 7754 8366 3566 -4204 -9870 -9972 -2265 7356 8139 2568 1033 -233 -6820 -9857 -2141 7002 8884
1749 8884 5175 -791 -4785 -5088 -3991 -2989 3603 10713 7483 -2739 -6596 -4847 -5339 -3477 3965
$$ packed form
1647B782j1800m157R40P126J2695P079l312p716r856r164Q45J1734J1042M780
1661A3018m72q329j2827n122L678O288R067R366n47j1204j0566n460J042R319
1675b749J1526L679l203m913r338r792J532J0965R532M725o71q249j1046l995
1689a1997K035N990R964P584l021q728o583n560j682Q627J2180L434l577o768
1703A898p515n226K018N791P113P732J63j1405j0758k44L772M100P318O258j404
1718I611p486q191n928K524R513P176J347O67m179j1255o204N014P329M218L598
1733G754O12m800p770n666j02P707R621P83n571j535j266o587l037P716R143J882
1749H884l709n966l994l03J097J002O592P110l230j0222l857J749m92J862P442
$$ plain form
1764 3965 9623 7430 206 -7049 -8250 -3737 -610 -417 4782 10838 5272 -6601 -8737 -2360 957
1779 957 754 1985 4729 5187 384 -6800 -6736 1804 5658 403 -1408 2725 797 -5961 -5555 1764
1795 1764 5905 3616 -530 -2353 -1076 -2187 -5936 -2921 7408 10088 1009 -4831 -988 -139 -5201
1810 -5201 -5435 2214 8693 7077 -1121 -5706 -2105 894 -4035 -5906 3018 8667 1975 -4713 -1611
1825 -1611 2016 -412 -3938 -2217 2429 3940 -1020 -4112 1813 6546 338 -5898 -938 4446 -697
1840 -697 -6228 -1219 6099 5624 -1237 -4794 -603 3052 -2123 -7872 -1488 8155 4646 -3994 -2154
1855 -2154 4003 1657 -5154 -5285 865 4773 1915 -2082 1227 6603 1585 -7627 -5322 3149 2217
1870 2217 -3865 -1155 6795 6212 -2177 -7495 -3572 2460 901 -4461 -1048 8223 6329 -5444 -7330
$$ packed form
1764C965N658k193p224p255j201M513L127J93N199O056n566j1873k136O377L317
1779I57k03J231K744M58m803p184O4Q540L854n255j811M133j928o758M06P319
1795A764M141k289m146j823J277j111l749L015J0329K680r079n840L843Q49n062
1810e201k34P649O479j616q198m585L601K999m929j871Q924N649o692o688L102
1825a611L627k428l526J721M646J511m960l092N925M733o208o236M960N384n143
1840f97n531N009P318m75o861l557M191L655n175n749O384R643l509q640J840
1855b154O157k346o811j31O150L908k858l997L309N376n018r212K305Q471r32
1870B217o082K710P950n83q389n318L923O032j559n362L413R271j894j1773j886
$$ plain form
1885 -7330 1326 3962 -2008 -3621 2187 5802 1485 -4995 -3652 4097 4843 -3021 -4837 2354 3448
1900 3448 -4808 -5786 3503 8070 1962 -4548 -3389 742 -582 -5907 -3160 7870 11117 -67 -7704
1915 -7704 -2112 2103 -3546 -5792 2775 10374 6378 -3339 -7287 -2268 1325 -2460 -3237 5108 9412
1930 9412 126 -8773 -4586 2361 880 -2053 1677 6291 3313 -5876 -9125 -839 7304 3745 -2065
1945 -2065 2156 5797 -2473 -11268 -5610 5821 8767 2698 -1304 -10 -25 -5715 -9593 -857 10567
1960 10567 8404 -1583 -3635 -401 -3086 -7593 -2499 7576 10117 3240 -4868 -4944 -1309 -2011 -4433
1975 -4433 2539 11922 7475 -5898 -9529 -3119 270 -1252 550 6948 8737 520 -10340 -10358 -310
1990 -310 5141 1655 2399 7543 4030 -7398 -10909 -3049 5032 5791 3669 2944 2486 -3001 -9941 -7591
$$ packed form
1885g330Q656K636n970j613N808L615m317o480J343P749P46p864j816P191J094
1900C448q256r78R289M567o108o510J159M131j324n325K747J1030L247j1184p637
1915g704N592M215n649k246Q567P599l996r717l948N019L593l785p77Q345M304
1930I412r286q899M187O947j481k933L730M614k978r189l249Q286Q143l559n810
1945b065M221L641q270q795N658J1431K946o069m002J294j5n690l878Q736J1424
1960A0567k163r987k052L234k685m507N094J0075K541o877q108p6L635p02k422
1975d433O972R383m447j3373l631O410L389j522J802O398J789q217j0860j8J0048
1990c10N451l486P44N144l513j1428l511P860Q081P59k122p25m58n487o940K350
$$ plain form
2006 -7591 4550 10393 3949 -1252 38 -1654 -8255 -8464 1308 10600 9741 531 -5554 -4828 -3402
2021 -3402 -6072 -3246 8053 13512 5081 -5775 -7377 -4778 -3689 -1423 4745 10083 8169 -1866
2035 -1866 -9784 -7399 -993 149 1166 7316 8589 -839 -9887 -8590 -1172 3487 4163 3960 4717 1971
2051 1971 -6311 -11525 -4524 7226 8940 3959 2015 536 -5720 -10350 -6207 3704 10302 9043 1764
2066 1764 -3529 -5244 -7984 -8316 397 10622 10305 2362 -3187 -4795 -6731 -6160 -609 6986 10835
2081 10835 5842 -3929 -7875 -4460 -1593 -937 3932 9262 6133 -3539 -9030 -7103 -1819 3104 5324
2096 5324 5427 4289 -1064 -8874 -9922 -1983 5116 6338 6138 5062 -1212 -8419 -9277 -3687 3875 8562
2112 8562 7179 2551 -563 -4989 -9585 -7010 2774 9158 6940 1735 -1837 -5213 -6944 -4866 492
$$ packed form
2006g591J2141N843o444n201J290j692o601k09R772R292q59r210o085P26J426
2021c402k670K826J1299N459q431j0856j602K599J089K266O168N338j914j0035
2035a866p918K385O406J142J017O150J273r428r048J297P418M659O76k03P57k746
2051A971q282n214P001J1750J714m981j944j479o256m630M143R911O598j259p279
2066A764n293j715k740l32Q713J0225l17p943n549j608j936N71N551P595L849
2081A0835m993r771l946L415K867O56M869N330l129r672n491J927N284M923K220
2096E324J03j138n353p810j048P939P099J222k00j076o274p207q58N590P562M687
2112H562j383m628l114m426m596K575R784O384k218n205l572l376j731K078N358
$$ plain form
2127 492 6660 8774 3527 -4135 -6309 -4946 -3117 817 7210 8308 2792 -3368 -6298 -6266 -2823 2491
2143 2491 6086 7052 4287 -2948 -9031 -7130 -1292 2498 4928 6809 4479 -2163 -7454 -7638 -3519
2158 -3519 3286 7369 5836 2488 -684 -5059 -7678 -3610 3422 6357 6089 3320 -1873 -6413 -6123
2173 -6123 -2779 1687 6222 6354 1869 -3011 -4948 -5929 -4000 2002 7202 6072 1678 -2499 -5758
2188 -5758 -5501 -1670 2387 4928 6298 3552 -2892 -6702 -5085 -1495 1928 5437 5789 1569 -2703
2203 -2703 -4899 -5651 -2993 2433 5414 4587 2154 -1792 -5660 -5344 -1055 2606 4252 4976 2670 -2092
2219 -2092 -4725 -4219 -2155 2110 5726 4914 634 -2267 -3902 -4634 -2219 2061 4342 3742 2030 -1929
2235 -1929 -5464 -4323 -748 1708 3659 4324 1519 -2260 -3662 -3494 -2138 1467 5022 4034 649 -1797
$$ packed form
2127D92O168K114n247p662k174J363J829L934O393J098n516o160k930L2L443N314
2143B491L595R66k765p235o083J901N838L790K430J881k330o642n291j84M119
2158c519O805M083j533l348l172m375k619M068P032K935k68k769n193m540K90
2173f123L344M466M535J32m485m880j937r81J929O002N200j130m394m177l259
2188e758K57L831M057K541J370k746o444l810J617L590L423L509L52m220m272
2203b703k196p52K658N426K981q27k433l946l868L16M289L661J646P24k306m762
2219b092k633N06K064M265L616q12m280k901j635p32K415M280K281o00j712l959
2235a929l535J141L575K456J951O65k805l779j402J68J356L605L555r88l385k446
$$ plain form
2251 -1797 -3634 -3858 -911 1969 2983 2944 1844 -1744 -4747 -3594 -950 1349 3418 3394 770 -2004
2267 -2004 -2451 -2812 -1624 1628 3921 3105 1057 -1065 -3238 -3347 -510 1925 2200 2559 1376 -1200
2283 -1200 -3203 -2403 -1183 784 3078 2919 -313 -1862 -1949 -2009 -1510 1231 2585 2229 1201 -819 -2937
2300 -2937 -2270 294 1350 1891 2185 1220 -1147 -2085 -1146 -772 203 2022 1960 99 -1066 -1809 -2102 -398
2318 -398 1190 708 300 1268 389 -1902 -2112 57 1058 1116 1062 52 -387 -229 -675 -1080 286 1856
2336 1856 795 -845 -165 -503 -1395 -664 734 716 493 157 -592 -711 -137 -436 -809 995 1954 55
2354 55 -1390 -90 800 -372 -746 -336 526 1078 592 -875 -523 882 34 -1641 -674 1041 508 -432
2372 -432 36 317 -194 -523 -668 -404 684 708 -526 -50 1380 212 -2035 -523 1705 957 -654 -792
$$ packed form
2251a797j837k24K947K880J014l9j100l588l003J153K644K299K069k4k624k774
2267b004m47l61J188L252K293q16k048k122k173j09K837K435K75L59j183k576
2283a200k003Q00J220J967K294j59l232j549q7o0M99K741J354l56j028k020k118
2300b937O67K564J056N41K94r65k367r38R39L74R75J819o2j861j165p43k93J704
2318c98J588m82m08R68q79k291k10K169J001N8n4j010m39J58m46m05J366J570
2336A856j061j640O80l38q92P31J398j8k23l36p49j19N74k99l73J804R59j899
2354E5j445J300Q90j172l74M10Q62N52m86j467L52J405q48j675R67J715n33r40
2372d32M68K81n11l29j45K64J088K4j234M76J430j168k247J512K228p48j611j38
$$ plain form
2390 -792 46 404 -112 -907 -143 1955 1304 -1957 -2244 75 398 -688 29 1999 1639 -578 -1779 -1788
2408 -1788 -300 718 602 956 2335 1409 -2199 -3100 -236 857 -42 317 2062 1657 -1000 -2988 -2280
2425 -2280 626 2343 267 -795 1021 963 -2064 -2919 338 2699 1739 -59 -683 -635 -720 -1684 -618
2442 -618 2218 3736 877 -2356 -1416 -632 -2017 -1579 2054 4068 1914 -1409 -3050 -1954 -525 -650
2458 -650 -399 3044 4340 482 -3870 -2946 254 431 62 1445 2792 1631 -1870 -3951 -2062 1785
2474 1785 2155 341 1013 1876 -1296 -4353 -2351 2033 2929 1569 395 97 -841 -3081 -3755 -186 4665
2491 4665 4154 -21 -1402 -312 -1476 -3514 -1607 3192 4566 2198 -1795 -2948 -1648 -996 -1818 672
2507 672 4619 3802 -1477 -3878 -2102 -640 -587 741 3442 3689 314 -3665 -4186 -643 1912 1140 1383
$$ packed form
2390g92Q38L58n16p95P64K098o51l261k87K319L23j086P17J970l60k217j201r
2408a788J488J018j16L54J379r26l608r01K864J093q99L59J745m05k657j988P08
2425b280K906J717k076j062J816n8l027q55L257K361r60j798o24M8q5r64J066
2442f18K836J518k859l233R40P84j385M38L633K014k154l323j641J096J429j25
2458f50K51L443J296l858m352R24L200J77l69J383J347j161l501k081J889L847
2474A785L70j814O72Q63l172l057K002M384Q96j360j174k98r38k240o74L569M851
2491D665n11m175j381J090j164k038J907M799J374k368l993j153J300O52q22K490
2507F72L947q17n279k401J776J462N3J328K701K47l375l979n21L543K555p72K43
$$ plain form
2524 1383 3662 2011 -3453 -5323 -1872 2162 2607 1522 1312 1058 -854 -4451 -4378 889 4665 2678
2540 2678 -205 -71 -643 -3328 -3678 358 4061 4198 1244 -1651 -1922 -1614 -2620 -1417 3514 5997
2556 5997 1906 -3021 -3315 -1872 -1752 -1340 1631 4767 4166 -879 -4983 -3816 -284 436 187 2892
2572 2892 4586 802 -3988 -4363 -992 1483 1798 1972 2419 1282 -2149 -4561 -2305 2376 3409 976
2588 976 746 856 -2033 -4617 -3044 1937 4682 3345 19 -1697 -1571 -2568 -3911 -327 5259 5605
2604 5605 1080 -2087 -2192 -2544 -2732 -979 2687 4951 3190 -1331 -3692 -2410 -1228 -1387 745 4232
2620 4232 3504 -982 -3448 -2364 -667 333 846 2259 2691 503 -3682 -4335 -237 2990 2584 1291
2636 1291 1593 243 -3270 -4655 -2073 1883 4133 3247 711 -682 -2065 -4307 -3603 965 4324 3318
$$ packed form
2524A383K279j651n464j870L451M034M45j085k10k54j912l597P3N267L776j987
2540B678k883J34n72k685l50M036L703J37k954k895k71L08j006J203M931K483
2556E997m091m927k94J443J20M12K971L136o01n045m104J167L532P20k49K705
2572B892J694l784m790l75L371K475L15J74M47j137l431k412K256M681J033k433
2588I76k30J10k889k584J573M981K745j337l326j716J26r97j343L584N586L46
2604E605m525l167j05l52j88J753L666K264j761m521k361J282J182j59K132L487
2620D232p28m486k466J084J697J000N13J413M32k188m185o53M098L227m06j293
2636A291L02j350l513j385K582L956K250q86k536j393j383k242P04M568L359j006
$$ plain form
2652 3318 999 -217 -1492 -3176 -3226 -420 3120 4266 1771 -1386 -1813 -974 -1796 -1466 1654 3781
2668 3781 1698 -1865 -2847 -1983 -244 668 1385 1966 1722 -815 -3834 -3154 183 1738 1877 2493 2076
2685 2076 -895 -3491 -3392 -1128 1836 2828 2530 1365 412 -2234 -4479 -2457 1469 2921 1777 987
2701 987 228 -1415 -2737 -2277 -120 2469 2870 669 -1343 -1027 -1205 -1647 -65 2369 2350 397 -1043
2718 -1043 -1740 -1908 -663 635 1622 2595 1379 -1775 -3124 -1836 -420 82 1355 2841 1647 -967
2734 -967 -2800 -2384 -742 1376 1839 1436 1602 488 -1736 -2790 -1083 1020 1488 1526 1150 -199 -1446
2751 -1446 -1872 -1039 177 1662 1550 203 -401 -819 -1782 -1405 924 2165 1398 233 -625 -1310 -1206 -547
2769 -547 223 1435 2330 1112 -1175 -1755 -856 -629 83 1330 1537 504 -295 -1326 -1778 -754 569
$$ packed form
2652C318k319j216j275j684n0K806L540J146k495l157m27Q39q22L30L120K127
2668C781k083l563r82Q64J739R12P17N81k44k537l019O80L337J555J39O16m17
2685B076k971k596R9K264K964R92k98j165r53k646k245K022L926J452j144p90
2701I87p59j643j322M60K157K589M01k201k012L16j78m42J582K434j9j953j440
2718a043o97j68J245J298R87R73j216l154j349J288J416N02J273J486j194k614
2734i67j833M16J642K118M63m03J66j114k224j054J707K103M68L8l76j349j247
2751a446m26Q33J216J485j12j347o04m18r63L77K329J241p67j165q58o85J04O59
2769e47P70J212Q95j218k287n80Q99K27P12J247K07j033p99j031m52J024J323
$$ plain form
2786 569 1057 1032 1050 -305 -1524 -1097 -119 194 684 1372 816 -392 -950 -1076 -389 576 1264 557 -173 17
2806 17 -608 -1202 -505 379 895 803 630 -507 -890 -567 -277 47 753 925 371 -478 -443 -785 -744 439 990
2827 990 533 163 21 -663 -653 -51 141 196 708 662 -395 -782 -333 -25 -17 465 232 -21 187 -100 -451
2848 -451 -629 485 523 143 155 -45 -425 -447 191 92 -195 407 271 -223 -159 -200 -440 -102 402 103 -281 188
2870 188 260 -34 -292 4 39 53 362 221 -399 76 301 -308 -383 -100 26 65 325 100 -282 -245 182 -245
2892 -245 -364 247 372 123 151 -197 -598 -65 445 396 160 391 258 -191 -239 -262 -283 243 752 333 -401 -384
2914 -384 -239 -589 -98 467 358 340 162 -489 -1021 -473 105 397 584 615 -300 -514 -310 -242 -211 452 1059
2935 1059 633 -91 -363 -673 -547 273 464 539 650 573 -745 -1224 -530 191 402 752 651 -258 -681 -647
$$ packed form
2786E69M88k5J8j355j219M27R78L13M90O88n56j208n58j26O87R65O88p07p30J90
2806A7o25n94O97Q84N16r2j73j137l83L23K90L24P06J72n54q49L5l42M1J183N51
2827I90m57l70j42o84J0O02J92N5N12m6j057l87M49L08QM82k33k53K08k87l51
2848d51j78J114L8l80J2k00l80k2O38r9k87O02j36m94O4m1k40L38N04k99l84M69
2870A88P2k94k58K96L5J4L09j41o20M75K25o09p5K83J26L9K60k25l82L7M27m27
2892b45j19O11J25k49K8l48m01N33N10m9k36K31j33m49m8k3k1N26N09m19p34J7
2914c84J45l50M91N65j09j8j78o51n32N48N78K92J87L1r15k14K04O8L1O63O07
2935A059m26p24k72l10J26Q20J91P5J11p7j318m79O94P21K11L50j01r09m23L4
$$ plain form
2955 -647 -715 -83 868 1077 739 18 -363 -965 -958 271 799 609 433 211 -552 -808 -827 -312 737 1426 910
2976 910 -628 -756 -491 -741 -476 649 1202 658 68 -809 -1282 -691 191 819 1315 1314 139 -1275 -1201 -555
2996 -555 -295 366 1187 1183 65 -990 -1445 -950 149 699 598 567 635 -627 -1697 -1206 296 1186 1084
3015 1084 725 -77 -696 -1127 -936 -143 1186 1554 468 -334 -641 -1239 -1421 -170 1245 1606 716 -257
3033 -257 -1162 -1262 -768 -332 588 1892 1447 -439 -1691 -1105 -397 -32 667 1306 1365 236 -1287 -1719 -937
3052 -937 541 726 914 1056 369 -1302 -2031 -713 477 950 1152 1057 142 -946 -1682 -1212 401 1953
3070 1953 1248 167 247 -477 -1543 -1426 115 1586 1583 665 -648 -1155 -736 -905 -416 972 1971 905
3088 905 -846 -1198 -1169 -791 -6 1241 1702 930 -309 -1464 -1436 -369 150 568 1420 1722 -36 -1765
$$ packed form
2955f47o8O32R51K09l38p21l81o02PJ229N28j90j76k22p63k56j9N15J049O89n16
2976I10j538j28K65k50K65J125N53n44n90q77m73N91Q82O28M96jj175j414P4O46
2996e55K60O61Q21mj118j055m55M95J099N50j01l1O8j262j070M91J502Q90j02
3015A084l59q02o19m31J91P93J329L68j086q02l07n98j82J251J415L61q90r73
3033b57r05j00M94M36R20J304m45j886j252N86P08L65O99O39N9j129j523m32P82
3052i37J478J85J88J42o87j671p29J318J190M73K02r5r15j088p36M70J613J552
3070A953p05j081Q0p24j066J17J541J471lr18j313n07M19j69M89J388R99j066
3088I05j751l52K9L78P85J247M61p72j239j155K8J067N19M18Q52L02j758j729
$$ plain form
3106 -1765 -1700 -435 466 793 1013 816 380 -954 -1928 -1122 682 1202 673 389 17 -990 -1574 -872 693
3125 693 1307 1258 257 -438 -757 -1064 -1020 189 1900 1749 -4 -785 -784 -1045 -1075 -244 1303 1907 944 -715
3145 -715 -1563 -889 -411 -387 458 1787 1620 -225 -1480 -1280 -402 221 642 779 1169 220 -1015 -1584 -189
3164 -189 745 536 484 583 15 -1188 -1426 -184 948 1420 702 -159 -309 -624 -1457 -1270 925 2042 1300
3183 1300 -48 -659 -832 -1214 -926 92 1403 1739 718 -657 -787 -947 -852 -426 897 1352 555 -430
3201 -430 -892 -241 -289 -109 158 1058 823 -281 -1310 -659 663 735 371 398 424 -293 -1395 -1199 -10 1180
3221 1180 844 378 185 -392 -990 -1605 -275 853 1242 873 361 -11 -700 -1390 -743 272 1179 861 124
3240 124 -263 -43 -454 -788 -276 952 922 -143 -647 -347 -161 -119 2 82 502 162 -562 -837 -153 628
$$ packed form
3106a765O5J265R01L27K20j97m36j334r74Q06J804N20n29k84l72j007n84P02J565
3125F93O14m9j001o95l19l07M4J209J711j51j753p81Jk61l0Q31J547O04r63j659
3145g15q48O74M78K4Q45J329j67j845j255K00Q78O23M21J37L90r49j235n69J395
3164a89R34k09n2R9n68j203k38J242J132M72p18q61j50l15q33J87K195J117p42
3183A300j348o11j73l82K88J018J311L36j021j375j30j60R5M26J323M55p97r85
3201d30m62O51m8J80K67R00k35j104j029O51J322P2l64K7K6p17j102J96J189J190
3221A180l36m66j93n77n98o15J330J128L89l69n12l72o89o90O47J015R07l18p37
3240A24l87K20m11l34N12J228l0j065n04L00J86M2J21Q0M20l40p24k75O84P81
$$ plain form
3260 628 425 527 762 199 -771 -926 -675 43 734 582 557 383 -98 -1188 -1169 -165 552 474 253 317 139
3281 139 -515 -909 -481 122 892 479 37 -68 4 -414 -432 195 398 278 -246 -104 -288 32 -98 151 387
3302 387 403 -202 -858 -354 -30 -12 -31 621 703 19 -460 -553 -201 90 162 222 568 495 55 -687 -517 35 218
3325 218 127 101 192 21 -259 -189 -245 290 121 48 34 155 -145 -332 14 354 126 -104 12 -185 -197 -127 -26
3348 -26 137 314 200 -380 -405 -105 -65 -26 -20 127 196 66 -151 -120 -149 -66 197 55 105 282 -60 64 92 139
3372 139 -18 -38 196 270 2 -49 -34 112 122 -220 -285 126 369 -231 -295 9 -121 -40 9 -54 -270 51 180
3395 180 -264 -70 7 49 23 100 -150 -119 54 -29 95 -13 109 65 47 48 -76 -206 -152 32 -40 -230 68 126
3419 126 -68 -61 -313 -45 -47 211 199 -111 76 -128 -87 -159 105 -80 97 100 -158 -130 -218 17 221 112 173 36
$$ packed form
3260F28k03J02K35n63r70j55K51P18O91j52k5j74m81j090J9J004P17p8k21O4j78
3281A39o54l94M28O03P70m13m42j05P2m18j8O27K03j20n24J42j84L20j30K49K36
3302C87J6o05o56N04L24J8j9O52Q2o84m79r3L52K91P2O0L46p3m40p42J70N52J83
3325B18r1k6R1j71k80P0n6N35j69p3j4J21l00j87L46L40k28k30J16j97j2P0J01
3348b6J63J77j14n80k5L00M0L9OJ47O9j30k17L1k9Q3K63j42N0J77l42J24K8M7
3372A39j57k0K34P4k68n1J5J46J0l42o5M11K43o00o4L04j30Q1M9o3k16L21J29
3395A80m44J94P7M2k6P7k50L1J73q3J24j08J22m4j8Jj24j30N4J84p2j90K98N8
3419A26j94Pk52K68kK58j2l10J87k04M1p2K64j85J77Lk58K8q8K35K04j09O1j37
$$ plain form
3443 36 -2 -7 -187 -390 173 316 235 62 -253 -142 -66 143 75 99 261 75 -36 -170 -167 -138 83 83 92 101 -327 1
3469 1 -341 -137 28 54 294 -62 -184 -272 -153 -181 249 203 225 -27 -81 -327 -385 -114 245 314 236 -174 -117 -89
3493 -89 -354 -315 216 188 162 -3 -97 -319 -334 190 108 292 123 36 -95 -285 -326 -193 28 297 250 18 -282
3516 -282 -327 -112 109 94 331 159 -9 -148 -562 -298 72 135 241 155 109 -193 -274 -125 -28 399 416 211 -4
3539 -4 -167 -265 -179 264 485 247 148 176 -257 -317 -160 -74 59 249 162 -307 -386 -154 -150 -256 175 296 99 124
3563 124 -163 -349 -311 126 182 430 -3 31 -222 -234 -134 96 208 316 348 88 -243 -510 -315 214 250 311
3585 311 199 45 -42 -321 -187 40 199 185 -25 -56 -332 -420 -203 187 198 343 8 -76 -224 -332 -314 292
3607 292 281 366 23 -375 -328 -327 -159 -14 402 331 241 -154 -297 -266 74 104 368 313 135 -106 -394 -285 -209 424
$$ packed form
3443C6l8nj80k03N63J43q1j73l15J11P6K09o8K4J62j86j11j34LK9K21%RRm28L28
3469Al42K04J65K6K40l56j22q8J19k8M30m6K2k52n4k46n8K71L59O9p8m10N7K8
3493h9k65L9N31k8k6j65r4k22j5N24q2J84j69q7j31j90m1J33K21K69m7k32l00
3516b82m5K15K21j5K37j72j68j39m14K64L70O3J06q6m6l02q1J49R7M27J7k05k15
3539dj63r8Q6M43K21k38r9K8m33o0J57Q6J33J90q7m69p9K32Mj06M31J21j97K5
3563A24k87j86L8M37N6K48m33L4k53j2J00K30J12J08L2k60l31k67J95N29L6O1
3585C11j12j54q7k79J34K27J59j4k10l1k76q8K17L90J1J45l35q4j48j08J8O06
3607B92j1Q5l43l98M7JJ68J45M16p1r0l95j43L1L40L0K64n5j78k41k88J09P6O33
$$ plain form
3631 424 376 182 94 -122 -438 -262 -7 198 292 384 152 -59 -321 -251 -225 392 487 115 -7 -132 -326 -292 -233
3654 -233 164 451 288 122 -63 -202 -106 -109 103 248 242 -81 -304 -98 -321 -257 234 491 341 -270 -137 -373
3676 -373 -257 138 171 209 307 124 -302 -442 -245 -67 248 334 344 -55 -52 -246 -399 -106 422 304 48 123 -107
3699 -107 -388 -332 -189 161 273 80 -60 -169 -254 -133 -1 327 338 189 -266 -169 -208 -137 -106 199 207 358 -141
3722 -141 -443 -480 -11 108 158 329 273 46 -41 -431 -140 104 200 408 209 21 -91 -106 -104 207 175 -138 47
3745 47 71 -112 -365 -288 16 347 79 -87 -198 -154 -259 -268 -20 456 215 -65 -283 -126 -174 -220 95 163 354
3768 354 210 -217 -232 -85 -202 -218 -58 400 221 -111 -391 -134 -160 -5 -73 153 279 35 58 -83 -110 139
3790 139 155 0 -108 -23 -182 59 54 221 283 76 -172 -302 -259 -120 5 285 373 134 -137 -14 -184 -547
$$ packed form
3631D24m8j94q8k16l16J76K55K05R4R2k32k11k62P0K6O17R5l72j22j25j94L4N9
3654b33L97K87j63j66j85j39R6lK12J45ol23k23K06k23O4M91K57j50o11J33k36
3676c73J16L95L3L8R8j83m26j40J97J78L15Q6J0l99Lj94j53K93N28j18k56P5k30
3699a07k81N6J43L50J12j93j40j09q5J21J32L28J1j49m55R7l9P1L1L05QJ51m99
3722a41l02l7M69J19N0J71n6k27q7l90K91K44R6K08j99j88j12j5KL11l2l13J85
3745D7K4j83k53P7L04L31k68j66j11M4j05rK48M76k41k80k18J57m8m6L15O8J91
3768C54j44m27j5J47j17j6J60M58j79l32k80K57k6J55o8K26J26k44K3j41k7K49
3790A39J6j55j08Q5j59K41nJ67O2k07k48j30M3J39J25K80Q8k39k71J23j70l63
$$ plain form
3812 -547 -157 177 380 348 161 -65 10 96 -204 -203 184 313 -45 -56 -44 75 -40 -93 21 -35 45 81 -129 14
3836 14 238 78 -22 -47 107 -128 -227 193 271 27 151 90 53 180 -234 -508 -116 292 223 14 -59 125 -116
3859 -116 -328 -303 -24 -1 332 69 112 -193 -127 -238 -158 6 93 -61 148 201 59 27 -120 -16 19 -45 -170
3882 -170 -38 247 153 -123 59 106 139 -216 -238 -201 -78 225 -41 -125 177 -132 -50 -162 149 73 -68 27 133
3905 133 61 -77 -24 -224 -117 -162 -113 209 370 224 -123 -337 20 -86 -92 -237 99 266 329 3 -202 170
3927 170 41 -40 -111 -1 171 -73 88 -24 -135 -12 41 41 -115 -96 -58 23 156 183 176 -25 -69 -12 -244 -249 39
3952 39 185 261 28 -146 -206 2 -20 -55 113 464 375 107 -62 -27 -116 -64 108 60 47 24 -37 -76 -38 45 -131
3977 -131 201 98 64 -213 -186 -156 -132 105 203 203 58 102 -451 -366 202 458 83 -29 143 -99 -301 -182 -227
$$ packed form
3812e47L90L34K03l2j87k26P5Q6l00JL87J29l58j1J2J19j15n3J14n6Q0L6k10J43
3836A4K24j60j00k5J54k35r9M20P8k44J24o1l7J27m14k74L92M08o9k09p3J84k41
3859a16k12K5K79K3L33k63M3l05O6j11Q0J64Q7j54K09N3j42l2j47J04L5o4j25
3882a70J32K85r4k76J82M7L3l55k2L7J23L03k66q4L02l09Q2j12L11p6j41R5J06
3905A33p2j38N3k00J07m5M9L22J61j46l47k14L57j06oj45L36J67O3l26k05L72
3927A70j29q1p1J10J72k44J61j12j11J23N3%j56J9L8Q1J33K7pk01m4N7k32nK88
3952C9J46P6k33j74o0K08k2l5J68L51q9k68j69L5q9N2J72m8j3k3o1l9L8Q3j76
3977a31L32j03l4k77K7L0K4K37R8%j45M4n53Q5N68K56l75j12J72k42k02J19m5
$$ plain form
4000 -227 74 404 268 164 -139 -233 -215 -137 238 319 -24 46 96 -246 -278 -263 173 138 213 -28 -114 -75 -138 -163 82
4025 82 118 193 -166 -118 -240 -227 87 99 166 147 43 -80 -260 -257 -163 75 209 313 136 -207 -440 -323 -179 228
4049 228 276 306 113 -329 -399 -316 4 297 417 132 41 -133 -530 -224 -156 119 474 533 -156 -218 -292 -183 -220
4072 -220 170 383 270 -3 -135 -256 -222 139 213 506 282 283 -333 -395 -288 -209 107 298 367 6 -308 -256 -427
4095 -427 -200 297 349 280 71 -113 -476 -378 83 177 271 355 70 -210 -459 -305 -79 291 474 333 108 -199
4117 -199 -126 -503 -146 263 474 320 82 -146 -408 -491 -94 -24 390 441 -59 -492 -397 -289 48 160 436 408
4139 408 8 -266 -379 -631 -213 412 479 421 186 -291 -376 -450 -167 118 400 433 135 -342 -504 -331 -201 318
4161 318 521 325 -33 -132 -581 -432 -57 235 455 544 203 -428 -631 -347 -121 187 640 565 62 -317 -423
$$ packed form
4000b27L01L30j36j04l03r4J8P8L75Q1l43P0N0l42l2J5M36l5P5k41q6L9o3k5K45
4025H2L6P5l59M8j22J3L14J2O7j9j04j23j80LR4K38J34J04j77l43k33J17J44M07
4049B28M8L0j93m42p0Q3L20K93J20k85r1j74l97L06O8K75L55N9o89o2p4J09l7
4072b20L90K13j13k73j32j21L4L61P4K93k24Jo16o2J07P9L16J91O9l61l14N2j71
4095d27K27M97N2o9k09j84l63R8M61R4R4Q4k85k80k49J54K26L70J83j41k25l07
4117a99P3l77L57M09K11j54k38k28k62q3L97P0M14N1n00m33R5J08L37J12K76k8
4139D08m00k74j13k52M18O25O7n8k35m77q5p4K83K85K82L3k98m77j62J73J30N19
4161C18K03j96l58r9m49J49L75K92K20Q9l41o31k03K84K26L08M53p5n03l79j06
$$ plain form
4182 -423 -486 -118 191 562 314 -35 -276 -503 -254 -42 109 432 468 312 -264 -551 -359 129 184 663 516
4203 516 72 -127 -495 -373 -131 477 541 210 247 -289 -538 -499 5 253 397 296 21 -219 -541 -528 -75
4224 -75 219 628 246 -12 -212 -407 -521 -84 353 514 248 101 -286 -532 -313 -88 315 449 459 0 -432
4245 -432 -456 -141 -265 40 574 311 -196 -252 -458 -298 111 296 379 512 164 -112 -502 -382 -107 191 506
4266 506 338 44 -154 -373 -427 -154 436 391 277 188 -184 -342 -309 -112 361 162 163 58 -239 -457 -157 -89
4288 -89 258 484 306 -29 -307 -304 -174 -23 125 361 278 65 -450 -570 -354 107 153 374 449 192 -396 -439
4310 -439 -412 -296 66 181 427 290 -106 -172 -276 38 208 208 128 301 14 -361 -174 31 194 291 45 -273
4332 -273 -49 79 -2 228 340 530 -6 -195 -167 -159 -181 -41 332 364 197 46 -456 -284 -70 -270 -53 596
$$ packed form
4182d23o3L68L09L71k48l49k41k27K49K12J51L23L6j56n76k87J92M88N5M79j47
4203E16m44j99l68J22K42O08O4l31L7n36k49L9N04K48J44j01k75k40l22J3M53
4224g5K94M09l82k58k00j95j14M37M37J61k66j47l87k46K19K25M03J34J0m59m32
4245d32k4L15j24L05N34k63n07n6k06J60M09J85Q3J33l48k76l90J20K75K98L15
4266E06j68k94j98k19n4K73N90m5j14q9l72j58L3J97M73j99Jj05k97k18L00O8
4288h9L47K26j78l35k78LJ30J51J48K36q3k13n15j20K16M61M6K21P5k57n88m3
4310d39K7J16L62J15K46j37l96o6j04L14J70%q0J73k87l75J87K05J63R7k46l18
4332b73K24J28q1K30J12J90n36j89K8Qk2J40L73L2j67j51n02J72K14k00K17O49
$$ plain form
4354 596 562 39 -80 -117 -155 -220 -168 277 152 303 160 -170 -32 174 -15 -245 76 181 -54 -211 104 301
4376 301 189 49 -95 -150 6 -83 -476 93 380 328 -177 -145 -253 -196 -380 -159 126 512 349 185 58 131
4398 131 -196 -455 -174 157 94 -48 255 163 190 -198 -189 -254 19 136 46 192 323 39 -318 -228 45 -172 -141
4421 -141 -83 254 205 17 12 20 130 -50 -196 -251 85 248 -45 -87 330 240 73 -346 -236 -150 37 187 340
4444 340 336 254 -125 -458 -252 -249 -199 228 404 623 105 -101 -313 -220 -125 -250 69 309 612 -232 -254 -188 -68
4467 -68 -313 102 241 -2 87 -26 -14 129 217 239 -250 -134 12 -180 -215 288 330 288 15 -159 -291 -287 -288 -241
4491 -241 324 799 296 -210 -300 -421 -565 -510 -18 551 432 270 -167 -401 -183 -152 -252 126 486 368 -139
4512 -139 -103 -215 -339 130 281 309 109 -77 -366 -366 137 553 308 366 65 -211 -516 -356 197 268 455 476
$$ packed form
4354E96l4n23j19l7l8o5N2M45j25J51j43l30J38K06j89k30L21J05k35j57L15J97
4376C01j12j40j44n5J56q9l93N69K87n2n05L2j08N7j84K21K85L86j63j64j27P3
4398A31l27k59K81L31o3j42L03r2K7l88Ro5K73J17r0J46J31k84l57R0K73k17L1
4421a41N8L37m9j88nQJ10j80j46n5L36J63k93m2M17r0j67m19J10Q6J87J50J53
4444C40mq2l79l33K06LN0M27J76K19n18k06k12R3R5j25L19K40L03q44k2O6J20
4467f8k45M15J39k43Q9j13J2J43Q8K2m89J16J46j92l5N03M2m2k73j74j32MjM7
4491b41N65M75n03n06r0j21j44N5M92N69j19j62m37k34K18L1j00L78L60j18n07
4512a39L6j12j24M69J51K8k00j86k89%N03M16k45N8l01k76l05J60N53P1J87K1
$$ plain form
4534 476 -20 -307 -546 -426 -380 420 695 394 63 -120 -419 -558 -240 111 272 526 33 -291 -434 -420 -330
4555 -330 94 424 566 102 -285 -302 -304 -258 196 536 276 239 -429 -534 -329 -67 333 342 327 255 -131 -599 -427
4578 -427 -108 378 642 344 58 -337 -584 -476 -203 390 660 391 294 -220 -671 -409 -176 182 377 304 239
4599 239 -303 -440 -545 -480 173 539 416 44 -421 -551 -359 -5 310 451 547 221 -272 -757 -526 59 256
4620 256 527 695 88 -473 -622 -403 -242 142 467 600 72 -143 -754 -632 -130 344 350 496 145 -383 -609
4641 -609 -399 -176 173 498 473 41 -178 -353 -427 -183 317 530 578 155 -249 -590 -463 59 108 374 565
4662 565 435 -462 -562 -387 -201 275 667 693 79 -366 -439 -532 -178 306 568 369 351 -139 -653 -602 -88 97
4684 97 617 754 64 -486 -590 -393 -110 300 788 584 67 -224 -593 -636 -182 402 584 364 237 -231 -458
$$ packed form
4534D76m96k87k39J20M6Q00K75l01l31j83k99j39L18L51J61K54m93l24j43J4R0
4555c30M24L30J42m64l87j7kM6M54L40k60l7o68j05K05K62M00Rj5p2l86m68J72
4578d27L19M86K64k98k86l95k47J08K73N93K70k69r7n14m51K62K33L58J95p3o5
4599B39n42j37j05O5O53L66j23l72m65j30J92L54L15J41R6l26m93m85K31N85J97
4620B56K71J68o07n61j49K19J61L84L25J33n28k15o11J22N02M74OJ46l51n28k26
4641f09K10K23L49L25k5m32k19j75p4K44N00K13M8m23m04l41J27N22M9K66J91
4662E65j30q97j00J75J86M76L92K6o14m45p3r3L54M84K62j99j8m90n14N1N14J85
4684I7N20J37o90n50j04J97K83M10M88k04n17k91l69m3M54N84J82k20j27m68k27
$$ plain form
4705 -458 -497 -57 201 397 718 83 -352 -370 -489 -10 129 725 353 146 -233 -606 -534 21 464 497 568 341
4727 341 -279 -514 -190 -87 221 497 456 9 -399 -566 -473 -134 122 463 279 160 -66 -596 -543 -151 196
$$ packed form
4705d58l9M40K58J96L21o35m35j8j19M79J39N96l72k07l79l73P2N55M43L3P1k27
4727C41o20k35L24J03L08K76m1m47m08j67R3L39K56L41j84j19k26n30N3L92L47
$$ [...]
8191A00
##END NTUPLES=NMR FID
##END=
