##TITLE=1H ikalashn
105-2024-BAU
11.12.2024
##JCAMPDX= 6.0         $$ Bruker NMR JCAMP-DX V2.0
##DATA TYPE= NMR FID
##DATA CLASS= NTUPLES
##ORIGIN= UXNMR, Bruker Analytische Messtechnik GmbH
##OWNER= root
$$ TOPSPIN		Version 1.3
$$ 2024-12-11 10:09:29.250 +0400  Irina@DPX200
$$ Compression mode = diff/dup
##.OBSERVE FREQUENCY= 200.131300845
##.OBSERVE NUCLEUS= ^1H
##.DELAY= (6, 6)
##.ACQUISITION MODE= SIMULTANEOUS
##.ACQUISITION SCHEME= undefined
##.AVERAGES= 32
##.DIGITISER RES= 18
##SPECTROMETER/DATA SYSTEM= spect
##.PULSE SEQUENCE= zg
##.SOLVENT NAME= CDCl3
##.SHIFT REFERENCE= INTERNAL, CDCl3, 1, 17.49637
##AUDIT TRAIL= $$ (NUMBER, WHEN, WHO, WHERE, WHAT)
$$ ##TITLE= Audit trail, TOPSPIN		Version 1.3
$$ ##JCAMPDX= 5.01
$$ ##ORIGIN= Bruker BioSpin GmbH
$$ ##OWNER= Irina
$$ $$ F:/spectra/data/iren/nmr/1H/4/audita.txt
$$ ##AUDIT TRAIL=  $$ (NUMBER, WHEN, WHO, WHERE, VERSION, WHAT)
(   1,<2024-12-11 10:09:01.250 +0400>,<Irina>,<DPX200>,<TOPSPIN 1.3>,
      <created by zg
	started at 2024-12-11 10:06:48.765 +0400,
	POWCHK disabled, PULCHK disabled
       configuration hash MD5:
       BE 6D 3F 07 2A EA 11 49 91 17 2B D3 AF B3 58 0D
       data hash MD5: 16K
       74 52 6E BF A5 CB EE EB 08 A2 C1 AE CE 6B A6 30>)
$$ ##END=
$$ 
$$ $$ hash MD5
$$ $$ 04 2F 00 02 A3 DD A5 4D FA 89 64 65 A4 86 FA 51
##$RELAX= 
##$RELAX= 
##$RELAX= 
##$RELAX= 
##$RELAX= 
##$RELAX= 
##$RELAX= 
##$RELAX= 
##$RELAX= 
$$ Bruker specific parameters
$$ --------------------------
##$DU= <F:/spectra>
##$EXPNO= 4
##$NAME= <1H>
##$PROCNO= 1
##$TYPE= <nmr>
##$USER= <iren>
##$AMP= (0..31)
100 100 100 100 100 100 100 100 100 100 100 100 100 100 100 100 100 100 
100 100 100 100 100 100 100 100 100 100 100 100 100 100 
##$ANAVPT= -1
##$AQSEQ= 0
##$AQ_mod= 1
##$AUNM= <au_zg>
##$AUTOPOS= <>
##$BF1= 200.13
##$BF2= 200.13
##$BF3= 200.13
##$BF4= 200.13
##$BF5= 200.13
##$BF6= 200.13
##$BF7= 200.13
##$BF8= 200.13
##$BYTORDA= 1
##$CFDGTYP= 0
##$CFRGTYP= 5
##$CHEMSTR= <none>
##$CNST= (0..63)
1 1 145 1 1 1 1 1 1 1 1 1 1 1 1 1 1 1 1 1 1 1 1 1 1 1 1 1 1 1 1 1 1 1 
1 1 1 1 1 1 1 1 1 1 1 1 1 1 1 1 1 1 1 1 1 1 1 1 1 1 1 1 1 1 
##$CPDPRG= <>
##$CPDPRG1= <>
##$CPDPRG2= <>
##$CPDPRG3= <>
##$CPDPRG4= <mlev>
##$CPDPRG5= <mlev>
##$CPDPRG6= <mlev>
##$CPDPRG7= <mlev>
##$CPDPRG8= <mlev>
##$CPDPRGB= <>
##$CPDPRGT= <>
##$D= (0..63)
0 2 0 0 0 0 0 0 0 0.06 0 0.03 0 0 0 0 0.0002 0 0 0 0 0 0 0 0 0 0 0 0 0 
0 0 0 0 0 0 0 0 0 0 0 0 0 0 0 0 0 0 0 0 0 0 0 0 0 0 0 0 0 0 0 0 0 0 
##$DATE= 1733897336
##$DBL= (0..7)
120 120 120 120 120 120 120 120 
##$DBP= (0..7)
150 150 150 150 150 150 150 150 
##$DBP07= 0
##$DBPNAM0= <>
##$DBPNAM1= <>
##$DBPNAM2= <>
##$DBPNAM3= <>
##$DBPNAM4= <>
##$DBPNAM5= <>
##$DBPNAM6= <>
##$DBPNAM7= <>
##$DBPOAL= (0..7)
0.5 0.5 0.5 0.5 0.5 0.5 0.5 0.5 
##$DBPOFFS= (0..7)
0 0 0 0 0 0 0 0 
##$DE= 6
##$DECBNUC= <off>
##$DECIM= 32
##$DECNUC= <off>
##$DECSTAT= 4
##$DIGMOD= 1
##$DIGTYP= 9
##$DL= (0..7)
0 120 120 120 120 120 120 120 
##$DP= (0..7)
150 150 150 150 150 150 150 150 
##$DP07= 0
##$DPNAME0= <>
$$ [...]
##$SW= 21.9926040160658
##$SWIBOX= (0..15)
0 0 2 0 0 0 0 0 0 0 0 0 0 0 0 0 
##$SW_h= 4401.40845070422
##$TD= 16384
##$TD0= 1
##$TE= 300
##$TE2= 300
##$TE3= 300
##$TEG= 300
##$TL= (0..7)
0 120 120 120 120 120 120 120 
##$TP= (0..7)
150 150 150 150 150 150 150 150 
##$TP07= 0
##$TPNAME0= <>
##$TPNAME1= <>
##$TPNAME2= <>
##$TPNAME3= <>
##$TPNAME4= <>
##$TPNAME5= <>
##$TPNAME6= <>
##$TPNAME7= <>
##$TPOAL= (0..7)
0.5 0.5 0.5 0.5 0.5 0.5 0.5 0.5 
##$TPOFFS= (0..7)
0 0 0 0 0 0 0 0 
##$TUNHIN= 0
##$TUNHOUT= 0
##$TUNXOUT= 0
##$USERA1= <user>
##$USERA2= <user>
##$USERA3= <user>
##$USERA4= <user>
##$USERA5= <user>
##$V9= 5
##$VALIST= <valist>
##$VCLIST= <CCCCCCCCCCCCCCC>
##$VD= 0
##$VDLIST= <DDDDDDDDDDDDDDD>
##$VPLIST= <PPPPPPPPPPPPPPP>
##$VTLIST= <TTTTTTTTTTTTTTT>
##$WBST= 1024
##$WBSW= 25
##$XGAIN= (0..3)
0 0 0 0 
##$XL= 0
##$YL= 0
##$YMAX_a= 1662847
##$YMIN_a= -1931961
##$ZGOPTNS= <>
##$ZL1= 120
##$ZL2= 120
##$ZL3= 120
##$ZL4= 120
##$ABSF1= 10
##$ABSF2= 0
##$ABSG= 5
##$ABSL= 3
##$ALPHA= 0
##$AQORDER= 0
##$ASSFAC= 0
##$ASSFACI= 0
##$ASSFACX= 0
##$ASSWID= 0
##$AUNMP= <proc_1d>
##$AXLEFT= 0
##$AXRIGHT= 0
##$AXTYPE= 0
##$AXUNIT= <>
##$AZFE= 0.1
##$AZFW= 0.1
##$BCFW= 1
##$BC_mod= 2
##$BYTORDP= 1
##$COROFFS= 0
##$CY= 7568.61572265625
##$DATMOD= 1
##$DC= 2
##$DFILT= <>
##$DTYPP= 0
##$F1P= 17.9538593292236
##$F2P= -4.03888763876832
##$FCOR= 0.5
##$FTSIZE= 32768
##$FT_mod= 4
##$GAMMA= 1
##$GB= 1
##$INTBC= 1
##$INTSCL= 1
##$ISEN= 128
##$LB= 0.02
##$LEV0= 0
##$LPBIN= 0
##$MAXI= 945.577
##$MC2= 0
##$MEAN= 0
##$ME_mod= 0
##$MI= -402.1523
##$NCOEF= 0
##$NC_proc= 0
##$NLEV= 6
##$NOISF1= 8.587773
##$NOISF2= 6.764455
##$NSP= 1
##$NTH_PI= 0
##$NZP= 0
##$OFFSET= 17.49637
##$PC= 1
##$PHC0= 121.2403
##$PHC1= 0.08102036
##$PH_mod= 0
##$PKNL= yes
##$PPARMOD= 0
##$PPDIAG= 0
##$PPIPTYP= 0
##$PPMPNUM= 100
##$PPRESOL= 1
##$PSCAL= 0
##$PSIGN= 0
##$REVERSE= no
##$SF= 200.13
##$SI= 32768
##$SIGF1= 18.5376
##$SIGF2= -6.396296
##$SINO= 400
##$SIOLD= 32768
##$SREGLST= <1H.CDCl3>
##$SSB= 3
##$STSI= 0
##$STSR= 0
##$SW_p= 4401.40845070422
##$SYMM= 0
##$S_DEV= 0
##$TDeff= 0
##$TDoff= 0
##$TI= <>
##$TILT= no
##$TM1= 0
##$TM2= 0
##$TOPLEV= 0
##$USERP1= <user>
##$USERP2= <user>
##$USERP3= <user>
##$USERP4= <user>
##$USERP5= <user>
##$WDW= 1
##$XDIM= 8192
##$YMAX_p= 0
##$YMIN_p= 0
$$ End of Bruker specific parameters
$$ ---------------------------------
##NTUPLES= NMR FID
##VAR_NAME=  TIME,          FID/REAL,        FID/IMAG
##SYMBOL=    X,             R,               I
##VAR_TYPE=  INDEPENDENT,   DEPENDENT,       DEPENDENT
##VAR_FORM=  AFFN,          ASDF,            ASDF
##VAR_DIM=   8192,          8192,            8192
##UNITS=     SECONDS,       ARBITRARY UNITS, ARBITRARY UNITS
##FACTOR=    0.0002272,     1,               1
##FIRST=     0,             0,               0
##LAST=      1.8609952,     195,             -183
##MIN=       0,             -1931961,        -1931961
##MAX=       1.8609952,     1662847,         1662847
$$ Real data points
##PAGE= N=1
##DATA TABLE= (X++(R..R)), XYDATA
0@%%%%%%%%%%L2l2L2o4O4o5R7j28J60j93K25k88L27l71M54n38O11p08Q34r53J081
31E77j234J399j586J796k027K278k556K853l186L556l950M389m860N377n946O566
47C446p242P982q790R683j0675J1765j2977J4331j5855J7582j9554K1841k4528
60a2991K7730l1627L6497m2784N1251o3361Q2250j16152J96406p47866r84961
71a605608J3034l39387J82417J37952K67473M77828O19737K92321M37610N17994
81A001371J56532k02509J332q9030l66382l27142j84062l97268l20314m2992j00825
92h71289j92631K22166M28075K02510J95811M01281K33761P8549J83427P3857
102I55517j81652m8125K3799l12607m15830j27517j19288k52974o7195P1567l6893
$$ y = [0, 0, 0, 0, 0, 0, 0, 0, 0, 0, 0, 32, 0, 32, -32, 32, -33, 64, -64, 96, -97, 128, -160, 167, -204, 250, -288, 323, -385, 449, -504, 577, -657, 742, -844, 952, -1075, 1203, -1353, 1500, -1686, 1870, -2080, 2309, -2551, 2826, -3120, 3446, -3796, 4186, -4604, 5079, -5596, 6169, -6808, 7523, -8332, 9250, -10304, 11537, -12991, 14739, -16888, 19609, -23175, 28076, -35285, 46965, -69187, 127219, -620647, -1605608, -1592574, -1931961, -1749544, -1611592, -1344119, -866291, -246554, 45767, 483377, 1001371, 1157903, 955394, 956726, 867696, 501314, 174172, -9890, -407158, -727472, -770464, -871289, -1063920, -841754, -413679, -211169, -15358, 385923, 619684, 698233, 881660, 955517, 773865, 725740, 749539, 436932, 21102, -106415, -225703, -478677, -545872, -474305, -511198]
113e11198O7503K21598L0390l9898K43030K44577l2902R188J30109o8357j47287
124A46753M835p7092j90517K7470J01084j48018j34473R3122K0278p7673Q6573
135a47658J03102l1572P8175J46089q6681j08155J48001J00872r9727R975R9032
146B11453o7991p6802L5886q4989j35615P4002N9318j62787q5489P8716m1284
157a95582q8317Q2736P2927j5964J17164J45038n4551k7589J53711N2614q2403
168A59784L3591M6024j07907o6624M268j30558j22225Q3765M6040j10794N632
179a59004J19894k368j2991J07360M8924j1323J01733N8191j26764o5604O0045
190A18093o6352j31513J1953R513r2178n766M8559o5597j7226J45130O6673m4936
$$ y = [-511198, -443695, -222097, -191707, -231605, 11425, 256002, 223100, 232288, 362397, 294040, 146753, 151588, 74496, -116021, -88551, 12533, -135485, -269958, -176836, -156558, -234231, -147658, -44556, -76128, 2047, 148136, 61455, -46700, 101301, 202173, 102446, 112421, 211453, 143462, 66660, 102546, 17557, -118058, -44056, 15262, -147525, -233014, -154298, -195582, -283899, -201163, -128236, -144200, -27036, 118002, 63451, 35862, 189573, 242187, 159784, 193375, 239399, 131492, 64868, 69136, -61422, -183647, -99882, -53842, -164636, -159004, -39110, -41478, -54469, 52891, 101815, 90492, 192225, 250416, 123652, 58048, 118093, 51741, -79772, -67819, -58306, -150484, -156250, -107691, -173288, -190514, -45384, 21289, -23647]
202b3647O6843R4934m4066k8841M8196m6481p0364N2849m495j39123l3493O4500
214f3188m6961n2953Q0542M9504j7802P0519O4557n5384P138J10012p871p7645
226F0468L8027K5428r4734m1236K1707o3325m3357P1425M013p7597L1784P0769
238C372m0136j4369P8233R486l1616N3345J5386q6609m041O8115m0247n9275N3308
251D952K0951n8148R945L4992m5504O27P9126j2113o2028M2975L5331o7786j8820
264c5500M9356k3144l2550M8835k033o7395K5122N8133m0643j8677O9723P459
276C8686m3510L1923K1372n6159N405O1775l5744n2032M4866J4427o4344J351
288c1984L9205l2550j0119N5151j5243n3017M1089L7500n3917n710O0679j3117
$$ y = [-23647, 43196, 138130, 94064, 65223, 113419, 66938, -3426, 49423, 44928, -94195, -127688, -63188, -110149, -163102, -82560, -33056, -50858, 19661, 84218, 28834, 35972, 145984, 138113, 60468, 98495, 123923, 29189, -12047, 9660, -53665, -97022, -25597, -21584, -99181, -67397, 3372, -36764, -51133, 27100, 36586, 4970, 58315, 73701, -12908, -16949, 51166, 10919, -48356, 4952, 25903, -32245, -22300, 12692, -32812, -32185, 46941, 34828, -27200, 15775, 51106, -16680, -35500, 13856, -9288, -41838, 6997, 4964, -62431, -37309, 20824, -19819, -38496, 31227, 38686, -4824, 27099, 48471, -7688, -2283, 59492, 23748, -28284, 16582, 31009, -33335, -31984, 7221, -25329, -35448, 19703, 4460, -48557, -7468, 30032, -23885, -29595, 31084, 17967]
300A7967l6050L7511O207n1460K1546M7253l9444k4368N3337k734n2085K1297
312a023K5628m2374R95M7560k9378m3190M2232J5682n3043P107M5872k4503j6857
325b5292M0529p843m0830L4617L2442m4864m169N2653j4803m0400L0911J3975
337B6926m0381J2474L7570l5129k4086M2253m290m8482K0274L0072l7138o621
349b6558L9953k0920l4612L9602J8413m2565J1456M5400k2028k1839L7886O94
361B4882l5557K6408K6812m2685r319M1289j9617m2004K7026J5665l9365M267
373b2198L2523k7691k0096M0809K181l7592K4669L3984l0783q102L8907j1919
385A4692k9946L1834J5575l9996L513L4704k5181k6486L1827K132l3774J6604
$$ y = [17967, -18083, 19428, 25635, -25825, -4279, 42974, 3530, -20838, 32499, 29765, -22320, -1023, 24605, -17769, -16774, 30786, 1408, -41782, 450, 16132, -36911, -29804, 16068, -8435, -25292, 15237, 7394, -33436, 1181, 33623, -11241, -15410, 37243, 22440, -17960, 12951, 26926, -13455, -981, 36589, 1460, -22626, 19627, 15337, -33145, -12871, 17201, -19937, -26558, 13395, -7525, -42137, -2535, 15878, -26687, -15231, 30169, 8141, -13698, 24188, 24882, -10675, 15733, 42545, -140, -9459, 31830, 12213, -29791, -2765, 12900, -26465, -22198, 10325, -17366, -37462, 3347, 5528, -32064, -7395, 26589, -4194, -12296, 26611, 14692, -15254, 16580, 32155, -7841, -4328, 30376, 5195, -21291, 10536, 12668, -21106, -4502]
397d502K3833l4082q194L7469j2118l2625K8207J9063l3816O42L2153k0194j9347
410b3511L4205L308l2751J8051K8260k9045j0593L5131p222k8764K5274J5304
422B7647l5741L26L0833k2546k5330K9078L926l3853J1851K2947k8446q285L5378
435G785o949k6198K7149K1048k9492J208L3092j4796j9842K8936L948l2880J0545
448C554K1378k9857j4518K9780q124k9483J9580J4546k9674J99L1475j4302j8432
461b3878K9902R053k7395J1290K4491k2189r315K9607n922k7142J9222J4455l0373
474h194l289K7078j3292k0859K3558N395k7202Q449K2108k2117r964K9035m080
487F626k5931J7349J5302k6370r43K7393j1721j8734K4697P115k5479Q366K2748
$$ y = [-4502, 19331, -14751, -22945, 14524, 2406, -30219, -2012, 17051, -16765, -16123, 16030, -4164, -23511, 10694, 14002, -18749, -698, 27562, -1483, -12076, 23055, 15833, -12931, 12343, 27647, -8094, -7768, 23065, 519, -24811, 4267, 8193, -25660, -13809, 9138, -19308, -27593, 7785, 836, -25362, 1787, 22835, -6657, -5449, 27643, 12847, -6995, 21941, 25889, -6991, 3554, 24932, -4925, -19443, 10337, 2213, -27270, -7690, 6856, -22818, -22619, 8856, -5446, -23878, 6024, 15077, -12318, -1028, 23463, 1274, -8041, 21566, 15644, -11498, 7724, 22179, -8194, -11483, 15595, 2303, -18556, 5002, 10397, -16805, -8356, 13752, -8365, -18329, 10706, 6626, -19305, -1956, 13346, -13024, -13967, 13426, 1705, -17029, 7668, 14783, -10696, -2330, 20418]
500B0418j8063r680K6587m052k5309J6055J3526k7760m247K5684j3139k2891J9659
513c212N378k6298P418K2237j7273p861K8458o8k1834J8214J8593k1449j123K5233
527B6413j0239j9964J7535M162k8253L094J8747j9567j3364K1209l150k2284J4295
540a1366J6652j9859L81K7698p266j7672K0881R223k1335M407J9649j6762j2034
553g403K0231l996k4068J1598J4882k0444m074K3978q962j7510J8399Q412k1349
566a0306N224K0471j5423j3377J9464j626k1489J1185J4609j9133l448K3886p362
579B675j6543J8722J1702j8567M721J8853j3307j1666J7451k450k2458R104J2632
592A0869k1578p475J8748p817j7461J6766J0521j7597O626K1200j0580j0041K1652
$$ y = [20418, 2355, -7325, 19262, 15210, -10099, 5956, 19482, -8278, -12525, 13159, 20, -22871, -3212, 2166, -24132, -16714, 5523, -11750, -19611, 8847, 8779, -13055, 5159, 23752, 2303, 1180, 26413, 16174, -3790, 13745, 17907, -10346, -7252, 11495, -8072, -21436, -227, -3377, -25661, -11366, 5286, -14573, -14192, 13506, 6240, -11432, 9449, 18672, -2663, 1744, 21393, 4631, -7403, 12828, 8832, -15236, -3638, 11244, -9200, -13274, 10704, 1742, -15768, 2631, 11043, -10306, -5082, 15389, -34, -13411, 6053, 4427, -17062, -5877, 8732, -10401, -13849, 10037, 2675, -13868, 4854, 16556, -2011, 2710, 21563, 8256, -3410, 14041, 11591, -10867, -1763, 10869, -10709, -18184, 564, -7253, -24714, -7948, 2573, -15024, -8398, 12802, 2222, -7819, 13833]
605A3833L551j7956R732J3394j8356o488J6303r269j9149J3441P740k0115J12
618a3227J7331j0378j1551J8768K815j5226J0803J4747j6409n415J8738m600j6352
631i956J2982R053j7934Q30J5646j1433j1136J8653L588j7250Q487J3489j5411
644c92o636J6614n290j6474J2989P692k0512j840J7198r821j0889J6764M174j3692
658a0115R899J3240j3255m255K0540k478j5534J1177Q268j7918l188J2799j1280
671b100j1828J4478J739j8431O128J3159j2405m909J8093q46j0881J2341Q456
684A2994j5679j405J6987o886j2549J3312K843j5964L253J0609j2401m647J7110
697G577j701j5138R774R922j5782j597J4099o617r490J2031J410j6421M167J2514
$$ y = [13833, 17384, -572, 9160, 22554, 4198, -2290, 14013, 4744, -14405, -964, 6776, -13339, -13227, 4104, -6274, -17825, 943, 3758, -11468, -665, 14082, -2327, -7742, 10996, 6396, -9956, 3026, 12079, -5855, -5025, 10621, -812, -11948, 6705, 10293, -6957, 1530, 15019, -392, -7028, 9586, 4296, -12178, 811, 8503, -12009, -13849, 3349, -6472, -17361, -597, 3577, -10115, -216, 13024, -231, -4486, 16054, 13576, -1958, 9219, 17487, -431, -3619, 9180, -2100, -13928, 550, 2289, -16142, -10014, 3145, -9260, -14169, 3924, 3078, -7803, 4538, 12994, -2685, -4090, 12897, 6011, -6538, 6774, 9617, -6347, -3094, 7515, -4886, -9533, 7577, 5876, -9262, 512, 10434, -5348, -6945, 7154, 537, -8953, 3078, 4488, -11933, -7766, 4748]
711D748j0903n318J6081j6j1486R658Q916j2902P41J5792o235j1661J0648L736
725A1799j6613O53R133j0932o047J2944l653j4320R437J0155j2244m25J7311k974
739D224q314J2139L413j3033M841J1659j0229q064J2057k055j4854N219P240j2357
753h114r80J3363n436j0639J1628N165j2582L251J2304p076n176J0806k565j2080
767h131P443Q013j1575k132J2966l493j0127Q908N209j1021L886J1058q397p131
781d524J1385p22j3295M410Q042j1201l117J1198n595j0242J0338O633j1203K870
795e023J3134n966n122J0879Q07j0397O944Q027j1652l966J0818m974j2068O833
809a726M153j0975J470Q987p374n971J1391J811j0102O686J0075q854k459J1462
$$ y = [4748, -6155, -11473, 4608, 4592, -6894, 2764, 11680, -1222, -481, 15311, 9076, -2585, 8063, 11799, -4814, -4161, 4972, -5960, -12007, 937, -2716, -17036, -7599, 2556, -9688, -10113, 7198, 4224, -4090, 8049, 11462, -1571, 3270, 14929, 4700, -3364, 8693, 6638, -8216, -2997, 4243, -8114, -9094, 4269, -1167, -11806, -178, 4987, -7595, -4344, 7960, 884, -4292, 6514, 3949, -8131, -688, 7325, -4250, -6382, 6584, 3091, -7036, 1872, 7081, -3940, -54, 11004, 2607, -4524, 6861, 6139, -7156, -2746, 5296, -5905, -9022, 2176, -3419, -13661, -3323, 3310, -7893, -5023, 8111, 2145, -2977, 7902, 8709, -1688, 5256, 13283, 1631, -2335, 8483, 3509, -8559, -1726, 2427, -8548, -7078, 1909, -5465, -11436, -45, 1766, -8336, -1650, 8425, -429, -2888, 8574]
823H574l464r423Q864M455j1159J54R822o976q094R489P12r582N020P383r017
838c242l355J0971k765r269P417N857r561j001R783o268o450R574K130r778M964
853i93Q747p537l801R648j178p922O946M486r816j211R401p390o875Q035J733
868B273r569K384P288q245k819J0502o52p894P389O291p955k55R054m127n530
883a865Q224J246j0031L288N823q375m599Q447j326r102N724N087q814K19Q743
898B689l668o186Q803K963q001K268P440o425l520R536j827p661N661M604q674
913a998r51Q029l807o234O862K088q484J582P051o017l992Q687j369q292N544
928a301M410p270o01Q773l247n670P212L147p717K431O700n084m373Q042r69q160
$$ y = [8574, 5110, -4313, 4551, 9006, -2153, -1999, 7823, 847, -7247, 2242, 2954, -6628, -1608, 5775, -3242, -6597, 4374, 1609, -7660, -243, 5614, -3947, -4948, 4835, -1433, -7883, 1691, 3821, -5957, -993, 7754, 217, -3584, 6064, 4886, -3036, 3910, 8396, -1420, -2631, 6770, -620, -7495, 540, 2273, -7296, -4912, 2376, -5869, -8688, 1814, 1162, -6732, 657, 6948, -1007, -1262, 7792, 3665, -1865, 6359, 7605, -2426, 862, 6685, -1690, -6289, 2158, 832, -8270, -2546, 2541, -6273, -6054, 2689, -979, -7165, 1638, 4601, -3400, -1132, 6308, -117, -3637, 5899, 4072, -3589, 2072, 6676, -1998, -2949, 5080, 1273, -4961, 1901, 3989, -4495, -2913, 4138, -1879, -5871, 2816, 1447, -6845, -1301, 3109, -4161, -4762, 4011, 764, -4906, 2306, 5453, -2264, 167, 6867, 1783, -2590, 5452, 4483, -3677]
944c677M196M266p999j788Q176m193o281O900J847p775K000P395m770l029Q310
959C578l7o952M479O232p280p65P123k637o640N549K039q416J880N804n675l856
975e574O554j85p251M204M419n485r46P442k407n073N912K356o115P84O499m230
991I04l565O750K87p308L648M546o464j595O850k729n928N027K023p036R47O641
1007B998m705m084O452M38o092L609M994n462r56P810k262n799N573K777o011
1022g20Q63N462m918l952N803K1o943K782M592o251k085O571j884n133N242K820
1038B270n304K80O780l956l039O700M00o331L210M581n553j512O149k109o473
1053c907M720K801o434pN446l554m207N790O97n926K574M899m852k061O529j092
$$ y = [-3677, 519, 4785, -3214, -5002, 3174, -1019, -7300, -400, 1447, -6328, -4328, 3067, -1703, -4732, 3578, 3541, -3411, 1068, 7300, 20, -745, 6378, 3741, -2899, 2650, 4689, -3727, -1847, 3957, -1718, -5574, 980, 795, -6456, -2252, 2167, -3318, -4264, 3178, 771, -4302, 1610, 3966, -2149, -1365, 5134, 904, -2661, 4089, 4376, -2932, 716, 5262, -1202, -2797, 4053, 1324, -4604, 423, 2446, -4590, -3643, 2998, -1707, -5791, 661, 1099, -4993, -1384, 3610, -1852, -2808, 5002, 2740, -3059, 2514, 5291, -720, 143, 5605, 687, -3265, 2538, 2559, -4384, -1602, 2990, -3261, -5346, 1225, -659, -5792, -550, 2270, -3034, -2754, 4026, 70, -2969, 3731, 4131, -2200, 1010, 5591, 38, -1474, 4675, 2566, -3907, 813, 3614, -2820, -2827, 2619, -935, -5142, 648, 1345, -4581, -2007, 2892, -1960, -4021, 2508, 1416]
1069A416n145M778K718m658M97N568l654l994N265J206o130J966M242n183k029
1084c137N500j940n264L869L052n668j16N577k591l352M986J737n288K479M727
1099D571m484k001N778m24n145K833L217n544l37N241l472m450N530N62o192J708
1115b609M844m268k405N901o76n066L913L448n521K76N805j796m321N310J190
1130D025n191J153M611m383k410N263j022n820L195L184n331o42N070k472l549
1145d319M561J556n598J777M760l172j636M903l65m656L536K800m940l12N026
1160C921k744l911M194J276n016N14M585l913k375M543l20m754K760L254m880
1175b866o36N706j719l638M684J377m117J055M240l255k130M529J47n033J778
$$ y = [1416, -3729, 1049, 3767, -891, -394, 5174, 1520, -2474, 2791, 3997, -2133, -167, 4075, -1108, -3137, 2363, 423, -4841, -972, 2080, -3588, -3704, 1873, -718, -4070, 916, 2653, -2635, -156, 4571, 87, -1914, 3864, 3440, -1705, 1128, 4345, -1199, -1536, 3705, 233, -4217, 1313, 1875, -4317, -2609, 2235, -2033, -4438, 1463, 787, -4279, -366, 3082, -2439, -2163, 3642, 1846, -2475, 2835, 4025, -1166, -13, 4598, 215, -2195, 3068, 2046, -3774, -579, 2605, -2726, -3368, 1702, -770, -4319, 242, 1798, -3800, -2023, 2737, -435, -2071, 2832, 2467, -2189, 1347, 4147, -793, -1105, 3921, 1177, -2734, 1460, 2736, -2280, -1766, 2819, -1094, -3469, 1074, 754, -4000, -1240, 2014, -2866, -3502, 2204, 485, -3153, 1531, 2908, -1209, -154, 4086, 831, -1299, 3230, 3377, -1656, 122]
1190A22L619m893j162M682k095m050L559J786n339P56M629k606j898M088L49m108
1206b561K524L630m116p72M639j153m470L663J469m580K91M555l491k630M527
1221A525l70m110J681L186l613j037M536j190m183L441J845l938O59M045k269
1236B08k367M214J08l696K478K812l679j479M050r82m397L081J839m248M30K997
1252A369k283l261N111p82l684K166L488l930j11L863n67l130L197K425m397l
1268e29M172k349l412L817K31m008J184K698l344j736M136p24l637L207J582l150
1284a862P0L409k044j708L607R63m001J603K677k559j392L895j200l134K624K214
1300C162m379m37L709k046k366L217O68m105J129K634l098m46L593r19k656K525
$$ y = [122, 3741, -1152, -2314, 2368, 273, -3777, -218, 1568, -3771, -3015, 1614, -992, -2890, 1198, 1547, -2561, -37, 3593, -523, -1295, 3344, 2191, -2279, 1384, 2853, -1727, -1436, 3119, -372, -3002, 1525, 1155, -2955, -1274, 1912, -1701, -2738, 1798, 608, -3575, -134, 1711, -2227, -1568, 2477, 208, -2159, 2055, 2163, -1533, 945, 3757, 78, -1401, 2649, 1667, -2730, 351, 2190, -2058, -1628, 1369, -914, -4175, 936, 154, -3530, -1364, 2124, -1806, -1917, 1946, 1379, -1751, 1446, 3871, -526, -529, 3643, 1294, -2118, 1699, 1930, -2078, -894, 1804, -1540, -3276, 860, 136, -3501, -294, 1288, -1862, -1792, 1617, -427, -2135, 1472, 2435, -1566, 37, 2714, 155, -1237, 2658, 1458, -1676, 948, 3162, -1217, -1654, 2055, 9, -2357, 860, 1528, -2577, -1448, 1186, -1912, -2358, 1235, 316, -2340, 185]
1316A85K327l316m88L562j578k146L662L72l116N75L041l457j555L600p26l578
1332b636J989J908l992L15L223j738k169L468J411l491R61K486k043j084M125
1347B733o24l068K295J574l581o79L661j653k143K016O16l028Q13K635k948q61
1363b242K927p4l244K000J869k910L14L042j040k401L261R60l581Q11L146k376
1379D62j063K475m62k565J574J878l682o66L735j543k162J979L41k275N47L076
1395A649k800j040L448m73k144K176J728k423m20K923j361k414K764l0l046N65
1411h98K446k009j365K186M57l367J563K110k453m46L224j212k405K045J608k588
1427a104Q46K142j501j237K267K70k926J292J796j750j033K389o72k802J965J060
$$ y = [185, 2512, -804, -1292, 2270, 692, -1454, 2208, 2580, -536, 39, 3080, -377, -1932, 1668, 942, -2636, -647, 1261, -2731, -2416, 807, -931, -3100, 368, 1779, -1712, -751, 1735, -308, -1392, 2733, 2109, -959, 1336, 2910, -671, -1350, 2311, 658, -1485, 531, 1147, -1881, -1068, 1567, -1381, -2242, 685, 611, -2633, -633, 1236, -1674, -1360, 1682, 642, -1759, 1502, 2462, -1119, -308, 2838, 462, -601, 1874, 1412, -1153, 421, 2299, -1383, -2049, 1686, 143, -2019, -40, 301, -1974, -1427, 1649, -1151, -2191, 1257, 784, -1360, 816, 2544, 121, -299, 2624, 1263, -1151, 1613, 1583, -1463, -898, 1548, -461, -1826, 360, 817, -2550, -987, 1123, -1330, -1776, 1448, 236, -2169, -124, 1484, -1104, -258, 1884, 383, -854, 1413, 1683, -1243, 49, 1845, 95, -938, 1451, 779, -2023, -58, 1002]
1443A002k520J97K481j741j936L009M29k968J682J816k049l40K976n94k478J919
1459H85J289k679O24J980j798j446K177n1k671O88J829j255j358K144l23k478
1475b443K155Q42k011N29K377j262j466K509P43k639Q84K083k624K18K375q44
1491A426k731J605J963l207o5K388k064j161K126O28k958J619J120j316o42J997
1507G28j18j689J556R74k028J91K219j405j718K266M33j843Q8J889k052p60K494
1524A225p57k529K098R47k172j41K360j126r95J732J06j993J445J230j436q14
1540h20K855r12j718J136J327j701n88J463p73j344J576l35j351N54J645j704
1556f90j120K125P3j867J056R23r20k55K048q10j494K346K30k601R31J607j699
$$ y = [1002, -1518, -1321, 1160, -581, -2517, 492, 921, -2047, -365, 1451, -598, -938, 2038, 1444, -1034, 885, 2174, -505, 119, 2099, 301, -1145, 1032, 981, -1690, -1002, 827, -428, -1786, 358, 35, -2443, -288, 554, -1457, -928, 1449, 187, -1279, 1230, 1973, -666, 218, 2301, -323, -105, 2270, 1426, -1305, 300, 2263, -944, -1009, 1379, -685, -1846, 280, 908, -2050, -431, 689, -627, -1269, 728, 610, -1079, 477, 1451, -577, -386, 1833, 428, -1290, 976, 1409, -434, -346, 1543, -509, -1269, 1225, 468, -2061, 37, 984, -1188, -1329, 1031, -95, -1090, 642, 748, -1245, 200, 1430, -6, -820, 2035, 1123, -595, 541, 1868, 167, -421, 1042, 269, -1075, 501, 166, -1185, -631, 1014, -690, -1810, 315, 388, -1479, -423, 500, -420, -675, 1373, 563, -931, 1415, 1645, -956, -25, 1582, -117]
1573a17q82K055l21k285J763Q91j941j72J246o18j172J578N52j581P23J338r32
1590A25j282K117J09j178M66J253j554n25J873l06j683J265K46j845J39J797k046
1607a029k29J746m6k171Q54J609j425n55K064p27j311J367J248j907Q04J518j242
1624E68r97J483k88j181N46J177j918j99J729r53j586J670Q24j738j95J649q68
1641b77r14J775k20j447J346J711k410m6J987j003j349J801P31k133J87J933j778
1658a06r41J405J11j273O96O44j602%J434m42j171J346Q18k290P38K051j372o11
1676e65J266o5j237Q62R75j906O65J040m16j528P25P68j261N8J107r50r96J446
1694a2K75j268N81R53q34l58J609o18j126J392M02j072j63J573j380q20J695K83
$$ y = [-117, -999, 1056, 735, -1550, 213, 1104, -837, -1009, 237, -381, -1553, 25, 577, -1004, -281, 1057, 125, -1157, 960, 1069, -109, 357, 1610, 56, -469, 1404, 1098, -585, 680, 926, -919, -780, 1017, -1029, -1258, 488, 442, -1729, -875, 734, -691, -1246, 818, 91, -1220, 147, 1395, -512, 292, 1810, 568, -429, 1054, 766, -415, 131, 1308, -610, -809, 920, -33, -1619, 51, 875, -863, -1058, 591, -277, -1191, 584, 364, -1083, 263, 1974, -436, -482, 1505, 502, -847, 954, 1685, -448, -261, 1672, -106, -1047, 358, 469, -804, -108, 536, -1066, -1066, 368, -74, -1245, 101, 919, -1371, -633, 1418, 46, -565, 701, 636, -601, 261, 1236, -670, -5, 1035, 619, -909, -184, 584, -677, -619, 488, -462, -1458, -12, 263, -1005, -424, 529, -305, -663, 946, 328, -798, 594, 996, -76, -239, 1334, -46, -866, 829, 1112]
1712A112j925P22R79j395j14J189p26q84Q51Q88j548k08J935j035q42J300R67
1729A266j770P12R79j135n52J274k23q34N15O70j768L50J138o34q68O54j01m33
1747g60R37K29j142m52J581k09j360Q92J342j420l85K000q63j326J512O46j084
1764A38j9R38q48m25N42o7j231P92Q18j162o8R29q11r54J424R11j932M31J210
1783F16r89j2R87l01j149R24J045j237O0R70p32m21N93R5p40n87J590j172o47
1802a107J792o31o82L41Q05j052J27J230p50n06P95L86j048j82J247n91n77J095
1820F92k18j343P69J244j630o72J898j012n96P61J35o61M14M67m99r4R16l9k01
1839C31j0l0o28l21J665m18j321J199N18j237K1J102j178m7O06p88l56M37N58
$$ y = [1112, -813, -91, 888, -507, -621, 568, -158, -1042, -191, 697, -851, -1059, 876, -159, -1001, 299, 1266, -504, 208, 1187, 52, -500, 774, 551, -283, 232, 902, -866, -516, 622, -12, -880, -226, -327, -760, 177, 406, -736, -1188, 393, 184, -1176, -284, 1058, -362, -747, 1253, 390, -936, 576, 1222, 138, 119, 1057, 209, -216, 326, 259, -972, -180, 638, -524, -592, 337, -474, -1428, -4, 907, -1025, -594, 616, -373, -385, 602, 301, -848, 76, 1121, -116, -56, 914, 182, -239, 354, 449, -291, -878, 712, -460, -1107, 685, 54, -628, -287, 518, -534, -407, 823, 73, -433, 362, 748, -300, -482, 765, 174, -403, 692, 474, -869, -100, 1144, -486, -1158, 740, -272, -868, -107, 28, -633, -219, 248, -251, -345, 571, 532, 331, 321, 291, -337, -658, 1007, 589, -732, 467, 985, -252, -231, 871, -307, -354, 252, -536, -892, -455, 103]
1858A03l03k62P64r93m15J230M39j115L84R07q81o44Q41J28k70R7L31n64k89J095
1878E83j05j086O19q9m23R1M35n71K38Q61m66j021Q73L19R0k37N21k4j234O36
1898A0O45o07m63N29L69p08O53lo66J65L02p93M4N95o14K20K71L23q63L43M17
1919A69Q4j115J293O4r31M10O25m12n02Q24k10m26L85N3m50l72R85o67l82K48
1939c27L37k76q5N94p49K66K53N4j150J234L60j387N91J009l76n24O07K84q11
1958i6P39l02k37q17N76R44j541K61Q45q20J25M72m7r01J040K18q14M67K48p9
1978B81l74O25m85j85p9R68r88k45J235j013k28P27k49k77L62L05q05k99Q41L6
1998A53o35P69Q9p80K35N46j21m52Q79k66j79m33R90n41l11K41M8o20O23k68m25
$$ y = [103, -200, -462, 302, -691, -1106, 124, 563, -552, -168, 739, -142, -786, 55, 183, -87, 10, 341, -223, -512, 583, 478, -608, 11, -78, -501, -410, 25, -546, -308, 553, 87, -934, -61, 258, 348, 111, 632, 608, -626, 10, 655, 48, -415, 114, 483, -225, 428, 425, -241, -76, 226, -567, -523, 72, -542, -322, -51, 272, -591, -248, 169, 253, -862, 431, 495, -436, -26, 599, 187, -315, 509, 299, -127, 258, 311, -139, -511, 474, -193, -575, -327, 10, -266, -351, 243, -506, -240, 13, 67, -1083, 151, 511, -876, -285, 724, 348, -176, 431, 715, -96, 643, 341, 104, -713, -137, 807, -734, -473, 372, -448, -323, 149, 102, -799, 241, 459, -355, 112, 360, 281, -93, 532, 47, -138, -217, 751, -237, -482, 753, -260, -488, 239, -10, -287, 75, 380, -425, -724, 117, 153, -482, 287, 376, -404, -169, 377, 256, -196, 683, 417, 238, -195, 795, 254, -57, 184, 232, -388, 235, -33, -458]
2019d58J12Q00m88k93Q09K11j205M84o1l00k09J075J7j137O61P19j096K65O11
2038E17M9o18L50K1n20j27N25j47l27M48n3q27N95k17j85J74L29o0m38J069l15
2059B43p55O92K89ml88K55j34o58O59J61q28K57O47l08l74J76L03o90K83Q4P9
2080a1n20J441o93l21J31J61P5m57R19m26p56M65N74p65J04K28l20j75N06J23
2100B83o37P98l81m62K35J50k25%M60K55r26K51M75j13k81O54j58m00L92J61k39
2121B92p18P52m47l1K06L24n59K0J83m58J37J50K86m46L95P6j67l00N87j82n92
2142d92R06k01p1j48Q11j329N66P82k59q84L87M22q19m9N23j44n84K73P6J73L
2163e8N49r22k1P03j19n16M94K59o61J41Q21j74p29O07O23j447Q33n6n63o33J084
$$ y = [-458, -346, 454, -34, -327, 482, 693, -512, -28, -89, -389, -598, 477, 494, -643, 18, 737, -359, -94, 517, 566, -52, 298, 319, -201, -328, 197, 50, -277, 171, 118, -709, -114, -331, -516, -342, -13, -73, -511, 558, 243, -512, 180, 469, 465, 77, 332, 198, -460, 199, 360, -468, -211, 436, 128, -246, -70, 233, -457, -174, -90, -11, -531, 910, 217, -104, 27, 188, 263, -194, 725, 299, -457, 8, 582, -183, -79, 149, -171, -346, 160, 283, -354, 444, 63, -399, -164, -14, -239, -239, 221, 476, -450, -199, 276, 163, -118, 536, 378, -22, 370, 531, 292, -426, 326, -121, -152, 54, 378, -181, -161, 22, -436, -299, -149, 137, -309, 86, 162, -5, -305, 282, 100, -492, 414, 213, 142, -6, 805, -524, 42, 824, 565, -319, 68, 490, -329, -378, 145, 1, -583, -310, -234, -61, -58, 491, -431, -452, 251, 132, -384, 110, 369, -292, -151, 670, 496, -233, 374, 997, -450, 383, 327, -236, -869, 215]
2184B15K19o56K34K68m41l94P76k99j86L52L67o00K8M62m56K06L57J37l65l29
2204a05M92p14L12J54k00j79k0P13r71N46o9K05k69m08Q47r16R3M37k94K37O42
2225E33p78K28k09P09n59j24O6L73m66N8M43m93j94P51m50P2P52q25l13L51Q5
2246A0m5l35P29m17k27O15n0m74J48Q01p84n7O34k39r2l27R2J36K01J26p82L1
2268c06l7M30n21MM55L35p25O13J7q66J165m56l7N63o30R4l57N26o9k84NJ56o1
2291A4K56q7L37o67j98P81l74j43R22p83m50j5O89k21m23P52o54l12O90k47j72
2312c05Q82J5q64K80J62n7p2K4L92n14l09L73j86J69k28L36l84L29l17k38M95
2333a7L12k65m42P09j41l4j16P0j23K02P1M47j000K49J27l14J38o9K37k06M03
$$ y = [215, 434, -222, 12, 280, -161, -555, 221, -78, -264, 88, 455, -145, -117, 345, -111, 95, 452, 589, 224, -105, 387, -327, -15, 139, -61, -240, -260, 453, -518, 28, -41, 164, -105, -513, 334, -582, -489, -52, -346, -109, 533, -245, -17, -226, 483, -76, -200, -134, 239, -227, -169, 274, -219, -413, 338, -112, -40, 712, -113, -426, -75, 10, -35, -370, 359, -58, -285, 330, 280, -194, -46, 755, -29, -86, 548, 309, 217, -110, -18, 118, 319, 445, -337, -306, -343, 87, -434, -430, 25, 360, -365, 248, 265, -601, 564, 108, 71, 634, 4, 98, -259, 267, 198, -86, -81, 75, 14, 270, 183, 520, -147, -345, 436, 62, -81, 841, 58, -392, -407, 282, 61, -362, 390, -264, -576, 114, -133, -305, 577, 592, -272, 8, 170, 113, 41, 65, 457, -57, -366, 7, -179, -10, -238, 98, -286, 43, -274, -512, -17, 295, 30, -412, 297, 156, 122, 6, 76, -47, 155, 226, 673, -327, -78, 49, -265, -127, -196, 41, -165, 238]
2354B38J0o30Q6R46n37k90N14j76p03P67j00l37L07K23j50m8R5o2j35l03M08O7
2376A90j38k64n7r4K49J69j23k92P58n7m94M05m02j03O25L25o94j87L97n43K7
2397c03J75L08k14J65L22j67p40P84m30j42L43J24l82k86N91l2k6j92m5L60j36
2418G7J25m28m34J188k41o57J52M09P0q00M97K82p66P61Q4q67N38q5J98l65k2
2439b84M62l31J82L47l35k71L15J88n58K99K26m51J73K70k86J02l8J8l97R8L96
2460A25k49rk7J0J29M62Km57o94R34Lp27P00l92o31P68M08j38l17K29J98o56M87
2483A58J59k17k77P8j38rN13q1m63O4M51q11P1K96m8n0K96K69j06l09M42j77j60
2506d9M8N63r51N40M18m14l00R37q22L4K32J28n55j10M95m2p58O26J81k04K09
$$ y = [238, 248, -382, -296, 650, 113, -177, 337, 161, -542, 225, 125, -212, 95, 318, 168, 120, 215, 153, 18, -285, 123, 190, 52, -212, -269, -363, -114, 55, -68, -360, 398, 341, -153, 252, -150, -253, 372, 697, 3, -184, 213, -330, -303, -128, 180, -34, 131, 453, 286, -454, 330, -100, -242, 101, 225, -157, -443, 148, 116, 90, -102, -147, 213, 77, 202, -226, -660, 528, 287, -370, -218, 191, 261, -539, -42, 240, -526, 235, 319, -548, -10, -95, 103, -262, -284, 178, -153, 29, 376, 41, -230, 85, 273, -285, 14, 240, -211, -38, 232, -54, 48, 10, 28, -369, -271, 125, -124, -133, -160, -150, -21, 441, 443, -14, -708, 226, 229, -498, 202, -190, -821, -53, 355, 217, -100, 129, 327, -329, 158, 317, 100, -177, -99, -237, -246, 267, 186, -277, -213, 238, -573, -502, -206, -254, -304, -8, 261, 155, -154, 288, 111, -49, -1, 562, -389, 151, 569, 155, -145, 792, -30, 4, 236, 364, -191, -301, 194, 152, -606, 20, 201, -3, 206]
2527B06J5p5K36k97J79j81J97L63l08j3j75n3p54M03N80r44N15R2L71r66O64j15
2549f0k26L80m15O88o46K79K22k44K63l58J86k73k24N20j74K1k18L99m58K57N13
2570D32p14K05J79k04l12K16j83l14L76K1J77J54N47n98L4J54k55rL33n49j24
2591d34K75N42N4p08L31k5J4k13N56o58R5L78m64j03j04K76j29M52l39K70R5p8
2613H3J40n79K25L32j12k22N6k28L21k25N92k82m5m4j0k46j00M74k04q2L07M9
2635B00k75L48Nl41Q51m70l32K97l26K66k17j73Q5m3J06k91j19J85L01j01m6L58
2657B68j6M72p08L2O19l23l03L27j02q59R36m87l73J012l93m87j34N27m43M33
2677bn3k32K54K97j62n53N41m30nM82l4j55l22M33K14j44l5N23q49M80n96M93
$$ y = [206, 221, 146, 382, 85, 264, 83, 280, 643, 335, 322, 147, 94, -660, -257, 323, -621, -106, -14, 357, -609, 55, -60, -286, 94, -321, 367, -279, 0, 222, -22, 241, -117, 69, -204, -428, 92, -82, -61, -279, 120, -338, -81, 432, -282, -77, 102, -102, -414, -198, -381, -695, -319, -298, -121, 33, 580, -18, 16, 170, -85, -94, 239, -310, -434, -159, 383, 437, -271, 60, 35, 49, -164, 392, -266, -171, 207, -257, -360, -464, -188, -317, 135, -204, 66, 161, 83, 223, -356, -131, 201, 89, -133, -77, -305, 16, -209, 383, 101, 56, 12, 2, -244, -344, 130, -74, -156, 151, 200, -75, 273, 278, -63, 788, 318, -14, 283, -43, 223, 6, -167, -82, -125, -19, -310, -429, -244, 57, -44, -90, 268, 252, 724, 16, 48, 667, 344, 41, 368, 266, -593, 343, -144, -517, 495, 102, -385, -519, 8, -435, -2, -55, -287, -33, 264, 102, -451, 90, -340, -345, 137, 103, -52, -374, 59, 273, 129, 94, 617, -232, 248, -348, 145]
2699A45J54o23P56k15k04K47K4Q6m99O6K57J20l35J23o88J101p77K16Q4k69R7
2720a34P9L89p14N53J4l32L74J4l93k42J43O68k61k50m13L26j94K65O74q14J18
2741a30j34K74o8j68K1M9K29K88k12J7m11N03l81k88N21J23K2k24J84l53J68J53
2763A83k91j9J27J60j06n5k5k30j4M95J41m19K66r8lk26p6M58n65K97K36k29L2
2786C9m60N91n67L62P6o35N86K0j82K51l9K36q27N83K02l04k81O5M1P7M75j80
2808A29o0j25n6M9J13Q6j55jn30M02P7J26N9k48K12l09O0l13K01O66N8o46J71
2831c4K50j89M92J43n13j24R0J62p1Q1J3l16M71m25l85K25J64j20K94j18j12n43
2853e65M04K91p6j79P1N2k62M31J50l43j47L43k33l96N28l97j40N75m48L95m18
$$ y = [145, 299, -324, 432, 217, 13, 260, 284, 370, -129, -63, 194, 314, -21, 102, -586, 515, -262, -46, 38, -231, -134, -55, 334, -380, 173, 187, -145, 229, 243, -150, -392, -249, 419, 158, -92, -505, -179, -373, -108, 566, -248, -130, -264, 10, -58, -226, -205, -156, 73, 361, 149, 166, -245, 258, -123, -411, 110, 233, 255, 31, 215, -138, 30, 183, -108, -127, 0, 160, 54, -1, -26, -256, -270, 225, 366, -53, 213, 115, 112, -114, -190, 268, -297, 0, 236, 7, 39, -421, 170, -397, -35, 41, -594, -8, 12, -170, 81, 42, 278, -549, 34, 236, -68, -349, -284, -243, -166, 309, 129, 69, -56, -112, -63, 50, 136, -19, -20, -550, -148, -71, 55, 114, -134, 78, -231, -171, -484, -283, 383, 441, -205, -34, 216, 27, 519, 662, 149, 25, 115, 277, 206, 287, 300, -16, 455, 30, -355, -130, 34, -86, 208, 90, -22, -565, -161, 130, 54, -125, -54, -2, -264, 167, 317, -26, -173, 170, -63, -459, 69, -328, -468, 107, -341, 54, -364]
2874c64P3K00j23K79k01L29Kl09j39O73l68%J10l38M65j62K51j24k56K64r6k93
2896a27m54J029j03K49p48L22o01M01j5P4J8l3J83q22N24M79n28m11L76L54l34
2917a67K12M85n32L9O3K1o12K28M58r3J10l37L02k82N10q10O20j77o69N97qJ13
2939G1Rm53q8O76j92K72k12J81r2K9j86j25m93Q49O4l43n6L98k1K72n28q27R96
2962B01j96p0L4L22k59j36j8M13j47k56J07k8m07L99l2J94O25m73l04j26L83k57
2984c1k07j31O66k58k14J55l01L4k06M07L02p0k89N8K27R6rl56K78p93J000k93
3006F5J05k9o03L10J08r7L23n93O67j02J94j63k56N2M77l31q96J188j57l29JJ94
3028A28PJ12q41O70Q4J31m30l60M76K65k12k18K57K58m16L49M6n55j75M33K09
$$ y = [-364, -291, -91, -214, 65, -136, 193, 195, -114, -253, 420, 52, 52, 162, -176, 289, 127, 378, 254, -2, 262, 166, -127, -581, 448, 345, 594, -154, 168, -433, -32, -47, 27, 45, 12, 195, -627, -103, 376, -152, -563, -187, 167, -167, 45, 530, -2, 37, 100, 121, -491, -263, 195, 102, 212, -125, 177, -105, 405, -405, 215, 38, -631, -34, -42, 71, 80, -373, -461, 215, 23, 295, 83, 264, 172, 201, 15, -110, -603, 246, 310, -33, -89, 309, 288, 560, 32, -795, 201, 5, -65, -31, 291, 32, -104, -122, 291, 144, -112, -5, -33, -440, -41, -73, 121, 746, 273, -31, -157, 226, -31, -238, -369, 297, 39, -175, -20, -321, -287, -493, -86, 216, 146, -143, -85, 142, 238, 229, -127, 151, -642, 358, 65, 170, 141, -462, -152, -44, -141, 182, -411, 256, 154, 348, 185, -71, -19, 458, 127, -769, 419, 262, -67, -66, 128, 135, 247, -594, 76, 160, 291, -139, -499, -23, 242, 30, -188, 69, 327, -89, 260, 306, -249, -424, 9, 218]
3049B18l49N05r38O44K61n00N1N06n48L83K11o59j25J13N02j85J62k8l2K82r17
3070d43J11Q28K6o10LL69j45k92N60j19l6n60L26K90j43m7j69M21m07o3M53o28
3092b75M03o34L60M54o42M10j30L75l49l33N81k72m27L88j45K95m48Q45l24k03
3112g1J84q7L51m20j64K29j01m7J19k88Q02n35m80K00M54K85j27J0k58J05n35
3133c74Q39n34j60L99j83K28q00R76k21J74k94k88J14k70L62M20j10k77P1M4J87
3154C03n87L94J27m50L65Nl2O8j43Nr3L83j38j68J28k46J20j09M79m77j00q6K03
3177d9M9R2k06J20K24K6k38l93K39M19o25O08l39k93L16k56N25l00K92j77K20
3198B54N9n87n6K52j33K40k15J66KP3Jn53L38N13p68N88j93l4K64o36Q00k42k8
$$ y = [218, -131, 374, -564, 80, 341, -159, -108, 398, -150, 233, 444, -215, -340, -227, 275, 90, 252, 224, 192, 474, -443, -332, 496, 522, -88, -85, 284, 139, -153, 407, 288, 252, -308, 18, 308, 165, 118, -51, 370, -37, -100, 353, -275, 128, -506, -146, 308, -334, 76, -54, 321, -28, -361, 220, -52, -479, -91, -236, 59, -389, 456, 132, -71, 113, 26, 377, -43, -207, 22, -79, -126, -7, -295, 507, -28, -508, -308, 146, 431, 304, 314, 56, 161, -374, 465, -69, -229, 170, -13, 215, -585, 391, 170, 344, 50, -238, -124, -394, -32, 388, 278, 1, 72, 116, 303, -284, 110, 237, -213, 152, 157, 125, 193, 50, 55, -38, 345, 207, 39, 167, -79, 41, -68, 411, -66, -166, -252, -49, 0, 92, -114, 6, 230, 256, 18, -375, -136, 283, -342, 266, -73, -366, -50, -306, 219, -81, 211, 34, 254, 313, -274, -330, -78, -211, 29, -186, -20, -18, 55, 56, -497, -159, 354, -414, 174, -19, -53, 211, -425, 375, 133, 105]
3221A05l62R4L36m10O3n7N87o33J67J47J54o66M61J75r4l28K45J7k08K90n63P16
3243B36l7m4j06J4J23l66L25m46M07L0k20q5K41j27j77K12M26r6k85m17N88l55
3265a59n11Q98n62O48j38k3J89P1m58M0J2J23Q68m87o20j2N3J18l2q9L92m23J79
3288G7K82l74j71J18K78k72m26L43P78o44r4j99O52m04k54M88m96K23M47o0o51
3309c59M97l54L60k81K55r9j98l8K88J31m82q3mM29j71L21j65R5J10j57k54L48
3331A89N7j25j08n8n5K85m51N66kj93n20N91P1m90M77n07l83L11K23l30N79j08
3353A9k15n3Q22m21j88M8j74O47m95J52L53m94n6p5j87N1M18k65K48o39L38M26
3375B60n67L31R6j82J25o54P14n21J15j9N39m56N06L6l52j94J34m67M64L23P4
$$ y = [105, -257, -163, 173, -237, -174, -231, 356, -277, -110, 37, 191, -475, -14, 161, 67, -261, -16, 1, -207, 83, -480, 236, 199, 155, 49, 63, 186, -180, 145, -301, 106, 136, -84, -169, 72, -55, -232, -20, 406, 310, 25, -392, 196, -159, -670, 228, -334, 314, 176, 153, 342, 413, -45, -5, 7, 130, 998, 511, -109, -121, -68, 50, 18, -71, 321, -102, 77, 359, -15, -186, -68, 210, -62, -488, -145, 633, -11, -105, -304, 348, -56, -310, 178, -318, -95, 352, 292, -359, 138, -216, 144, -137, 118, 19, -179, -217, 71, 202, -280, -363, -367, 62, -109, 212, 47, 142, 252, 95, -159, 189, 246, 121, 13, -45, -100, 185, -266, 300, 298, 105, -415, 176, 247, -243, 234, -273, -656, -345, -122, -452, 127, 19, -196, -249, 573, 152, -36, 12, -162, 485, -10, 142, 495, 1, -55, -130, -317, -266, 152, -113, 135, -504, -166, 260, -307, 24, 120, -62, 63, -591, 123, -398, -283, -302, 237, -219, 287, 323, -29, -223, -89, -556, -92, 231, 305]
3396C05R4m76K2J64j09K5j44J68n99O76L01o21L2L05r9m43K69J35p3o0l36O40
3418A76JR5k06n1k53K37M6J62k36J77j34N2n25P82L51k48l5o82K91j53K46j27
3440c4K49l52k3M3O1n2L17m10K48j89J88j98j42L73k89O40k07o2k33n60N43N88
3462D99j88l84p9N24n75R6M77j32k4M14k19n34K67m5l38K83q5l32M36k24K72J25
3484B34J96k68m14K22m8l44J221n05p3oR2j54m23k26Q70o84O00k80K08l92L76
3505B02o73J27Q76j103M19l16O97l94N23k21n34O40mp60N66M31k59l17J52j00
3525d8J48k97N03o9j64j98j53K23K8k23K55J45Q1n00p1J130n39L4l36k38K55m0
3547g4L90j56j67k6J21j76p7M46l59j00K46J96J5l14l3k55K36J82J70l65L10m39
$$ y = [305, 399, -77, -55, 109, 0, 25, -119, 49, -550, 126, 427, -194, -162, 143, 44, -399, -130, 5, -68, -128, -464, 176, 177, 272, 66, 15, -238, -1, 45, 207, -29, 148, 14, 66, -459, 323, 674, 426, 391, -291, 0, -153, 93, -34, 215, -137, -160, -117, -56, -108, 209, -201, 47, -142, 46, -152, -294, 79, -210, 430, 223, 161, -72, -632, -89, 499, 311, -73, -152, 372, -203, -107, 370, 238, 214, 628, 409, -125, 142, 97, -241, 42, -43, -375, 61, -163, 109, 234, 430, 162, -252, -30, -78, -422, 799, 294, 221, 215, 307, 153, -270, -496, 374, -310, 290, 10, 218, -174, 202, -471, -344, 532, -571, -152, -468, 229, -165, 358, 137, -397, 243, 239, -521, 45, 476, 217, -100, 52, -48, 100, -197, 306, 237, 73, -125, -278, -55, -27, -250, 5, 150, 231, -269, -340, 790, 251, 285, -51, -289, -34, -74, 316, 160, -7, -33, 88, -88, -165, 281, -78, -178, 68, 264, 279, -35, -68, -323, -87, 95, 265, -100, 210, -229]
3569b29L23k54K79k61n0N49n08j73M31l08J59j68K11k8J39q4P7J62q43O18l6o6
3591f0K35M1J86o42L6K49j20L82k35m45N01j59k6L78l11m2q7l40L68J9N7k57K56
3614a6J81J5K9j36n12N93k53r3J14L27m59J81j12k76K85N14k07L0j63m07N00J79
3636C14p24P36m29RJ18j73K60j57L57o67J18M60l72L91l99P8K29J03o07J10J94
3657e1J29K87n96O17n08j05O03n78n9R0K32r4j95N74o47L44L16o35l5M5K74j26
3679a18L10K61l39J35O1n47J70l28K57l13J31O20q7p9p16Q55j38qL20l93k33L29
3701A50o40M02N84l62k78QK74l68L80l77k20P59k14L31j91m84O11l30l1j06j85
3722b87P88n77J51k37k10L15k39j65K85k65L63rK93j2J78j53k28j53j47P13q28
$$ y = [-229, 94, -160, 119, -142, -192, 357, -151, -324, 107, -201, -42, -210, 1, -27, 112, 28, 105, 267, -576, 42, 6, -60, 175, 216, 402, -240, -204, 45, -75, 307, 72, -373, 128, -31, -57, 321, 10, -32, -119, -459, -91, -72, -15, -272, -16, 165, 180, 209, 73, -439, 154, -99, -192, -78, 249, -210, -29, -141, -417, -132, 382, 175, 205, 42, -365, 135, 314, -410, 326, -103, -94, 24, -149, 111, -46, 311, -356, -238, 222, -150, 241, -158, -80, 149, 252, -355, -245, -51, 78, 365, -231, 386, -122, -227, 376, -202, -261, -171, 61, -33, -228, 346, -301, 43, 359, -276, -311, -266, 8, -118, 192, 453, 114, 249, 310, -237, -67, -395, -138, -451, -320, 300, 213, 134, -582, 273, 135, 127, 447, 54, -179, 150, -490, -88, 496, 134, -144, -136, 138, -230, 150, -227, -447, 312, 98, 429, 238, -246, 365, 35, 4, -102, -287, 501, -76, 75, -162, -372, -57, -296, -461, -176, -441, -78, -87, 206, 194, 372, 219, -9, -162, -309, 404, -424]
3743d24O21r4j08qK04l20L5l89J33L09K4J02J38n83N06p75Q67R4o85N22N79j196
3765d48N12L8l93M80k03M20j01l75M84m28k74M07O1k57M80o50L25J28n73K74M68
3786C75l34m28j41O08k65M07m99K88M1j65K54n5K9k87L43j82j86Q9m7L45oj93
3808iK02k17j31K28K94j22n30K02L5N8q7J0L03K6m05K01q4L41n12J60j77k05O04
3831A85L54o75JJ57j24l53K67k99K23L47l05K87N9j77R3j38M6nQ3K22m07N3K1
3854h5j78J29K16j35J28O11o43K54o65m0K43J09M10k33o9O0L23n75J28N05j52
3875C41p70J44J01q9K74K83n77L63J28p33R15l40K1k03J08L00m54k8N92j120Q48
3896A04j08j30L08m22M51M8o0k13J11l32P29o49L82l36M35k12k26N1J49K3j92
$$ y = [-424, 197, 103, -5, -13, 191, -129, -94, -483, -350, -41, -17, 85, 223, -360, 146, -629, 238, 332, -353, 169, 748, -448, 64, 102, -291, 189, -14, 406, 305, -70, 414, -14, -288, 119, 180, -77, 403, -247, 78, 206, -367, -93, 375, 41, -387, -528, 80, -185, 222, -277, 11, 52, -113, 141, 86, 115, -172, 171, -11, -197, -108, -155, 190, 184, -9, 193, -24, -155, 73, 367, 245, -285, -83, -48, 10, -77, -67, 236, 262, -143, 58, -26, 315, -197, -37, -214, -419, 185, 539, -136, -135, 22, -102, -455, -188, -487, -264, 83, -222, 65, 124, -53, 40, -98, -52, -57, 26, 248, -159, -106, -85, -263, -134, 82, -53, 75, 686, 43, 297, -368, -408, -165, -56, 354, 121, 52, 112, 435, -140, -12, 493, 341, -429, -285, -184, -273, 1, 284, -293, 70, 198, -535, 380, 40, 61, -142, -34, 266, -188, -216, 376, -744, 104, -4, -134, 174, -248, 203, 251, 191, -22, 89, -243, 486, -163, 219, -117, 318, 106, -120, -69, 80, 103, -89]
3917h9o7M39k02J60k74L56j94j7j2k06p0J3m57O74R5m4O3j56L13n81M4M25oM82
3941F89o74K85j9o22N78J0n75O60o55J56M7K5L71p2J85k89K06o82N35o1P2k42
3963g2l12K83J75J51l15L97k69J6K0m29O62n52L71j78J92k55l61M08J04L90l29
3984I7J04o00K97k87K58K54l64j87L45k05N35k91Q6j31L59l84n1j95K30L79J90
4005D39m57K84k03Q0m00j19N5M28l57K52N45j29l48J1l38P05n52N03n64o9L43
4026A09q11J217m05k09m9L02j33j2l82L74j1k70N74j70j5k13PK92K37m06j65J23
4048a6j1L52p09K69k97N80l93LN67j6K1m11R0K35k7l92K20l25L76J1j5P4J14m25
4072a25j61M81p23M58J61J53l05J82k59o8r3K28K43n86K47J41j8m8L42m34j1J76
$$ y = [-89, -156, 283, 81, 241, -33, 323, 129, 112, 100, -106, -176, -163, -620, 54, 149, 105, 168, 12, 325, -256, -212, 213, 207, 689, 15, 300, 281, -341, 237, 247, -328, 332, -323, -167, -120, -95, 276, 204, 389, 100, 306, -376, 159, 98, 170, -72, -384, -101, 74, 225, -90, 307, 38, 54, 74, -355, 307, -245, 126, -52, 140, -115, -476, -68, 36, 426, 97, 201, -399, -102, -389, -131, 123, -241, -428, -83, -288, 247, -44, 42, -89, 270, -114, -165, -360, -130, 249, 439, -18, 266, 63, 143, -257, -376, -321, 107, -250, 2, 547, 418, 70, 81, -257, 448, -104, 399, -165, -234, 109, -702, 515, 110, -99, -148, 154, 21, 9, -373, 1, -10, -280, 294, 124, 109, -104, -97, 195, 432, 26, -139, -16, -27, 325, -384, -115, -412, 168, -225, -222, 345, 329, 350, -61, 29, 264, 237, -155, 65, -260, 116, 127, 112, 186, 300, -125, -286, 195, -528, -70, 91, 244, -61, 121, -138, -206, -299, -71, 172, -414, -167, -26, -44, -92, 250, -184, -195, -19]
4094a9K87j91K05k43j46j20kKK96J58j08l14O30o21J09L71m20J38k01n5N06m7
4116B15q0J91l82r2J17J44q3m5m1n9J37m5L14n30L89m62n4M37j23k26R0K65M08
4139D85q49P44n58J69j02k51K00L63k55k72J65Q69m91n2j50j81n27L32M36Mk3
4160E6L88q58K92K76k58n9L73j90J09N0n3q2n28M96J46j41m51L80Q3R7K85o45
4182b34N17m75m1L37l20R8j53l66N30J7N43j61l51Q1K24o60M77R0j80K4K83QJ37
4205D25n00k96J25o8M71O8J20j14j71Q2m22J78L01q3J09K65km56j89K43K0M0n
4228A41l27K67L39m66l84J44J72N6L11l70j28N15l31j1J81k67m28L06O39k90n1
4249A8q9r3J61j02L48K47n76L93l05n0l5K21k68M57k88L34k20o15L00K12m48J54
$$ y = [-19, 268, 77, 282, 39, -107, -227, -229, -227, 69, 227, 119, -195, 435, -186, -77, 294, -126, 12, -189, -244, 262, 215, 135, 326, -56, -148, -31, 113, 30, -15, -56, -115, 22, -23, 291, -239, 150, -312, -366, 71, -52, -278, -188, 77, 485, -364, 380, -178, -9, -111, -362, -162, 201, -54, -326, -161, 708, 217, 165, 15, -166, -693, -361, 75, 79, 56, 444, -414, -122, 154, -104, -163, 210, 20, 129, 179, 126, 44, -484, 12, 158, 17, -434, -54, 29, 126, 411, -234, 283, -192, -233, 104, -216, -118, -271, -637, -107, -90, 453, 292, -59, 22, 246, -414, 63, 153, -27, -3, 280, 288, 425, -75, -371, -246, -314, 157, 225, 345, 231, 60, 142, -280, -102, 199, 116, 225, 490, 488, 32, -157, 86, 106, 146, 141, -186, 81, 420, -46, -430, -286, -114, -58, 253, -117, -245, 270, -61, -72, 109, -158, -586, -280, 359, 69, 18, -71, -164, -3, -105, 243, 490, -86, 307, 2, -48, -83, 138, -130, 327, 39, 373, 153, -462, -162, 50, -398, -244]
4271b44L59n95M54j37k88J24J68j87L99M8k24J17J68P2k69q7K59j50J68m56k4
4292c25j16N61Ll7l73J83K57l25N09k87P6m58J74O8K22K45On49L12l97j67M06
4314a2Q1j53K48k77k20P96l9m05m58M85k94M84p82K84L85k31N62l64J26k71J26
4335G1J59M5l97K22j58l41L62k13Q74m37q0j23K25k84nn8N5O3k57J57R0Qm2J69
4359A05j35O3r0R9j58L99n40J92Q9K45j25j20K99K54p92N35n10N80l11q0J46j26
4381A9k62O05m88K84k14N83L5n90J45l96J61L94l38M15l92k67N23j78N7J49l56
4402a11K09L45j73N8l16K04j7o75O81J9q08Q42L04j285O56N4L85p18N09l39M94
4423C18k21K8J95p66J026m68l85N52nk72k29M08J91r95Q53m89M75K26k78J64j20
$$ y = [-244, 115, -480, -26, -163, -451, -327, -159, -346, 53, 101, -123, -6, 162, 234, -35, -122, 137, -13, 155, -301, -325, -441, 120, 123, 86, -287, -104, 153, -172, 337, 50, 126, -332, -158, -90, 132, 377, 383, -166, 146, -251, -418, -12, 69, -84, 164, -113, -333, 463, 424, 19, -439, 46, -248, 236, -546, -262, 123, -108, 454, 90, 216, -55, 71, 230, 275, -122, 100, -58, -399, -37, -250, 624, 187, 107, -16, 209, -75, -80, -138, -83, -20, -277, -120, -30, -22, -64, 105, -30, 33, -57, 42, -116, 283, -257, -65, 24, 269, 144, 24, 323, 577, -215, 320, -190, 390, 79, -1, 145, 19, -243, 362, -126, 158, -56, 527, 562, -28, 117, -279, -118, 276, -62, 353, -39, -306, 217, 39, 96, 245, -111, 98, 443, 270, 328, 12, 216, 199, -476, 205, 224, -584, 258, 562, -723, -67, -13, 372, -346, 163, -176, 318, 97, 125, 320, -446, 580, 112, -273, 279, 274, 2, -227, 181, 372, -623, 230, -259, 216, 442, 164, 328, 208]
4444B08n4l6R5K45m9n03M42m44L30n9k23k10K57K59m5o53J45M50n60N84j64N10
4466E25o67R5L86l86N34p46N10j71m31J63j35O83j97k50j35m2J13l54L15J66l29
4487c53L0M94j67k92k64N35R2l34K58m14O07j29n4q6K13J78j72l01q0N4K85m36
4509c36M03k3k28L35m18J5K0K49K93k54L7p7O61m91m18N25j07k44K49l06J07J21
4531A13k73M03K83o97L54l24R2J65N28q86N81O8n43L98n96M09J12l26L22j89J36
4552A30j6j48J41K9LJ86N4N2l78j9j72j8L95j24Q4m91L45K1j59k11M17j62K38
4575A97r26O02M15m37k47M84j82j10Q8M07m70L86l18L44l08P29q07L89j09o58
4595e31O21J59Pk63J61J2J19j69k07J44J89k87j21M04m95M97l4m55L56J95o81
$$ y = [208, 154, 118, 213, 458, 409, -94, 348, -96, 234, 175, -48, -258, -1, 258, 213, -440, -295, 155, -405, 179, 15, 525, -142, -47, 339, -47, 487, -259, 251, 80, -351, -188, -323, 360, 163, -87, -222, -264, -151, -505, -190, -24, -353, -323, 171, 4, -288, -552, -17, 75, -259, -1, -415, 192, 63, 9, -77, 136, 314, 142, -159, -239, -185, 100, -336, 67, 44, -184, 151, -267, -252, -232, 17, 310, 56, 93, 16, 677, 186, -232, 293, 186, -58, 191, -115, -8, 113, -160, 243, 526, -171, 183, -141, -49, 116, 644, -242, 339, 407, -136, 262, -334, 75, 187, -139, 183, -6, 130, 114, -34, 107, 136, 139, 325, 379, 431, 53, 34, -138, -156, 239, 115, 199, -292, 53, 74, -85, -296, 121, -41, 197, -729, -127, 288, -149, -396, 88, -94, -204, -116, 291, -179, 207, -111, 233, -75, 654, -153, 236, 127, -531, 90, 249, 256, -7, 154, 166, 285, 116, -91, 53, 242, -45, -166, 238, -257, 240, 206, -249, 107, 302, -379]
4616c79O03k97L8l18N20o2l05n0R21j146J85L42L23k19j88Ml91M10o83O90j41
4637a43M34m89L83m78O56j81k57M0K07l65K00M3k28L59k97J17L2n65K49J44N37
4658C98p30J69N71q23qN15J16j127Q23K53n20J06l2N53o59O09n28N15l50K76k5
4679A02l03k32Q9M39j17j38N95k70j82j57J34j13J05k55M61K72n87M8K87o8l52
4700b42N6j15Q86l95l78L15n9j58M41o29L25J77l11J39j96r5M25l4J74o87O10
4721B49k76M22k01m8L07l81N1j40j24J58n6L67m76P48r12N96m01J79k3m8K67l77
4743a19j02N31k86k92K11k27j2K60K06qj74j34O3k82K74K45o1r2k58M93n66J91
4765a39j28K03o5J28J20o4k94r3P02m34K77l27K02R7L16r37L90L21l9k63J89k04
$$ y = [-379, 224, -73, -35, -353, 167, 105, -200, -250, 671, -475, -290, 52, 375, 156, -32, -28, -419, -9, -692, -2, -143, 291, -198, 185, -293, 363, 182, -75, -35, 172, -193, 7, 50, -178, 181, -116, 1, 33, -532, -283, -139, 398, -332, -163, 408, -415, -423, 92, 208, -919, -96, 157, -363, -257, -289, 264, -395, 214, -314, 201, -149, 127, 102, -201, -433, -344, 95, -22, -160, 435, 165, -17, -174, -40, -153, -48, -303, 158, 430, -157, -109, 178, 110, -242, -186, -301, 585, 190, -188, 127, 68, -90, 351, -278, 47, 224, -87, 52, -144, -239, 186, 152, 326, -361, 249, -27, 395, 194, 146, 453, 72, 123, -17, -141, 17, -39, 328, -148, 600, -312, 284, -117, 62, 39, -9, 258, -119, -221, 310, 24, -268, -57, -284, -296, -36, 170, 162, -12, -146, -83, -365, -91, 154, 93, 1, -257, 236, -330, -139, -267, -64, -129, -1, 119, 55, -239, -332, 370, -64, 213, -114, 88, 185, 501, -436, -46, 275, 236, -27, 162, -42]
4787d2J38ol58o2K15M36k72M27n27J9J36k64L00Jm79J38J51j87L9K90n0l84k4
4810c65K35j52O52p16K59j4j44P35l76OR1l72Q37m67j9k07j49J97J11l57J66K03
4832A54l43M56j98L33j77K4j27o06N32J11l3J01k73N45l93j65j21J62O4K52L08
4853F06m42R1n36K79K58m08L6k85N5N46o6l92J57K83k94k94K42K38Q0K87m73j47
4875a79P91m36k65l55N23k8j79M21P1l27k08J7J34L8o8K06p5k6l1M22m98Q2N39
4898E69m00o5k2j19L48n50O5J75O2J62j01J00mj88L68k47j14R0M40o00M0M09j71
4921B47l18J25k60N25k13k66L39J45q75Q11k95j98K99l73K83K21j31j39J63L20
4941D10k99j03l19l3M62R5K8m50J06M6J68qk19N38p94M73j98M22n10J62M9L3J67
$$ y = [-42, 96, 90, -268, -330, -115, 321, 49, 476, -51, -32, 104, -160, 140, 141, -338, -200, -49, -236, -197, 93, 43, -341, -365, -130, -282, 370, -346, -87, -101, -245, 490, 114, 120, 211, -161, 676, 209, 190, -17, -166, 31, 142, -215, -49, 154, -189, 267, 69, 402, 225, 249, 122, -484, 48, 159, 126, 227, -46, 499, 106, -59, -180, -18, 46, 298, 606, 164, 255, -281, -2, 256, -152, -116, -401, -346, 200, 134, -258, -101, 182, -112, -406, -164, 74, 154, 441, -32, -179, 612, 176, -89, -444, 79, 51, -128, 293, 364, 37, -171, -154, -20, 18, -50, 156, 81, 55, 24, 446, -52, 30, 569, 169, 104, 82, -37, 311, -239, -174, 1, 63, 225, 124, 224, 220, 32, 400, 153, 39, 129, 569, -31, 9, 418, 247, -71, 54, -206, 319, 106, -160, 179, 324, -551, 260, -35, -233, 66, -307, -24, 197, 66, -73, 90, 410, 111, 8, -311, -344, 118, 213, 241, -209, -103, -57, 111, 103, -116, 422, -372, 101, -97, 325, -185, -23, 26, 59, 226]
4964B26m67K84q7k05L82m89K22r9j5L06J57K51k16k55p4O02q26L97K03m14J23
4985FJ89k01m50N06k04L73m14m6L62j68M93m34N94p35m16R36n82J9M4N27p11M3
5007b69K33O7qL23k39q00K45K90J22K19m29L69m68O08o16M36l31K40Pj51k0N33
5029C61k89m3k67M70N2j44o59K32K06L0J62k65J66j62K33K10K9L0k80j00j15J56
5051A3l4m39K19M89l88j64N23j46L31m53O0K34n55L21R7r8P12o18j70k8m4M21
5073B83q17L42L04K69k50j75K64l4J04l38J02o4l7M55j11k82k97J39L88p1M24
5094E98k91l42Q22p39M77m82k00J68K79l73j13J8K20J68n09N13k17L66j60m3k11
5115e1l6k42j05L55L47l25K74p68N75k18l88P66M4k97J89l9l34J66j80L8L58k18
$$ y = [226, -241, 43, -44, -249, 133, -356, -134, -233, -248, 58, 215, 466, 250, -5, -79, 523, -303, 94, 297, -117, 6, 195, -6, -456, 50, -154, 219, -195, -241, 121, -47, 446, 12, 606, -129, -545, 391, -191, -172, -128, 399, -312, -269, -36, 31, 23, 346, 107, -693, -448, -158, -36, 183, -246, 123, -345, 263, -353, 83, -248, -8, -1, -152, -172, 361, 72, 29, -238, 232, 284, 140, -519, -287, -81, -51, 111, -154, 12, -150, 83, 293, 322, 352, 72, -28, -143, 13, -21, -460, -241, 248, -140, -304, 219, 73, 404, -49, 11, 245, -310, 11, 108, 10, 722, 104, -66, -94, -138, 283, -534, -192, 112, 381, 131, -44, 220, 186, 290, -48, 54, -10, -47, 408, 297, 15, -282, -143, 245, 174, 598, 307, -35, 787, 48, 525, 43, -157, 11, 290, -83, -196, -178, 42, 210, -299, 214, -3, 363, 203, 160, -51, -87, -329, -434, -79, 268, -57, 217, -551, 24, -194, -582, 184, 228, -69, 120, 81, -253, -87, -267, -229, 129, -89]
5137h9j95l38N62p5O7L41m61K50L3l59O45l35k31K73j23M35l39K26o73K20K5r3
5159b34L36L63o73Q5L18j85p3J29K80l37L25m13k12M83p8P5k40J31k34L04K37
5180C87l96m16L56k08M83j27Mo01O27p9pJ79j69k96j47M23n7m1L15l99P5j84K11
5203f7q7j41P81n57r9K06l0j9L82j46m40k53M01p2K23J73J1j23jk49M55m77O03
5226D74o80q4M57J91J07k64q8p5k0k39k4j34O53o02L40o9r5j39N66m05J19j87
5248a98O51k13l16K23L1m15M60o11M27oO8K30k80q8K75l74l60M43L74j06m16J87
5270a4j22j73K20P3k35j45J54l38Q61m66J39P5Ml93J63Q93l75m93J42L63m06j35
5292b08R3J00J06k37J12N55j82m99m14J094r53L26J20j23L94j33j12L21p06K76
$$ y = [-89, -284, -622, -60, -135, -68, 273, -188, 62, 95, -264, 381, 46, -185, 88, -35, 400, 61, 287, -386, -166, -141, -234, 102, 465, -208, -123, 195, 10, -63, 66, 346, 9, 334, -79, -291, 192, 114, 189, -51, 80, -154, 150, 387, -9, -425, -69, -277, 206, 79, 83, -518, 109, 30, 23, 202, 33, -263, -410, 13, -44, -85, 230, -169, -94, -278, -67, -154, -295, 486, -71, -170, 36, 6, -13, 369, 223, -217, -470, -69, -141, 82, 255, 266, 143, 142, -107, 348, -129, 474, -206, -290, 167, 358, 465, 201, 113, 38, 18, -221, -245, -379, 274, -328, 12, -57, -152, -291, 275, -130, -11, -198, 453, 240, -76, 147, 178, -237, 223, -388, 39, 33, 101, 331, 51, -37, 238, -136, -496, -53, 321, 215, -201, -14, -136, -309, -89, -16, -251, -396, -242, -580, 281, -185, -46, 29, 33, -360, -197, 696, 321, -172, -30, 333, -73, -208, -115, -15, 91, -146, -34, 521, 339, -160, -574, 520, -433, -107, 13, -110, 284, 151, 39, 360, -346, -70]
5312g0P7p8L16j91q3j83L22j11m56N08J5j35j89Q46j17p58l69N03L68k79%l50
5334d14N00m50P24l24j81O21n18O8K43k7r8j92j48J9j82N6L14J81Nl19M18r3l38
5357a35J86M68m71L2O5m74P94l01l12J07k20N0M35n24l92K85Q40o18q8r7N82l8
5379A74l85L42k79l43N44M29k02n89K23j51j13j05L54K55J30M0p01Q10l29j30
5399b6J16l74J64L17q7J58J84m38K44j30l21L05l69K03j76M48m65M80m39k39L82
5420f3L2K44m58L26j10j28K87j79j78J35j04q0N72m77k77O54J71k55k11M83j78
5441B06l61R5K84j82j23M41J24l59k8N73m77j89p8K16k91k55M79k12K93l00M04
5462B60k0J9o03L38K57l90J80m69N99K16m62n2L65k40Q4K6o59P70pr0m81K64J08
$$ y = [-70, 7, -71, 245, 54, -29, -212, 110, -1, -457, 51, 66, -69, -258, 588, 471, -287, -656, -153, 215, -64, -64, -414, 86, -364, 360, 36, -145, 476, -42, 26, 269, 242, 144, -48, -196, -177, -359, -303, 11, 192, 197, -122, 296, 203, -135, 51, 519, 48, 80, 145, -329, 465, 164, -148, -41, -261, -211, 224, -300, -692, -407, 433, -185, -273, -370, 212, 174, -211, 131, -148, -491, 53, 482, 280, -309, -86, -237, -350, -455, -101, 154, 284, 324, -377, 433, 104, -26, 90, -284, -120, 197, 110, 268, 452, 14, 258, 128, -193, 112, -257, -54, -230, 218, -247, 233, -206, -445, -63, -31, 213, -245, 81, -29, -157, 130, -49, -227, -92, -196, -276, 296, -181, -458, 196, 367, 112, -99, 384, 206, -155, -60, 224, 42, -81, 360, 484, 125, 97, 670, 193, 4, -74, 142, -149, -404, 75, -137, 156, -144, 260, 240, 259, -344, -6, 251, -139, 41, -428, 171, 387, -75, -127, 238, -2, 82, 108, -551, 219, 212, 122, -359, -95, 13]
5485A3m0k3m53M86j65J92K68k81K8J95l50J24K71rl03k95R2M65j51j63J89L56
5507D46l51r0K28%j56n4p1N08n84m43M13M70r9m56L01o57N51M86m98P97o79L0
5529I2n4k29O4j91N61k91m1l37N85O5k06J34n25J76K06j18o6K03l87j24L55o4
5551a92K69j18P1l55O13m13j88N00l4m2J29n43L40J73K51j91n33N93J21r21L82
5572h8k06O08m21L28m56J86J47k11k10M56k52J96J4J83R8n24N89n10k55N93j83
5593H2k10k65p9K39j27J41L56N18p31L63j98J01l27M96m22L98k63l27M3L58l02
5614a56L94n57N32n80M67J22m68m1K22J52l61M92P8j73K27k73m85N26J03M1m31
5635a69J43K04r4K09L8l11j77R4J93MP5j22J15m79P42m69l75R2K62j8O9J03k02
$$ y = [13, -27, -50, -503, -17, -182, 10, 278, -3, 25, 220, -130, -6, 265, 256, -47, -342, -250, 215, 64, -99, 90, 446, 95, 5, 233, 233, 77, 23, -48, 460, -124, -567, -154, 316, 217, -239, 62, -595, -44, 442, -56, 741, 62, 92, 38, -191, -127, -318, 243, -48, -89, -426, 159, 224, 18, 152, -373, -197, 9, -109, -175, 28, -359, -483, -128, -192, 77, -41, 30, -325, 288, -125, -313, 187, 153, 111, 240, -303, 37, 210, 461, 270, -263, 330, 451, -470, -88, -294, 314, -107, 221, -235, -49, 98, -113, -323, 133, -119, 77, 91, 274, 372, -152, 437, -73, -328, 265, 82, -128, -393, -472, -233, -360, -219, 137, 655, -76, 287, 89, 190, -137, 359, -63, 335, 72, -255, -212, 146, -156, 238, -319, 213, -367, 100, 222, -246, -287, -65, 87, -274, 218, 296, 123, 350, 77, -408, 118, 221, 262, -169, -26, 178, 84, 293, 331, 20, -157, -63, 130, 134, 209, 87, 202, -277, 465, -4, -379, -287, -25, -43, 26, 129, -73]
5658g3j62J41N13n15k4L35m33J85L5Om34N33J93rL13n46P2M2l71O3q3k68O41n4
5682A00M7J31l01L35m87k70M22L32m04O41k40m04j86K94k59N3K68K89k93l23J10
5703a45l98J93L60k95K27j81P65j96k68M29l65j52j23L96k71r9L63l44l8J53k83
5724b72M66o35P71m19M2J3j81L18J20l58L54k27J16j96j4K71K33k95l56O11l98
5745c6K79k03l39K46P0oL85n26K34j54j25j44K67m49K80Pj76K41J26j00K05n40
5767d58L43L02m70R6m5O7P2j99M53l10P44p33J15k67L42K4M25m19k73j50L11N3
5789B3l63Q1p6M17r4l22o0J04K65j5J59l02L4J83o7K9M1n48L17K28j62j81K01
5812a08L72k65K3O6j07j66R4l65J03mP93q10P97n16NL03M01p39L45l25K79K04
$$ y = [-73, -235, -94, 419, -96, -120, 215, -218, -33, 2, 8, -426, 107, 300, 291, 604, 58, 130, 172, -199, -136, -219, -487, 154, 100, 147, 278, -23, 312, -175, -445, -23, 309, -95, 546, 306, -98, -284, 10, -249, -196, 72, 361, 68, -255, -145, -543, -350, 10, -285, -58, -239, 526, 330, 62, 491, 126, -26, -149, 247, -24, -123, 240, -104, -142, 11, -272, 194, -441, 330, -89, -47, -34, -215, 103, 223, -135, 219, -8, 108, -88, -102, 169, 402, 107, -249, 362, -36, 243, 40, -299, -53, 17, 11, 396, -130, 104, -50, -175, -319, -52, -501, -221, -214, -390, -149, -23, -123, 82, -458, -115, 187, -283, -187, -232, -165, -93, -292, 161, -149, 595, -138, -23, -290, 52, 76, 501, 82, -191, -341, -30, 23, -340, -259, -335, 82, -12, -334, -394, -290, -25, -40, 119, -183, -149, 34, -33, -4, 37, -511, -194, 34, -128, -309, -108, 264, -1, 22, 88, -19, -185, -91, -456, -353, -357, 436, -374, 423, -93, -88, 215, 616, -123, 222, -103, 176, 380]
5834C80p56M73j3K8k99J15l96j09P01L8l16L05j53j99j47P7N81j14Q4n14M29k08
5856a3Lo7j84L34p3J11Q6j19K25n13O30k79q1j86K69r7j72k22N1P41q00Q47k95
5879A96m11o8l52O34k34j82L27m76J046j43m87J94P4q3M32o55K45J67j62L34p93
5900c97O62n10J41K51j85l07M31M8k56K31k66N63n0p5l14j74K0k15M01j76O75
5921D98k76r98N05M90l21N19m46m65J51M06J16j73j86L22m78P8L57L8j22j77J42
5942b0k44M31OJ93n0K31n10n7M49J08m27J88m02k34K17n7M3J48k30J42m19L72
5964a22N12o42N13o28l5J70q2L0K79k88O98n33K22o06J24O37m02j3m00N41L58
5985C33m2j89l73K62L84n96N72L32o81J66j33O2L5K56R3o92L68l32m8K52l00K52
$$ y = [380, -376, 97, 84, 112, -187, -72, -468, -577, 124, 162, -154, 151, -2, -201, -348, -271, 310, 196, 280, -234, 195, -13, -10, -77, -261, 73, 0, 111, 197, 78, 303, -210, 420, 141, 60, -126, 143, 46, -126, -348, -297, 444, -356, 491, 196, -215, -283, -635, -1, -235, -417, -90, -566, 480, 337, -150, 44, 118, 35, 467, -188, 57, 224, 62, 396, -397, 265, -245, -104, 147, -38, -345, 86, 134, -122, 109, -157, 406, 356, 281, -33, -207, -187, -402, -1, -177, 498, 222, -776, -271, 219, -102, 417, -29, -494, -343, 63, 179, 6, -180, 142, -336, -258, 99, 137, 15, -162, -20, -264, 167, 173, 366, 316, 547, 37, -20, 429, 537, 110, 298, -104, -338, -121, -178, -135, 13, -217, -75, -494, -122, 390, -252, 261, -367, -402, -232, -314, -284, -5, -293, 405, -128, 94, -512, -388, 249, -153, -166, -566, -25, 333, 291, 102, -271, -9, 375, -221, 351, 683, 2, 168, 35, 97, 132, 388, 481, -211, 157, -175, -223, 29, -271, -19]
6007a9Q8Kl92K60j34K84j55N4q1K98m12J90j30k36P00m61L32l31QL00j2J82j42
6030A93m25M16M3l20M46l80K19p3P7k77M4M3N1M59o20m8J02K55k54Q4k91j91J57
6053b90J042q93M53l60k17M1L89m60K73j91K35j48k0M38n94J63r9j51M07n8O3
6074B3Q3j24j45L53m96M81O8l50K9r8O09j028P15K59m37L4l74J83k80P74J26J73
6096E78o31O8M32m50K65j86k80K31j82J87M38n27K02J55k11j16k25j08M28j84
6116a16k6R9K27p5l1L6m49m7M22J95k00o25K06K96J82r2O74n44n35L34J1j65M15
6139A92Q3l28n33K98K28j79Q01r38L05L37j54K03j91J2J2L31n11K35Q1j30L4J46
6161C34j76J9j36l28N44j3o2n5R2m22O32n72J95m3J22k02J44j71K3L02k9m58L60
$$ y = [-19, 69, 71, -321, -61, -195, 89, -66, -12, -93, 205, -207, -17, -147, -383, 317, -144, 188, -143, -135, 165, 153, 335, 193, -232, 184, 227, -93, 353, -27, 192, 119, 196, -81, -37, 6, 57, 516, -104, -152, -50, 205, -49, 35, -256, -447, -290, 752, -141, 312, -48, -265, -224, 165, -295, -22, -213, 22, -126, -146, 292, -302, -139, -238, -389, 18, -40, 23, 106, -18, -163, 190, -306, 175, 243, -107, -78, -176, 433, -595, 120, 379, -58, -24, -398, -215, -495, 279, 405, 578, -53, 15, 447, -3, 262, 76, -204, 27, -155, 32, 470, -57, 145, 300, 89, -27, -252, -360, 68, -116, -142, -43, 184, 109, 78, 114, -335, -382, 40, 235, 35, -590, -384, -88, 94, 2, 676, 132, -403, -69, -58, -223, 192, 275, -53, -586, -288, -60, -239, 562, -376, -71, 266, 112, 315, 124, 136, 148, 479, -32, 203, 284, 154, 188, 334, 158, 177, 41, -287, 257, 244, 182, 127, 219, -203, 429, -143, 52, 9, 131, -71, 73, -98, -75, 227, 198, -260, 100]
6184A00J58k14K54r9j41K21r5l71N16l83L55m34L67l63m04L61M6j27M93l41L44
6205B43k94l4M92J22j45p38K71N92n95K18J15j16n92L38j73K51j76j18j15L86
6225f8M07m40K7J41l17L37n64K22M42k58N02n63K54l66N8L17k66L91lj97k80l97
6247f21P29l6j33m4J74M3j1m21M32j15j98J22K03k68N88k14m45j07m9N63m80p
6269b95J84K17N7k58J63K27j15m64J55J10J03p8k11J35j45n9M15m98R40p91K05
6290cr5L73n81N51l09Q8k19L2l1j8N85k73m58L66L69k99L73n99o8R6L97j52j08
6313A7l57L60q1j11LJ1K95k71J87J7k95N08K9m23j65r5M52j93k5M0L40J79p06
6336b84K95k14j54O65l28p24R91n69L58N32m41j86n05N14L30l35J72j42N11o46
$$ y = [100, 258, 44, 298, 199, 58, 279, 184, -187, 329, -54, 301, -133, 234, -129, -533, -172, -126, -253, 240, -101, 243, -51, -85, 407, 529, 384, -354, -83, 509, -86, 132, 247, 131, -461, -123, -296, -45, -221, -339, -454, -68, 339, -101, -74, 67, -250, 87, -477, -255, 187, -71, 431, -132, 122, -244, -186, 131, -135, 256, 253, 56, -224, -621, 108, 72, -61, -105, 69, 112, 101, -320, 112, -3, -201, -79, 124, -144, 444, 230, -215, -322, -371, 192, -288, -295, -111, 106, 163, -95, 68, 295, 180, -284, -129, -19, 84, 6, -205, -70, -215, -274, 141, -357, 583, -208, -3, -98, 275, -306, 245, -64, 24, -195, -163, -194, -212, 373, 100, -358, 8, 377, 78, 451, -148, -216, -120, 277, 125, 17, -340, 20, -61, -172, -169, -158, 137, -134, 53, 70, -225, 283, 312, -111, -276, -371, 81, -112, -137, -97, 243, 422, -284, 11, -203, -357, 308, -20, -744, 247, -322, 36, 568, 127, -59, -564, -50, 280, -55, 117, -25, 486, -160]
6356a60N77m24O69m57j96j19J25j35k57K15q5l66R53k15K58o81K80R6m49O97l44
6377a8J34p0K51j25m55L93rl63K25j94K03J39l60M38j83L14n49O14l60L01J72
6398D98m60K62n22O30l68l81o2N4k30Q04k21j97O22j62j74R6L91p98J32J35l02
6419b53L23j33q9M23l11J2M9l06J07P2N25k57l15K10L09n08K22j76M10k16j82
6440h4J2J00n37j32M33jL4n3N02r9o0p6J0j85L80O2m52L70l03J90k3L73K0q48
6464c67O79l98K75pk61J11j98J23Q5K56l06k22j5J64N3p0J82j38J9r3j68j03K56
6487a43K30m13J86J67j13j02L24k39M30O6j70l84K07l12J37j32q3O96k81j49R2
6508A4PL12n0k02q5l7m53L53qJ17L65l81L49n07J83J4J15m18r4L90j18k30M42
$$ y = [-160, 417, -7, 662, 205, 9, -110, 15, -120, -377, -162, -247, -613, 340, 125, 383, -298, -18, 78, -371, 326, -18, 116, 46, 297, 172, -283, 110, 101, -262, -37, -231, -28, 111, -249, 189, 6, 320, -229, 385, 25, 326, 498, 38, 300, -222, 408, 40, -341, -403, -349, -579, 225, 4, -193, 429, 267, 93, 189, 580, -218, -86, 49, -253, 70, -63, -152, 271, -40, -28, 21, -285, -178, -106, 419, 162, -153, 57, 366, -142, 80, -96, 314, 98, -84, -72, 28, -509, -641, -208, -209, -175, -228, 274, 175, 115, 39, 49, -136, 244, 306, -146, 224, -79, 111, 88, 461, 481, -367, 312, -86, 189, 182, -79, 32, -166, -43, 42, 298, -8, -230, -245, -81, -28, -98, 84, -54, -35, -128, -296, -399, -143, 87, -326, -140, 27, -86, -188, 136, -103, 327, 393, 223, -161, 46, -266, -129, -261, -344, 352, 71, -78, 14, 21, 333, 283, 81, -4, -41, -494, -141, -149, -32, 333, -48, 301, -206, -23, -9, 106, -312, -406, -16, -134, -364, 78]
6531G8n63N84l9K37n89K72k66J72J70P7lk67k19Q08n24q8L18J1k2l66O82q81N20
6554A02J34o97M15L93J89m79j73J28L7j65K67j69j1j90M44J28n82K16r2K26O3
6575A84j64j25P8J03J6l59M18k21K22J90n79O25n79M91m17J99k14N17n77m07N83
6596a6n2Q0J53l71j86K56Q2mq5N55q48O62J72P8m37M33j028O73j26kN45k06m08
6619h0M27j94j66K13l4K19J4n16K57J12q18M52k0JL27m03j14m44K90J038p11j21
6641b71L73K33n88k98l5Q78j80J43k11l19K33J23r4p9n02J111m94r9K15K81n28
6662a08J23l3J25l01k34O34J39o21J47J35O8k04j57M45N6j33k06N68n67K55m76
6683c45L98K43m15K12K03l92K66O7m99L7r3L22O12n90M13M9k58j96R6ql74N3P58
$$ y = [78, -485, 99, 60, 297, -292, -20, -286, -114, 56, 133, 130, -137, -356, 452, -72, -160, 158, 169, 147, -219, 463, -418, 102, 236, -461, -46, 347, 536, 57, -116, 12, 49, -116, 151, -18, -29, -219, 225, 353, -229, -13, -105, 121, 184, 20, -105, -27, 76, 92, -267, 151, -70, 152, 342, -237, 388, -191, 300, -117, 82, -132, 385, -192, -599, -16, -68, 12, 165, -206, -392, -136, -54, -58, -143, 412, -436, 226, 398, 476, 39, 472, -556, 117, -9, -11, 534, 328, -80, 347, 153, -13, 200, 166, 385, 399, -117, 140, 252, -566, -114, -134, -133, 194, -209, -323, -767, -477, 561, -150, -271, 102, 335, -253, -551, -586, 292, 112, 255, 44, -275, -42, 81, -13, -92, -594, 517, 23, -76, 139, 420, -108, 15, -18, 107, -194, -428, 206, 345, -276, -129, 6, 74, -130, -287, 158, 214, 81, -125, 443, -124, 131, -345, 53, 296, -119, 93, 296, -96, 170, 237, -262, -225, -318, 4, 616, 26, 439, 488, 230, 34, 130, 122, -252, -199, 559]
6706E59j074J59QO21J53o63RJ27l3J52j69L78j52j31J59n8k08R9L23p4M0j96j13
6729h4k62k3R8M63p88L41J72K41q11M77L09J30k36q6M73l01l27j7J89M2N7l41
6751b84j9N90o51nJ19L98M8l16l67N89L3k25j3p7Q14o80j4R2M8J81k86J1K6m77
6775d65M16N90n32L9L60l03O13j130J77L79K52j07kk13p1j37k35L80J19M50m84
6796I6j49j34L93l51K87k2k98J11m90M44M44l79M96j61l46J00k68r3J11K29L69
6817C89n55M07m8l09K52j48o0n1M10o4k02J43P3L73l43k63k94O18l22L46l75o0
6839h3j80L25k32K55k96mL00M82l73j7j92l62nL99J07k29K32k86j58M85m42K09
6861f5Rj25M23K57m24L5k53J85Q4K56r96Q07J10l53n9l17L43J18K44l70nK4K13
$$ y = [559, -515, -356, -348, 273, 426, -237, -228, -101, -134, 18, -151, 227, 75, -56, 103, 45, -163, -64, 259, 185, 225, 29, -84, -346, -369, -271, 192, -596, -255, -83, 158, -653, -176, 133, 263, 27, -59, 414, 113, -214, -231, -42, 0, 57, -284, -303, 287, -364, -369, -250, 148, 196, -120, -487, 102, 135, -90, -103, -180, 634, -46, -60, 32, 80, 261, -25, -14, 12, -465, -49, 541, 9, 48, 408, 105, 718, -412, -235, 144, 396, 289, 287, 74, 3, -134, -369, 11, 130, 580, 96, -53, -187, 206, -145, 142, 120, -178, -67, -557, -113, 331, -48, 448, 287, -59, 41, -227, -320, -209, 20, 389, -166, 241, 193, -116, 136, -12, -72, -123, 287, 223, 21, 164, 237, 610, 267, 4, -290, 328, 6, 352, -23, -83, -263, 62, -170, 85, -211, -215, 85, 567, 194, 177, -15, -377, -382, 17, 124, -105, 127, -159, -317, 168, -274, -65, -56, -181, 242, 499, 75, 110, -143, 42, 126, 382, -614, 193, 303, -50, -109, -426, -83, 35, 279, -91, -96, -72, 141]
6884A41k90j05M33K00k90N5k66L93o74O16K64k09j45k67m7j2q9M13l15N71n76
6905a99K16j87Q2J32J52l79j59N53j15j97Oj11N85p22Q48q47N92j16L18k15K9
6926B66K0p74Q80l83K21Rj10n24M25k67j63K10M31l57j8O22o85M89k14M36k30
6947B84m45j16N10k34J70n15J83pL16J5l95l3J04J91Jo0o3K76k10j05Q0L82k04
6970A25K6j39J43k46K73K56n2l79j51j9k33L51L74n25K8L98j61J25R4Pm67N25
6992C53L23o10J22P2L7o96J49N5n5N50J64m48J10k12kl97J73k78M61k0M27k74
7014Dp5m8L12J90l48k82j02O96o03N08j66k66j2l8N80o12J13K55j18k66L91r2
7036B1K16k94NK27r6M4o01J53L95J72m06N7j2J14L69m48N03j91o24N22K14p42
$$ y = [141, -149, -254, 179, 379, 89, 144, -122, 271, -403, 213, 477, 268, 123, -144, -191, -203, -292, 121, -194, 377, -199, 17, -170, -88, 44, 196, -183, -342, 211, 96, -101, -95, -206, 379, -343, 505, -342, 250, 134, 452, 237, 266, 286, -488, 392, 9, 230, 239, 129, -395, 30, -237, -400, -190, 241, -116, -134, 488, -197, 292, 78, 514, 284, -161, -277, 233, -1, 169, -346, -163, -170, 146, 161, -234, -267, -163, 28, 29, -31, -94, 182, -28, -133, -53, 329, 125, 151, 12, 155, -91, 182, 438, 386, 7, -144, -163, -396, -45, 329, -196, -168, 230, 69, 194, 288, 295, -172, 353, 676, 66, 188, 260, 297, -399, -250, -195, -250, 300, 464, 16, 126, -86, -88, -485, -312, -590, -129, -149, 278, 4, -71, -119, 193, 383, 35, -247, -349, 347, -256, 252, 86, -180, -192, -230, 350, -262, -149, 106, -12, -278, 113, 21, 237, -57, -52, 175, 79, 123, -478, -325, 70, 242, -164, -107, -119, -5, 364, -84, 419, 228, -396, 126, 340, -402]
7058d02o9L07j50N21j68N97n44j02N91m88k40N25k02l39M35k78m4M21l36RJ60
7079B04k14j54N38j90m7l20J14O8l14M18k8L05j18n17K53J23j34k55N38n70M42
7100A42l02l8K33qJ85k05j85K72J18m44J05L24n7j43j04MJ86l20K57J18j19k36
7122b17K17K74J78l82N4J65k78j14j12K45l8p2M57n7j70j78j97K27J85k86P0k26
7144b55K20M04o11M04LJ04m81j26J21K96k16k1K78j69Ol7N92n03j14M3p3N26l71
7167B0p7m08M17m17K38J72k99k0N59j96k33J47L8k46J98L7p2n6J38L4J21k0K18
7190B93n4n15Q3j34J35k5N13j01k03rL63m48J25q43J025n61L19K71k48j21l4J86
7212A7j38l27O85k61pM59r85O87K83n93q9l18O89l72k08N86j65K20K85n45O8j67
$$ y = [-402, -471, -164, -314, 207, 39, 636, 92, -10, 581, 93, -147, 378, 176, -163, 272, -6, -50, 371, 35, 44, 204, -10, -164, 374, 184, 137, -183, -69, -1, -315, 103, 75, 380, 262, -255, -2, 121, -13, -268, 270, -300, 142, -160, -198, 35, 27, 212, 7, -178, 94, 212, -232, -127, 197, 140, -3, -107, -103, 83, -237, 20, 138, 19, -217, 0, 274, 452, 70, 124, 289, 11, -103, -215, 30, -8, -80, 377, 320, 150, -28, -225, 2, 187, -99, -29, -255, -35, 369, -242, 162, 165, 269, -212, -338, -217, 79, -137, -158, 120, -49, -43, -80, 512, 9, -105, -62, -135, 391, 20, -57, -465, -48, -465, -227, -55, -354, -374, 185, -11, -244, -97, -59, -305, -107, -70, -142, -198, -60, -26, 95, 75, 293, 239, -276, -193, -327, -192, -217, 296, 195, -8, -17, 346, -102, 23, -820, 205, -356, -37, 234, -14, -135, -169, 17, -121, -448, 237, -24, -31, 428, -557, 130, 413, -180, -269, -587, 102, -270, -478, 108, -57, 163, 448, -97, -29, -196]
7234a96J6L94l0j14k4L11j82j03J84l40K25j62j08K06K12n2o3O9O5j47k14K55
7256B02J82p35K57L58J07j21m74J11N06m36K26k02j63M08L4J71l18m27N59k00
7276D5K86O9l06J37k3r0K06m57K47o2j06M5k58R5L38l00K51j58r6N0M65m77M01
7299C02l76J50O2k03QM62m92o08N04M79k85J25M86r10K51R6l33P37q06O55n63
7320b59k3r3M13K34o44O25o68M54k11M38k31M24m97j19j80L12J19K90k72j56R2
7341D8L61l17j85N02p68O77k56J58l31M98Op23Q3M06k41q1J29K69K6j46P4l4k76
7364a21J3K75n37O47m97j71NK79M94k28J40l89N9L11n0P7j50q8l35J64J13k80
7386b69L62N7n0j46k82J7L78O89p16m5n85L23N16p03L98J54j87K99o7J40J70m15
$$ y = [-196, -180, 214, 184, 70, 46, 357, 175, 72, 256, -84, 141, -21, -129, 77, 289, 237, 174, 243, 308, 161, -53, 202, 384, -351, -94, 264, 371, 250, -224, -113, 393, -43, 183, -19, -182, 226, 260, 431, 113, -314, 245, 45, 331, 400, 94, 231, 208, 118, 324, -133, 114, 52, -54, -9, -267, -172, 166, -134, 117, -41, -137, -87, 378, -99, 302, -74, 76, 138, -65, -57, 405, -87, -695, -191, 288, 3, 128, 614, -296, -45, 51, -282, 455, -351, 304, -259, -282, -375, 38, 272, -372, 253, -415, 39, -172, 266, 35, 459, -38, -157, -337, -25, 94, 384, 112, -44, 48, 409, 92, -93, 409, -359, 318, 62, 220, -111, 387, 393, -330, -247, 159, -82, -163, -34, 235, 261, 115, 189, 155, -121, -108, 167, -370, 277, -220, -391, -386, -107, 387, 159, 299, -90, -31, 280, 230, 307, 157, 69, -266, -102, 11, -269, 93, 150, 100, -46, -328, -311, 67, 756, 40, -5, -590, -267, 249, -454, -56, 98, -89, 210, 143, 283, 453, 38]
7408C8J90n48J65J87k55O8L3J83L39m73N5k59M85j80j06L64j09m42Q03m53j67
7429h2L81j79L3m97M3L29J9P5l25N85R6l65q6Rp3%j40k56O48k70k64J83L46J27
7453C37n02K88l78L82k6k2n78Q34r13O98r2l24pK55K46O8p24K00J23j23L54l31
7475b35J81J93J7R5k96K22n56K25pk7M33n40N2K00P8K64m95L38l81M62l77k40
7497c94K58P7j10J1O80n61Q5k6j29K16L71m22k20O2L94p34mM72j99k60N45K25
7519C37M48j065k18K10m25J058n87lN34j81K77l77o6J28J71m41J28K4l77O2k5
7540c88K56L77l6l53K12m13O67j31l38L45p43P95O3m36O4N07k65J37j70j03l29
7561b82O30l01nN1j20K06k11l27R9P62p32L45j63l56J86L3O1R7K18k60N05l11
$$ y = [38, 228, -320, -155, 32, -223, -155, -122, 61, 400, -73, -18, -277, 208, 28, -78, 286, 177, -265, 538, 85, -82, 299, 120, 153, -344, -301, 28, 47, 122, -203, 382, 478, 113, 27, 36, -37, -37, -177, -433, 215, -55, -319, -136, 210, 337, -165, 123, -255, 127, 101, 79, -499, 335, -578, 120, 28, -296, -303, -48, 198, 266, -458, -258, -135, -258, 96, -235, -54, 139, 156, 251, -45, 177, -379, -154, -161, -188, 245, -295, -243, -43, 35, 299, -196, 142, -239, 223, -154, -394, -136, -59, -169, -158, 522, -39, 46, 20, -109, 107, 478, 56, -164, -102, 292, -442, -446, 26, -173, -433, 112, 337, 785, -280, -498, -288, -713, 345, -242, -245, 289, 108, 385, 8, -58, 70, 241, -200, -72, -48, -425, -363, -388, -132, 245, 209, -144, 68, -345, 322, 191, -147, 198, -545, 250, 313, -123, -59, 448, 183, 320, 150, 47, -282, 348, 47, 42, 93, -27, 179, -32, -359, -260, 502, -230, 115, -48, -404, -218, -185, -124, -27, 191, -69, 436, 125]
7583A25o37J66M27L16k91k23P2J83K09j78l72L31l44M16k53L33l46K05k21K03
7603A21J41o22L55j41j76o9M39j5k78L02N25m47L45l52K0k83M20m88j26K8J34
7624a67M01o70K11n4O49o75L63M2N7l85M66l50L66R1o73J70j56N90j07K27k26
7645A70K6p83R01m52N88r83M53l31L32l41M57K04o79O06m46K31l46M95o59O54
7665I7J07r2k0K87m69J57l94N40l28k00K28J42m29M95K13q87P32L3l12L9K8k45
7687b78R94p72l4J08J99J0j1K58J8l99j87j63L11O2l06L56J7k07k4j44P1J03m30
7710d48J36M20o2K24O2j05m04k29M18M36o2j58k95L19l24K99l02k9m9K38j12j83
7732b10J65J50q5J8j53P1j83N68n11j14M74J59l05m74O77k69Q9k17rN1K4j06L55
$$ y = [125, -512, -346, 81, 397, 106, -117, -45, 138, 347, 169, -203, 128, -216, 200, -53, 280, -66, 139, -82, 121, 262, -360, -5, -146, -322, -391, 48, 33, -245, 57, 582, 135, 480, 128, 148, -135, 285, -203, -329, -301, -167, 234, -436, -225, -279, 370, -305, 58, 100, 157, -228, 238, -112, 254, 345, -328, -158, -314, 276, 169, 396, 170, 196, -587, 314, -138, 450, -533, -80, -411, -79, -420, 37, 241, -438, 168, -278, -47, -393, 102, -557, 97, 204, 112, 92, 379, -90, 67, -327, 213, -115, -315, -87, 55, -374, 121, 334, -553, 179, 212, -100, -61, -33, -278, 716, -56, -90, 18, 217, 227, 216, 474, 492, 93, -94, -257, 54, 116, -190, 166, 183, -24, -48, -192, -121, -18, -448, -312, 108, 46, 270, 332, 227, -177, -406, 12, 448, 386, 228, -67, 252, -72, 227, -75, -104, -153, 85, -27, -210, -45, 105, 20, 38, -115, -44, -227, 341, -170, -284, 190, 349, 44, -430, 247, -22, 67, -150, -159, -108, -84, -190, 165]
7755A65j59K06j90K79p50L97J96k92l5J34m07O61J60j57j89pl3mR8j19N99r09
7777c56r7P65j24k87q9K11O6k1n8j03K71K3m5n42r8N46nk69P1N50l19o64J40L73
7801f1L05j01k75M61j23l55L40j02j24l56L54k89J30K30j10k92N57L2p9J2p02
7822e48M23M32j39n73O91M9j66l61M59j0j92l54J56J90K25n19L64k73K60j55l25
7843c66K91l0r0J26J00j05j66K87j77l2L62l02K39l85M35k78Q2k22L01q4l9k9
7865h2m15K72L71o01M67l93N48k70N9j35K8m10O10m04j83O28m6L97n90K74m51
7886c26K18J29K85R5o45L40n08M16m7l45Q55o53L7N22Q2k68q6K81k17L6k08k7
7908c4L20k51J95N0m64J93n8j40J91O7j45L88J22n37K72K25l05l2M1l46J54L24
$$ y = [165, 6, 212, 22, 301, -449, -52, 144, -148, -183, -49, -456, 205, 365, 208, 19, 12, -21, -25, 73, -46, 553, -356, -453, 312, 188, -99, -188, 23, 89, 68, 10, -93, 178, 201, 156, -386, -484, 62, 57, -212, -141, 409, 90, -574, -434, -61, 244, 143, -132, 329, 206, -149, 191, 89, -35, -391, -37, -326, -196, 34, -76, -368, 189, 221, 142, 154, -548, -125, 307, 168, -405, 286, 335, 169, -192, 267, 257, 65, -289, -133, 57, 282, -237, 127, -146, 114, -41, -366, -75, -105, -195, -69, 31, -74, -240, 47, -130, -162, 200, -102, 137, -248, 187, -91, -9, -231, 70, -14, -53, -82, -497, -225, 146, -455, 12, -381, 167, -103, -44, -179, -151, -561, 49, -355, -538, 90, 44, 441, -149, 125, -326, -108, 21, 306, 401, -244, 96, -412, 4, -43, -388, 467, -186, -149, 373, 455, 187, 101, 382, 165, 201, -7, -34, 286, 35, 230, 280, -184, 9, -49, -189, 2, 69, -76, 312, 434, -103, 169, 394, 89, 57, 98, -248, -94, 230]
7930B30n63P30m64n3L87L4k12p3j71j12K38k78K97J20p3N47q07M30l41p0l48M78
7952g4l5J55J09n50N25m4K18j50q0k52M30j01k67l06K49O48p47N92j77j92K87
7973B38o4j59n83K73M5K6M68J01q4n39K49q8J80L7K38j66M07q46k25N76L02j89
7995A97r91J076m51R4k49N54o41O95k23j85M3P0k08J96M31k85J81m29O1r0J19
8016c5j52N83n02M96o29L28j1M9J69J21o25N9q6K27o6L71m52N97j025L85L25L85
8038E12l14j68m89K33p1K16P7K55k43P8j34j23J67J26n43K20K5M07j06j14m39
8059d28M76k43M05j2k84n6L3m12M87L79p85K48j9O21o17J06L54k04M58p65J005
8080G47m39m86M79k98m18K41J40J23P0J7L71q50K01J84j92l52L88k43M84l57M31
$$ y = [230, -333, 397, -67, -120, 267, 301, 89, 16, -155, -267, -29, -307, -10, 110, 37, 584, -223, 207, -134, -204, -552, -74, -109, 46, 155, -395, 130, 86, 304, 154, 74, -178, 252, 151, -116, -422, -173, 475, -272, 320, 143, -49, 238, 174, 15, -568, -295, -250, -224, 244, 345, 261, -278, -29, -117, 63, 100, 338, 172, 579, -267, -492, 84, 386, 197, -794, 282, -169, -75, -324, 230, -411, 284, 61, -124, -81, -11, -219, -23, 408, 123, 304, -125, -64, -154, -35, -187, 396, -106, 390, -239, 89, 78, 127, 296, 417, -208, -149, -235, -8, -74, 297, -155, 442, -583, -198, 127, 512, 198, 30, -459, -226, -297, -81, -4, 251, 8, 86, -48, -171, -4, 122, -421, -201, -176, 231, 125, 11, -428, 48, -195, 210, 198, -86, -142, -109, -521, -34, 345, -440, -192, -211, 410, -207, -101, 253, 49, 507, -258, 747, 308, -178, 301, 3, -415, -174, -34, 89, 159, 176, 547, -303, -102, 82, -110, -462, -74, -317, 167, -190, 241]
8101B41k22J53J1l93K17K79n71J24O38n32K66Ql00O9k33K92KJ65l81O23p30J92
8123h2P8q3K69j039R74j08j99N08K71m24K66K00q81K57K36L9m98K93j18k83L10
8144a4L3k07N70l36j27M84j310Q36L76p1l13l3j11N33j95o4l2PO8j69k20k10O50
8167A45n36M86m54L7O23m63J2L07O1M3l81K71k41J48k8J49Lk33j11n9P09m80L34
8190C42j47
$$ y = [241, 19, 172, 183, -210, 7, 286, -285, -161, 477, -55, 211, 219, -81, -12, -245, 47, 49, 214, -167, 456, -274, -82, -4, -87, 182, -857, 117, 9, -190, 318, 589, 165, 431, 631, -250, 7, 243, 282, -216, 77, -41, -324, -14, 19, -188, 382, 46, -81, 403, -907, -71, 305, 234, -79, -112, -223, 310, 115, 51, 19, 26, 94, -75, -295, -505, 145, -391, 95, -359, -322, 301, -162, -150, 157, 218, 261, -120, 151, -90, 58, 30, 179, 182, -51, -162, -221, 488, 8, 342, 195]
8191A95
$$ Imaginary data points
##PAGE= N=2
##DATA TABLE= (X++(I..I)), XYDATA
0@%%%%%%%%%%l2O4o4Q0j12J28j60J93k25K88l52M16m83N79p02Q07r37J089j250
29f73J442j643J875k136K424k741L089l477L902m360M865n428O037o699P421q215
45d317R080j0026J1059j2187J3434j4799J6305j7969J9818k1886K4214k6852K9866
58A5740l3355L7446m2328M8264n5670O5220p8071R6392j24851J75557k93714J078686
70H89316P73531j191166k45828m60627n26472n31578n6433j60915J08222K95920
80a106030K41421R1250N23903N50427K46191J50052K88360m2634k16182j33279
90E93479k51096m98082k22037n2702k88403l08034N7120Q0460K1023K47396L48152
101b72724J74240K90010L95401P9151j06055J31172R7515j90763j57215n1019
$$ y = [0, 0, 0, 0, 0, 0, 0, 0, 0, 0, 0, -32, 32, -32, 48, -64, 64, -96, 97, -128, 160, -192, 224, -259, 320, -382, 425, -512, 577, -673, 769, -874, 1001, -1135, 1289, -1452, 1637, -1840, 2062, -2298, 2567, -2861, 3176, -3523, 3898, -4317, 4763, -5263, 5796, -6391, 7043, -7756, 8549, -9420, 10398, -11488, 12726, -14126, 15740, -17615, 19831, -22497, 25767, -29903, 35317, -42754, 53638, -71213, 104344, -189370, 889316, 1662847, 471681, 225853, -234774, -761246, -1292824, -1349257, -1510172, -1401950, -1106030, -864609, -773359, -249456, 300971, 547162, 697214, 985574, 942940, 726758, 593479, 342383, -155699, -377736, -430438, -718841, -1026875, -969755, -889295, -868272, -620876, -272724, -98484, 191526, 586927, 666078, 560023, 691195, 788710, 597947, 440732, 389713]
111C89713k23241k30658o2352j60464k15145R9448J93469n2958o101K12144Q3108
122B6963l0086J33652J07413o3624N9932J22252j49399j97659M4505N356j51016
133i1711j3723N8967q7177k9586Q6987q0786j14532J52090J47477q5795m247J41744
145G9708l232n4147R1813L2390n6819J03754J04837j40275j12023P3117m0614
156G8509j55267m109J7215j11729k6842M9992j01564p4697J50642J06124m1933
167a13659P4878J46491n782q116Q9113k2361p7800P8525L3512j68940r6918M6315
179b4742o4553j06647M5256M4019k7856P7450R7918n3659J749J56600M6458o9728
191A22265M6700N3933r5815o7025O999r7516r2993O4369J3975j12054L897R3331
$$ y = [389713, 166472, -64186, -126538, -287002, -502147, -402699, -209230, -262188, -268289, -56145, 26963, -3123, 130529, 237942, 174318, 234250, 356502, 207103, 9444, 53949, 59305, -91711, -105434, -46467, -133644, -163230, -76243, -157029, -271561, -119471, 28006, -57789, -62036, 79708, 76476, 22329, 114142, 146532, 89713, 193467, 298304, 158029, 46006, 119123, 78509, -76758, -80867, -63652, -175381, -202223, -152231, -253795, -328492, -177850, -71726, -113659, -38781, 107710, 101928, 93812, 182925, 160564, 82764, 161289, 194801, 25861, -71057, -24742, -89295, -195942, -150686, -106667, -134523, -57073, 40845, -12814, -11065, 145535, 191993, 122265, 168965, 222898, 127083, 60058, 67057, -30459, -123452, -59083, -45108, -157162, -153265, -59934]
203e9934k1967j7357J03524M5532j5548Q3504M9259j04189l6920P1816m8050j05434
215e5764K0361J1484q5705j2658L4734n8686o935J22080L5191n1809O5301Q7126
227A04720m3998j9106O5163j6909m8042M7288l969j08930j6292N2398n2988n1252
239i1917O3638J9856m5241L6480L8847n8359K967R1723j1782o3264M5279L2440
251F0667o8780j6589M0195l4415j9383O5725l710o8589L4503N6371n0801k1677
263b6483O6274o52m4867L1787P281p1508L711N7074m0131m3920N5365J4369n6439
276d8139J7379M0802l6748K837P0974j3466n3690M3407L3128n9471r099M9935
288C7849k1868l0595L9943q753o1334K5806M5339m8871k0747O0747k982m9418
$$ y = [-59934, -81901, -99258, 4266, 49798, 34250, 117754, 167013, 62824, 25904, 97720, 49670, -55764, -35403, -23919, -109624, -122282, -87548, -146234, -153169, -31089, 4102, -47707, 17594, 104720, 60722, 41616, 106779, 89870, 41828, 89116, 85147, -23783, -40075, 12323, -40665, -91917, -28279, -8423, -53664, -17184, 21663, -36696, -33729, 57994, 46212, -17052, 28227, 60667, -8113, -24702, 15493, -18922, -38305, 27420, 23710, -44879, -10376, 45995, -4806, -26483, 39791, 39139, -5728, 26059, 33340, -38168, -34457, 22617, -17514, -61434, -6069, 8300, -48139, -30760, 10042, -26706, -23869, 47105, 33639, -20051, 23356, 56484, -2987, -12086, 37849, 15981, -14614, 25329, 16576, -44758, -18952, 26387, -22484, -43231, 17516, 14534, -34884]
300c4884K6223K3025m4351R322N4108k9284l5208M9317J2631n3353J4098M2526
312C4170l0864j1381M7269j7026m8819L4499K8001n1657o122M8688j9788l5566
324b8596L1268K436m4560K2516L9248l9289j7947N2125l733m7143K6300L0357
336B2982l3825K474M2806k3534l1284M1446J1009m7407J3380L9662l1318k1334
348a4943L6805j1730m2593K7878K4039m5523n510M4116j7924l4721L3111J4989
360G994l4218J8410L7315l1016j3666M6118k672m1688K4604K9220l6543r685L3996
373B8169k1951l2521L0841Q057m3093R583L6053k9604k0264L7191M27l2103K5812
386c403K7684l4827l139M0611j4245l0932K9944J5695l5150O398K9154k7928j8060
$$ y = [-34884, -8661, 14364, -29987, -20665, 33443, 4159, -31049, 18268, 30899, -22454, -8356, 34170, 3306, -8075, 39194, 22168, -26651, 7848, 35849, -15808, -21930, 26758, 6970, -28596, 2672, 5108, -39452, -16936, 22312, -16977, -34924, 17201, 13468, -33675, -7375, 22982, -10843, -8369, 34437, 10903, -20381, 21065, 32074, -15333, -1953, 37709, 6391, -14943, 21862, 10132, -32461, -4583, 19456, -26067, -31577, 12539, -5385, -40106, -6995, 7994, -26224, -7814, 29501, -1515, -15181, 30937, 28265, -13423, 11181, 40401, 3858, -5827, 28169, 6218, -26303, 4538, 12595, -30498, -20915, 15138, -14466, -34730, 2461, 2888, -29215, -3403, 24281, -10546, -13685, 26926, 12681, -18251, 11693, 27388, -7762, -1364, 27790, -138, -18198]
399a8198L6084l390l7193K0418K6312l3459j0005L2435j1819k7522K7414J1717
411A2794l4849O952L1058k3984j9661L5085L779l0890J9270K5070k9056n426L6379
424B6521j0298k8381K6831J3955l3934J809K5371k3868k0071K9588k255l5213
436b9945J6623K3853l0999q517L4910n492k3785K6237J6447k7666O604L0513j9179
449I604j7365L0792J960l2396J1611J9806k9800j0543K7910j0147k7464K0907
461e125J3482k9945J919K8004j5069j4642K9309L837k7613J5245K3161k4655q730
474a0822L0027n458k5455J8032J2941k7833N88K5482j6981j6552K5596L196k8601
487a5840J0988K0413k2959q694K7097o600k4648J8363J2785k6285l66K7145j2971
$$ y = [-18198, 17886, 14496, -22697, -2279, 24033, -9426, -19431, 13004, 1185, -26337, 1077, 12794, -22055, -15103, 15955, -8029, -27690, 7395, 11174, -19716, -446, 24624, -4432, -9858, 26521, 16223, -12158, 14673, 28628, -5306, -3497, 21874, -1994, -22065, 7523, 5268, -29945, -13322, 10531, -20468, -28985, 5925, 433, -23352, 2885, 19332, -8334, -1730, 28783, 9604, -7761, 23031, 24991, -7405, 4206, 24012, -5788, -16331, 11579, 1432, -26032, -5125, 8357, -21588, -19669, 8335, -6734, -21376, 7933, 11770, -15843, -598, 22563, -2092, -10822, 19205, 13747, -11708, 6324, 19265, -8568, -7980, 17502, 521, -16031, 9565, 12761, -15840, -4852, 15561, -7398, -16092, 11005, 4405, -20243, -1880, 10905, -15380, -15746, 11399, -1572]
500a572j5563K4823M752k4857J2764K2379k1229p488K8412n059k4774J5285J1880
513A9753k6773k477K1618j6356j8367K0526K071k6799J0207K1667j7952o614K8185
526H689r07j9319J8791J5798k2087Q51K4700j2183j8938J8106J973k6841N467
539e900J6588k0771j0073K2475l944k3002J5266J5935j8729O32K4536q512j4572
552a0071K0732M711k2322P212J9759j8705j1353K0922l377k2338J3291J3184j9961
565h316k59K2185r184j6644J8375O088k1223N784J7362j7470j1264J9693m001
578A126k2024J2617J5187j8628j769K2135n924j3976J9844P459j7866Q095J8289
591B4565j6279j2119J8451l712k2373Q864J0653k0857m970J8531r527j6341J8531
$$ y = [-1572, -17135, 7688, 12440, -12417, 347, 22726, 1497, -5991, 22421, 17362, -7412, 7873, 19753, -7020, -9497, 12121, -4235, -22602, -2076, -5, -26804, -16597, 5070, -12882, -19496, 8689, 7782, -11537, 7254, 23052, 965, 1816, 26516, 14333, -4605, 13501, 15474, -11367, -5900, 10688, -10083, -20156, 2319, -1625, -24627, -9361, 6574, -12155, -11523, 13013, 4501, -10071, 10661, 15372, -6950, 262, 20021, 1316, -10037, 10885, 7508, -14830, -1539, 11645, -8316, -8575, 13610, 4426, -12218, 6157, 12245, -8978, -3194, 14168, -3302, -14566, 5127, 1126, -20898, -8281, 6906, -11722, -13491, 8644, 2720, -11256, 8588, 16047, -1819, 6276, 24565, 8286, -3833, 14618, 10906, -11467, -2603, 8050, -12807, -17777, 754, -8773, -25114, -6583]
604f583R518j6700P018J9333j0780p601K0426O8j7288J2016J2816k0025o744J6700
618A2174q154j7127J3050N913j8549M281J5672j3656r396J9933J849j6915R872
631a053J3267j5672m934J7099o998j4548J5214P038j7489K353J6708j1021q913
644h949J8178J235j4709R857J1839j7928o338J7637o931j6066J1057N860j7501
657a2759Q69J3421j1807p322J8845L314j4916R415J4935j3328l083J7241l303
670A1522j2951J2345N278j9188j596J3497j1171j1166J3621J874j6018O679J1647
683D373j3935l046J9423j692j3589J1365Q681j4757N7J3100r156q455J4766Q50
697G985j6783N920J2318j1825n492J6376j686j2448R802N973j6142O32J3667q378
$$ y = [-6583, 2935, -13765, -6747, 12586, 1806, -5795, 14631, 14699, -2589, 9427, 22243, 2218, -4526, 12174, 4020, -13107, -57, 5856, -12693, -8412, 7260, -6396, -15792, 4141, 5990, -10925, -1053, 12214, -3458, -8392, 8707, 1709, -12839, 2375, 9413, -8076, -5723, 10985, -36, -8949, 9229, 10464, -4245, 5612, 17451, -477, -6815, 10822, 3891, -12175, -1118, 4742, -12759, -11890, 1531, -10276, -17598, 1247, 4561, -10355, -940, 13995, 667, -2416, 14825, 11522, -1429, 10916, 16194, -2994, -4590, 8907, -2264, -13430, 191, 2065, -13953, -7274, 4373, -9562, -12608, 6815, 5123, -8466, 2899, 11580, -3177, -3120, 9980, 824, -7631, 7135, 7985, -8798, -2878, 9440, -2385, -7877, 8499, 6813, -5635, 4167, 10140, -6002, -5370, 8297, -81]
711h1j0696J2575J008j5565M058J1460j2159k075J7355j674j1874J0868R838j2029
725A009j63J3977o029r215J0947r45j6260L208R982j2857p255J3759k191j2745
739a4778Q308P895j1109K810J5875o028q293J3013M351j4473L940J1270j0719
752B062n187J2124m564j4064P778P660j2369j332J3785n305q711J0315K459j1998
766g347N385J0765j0424n290J2432k260j2831O296Q224j0045lJ2066n491q171
780f694J1172M312j2081L764J1295p600o508R768k705j2762O311O775j2108k896
794i957J1698m846r585R210M420r443N762J1323p187m776J2327P8j0858O090Q842
809A3098j1416l285R689o581r958Q204L025j1846K193J0478p524n456R632J021
$$ y = [-81, -10777, 1798, 2806, -12759, -8701, 2759, -9400, -11475, 5880, 4206, -7668, 3200, 13038, 1009, 846, 14823, 8794, -421, 10526, 9581, -6679, -3471, 6511, -6346, -13601, 158, -2033, -14778, -6470, 1425, -9684, -6874, 9001, 2973, -5320, 7693, 12044, -2429, 1511, 12781, 2062, -3125, 8999, 4435, -9629, -1851, 5809, -6560, -7892, 5893, 588, -8123, 2192, 4651, -7347, -1962, 8803, -1621, -6911, 5521, 3261, -9570, -3274, 4950, -5095, -5098, 6968, 1477, -6694, 4478, 8790, -3291, 473, 11768, 4168, -2340, 7428, 4723, -8039, -1728, 5047, -7061, -9957, 1741, -3105, -12690, -3480, 940, -8503, -2741, 8582, 1395, -3381, 8946, 9024, -1834, 4256, 13098, 1682, -1603, 8086, 1505, -8453, -249, 2776, -9070, -6877, 3601, -3923, -9379, 253, 1274]
823A274r419P917Q436r887j345J1132l931r267P950M484r991J521Q330p586o089
838f471J0438n0j0154N619Q012r647l165R683l373p654P343L532j0282J481Q914
853D226o815n735R488K121q770N436P042p732j923J0277k291q382P729M273r837
868h93j038Q166p021o510Q369K59r782L667P410q197k996J0170r53o990P854M485
884F000p935J371Q605n354n834R415O50r216L081N766q239l057P972k325q262
899g362O292M471r049j66Q584m176n150Q455J930q426L326P501p217l655R766
914E124j226p674N701M060q270N57P139m016n982P344J767q910K342O493o986
929b537l233Q189j581p467N383M458p747j56Q297l215m625P284J815p034K604
$$ y = [1274, -8145, -228, 8208, -1679, -3024, 8108, 4177, -5090, 2860, 7344, -2647, -1126, 7204, -382, -6471, 3967, 3917, -6237, -618, 7394, -2253, -5418, 4265, 892, -6762, 581, 4113, -6169, -4688, 4226, -2589, -8324, 1164, 3285, -5485, -49, 6993, -739, -2662, 7615, 5324, -3058, 4671, 8944, -893, -1931, 6235, -786, -7296, 1073, 1332, -8450, -4783, 2627, -5570, -8566, 1604, 651, -6339, 1515, 6000, -1935, -564, 8041, 2687, -3147, 6268, 6918, -2298, 783, 6549, -1690, -4747, 3225, 900, -7362, -1070, 3401, -5648, -5814, 2770, -1406, -6556, 1899, 3829, -4597, -1271, 6230, -987, -4642, 5124, 3898, -3776, 1925, 5985, -2285, -1728, 5411, 1395, -4587, 2757, 4524, -4386, -2044, 4449, -2537, -5770, 2419, 838, -6629, -1246, 3212, -4535, -4691, 3606, 391, -4234, 3050, 4865, -2169, 435]
944D35P294o808k538P724j401p876M399L661p767j075P050m320n642O754J270
959A160q021K897P306n440k351P314q2o060M416M779o608k79P529l425o397N983
975B721J877p914J730O078o172l421O865q49o645M076M540o397n44O693k821n111
991e294O609K561p367K147O713m535l633O562j25o622M836L886o586q38O501l133
1007A682o220N191K147o831R77N580m803l928O902L11o410L610N646n398j116
1022b660P221k476m747N868J996o111J685M709m320l995N491J05o705K973M063
1037C097o158j536O520k497n246N398K460o060J651O182l848l196O491L80n753
1052b115L621M113n611k195O373k095m918M131K029o450O35N797m339l882N829
$$ y = [435, 7729, 921, -1617, 6107, 4706, -3170, 1229, 4890, -2877, -3952, 3098, -1222, -6864, -110, 1160, -6861, -3964, 3342, -2098, -4449, 2865, 2783, -3277, 1139, 5918, -690, -969, 6560, 3135, -3262, 2721, 4598, -3316, -1586, 4492, -1680, -5101, 1764, 915, -5730, -1654, 2886, -3511, -4055, 2638, -183, -5294, 1315, 3876, -3491, -1344, 5369, 834, -2799, 3763, 3638, -2984, 1852, 5738, -848, -1686, 4815, 1682, -4538, 653, 2800, -4031, -3054, 2526, -2277, -6205, 697, 1008, -5402, -1792, 3854, -1544, -2660, 4561, 2085, -2662, 3206, 5202, -909, 776, 5485, 1165, -2830, 2661, 2766, -3939, -966, 3097, -3061, -4597, 1923, -574, -5820, -422, 2038, -4022, -2371, 3811, -37, -3233, 3258, 3638, -2115, 1506, 5619, 8, -2187, 4186, 2091, -2827, 1304, 3333, -3117, -2482, 3315, -1024, -4906, 923]
1067I23M83o330L048N031n562k037O922k346m318N527K481n164P91N602l865l525
1083b339N982m6o020K669M057m952k897O037j507n720M677K281o232L56N934l784
1099a504l140O131J083n687K388N039m516j649N553r38m605L532K447n533M19
1114i80N040m145l165M689L56n872K310M187n079j471N371j219m882M734L332
1129C206n214J80N685l092k766M676J915n477J037M014l819k390M590m60n344
1144c259L006K496n450L06M742k375m038M857J119m807J764M232l726j951O175
1159C091j523l965L418L227m842m11M986k506l592M408O44n262Q67M722m633k010
1175c381M862p84m773K966K759m648p00O040k214l516N064J165m950J379M855
$$ y = [923, 1406, -4924, -1876, 3155, -2407, -4444, 2478, 132, -4186, 1341, 3822, -1342, -551, 5051, 1186, -2339, 3643, 3597, -2423, 246, 4303, -649, -3546, 2491, 984, -4736, -59, 2222, -4010, -3654, 2280, -1504, -4644, 1487, 2570, -3117, -729, 4310, -206, -1855, 3698, 2760, -1845, 1687, 4134, -1399, -980, 4060, -85, -3250, 1439, 1795, -4077, -1767, 2420, -2659, -4130, 1241, 22, -4860, -126, 3206, -2008, -1828, 3857, 765, -2001, 2675, 4590, -887, 150, 4164, 345, -2045, 2545, 2085, -3259, -253, 2243, -3207, -2901, 1841, -534, -4572, 285, 1404, -3403, -1639, 2593, -1133, -3084, 3091, 1568, -2397, 1021, 4248, -594, -1005, 3981, 1475, -2117, 2291, 2935, -2327, -1460, 3262, -1371, -3381, 1481, 697, -4076, -1110, 1649, -2999, -3699, 2341, 127, -3389, 1675, 2840, -2110, -731, 4124]
1190D124l278k050N335j436m401K320K759m452j228M938k820l132L195J108n231
1205d249K357L874l642j380M593q0l943K909K933l806o13M496j957l481L159K277
1221C447m959J141L562k999k421L680k20m177J974L415m384o71M333j576l360
1236c215L130J684m078J519L592k929k158M801n34l879K269L670l978o86L828
1251C036j921l309L076J366m635J136L194k864k659L713Nl395K333L347m478j05
1267b160M880j287l891L983J933m187P26L297k362k773L946L42m642J654K830
1282B289l248j624L695j320l609L619J984m259P60L814k809j795M233k53k839
1297a362J476K504l253n59L713r55l038K047K494m105K60L144k562k426L970k38
$$ y = [4124, 846, -1204, 4131, 2695, -1706, 614, 3373, -1079, -2307, 2631, -189, -3321, -126, 982, -4249, -1892, 1982, -1660, -3040, 1553, 1473, -2470, 439, 3372, -434, -1047, 3449, 1492, -1989, 1170, 3447, -1512, -371, 3191, 192, -2229, 1451, 1231, -2946, -972, 2443, -1941, -2612, 1721, 145, -3215, -85, 1599, -2479, -960, 2632, -297, -2455, 2346, 1812, -2067, 202, 3872, -106, -792, 3036, 1115, -2194, 882, 2248, -2387, -1251, 1943, -921, -3580, 133, 138, -3257, -924, 2423, -2055, -2160, 2720, 1433, -2458, 1525, 3458, -729, -3, 3294, 932, -1841, 2105, 2447, -2195, -541, 2289, -959, -2583, 1112, -208, -3817, -198, 1786, -2473, -1713, 2101, -708, -2503, 1730, 1477, -1362, 114, 2618, -635, -1194, 2519, 1564, -1474, 573, 3067, -1038, -778, 2366, -196, -2622, 1348, 1110]
1313A110m229J826K441k777j022L429n16l193L034J964l967J294L469k349k488
1328a974M047M27l293J416K452l193j445L643j238l091K296J724m447L53K967
1343F44j207k417L807M59l810K435K504k870j461L935l90l198K484J851l743P4
1359i03L294j840k323L277K12l572O47K659k393j154L245j090k664K620J555l690
1375b120K86L444j231k260L415M25l562J901K717k705j472L359m32l606K163J768
1391B090l319j20K947k051j983K707J06l071J095L089k355j391L320m06k109J789
1407C38K040k580j088L961j416k453K703n12j898M19K692k712j445L484j120k499
1423b086J164J970k738q5K974j056k574L376J72k677J037K776j205j935K166n0
$$ y = [1110, -3119, -1293, 1148, -1629, -2651, 778, 262, -2931, 103, 2067, -1900, -606, 2863, 514, -1974, 2073, 2500, -793, 623, 3075, -118, -1563, 2080, 842, -2249, 47, 1771, -2676, -2323, 644, -563, -2980, 827, 1286, -2524, -89, 2415, -455, -1916, 2019, 1629, -1569, 915, 2766, -977, -903, 2391, 551, -1772, 1505, 1717, -1855, -1208, 1451, -942, -2096, 1149, 59, -2605, 15, 1570, -2120, -1834, 1610, 379, -1881, 1534, 1959, -1603, 298, 3015, 310, -1162, 2197, 1765, -1841, 322, 2090, -1229, -1349, 1598, -453, -2436, 271, 377, -2694, -1599, 1490, -865, -2256, 1064, 658, -1451, 338, 2378, -202, -1290, 2671, 1255, -1198, 1505, 993, -905, -486, 2206, -506, -1951, 1533, 413, -2086, -922, 1048, -1690, -1775, 1199, 143, -2431, 945, 1117, -1560, -523, 2253, 1048, -887, 1279, 1229]
1439A229k414K324J109k988K45K793j920k327K289R16k726K10K157j689r59K138
1455C87p9k531J398K226j641o76K933j788j927K521J417k813M48K581k279r17
1471g40J754O3k487J039J944k696m09K173p83k287K096J212k565N10K664j468
1487B0j086K474o24j837J333K161k508q13K902j030j995J800M79j777m43K251
1503A307j657j747K630M15k684O25J735j220n42K603j545j189J758P98j752L05
1519a60J987j065j651K077L30k661R50K233k682p96K339r05j457J231Q85k558
1535a903M25K458j587r76K138K76j867P03J628j453m19J677J60j762J488Q58k139
1552b95l85K126j183j036J289J42j970L74K042j693r29K207q44j494J702R33j988
$$ y = [1229, -1185, 1139, 2248, -740, -495, 2298, 378, -1949, 340, 1256, -1470, -1260, 897, -792, -1751, 387, 308, -2223, -825, 1401, -240, -916, 2017, 229, -1698, 823, 2240, -573, -125, 2456, 177, -740, 1014, 1077, -1410, -371, 1573, -1123, -1532, 641, -142, -2429, -333, 879, -1686, -1176, 1488, 20, -1066, 1408, 784, -1053, 280, 2441, -67, -880, 2022, 992, -1003, 797, 1276, -501, -944, 1307, -350, -2097, 533, 948, -1736, -1111, 624, -596, -1138, 1465, -80, -1269, 489, 1287, -465, -160, 1827, 762, -889, 1188, 1518, -1143, -193, 2040, -642, -1438, 901, -4, -1461, -230, 655, -1903, -1478, 980, -607, -1583, 555, 831, -1036, -333, 1295, -158, -577, 1100, 1260, -502, 986, 1844, -295, -680, 1446, 263, -773, 516, 658, -1312, -938, 1104, -589, -1518, 689, -155, -1649, 53, 986, -1002]
1569a002P10J507q52q62J614M34k768J379J695j766m90J133l11j315R92P83j800
1586i19J60J626n12j856J874m4j706N05J454j114n67J904j1j873J321J251j856
1603c63R1J488j170q50J359J11j330M24J085j052r54J381L21j844O84J291j740
1620a068l94K161r21r12J991P0j442N33J613j593o14J530O8j542Q26R04j963R4
1638f59J696r73j291J141P11j770M11J752j514m55J174L71j640J230J088j896
1654f24M56J829j490j044J846j40j175K67J584j251r69J358j31j972J060P56j250
1671h90p03K302l68j268J048M55j770L38J806p02r31J834l54j653J304J098j222
1688C24o17J636q47j393J122N43j945P21J257j317j56P82J19j767J273J060j211
$$ y = [-1002, -292, 1215, 363, -499, 1115, 1549, -1219, 160, 1855, 89, -401, 732, 421, -894, 98, 881, -919, -759, 867, 355, -1501, 373, 329, -1377, -872, 582, -532, -1099, 805, 794, -1079, 242, 1493, -363, -272, 1216, 46, -804, 555, 666, -664, -240, 845, -207, -1161, 220, 541, -1303, -619, 672, -1068, -1462, 699, -222, -1134, 857, 927, -515, 18, 1631, 38, -576, 954, 1022, -520, 306, 1210, -753, -659, 1037, 64, -1227, -86, 625, -1145, -734, 1018, -496, -951, 223, 594, -1046, 184, 1272, -624, -168, 1661, 171, -873, 973, 833, -342, -75, 1509, 258, -711, 647, 516, -1456, -396, 360, -890, -1593, 709, 341, -927, 121, 576, -1194, -856, 950, 248, -683, 1151, 797, -856, 448, 1546, 324, -293, 1343, 496, -897, 225, 768, -1177, -456, 801, -516, -672, 110, 229, -1538, -265, 795, -416]
1705d16k48J049l93q72J418M29j478Q25P24o54j411J736P6j577Q02N95p42n80
1723g17J895j342o76M36O76j414P52J418j464o84J562Jj072P26J010j069j36J412
1741A314j237j012J331Q60j501k09J185j350K3J405o46j037K64J142j111o99J618
1758C40m30n09L87O15m40n81J735j128l34J170k33r40J17J013j194R9J035o37
1776H5r01O16Q77q10q06J739j039o44J248k0r77K02J554j482Q0R70m54q47J204
1795E95J93j612J132L82p22n44J274l5j180O47L40q15r5Q71q14m11J062M58j107
1814c81qQ60n85p92J510k8p42J83O30n11m00J083q25k77L19P61j484K60J290j240
1834c77m63O57M70r37K49R48j008n04J140o5r80P14Q52p62K52R76p95r88J186
$$ y = [-416, -664, 385, -8, -880, 538, 967, -511, 314, 1038, 384, -1027, 709, 785, -792, 10, 605, -137, -717, 1178, -164, -840, -404, 272, -1142, -390, 1028, -436, -1120, 442, 443, -629, 97, 1107, 38, -98, 1314, 77, -935, 396, 1256, -245, -454, 731, -619, -596, 809, 163, -874, -610, 532, -579, -1278, 340, -90, -599, -212, 403, -37, -618, 1117, -11, -345, 825, 592, -348, -231, 782, -412, -313, 722, 85, -816, -200, 677, -133, -939, 800, -239, -883, 365, 345, -632, -430, 1124, -358, -278, 692, 238, -609, 595, 788, -824, 308, 690, -32, -576, 698, 663, -517, 130, 470, -345, -440, 431, -383, -794, 268, 726, -381, -389, 471, -114, -906, 604, 576, -166, 17, 647, 136, -264, 819, -6, -283, 36, 797, -687, -427, 863, -377, -840, -183, 287, -650, -401, 547, -461, -965, 175, 110, -870, -156, 696, -66, 186, 1162, 367, -621, 565]
1853E65M64j482L36R63j109m60P96j43n69M15R15j389j51R23P2j213J047O20j298
1872f98L20R28o19k49J256m66r05O06P60r33m45R67m37q43Q20K24p82r7J450j249
1892c92q6O07k10l81N84M8l18l27Q22l34n41J180l09o03j17J199l40r76J416m90
1912D32n57k97P18m29k99O51q01o78J084M44n29l33R75n47l16P47N3q45O38O73
1932G84p57q6J80J48o80J007p54k40N39J42l40q19O83M31q10N53J95j324N76J80
1952c92N29n25O08K86m06k58O64K12j047N81K01o44P30K76p00o28R07j97r52O11
1972a44O61q74L57k08k25k74N83P02n46j94P16j150R42L4K64j088N14L33o50K
1992b45P23m20o08P80j92o91M96M40q22q2K86J07m59M18K21j14O2O49j63o67L06
$$ y = [565, 1029, -453, -117, 846, -263, -723, 73, -70, -639, -224, 691, -698, -849, 74, 146, -1067, -20, 600, -698, -378, 550, -69, -318, 938, 472, -433, 173, 933, 0, -445, 522, 85, -758, 62, 286, -496, -593, 857, -392, -478, 129, -81, -462, 122, 170, -148, -475, 347, 13, -528, 652, 343, -260, -377, 822, 482, -494, 922, 432, -125, -422, 296, -133, -432, 219, -582, -1260, -176, 268, -261, -594, 381, -166, -482, 265, 318, -527, 111, 784, 27, -59, 121, 269, -411, 596, -158, -398, 141, 283, -57, -876, -193, 238, -572, -19, 176, -1148, -572, -392, 137, -388, 220, 506, 100, -158, 506, 718, -329, 252, 453, -191, 539, 815, 115, -513, 394, 197, -755, -144, 517, -357, 0, -208, -433, -707, -124, 578, 32, -162, 554, -596, 346, 380, 644, -444, 70, 403, -247, -245, 478, 58, -550, 230, 38, -653, -157, 283, -539, -621, -335, -228, -687, -269, -48, -162, -100, 549, 386, -281, 25]
2013B5M13m52l48Q75r9l63K83J10j244R75k73p11O87L80j42o74O64j58l13J29
2033b36O59m37n48P52L14o92N48K07r16N84l2j66rJ57Q5o02N06J56r56M88P0K8
2055d0q9j03M99o26L09M50m06m11O50M32p16P2Q38q09k27R98l85j008N52L26j89
2076A17k06j10Q91j195O67n6o24M99J03k96K2L93m83m27M76O22m00o2L78O9p88
2097d10O97N2k17l54Q55J59q68J06R1k77L35k1m56J82o9K28n77Q12m7m54J60N21
2119D48m08k4L72j00p16O21J20K21m75O32m83p15P51Q9l69N9l52O69q30O46m23
2140b67J4M0L8l06M44L21K0r04P38K61n60N37J87n68J36L65p15j85K28k98K03
2161b71j54K97M08o05J16N52j091J003K60n67j01N11l79l33M46o1RQ8L19o15M58
$$ y = [25, 438, -14, -362, 513, 414, 51, 334, 444, -800, 175, -98, -809, -122, 258, 116, -558, 106, -52, -365, -236, 423, -14, -562, 190, 504, -188, 360, 567, -349, 235, 203, 37, 28, 185, 270, -332, 174, 330, -626, -138, -68, -40, -129, -232, 267, -359, -50, 400, -6, -417, 233, 665, -51, 21, 859, 50, -177, 821, 436, -572, -20, 306, 117, -89, -199, 692, -503, 164, 108, -516, -17, 86, -210, -188, 205, -278, -705, -229, 393, -7, -69, 309, 378, -410, 287, 339, 122, -232, 623, 782, -86, 20, 111, -166, 169, 148, -308, -126, -195, 33, -544, 268, 221, -233, -73, 448, 40, 16, 388, 288, -428, 193, 313, 534, 59, 691, 208, -507, 244, 333, -36, 23, -329, 340, -490, 156, -267, -253, -213, -175, -481, -37, 284, 304, -600, 138, 399, -161, 376, 563, -5, 131, 496, -219, -404, -176, -474, -271, -425, -128, 280, -325, -209, 343, -748, 255, 515, -52, -153, 358, -21, -354, 92, 31, 40, 128, 447, -168, 290]
2182B90J76n1n95Q1k7K17l24M05QJ40o81J05l1Q8M47j69l11J99M61n37L03n9j72
2205c7o65J195L52q68O8N48l06L80l73p0m62N12j23m31K63J90m27k08N63k49l84
2226e32M37L74n46j40Q22n86K15j05M6p7p3M84J23q34L94k8N1J93j54k87k48N48
2248G7j44n82N88M11p47N8O42m36J3J84J82j00j72N44l65j62J92J53p1n54O50
2269C61n48J58L95p24r5P00r7k53j30L70j15m25M96J7Mm08P58n98m5L99QJ2k83
2292d3m9k72M36K23k53k39K12P8n70M51J9J82R2J01n95L97o62Q91q23O45r5k7
2314I9M2N4m08K92j01K64l54J41K76m13J33R4L47r28L97L7L4n32M90J42k72J90
2336B4K04m92K55J46K11n29J078q36Q7l11J023j061r0K12J34p6l56N69J7m26J71
$$ y = [290, 466, 415, -180, -99, -126, 91, -233, 172, 180, 320, -361, -256, -287, -199, 248, 79, -232, -33, 428, -109, 194, 135, -37, -702, 493, 845, -23, 45, 593, 287, 667, 294, 224, -238, 274, 151, -280, -17, 173, -254, -462, 101, -148, -532, -95, 279, -267, -407, 415, -171, 44, -61, -15, -92, -165, 319, 442, -392, 2, -26, 25, 218, 64, -223, -471, 77, -67, -649, -61, 350, -397, -339, 303, -133, -120, 64, 246, 146, -26, 518, 153, -9, 183, 336, 265, -289, 361, -187, -29, 366, -358, -453, 247, 150, -103, -233, 137, 22, -403, 93, 110, 114, -294, 464, -134, -179, 220, 228, 240, -43, -92, -364, 72, 295, 42, -197, 15, 93, -477, -26, -7, 175, 267, 368, -227, 170, -492, 399, -424, 221, 126, 99, 141, 195, -213, 79, -22, 242, -112, 29, 305, -108, 25, 119, 466, -462, -65, -28, 6, -526, -36, 106, -166, 24, 228, -264, -9, 137, 348, -181, 897, 61, 148, -163, 860, -201, -291, -79, 55, -21, -377, 192, 209, -217, -46]
2357d6Q8k2k73L48o14J054n98l44O81l01J1r3r6P88o27o5L1j85L85L24n23PL58
2380B88o2n87K10L79o50J24k5N57j13q35N59L52r39M77N60l53j78O57l29n7O1
$$ y = [-46, 42, 20, -253, 95, -519, 535, -63, -407, 274, -27, -16, -109, -205, 583, -44, -109, -78, -263, 122, 446, -77, -70, 288, 226, -361, -151, 228, -422, -298, -323, 234, 121, -714, -155, 197, -742, -265, 295, -58, -236, 421, 92, 35, 96]
$$ [...]
8191a83
##END NTUPLES=NMR FID
##END=
