##TITLE=1H ikalashn
AM_NVstilbene
20.12.2024
##JCAMPDX= 6.0         $$ Bruker NMR JCAMP-DX V2.0
##DATA TYPE= NMR FID
##DATA CLASS= NTUPLES
##ORIGIN= UXNMR, Bruker Analytische Messtechnik GmbH
##OWNER= root
$$ TOPSPIN		Version 1.3
$$ 2024-12-20 13:53:17.062 +0400  Irina@DPX200
$$ Compression mode = diff/dup
##.OBSERVE FREQUENCY= 200.131300845
##.OBSERVE NUCLEUS= ^1H
##.DELAY= (6, 6)
##.ACQUISITION MODE= SIMULTANEOUS
##.ACQUISITION SCHEME= undefined
##.AVERAGES= 32
##.DIGITISER RES= 18
##SPECTROMETER/DATA SYSTEM= spect
##.PULSE SEQUENCE= zg
##.SOLVENT NAME= CDCl3
##.SHIFT REFERENCE= INTERNAL, CDCl3, 1, 17.49637
##AUDIT TRAIL= $$ (NUMBER, WHEN, WHO, WHERE, WHAT)
$$ ##TITLE= Audit trail, TOPSPIN		Version 1.3
$$ ##JCAMPDX= 5.01
$$ ##ORIGIN= Bruker BioSpin GmbH
$$ ##OWNER= Irina
$$ $$ F:/spectra/data/iren/nmr/1H/4/audita.txt
$$ ##AUDIT TRAIL=  $$ (NUMBER, WHEN, WHO, WHERE, VERSION, WHAT)
(   1,<2024-12-20 13:53:05.921 +0400>,<Irina>,<DPX200>,<TOPSPIN 1.3>,
      <created by zg
	started at 2024-12-20 13:50:55.515 +0400,
	POWCHK disabled, PULCHK disabled
       terminated by command 'halt'
       configuration hash MD5:
       BE 6D 3F 07 2A EA 11 49 91 17 2B D3 AF B3 58 0D
       data hash MD5: 16K
       D0 E3 FE 7A 2A 35 20 6D D3 AA CF A8 C6 22 BB 84>)
$$ ##END=
$$ 
$$ $$ hash MD5
$$ $$ 9F 1E 65 0D D5 A6 46 F1 77 66 D6 A8 46 4F 89 69
##$RELAX= 
##$RELAX= 
##$RELAX= 
##$RELAX= 
##$RELAX= 
##$RELAX= 
##$RELAX= 
##$RELAX= 
##$RELAX= 
$$ Bruker specific parameters
$$ --------------------------
##$DU= <F:/spectra>
##$EXPNO= 4
##$NAME= <1H>
##$PROCNO= 1
##$TYPE= <nmr>
##$USER= <iren>
##$AMP= (0..31)
100 100 100 100 100 100 100 100 100 100 100 100 100 100 100 100 100 100 
100 100 100 100 100 100 100 100 100 100 100 100 100 100 
##$ANAVPT= -1
##$AQSEQ= 0
##$AQ_mod= 1
##$AUNM= <au_zg>
##$AUTOPOS= <>
##$BF1= 200.13
##$BF2= 200.13
##$BF3= 200.13
##$BF4= 200.13
##$BF5= 200.13
##$BF6= 200.13
##$BF7= 200.13
##$BF8= 200.13
##$BYTORDA= 1
##$CFDGTYP= 0
##$CFRGTYP= 5
##$CHEMSTR= <none>
##$CNST= (0..63)
1 1 145 1 1 1 1 1 1 1 1 1 1 1 1 1 1 1 1 1 1 1 1 1 1 1 1 1 1 1 1 1 1 1 
1 1 1 1 1 1 1 1 1 1 1 1 1 1 1 1 1 1 1 1 1 1 1 1 1 1 1 1 1 1 
##$CPDPRG= <>
##$CPDPRG1= <>
##$CPDPRG2= <>
##$CPDPRG3= <>
##$CPDPRG4= <mlev>
##$CPDPRG5= <mlev>
##$CPDPRG6= <mlev>
##$CPDPRG7= <mlev>
##$CPDPRG8= <mlev>
##$CPDPRGB= <>
##$CPDPRGT= <>
##$D= (0..63)
0 2 0 0 0 0 0 0 0 0.06 0 0.03 0 0 0 0 0.0002 0 0 0 0 0 0 0 0 0 0 0 0 0 
0 0 0 0 0 0 0 0 0 0 0 0 0 0 0 0 0 0 0 0 0 0 0 0 0 0 0 0 0 0 0 0 0 0 
##$DATE= 1734688382
##$DBL= (0..7)
120 120 120 120 120 120 120 120 
##$DBP= (0..7)
150 150 150 150 150 150 150 150 
##$DBP07= 0
##$DBPNAM0= <>
##$DBPNAM1= <>
##$DBPNAM2= <>
##$DBPNAM3= <>
##$DBPNAM4= <>
##$DBPNAM5= <>
##$DBPNAM6= <>
##$DBPNAM7= <>
##$DBPOAL= (0..7)
0.5 0.5 0.5 0.5 0.5 0.5 0.5 0.5 
##$DBPOFFS= (0..7)
0 0 0 0 0 0 0 0 
##$DE= 6
##$DECBNUC= <off>
##$DECIM= 32
##$DECNUC= <off>
##$DECSTAT= 4
##$DIGMOD= 1
##$DIGTYP= 9
##$DL= (0..7)
0 120 120 120 120 120 120 120 
##$DP= (0..7)
$$ [...]
##$SW= 21.9926040160658
##$SWIBOX= (0..15)
0 0 2 0 0 0 0 0 0 0 0 0 0 0 0 0 
##$SW_h= 4401.40845070422
##$TD= 16384
##$TD0= 1
##$TE= 300
##$TE2= 300
##$TE3= 300
##$TEG= 300
##$TL= (0..7)
0 120 120 120 120 120 120 120 
##$TP= (0..7)
150 150 150 150 150 150 150 150 
##$TP07= 0
##$TPNAME0= <>
##$TPNAME1= <>
##$TPNAME2= <>
##$TPNAME3= <>
##$TPNAME4= <>
##$TPNAME5= <>
##$TPNAME6= <>
##$TPNAME7= <>
##$TPOAL= (0..7)
0.5 0.5 0.5 0.5 0.5 0.5 0.5 0.5 
##$TPOFFS= (0..7)
0 0 0 0 0 0 0 0 
##$TUNHIN= 0
##$TUNHOUT= 0
##$TUNXOUT= 0
##$USERA1= <user>
##$USERA2= <user>
##$USERA3= <user>
##$USERA4= <user>
##$USERA5= <user>
##$V9= 5
##$VALIST= <valist>
##$VCLIST= <CCCCCCCCCCCCCCC>
##$VD= 0
##$VDLIST= <DDDDDDDDDDDDDDD>
##$VPLIST= <PPPPPPPPPPPPPPP>
##$VTLIST= <TTTTTTTTTTTTTTT>
##$WBST= 1024
##$WBSW= 25
##$XGAIN= (0..3)
0 0 0 0 
##$XL= 0
##$YL= 0
##$YMAX_a= 347360
##$YMIN_a= -313788
##$ZGOPTNS= <>
##$ZL1= 120
##$ZL2= 120
##$ZL3= 120
##$ZL4= 120
##$ABSF1= 10
##$ABSF2= 0
##$ABSG= 5
##$ABSL= 3
##$ALPHA= 0
##$AQORDER= 0
##$ASSFAC= 0
##$ASSFACI= 0
##$ASSFACX= 0
##$ASSWID= 0
##$AUNMP= <proc_1d>
##$AXLEFT= 0
##$AXRIGHT= 0
##$AXTYPE= 0
##$AXUNIT= <>
##$AZFE= 0.1
##$AZFW= 0.1
##$BCFW= 1
##$BC_mod= 2
##$BYTORDP= 1
##$COROFFS= 0
##$CY= 7568.61572265625
##$DATMOD= 1
##$DC= 2
##$DFILT= <>
##$DTYPP= 0
##$F1P= 17.9538593292236
##$F2P= -4.03888763876832
##$FCOR= 0.5
##$FTSIZE= 32768
##$FT_mod= 4
##$GAMMA= 1
##$GB= 1
##$INTBC= 1
##$INTSCL= 1
##$ISEN= 128
##$LB= 0.02
##$LEV0= 0
##$LPBIN= 0
##$MAXI= 945.577
##$MC2= 0
##$MEAN= 0
##$ME_mod= 0
##$MI= -402.1523
##$NCOEF= 0
##$NC_proc= 0
##$NLEV= 6
##$NOISF1= 8.587773
##$NOISF2= 6.764455
##$NSP= 1
##$NTH_PI= 0
##$NZP= 0
##$OFFSET= 17.49637
##$PC= 1
##$PHC0= 101.1897
##$PHC1= -14.08615
##$PH_mod= 0
##$PKNL= yes
##$PPARMOD= 0
##$PPDIAG= 0
##$PPIPTYP= 0
##$PPMPNUM= 100
##$PPRESOL= 1
##$PSCAL= 0
##$PSIGN= 0
##$REVERSE= no
##$SF= 200.13
##$SI= 32768
##$SIGF1= 18.5376
##$SIGF2= -6.396296
##$SINO= 400
##$SIOLD= 32768
##$SREGLST= <1H.CDCl3>
##$SSB= 3
##$STSI= 0
##$STSR= 0
##$SW_p= 4401.40845070422
##$SYMM= 0
##$S_DEV= 0
##$TDeff= 0
##$TDoff= 0
##$TI= <>
##$TILT= no
##$TM1= 0
##$TM2= 0
##$TOPLEV= 0
##$USERP1= <user>
##$USERP2= <user>
##$USERP3= <user>
##$USERP4= <user>
##$USERP5= <user>
##$WDW= 1
##$XDIM= 8192
##$YMAX_p= 0
##$YMIN_p= 0
$$ End of Bruker specific parameters
$$ ---------------------------------
##NTUPLES= NMR FID
##VAR_NAME=  TIME,          FID/REAL,        FID/IMAG
##SYMBOL=    X,             R,               I
##VAR_TYPE=  INDEPENDENT,   DEPENDENT,       DEPENDENT
##VAR_FORM=  AFFN,          ASDF,            ASDF
##VAR_DIM=   8192,          8192,            8192
##UNITS=     SECONDS,       ARBITRARY UNITS, ARBITRARY UNITS
##FACTOR=    0.0002272,     1,               1
##FIRST=     0,             0,               0
##LAST=      1.8609952,     -33,             46
##MIN=       0,             -313788,         -313788
##MAX=       1.8609952,     347360,          347360
$$ Real data points
##PAGE= N=1
##DATA TABLE= (X++(R..R)), XYDATA
0 0 0 0 0 0 0 0 0 0 0 0 0 0 0 0 0 0 0 0 0 0 0 0 0 0 0 0 0 0 1 -22 32 -32 32 -32 32 -32 32 -34 52 -61 64 -64 69 -84
44 -84 94 -97 113 -122 134 -148 163 -181 199 -218 244 -269 297 -334 371 -422 476 -547 640 -760
64 -760 927 -1173 1574 -2386 4603 -26518 -101926 -165921 -244275 -294696 -313788 -301789 -276366 -234657
78 -234657 -181585 -118126 -55008 10243 75859 137410 178551 198245 204485 203449 188332 157037
90 157037 113612 66398 17661 -27286 -62932 -83184 -93722 -105292 -118936 -120604 -96614 -56776
102 -56776 -23468 -6357 3796 17898 34562 46502 48122 42085 32202 18670 2972 -10135 -17377
115 -17377 -22669 -30000 -33743 -27860 -14066 207 11426 20388 27821 34176 38628 43997 49997 49168
129 49168 32967 9340 -4351 -2556 927 -6416 -19090 -24903 -19546 -10182 -3875 436 6663 12249
143 12249 12465 10268 8561 4576 -7371 -23103 -34396 -40097 -44636 -50006 -53244 -51217 -44510 -34720
157 -34720 -19003 5180 31363 48016 53785 60170 74083 85970 83742 67120 46346 28245 10655
170 10655 -11841 -37530 -59504 -74893 -85227 -90044 -86780 -76808 -64314 -49505 -29673 -4678 20112
183 20112 40243 54229 63960 69512 68064 60992 53162 45679 32503 11004 -10099 -20786 -22153
196 -22153 -23507 -29209 -32710 -26367 -11772 1547 8933 14353 21288 26983 28144 25658 20339 10257
210 10257 -4434 -19001 -29367 -36505 -43567 -50490 -53097 -48273 -38777 -28006 -14017 5599 25345
223 25345 38416 46360 56155 68540 74157 66758 50500 35348 24395 11250 -9021 -31075 -48669
236 -48669 -60127 -67422 -70301 -67743 -62315 -55440 -45098 -28623 -8997 8475 20389 28819 37846
249 37846 46084 48487 46419 43614 39132 29161 15623 5279 2305 1592 -4284 -14227 -20075 -16665 -8967
264 -8967 -4599 -4820 -5116 -2676 433 2525 3387 1740 -3393 -9045 -12117 -11519 -10579 -13170 -17470 -18379 -13589
281 -13589 -7748 -2663 3895 11247 16049 16548 17033 22413 30528 32250 24714 14514 9604 9742 7383
296 7383 -700 -9772 -15508 -18051 -19155 -19220 -19103 -20226 -21600 -20668 -15305 -8016 -4671 -6687 -8318 -6109
312 -6109 -2471 -209 1560 4650 6168 4059 857 2869 11074 18769 19110 14781 13854 18852 23458 22479
328 22479 17694 13572 10382 7336 3751 -1641 -8709 -17235 -24493 -27180 -25585 -24607 -27061 -30047 -28518
343 -28518 -23048 -16968 -10238 -1396 7549 12413 13314 15536 22847 31847 34556 29884 24164 23105 23567
358 23567 19433 11788 4362 -1156 -4548 -7807 -11247 -15272 -19627 -24102 -24963 -21077 -16078 -14617 -16113
373 -16113 -15695 -12672 -9432 -6752 -3140 2311 5188 3905 1129 2541 8879 13331 12307 9755 11162
388 11162 15700 18131 16438 14432 14042 14948 15378 13983 10869 5781 -1604 -8037 -11065 -12328 -16002 -22409
404 -22409 -27533 -29260 -29573 -29487 -27622 -21671 -13604 -7513 -4528 593 10080 19952 25340 26727 29152 32899
420 32899 34212 30426 23390 17005 12537 8196 2432 -3957 -10447 -16756 -21911 -23147 -20815 -18596 -18466
435 -18466 -17815 -14203 -9733 -6960 -5985 -3574 1123 4698 3598 788 713 3150 3378 1011 525 4203
451 4203 8424 9857 8545 8811 11465 15869 17798 17845 16564 13224 8191 4212 1683 -2013 -8612 -15405
467 -15405 -19320 -20374 -21777 -24644 -25683 -22201 -15592 -10630 -7668 -3268 3932 9107 11015 12305 15449
482 15449 18674 18633 14273 8552 6008 5462 4662 2758 698 -671 -1797 -1119 2383 5445 5951 3992
498 3992 3734 5152 5310 1405 -5699 -11268 -13793 -16554 -21393 -25562 -26194 -24881 -24181 -22397 -16048 -5533
514 -5533 5127 12434 17576 24304 32907 39699 41985 40670 36387 29501 21233 14101 6010 -4471 -16837
529 -16837 -27200 -32331 -33286 -34229 -35873 -34891 -28306 -19358 -11900 -4705 3865 12016 16596 17642 18464 20206
545 20206 20720 16707 9230 1926 -1575 -3473 -5539 -7491 -8667 -8590 -6596 -1127 6225 11922 13835 14307
561 14307 15559 18115 18314 13145 4927 -2148 -8149 -15516 -23787 -29922 -32846 -34503 -35400 -33724 -27553
576 -27553 -16923 -6749 1271 9135 19163 29827 37955 42078 42710 40028 34796 29071 23192 15909
590 15909 5624 -6882 -17190 -22641 -25425 -28928 -32633 -32340 -27595 -22212 -17693 -13186 -6258 916
604 916 5575 7919 10508 14257 16267 14371 10303 7959 7755 7236 6210 4160 2507 560 116 1757
620 1757 4443 5344 3092 751 624 1505 137 -4408 -7732 -8321 -8090 -9382 -11714 -12046 -10006 -7663 -5870
637 -5870 -3869 419 4969 6886 6109 5827 6707 7470 6571 3729 230 -3383 -6347 -8009 -7270 -5975 -4873
654 -4873 -4112 -463 5904 11414 13614 15160 18542 22187 22903 19062 13115 7107 1139 -7075 -15844 -22850
670 -22850 -27415 -32229 -37062 -39069 -36040 -29390 -21349 -12369 -2068 8918 19000 28583 37375 43936
684 43936 46939 45103 41835 37726 30612 18539 3940 -8531 -17021 -24307 -32942 -40680 -44561 -43848
698 -43848 -40629 -35587 -27801 -17682 -7418 720 8036 15610 22782 27771 29435 28793 26558 22742 18119
713 18119 12514 7030 1313 -4669 -9110 -9653 -8711 -9743 -12150 -12759 -9020 -2749 1110 1617 952 1700
729 1700 2412 1531 90 -440 -999 -3673 -7032 -8826 -8176 -6750 -5941 -5146 -3171 137 3416 5793 8315
746 8315 9976 9890 9361 10788 13193 12590 7596 1892 -379 708 1084 -1103 -4531 -6323 -6494 -6698 -7028
763 -7028 -6247 -5035 -4994 -6370 -7313 -6531 -5793 -5866 -6860 -7236 -6392 -4108 -2107 246 2488 4037 5327 8575
781 8575 14039 18315 18208 15136 12954 13660 14374 11682 5786 192 -4511 -8485 -12944 -15948 -17467 -18549
797 -18549 -19696 -19924 -17416 -13323 -9105 -5856 -2781 1780 6422 10310 13231 14937 14748 12485 10683
812 10683 11183 11921 9720 4454 -643 -2089 -646 -367 -2129 -3931 -3806 -2812 -2355 -2133 -1326 -1023 -2085
829 -2085 -3946 -4996 -4990 -5315 -7174 -9417 -10729 -10157 -9218 -7397 -4998 -2908 -1558 137 4433 10210 14722
846 14722 15276 14325 14507 16812 17670 15205 10492 7053 3968 410 -3839 -7545 -10340 -12985 -15526 -16881
862 -16881 -16295 -14290 -12833 -11986 -9851 -6940 -3431 -208 3157 5848 6892 6905 7661 10168 12070 10916
878 10916 8153 6038 6808 8049 6928 4023 1684 1356 1158 177 -975 -2012 -2939 -4664 -6513 -7206
894 -7206 -6852 -7363 -8709 -9818 -9691 -8614 -7849 -6966 -5432 -3713 -2576 -1076 2405 6239 8291 8042 7604
911 7604 9804 12777 13740 11433 8808 7532 6801 5384 2850 310 -1797 -4025 -6515 -8122 -8547 -8797
927 -8797 -9853 -10498 -9561 -8011 -6584 -5426 -4337 -2895 -1596 -250 1698 4873 6566 5475 3888 4841
943 4841 7682 9495 8277 5963 4952 5495 5610 4843 3559 2097 1100 -449 -1924 -2451 -3541 -5542
959 -5542 -7744 -8363 -8055 -7985 -8470 -8949 -8661 -8017 -7126 -5147 -1731 1339 2232 1789 2937 6760 10505 11381
977 11381 9959 8590 8905 9266 8405 6104 3760 2071 -192 -1910 -3071 -4006 -6129 -8174 -8993 -8015
993 -8015 -6478 -5825 -5493 -5461 -5053 -4149 -2917 -499 2057 2574 1003 -251 1330 4537 6056 4976 3677
1010 3677 4131 5985 7089 6815 6137 5628 5424 4629 4321 3675 1818 -1471 -4551 -5928 -6328 -7249 -8758
1027 -8758 -10605 -11730 -12074 -11520 -9538 -5827 -2692 -2054 -1696 716 5442 9290 10455 9881 9672 11024
1043 11024 11437 10306 7929 5205 3203 956 -414 -1330 -2789 -5502 -7626 -8115 -7214 -5450 -4864 -4758
1059 -4758 -4613 -4265 -3691 -3024 -828 1128 817 -1262 -2152 -431 1733 2178 982 521 1946 4323 5462
1076 5462 5666 5673 6035 6459 6859 7445 7295 5414 2680 288 -1041 -1655 -3160 -5361 -7388 -8806 -10218
1093 -10218 -10931 -9927 -7873 -6314 -6517 -6099 -3602 201 2508 3297 3072 4828 7285 8396 8301 7372 6707
1110 6707 6220 5750 5342 5285 4188 2092 -24 -804 -1067 -1515 -2973 -4127 -5047 -6108 -7756 -8107 -7413 -6816
1128 -6816 -7313 -8225 -7519 -4868 -2128 -1228 -776 875 4455 7459 8915 9424 9718 10125 10072 9775 9018 7506
1146 7506 4991 1757 -744 -1995 -3528 -5670 -7337 -8018 -8268 -8392 -8322 -6784 -4705 -3241 -2820 -2171 74
1163 74 2815 3403 2229 1509 2366 3672 3199 1657 586 167 147 793 1634 2278 2300 2342 2802 4136 5350
1182 5350 5299 4071 3411 2982 1752 -354 -2029 -3387 -5165 -7656 -9914 -10105 -9041 -8550 -9095 -9131 -6743
1199 -6743 -3016 -147 1952 3581 5613 8019 9994 11462 11764 11063 9502 7689 6950 5648 3120 -121
1215 -121 -2820 -4403 -5754 -7187 -7936 -8275 -7729 -7798 -7810 -6468 -3857 -1593 -1189 -1266 -129 2159 4235 4151
1233 4151 3583 3188 3590 3900 4144 4073 3527 2215 1389 1755 2603 2951 1667 556 30 183 -147 -806 -1219
1252 -1219 -1324 -2059 -3332 -4433 -3742 -2893 -3293 -4831 -5260 -3808 -2322 -1685 -1759 -1886 -1158 340 1659 3008
1270 3008 3445 3415 2765 3331 4893 5964 5495 4478 3824 3744 3463 2478 1553 879 -30 -1744 -4116 -4739 -4502
1289 -4502 -5628 -7249 -8667 -8150 -6861 -5668 -5418 -5146 -4042 -1580 1001 3451 5603 7020 7569 8182
1305 8182 9728 11138 10778 9421 7618 6263 4424 2126 -827 -2668 -4142 -6517 -8769 -10078 -9581
1320 -9581 -9208 -9467 -9573 -8167 -5343 -2488 -718 146 1430 3279 5169 6619 7589 7840 6679 5305
1336 5305 4812 4705 4136 2564 727 17 -465 -1142 -2343 -2864 -2250 -1821 -2559 -2695 -1878 -1263 -1526 -2486 -2965
1355 -2965 -2301 -1335 -1393 -2292 -3117 -3066 -2498 -1616 -581 77 519 782 1552 3122 4453 4878 4818 5305 5971 5973
1375 5973 4906 3545 2991 2625 1116 -626 -1750 -2364 -3283 -4733 -6179 -5954 -5258 -4309 -4600 -4819 -4319
1392 -4319 -3002 -1893 -775 436 1065 1562 1846 2684 3852 3799 3383 3369 4057 4546 3985 2881 2432 2788
1410 2788 2406 1556 629 510 -90 -1390 -3026 -3793 -3642 -3571 -4400 -5530 -5982 -5597 -5124 -4725 -3712 -2902 -1908
1429 -1908 -1013 493 2185 3246 3660 4214 5518 6739 7072 6172 5124 4986 4727 3785 2434 1598 775
1446 775 -655 -2402 -3897 -3700 -3928 -4285 -5490 -6019 -5615 -5070 -4487 -3979 -3466 -2917 -1913 -668 790 1994
1464 1994 2304 2273 3433 5410 6366 6173 5383 5215 5492 4912 3828 2699 1997 981 -1004 -2747 -3619 -4002
1482 -4002 -4713 -6025 -6901 -6830 -5982 -5473 -4900 -3989 -3065 -2049 -569 1242 2912 3438 3086 3428 4659 5895
1500 5895 5408 4114 3386 3152 2806 1908 1193 547 149 -632 -1628 -1843 -1458 -879 -1528 -2209 -2217 -1870 -1424 -1470
1520 -1470 -1676 -2088 -2199 -2190 -1737 -1114 -949 -1407 -1771 -781 749 1530 1446 1419 2346 3535 4141 4165 4061 4395 4063
1541 4063 2946 2305 1780 1704 461 -1550 -2894 -3351 -3654 -4181 -4785 -5206 -5320 -5184 -4515 -3279 -2110 -1771
1559 -1771 -1520 -307 1634 2779 3144 3131 3521 4203 4878 4584 3937 3602 3087 2236 991 641 648 89 -908
1578 -908 -2129 -2303 -2222 -2385 -2356 -2681 -2811 -2958 -2756 -2253 -1799 -1688 -2336 -1661 -804 436 436 264 606 1452 2533
1599 2533 2795 3048 3195 3762 3784 3199 3161 3297 3085 2132 1068 41 -508 -1304 -2281 -3375 -4120 -4603 -4941
1618 -4941 -4940 -4751 -4544 -4684 -4137 -2638 -933 83 351 809 2213 3763 4554 4673 4835 5035 5162 4464 3634
1637 3634 3206 2733 1979 409 -506 -1203 -1868 -2887 -3606 -4188 -4268 -4365 -4487 -3878 -3670 -3470 -3170 -1986 -293
1656 -293 612 1074 1167 1922 3511 4324 4447 4237 4270 4526 3762 2955 2443 1770 780 -472 -1553 -1939 -2417 -3194
1676 -3194 -3821 -4276 -3798 -3313 -2810 -2089 -1318 -1098 -903 -31 1308 2277 2137 1285 732 1010 1401 812 119
1695 119 -301 -435 -574 -831 -698 -392 201 651 1051 1879 2493 3199 2718 2452 2312 2287 1769 943 134 -1225
1715 -1225 -3075 -4169 -4122 -4062 -4596 -5286 -5704 -4753 -2965 -1619 -1037 -12 1620 3245 4275 5203 5899 6193
1733 6193 5927 5190 4867 4207 3499 1980 27 -1385 -1869 -2916 -3412 -3878 -4402 -5082 -5378 -4854 -3704 -2518
1751 -2518 -2594 -2699 -2110 -622 363 668 522 1186 1968 2693 3050 3187 3570 3618 3394 3258 3463 3745 3016 1848
1771 1848 958 338 -482 -1377 -1663 -2506 -3578 -4710 -5063 -4378 -3785 -3475 -3873 -3429 -1979 -436 679 884
1789 884 1446 2554 3232 3588 3566 3601 3250 2739 1984 1874 1792 1141 592 98 -302 -285 -327 -290 -157 -388 -865 -1284
1811 -1284 -1162 -712 -1306 -2581 -3159 -3175 -2735 -2633 -3091 -3203 -2758 -1685 -811 44 1017 2182 2753 3587 4293
1830 4293 5175 5465 5042 4347 3549 2807 1706 756 -550 -1702 -3019 -4198 -4665 -4190 -4200 -4517 -4491 -3550 -2282
1849 -2282 -808 -44 140 883 1869 2541 2664 2654 2382 2181 1386 1171 970 741 64 -128 -462 -109 370 523
1869 523 640 1000 902 860 679 1282 1300 548 -496 -1251 -1329 -1393 -1818 -2900 -3339 -3353 -2686 -2504 -2557 -1986 -1427 -888
1891 -888 146 899 1841 2179 2163 2654 2909 3280 3145 2880 2548 2490 1767 1052 837 849 133 -973 -1786 -1941
1911 -1941 -1914 -2194 -2929 -3844 -3738 -3227 -2973 -3285 -2791 -2398 -1635 -906 485 1765 2550 3163 3480 4331 5185
1930 5185 5335 4937 4654 3959 3039 1455 655 -310 -1323 -2830 -4241 -4683 -4677 -4640 -4804 -4851 -4022 -2755 -1693
1949 -1693 -539 270 969 1850 2315 3170 3620 3730 3279 2276 2146 1671 1225 641 -65 -553 -786 -1134 -1132 -885
1969 -885 -449 -524 -870 -682 -143 262 31 -547 -916 -858 -704 -937 -1257 -1616 -1805 -1610 -1289 -408 -106 352 277
1990 277 675 1512 2185 2490 2315 2287 2322 1852 1334 1112 849 363 -430 -1029 -1244 -1030 -1043 -1694 -2215 -1898 -1253
2011 -1253 -872 -966 -1064 -896 -757 -499 -190 240 540 100 73 324 869 1016 890 1006 1128 1263 1232 1285 1418
2032 1418 1468 1003 299 364 390 312 -338 -1415 -1659 -1618 -1447 -1468 -1708 -1790 -1872 -1482 -1045 -545 -268 -184 -135 14 620
2055 620 829 755 663 1114 1271 1259 1209 1469 1940 1860 1697 1545 1815 2061 1836 587 -13 -256 -676 -1356 -2247
2076 -2247 -2936 -3681 -3830 -4063 -3898 -3437 -3137 -2522 -1537 -475 907 2057 2737 3710 4634 4806 5107 4901 4507
2095 4507 3900 2650 1328 575 -321 -1552 -2852 -4043 -4319 -4204 -3991 -3890 -3583 -3108 -2198 -1396 64 817
2113 817 1370 1573 1938 2372 2574 2244 1723 1343 994 746 202 26 -210 -189 -328 -515 -205 367 760 615
2133 615 439 481 912 979 511 -82 -273 -833 -951 -1480 -1757 -1770 -2207 -2487 -1841 -1490 -1271 -905 -633 155 633
2154 633 1064 1489 1653 2117 2125 1939 1917 2141 2193 1689 1045 564 543 704 231 -441 -927 -1153 -1702 -1743 -2097 -2181
2176 -2181 -2530 -2734 -2757 -2099 -1772 -1599 -1107 -632 448 1204 1707 2237 2904 3164 3300 3121 3289 3120 2543 1474
2196 1474 582 78 -472 -1031 -2031 -2620 -2917 -2823 -2823 -2369 -1927 -1583 -1237 -485 199 782 1089 1114 1229 1150 1359
2217 1359 850 391 -42 -266 -553 -771 -785 -611 -213 -298 -67 415 1172 1823 1954 1808 1672 1708 1482 1203 651
2238 651 -262 -1061 -1885 -2450 -2617 -2841 -3263 -3356 -3101 -2278 -1666 -1017 -277 731 1532 2056 2537 3310 3718 3346
2258 3346 2932 2550 2307 2023 1281 519 -505 -1061 -1425 -1602 -1741 -2016 -2261 -2228 -1828 -1390 -1231 -1034 -1081 -646
2278 -646 -206 47 83 202 334 517 603 651 937 1065 1381 1200 1022 1306 1600 1511 1001 696 382 26 -381
2299 -381 -531 -823 -1185 -1604 -1725 -1790 -1586 -1531 -1291 -1293 -863 -126 153 192 481 635 1065 872 864 1113 951 727
2321 727 255 269 509 565 248 154 276 363 361 448 677 443 178 91 -56 173 -226 -777 -1228 -1284 -1274 -1136 -1520
2344 -1520 -1720 -1312 -1130 -1056 -522 -30 505 855 1173 1260 1785 2001 2001 1587 1555 1299 1231 841 399 -32 -435 -977
2366 -977 -1102 -1033 -1132 -1375 -1686 -1378 -1065 -809 -775 -995 -467 -270 -181 -127 74 307 430 481 405 756 904 1122
2388 1122 1065 1275 1142 1291 1294 1073 757 481 155 97 -292 -433 -807 -1471 -1535 -1366 -1147 -1403 -1240 -1236 -918 -635
2410 -635 -399 -15 182 248 513 436 811 898 880 1139 834 959 885 833 834 583 450 419 325 268 343 79 -440 -694
2434 -694 -566 -917 -1201 -1291 -1475 -1517 -1463 -1426 -1415 -985 -749 -492 -162 379 785 1193 1350 1550 1761 1940 2036 1873
2456 1873 1679 1126 636 314 -95 -182 -565 -1110 -1610 -1699 -1399 -1553 -1454 -1543 -1083 -994 -604 -340 -143 368 321 661
2478 661 621 1119 1207 1089 975 874 857 946 882 440 264 151 -139 -417 -18 -389 -610 -832 -949 -700 -648 -500
2500 -500 -728 -651 -481 109 -36 -20 249 278 225 319 139 303 301 -162 -298 -468 -297 -256 -289 -444 -211 -149 169
2523 169 563 988 1227 1128 1133 1507 1574 1424 1069 491 -7 -251 -900 -1302 -1823 -2075 -2587 -2495 -2590 -2022 -1822 -1183
2545 -1183 -711 -10 934 1479 2111 2519 2966 2963 2777 2728 2318 1849 993 178 -289 -720 -1496 -1940 -2503 -2546 -2444
2566 -2444 -2315 -1986 -1711 -1327 -648 -160 257 602 936 1330 1103 1083 1221 977 870 647 367 124 202 47
2586 47 187 200 135 -7 146 236 513 354 27 -168 -211 -305 -571 -710 -1036 -967 -1011 -1147 -1172 -813 -638 -577 -248
2609 -248 123 401 726 1019 1252 1081 1182 1085 916 870 655 49 54 135 -99 -137 -406 -444 -153 -171 -53 -183 -177
2632 -177 -352 -178 -400 -244 -456 -519 -641 -931 -675 -756 -644 -419 -320 -293 367 522 781 1069 1364 1346 1352 1355 1299
2655 1299 1335 794 24 -24 -200 -619 -1068 -1196 -1286 -1446 -1177 -1021 -729 -583 -428 -250 201 413 698 666 535
2676 535 453 287 141 106 -132 -211 -81 -276 -357 -29 334 239 367 515 924 1199 1115 921 658 454 319 -155
2698 -155 -400 -823 -1374 -1657 -1892 -1947 -1772 -1471 -1506 -936 -390 -37 574 1279 1524 1951 1848 1862 1989 1799 1413
2719 1413 683 318 -77 -417 -1053 -1255 -1478 -1512 -1421 -1284 -1018 -603 -277 -53 195 507 908 1009 862 627
2739 627 677 283 127 -204 -423 -372 -597 -917 -824 -540 -302 -210 29 233 710 906 1123 1103 1117 1111 846 571 227
2762 227 -104 -457 -671 -1253 -1188 -1381 -1436 -1309 -1253 -1006 -772 -607 -191 406 454 694 770 876 1214 1174 893 891 957
2785 957 1005 657 265 205 0 168 -101 -187 -548 -461 -772 -916 -682 -850 -888 -1088 -974 -908 -521 -664 -276 -321
2807 -321 99 281 574 960 1221 1420 1371 1197 1143 1541 1047 622 176 -43 -327 -523 -1040 -1224 -1312 -1384 -1419 -1225
2829 -1225 -796 -588 -459 -221 81 469 676 858 852 856 913 629 540 463 296 -190 -462 -593 -384 -231 -261 -425
2851 -425 -512 -188 165 340 241 639 464 499 355 200 281 184 -338 -421 -369 -704 -679 -773 -619 -837 -557 -521 -348
2874 -348 45 27 285 486 969 701 824 738 589 609 725 397 367 114 -65 -119 -371 -397 -279 -394 -481 -546 -533
2897 -533 -465 -355 -576 -312 -303 -320 -504 -419 -166 -149 -282 -364 -105 222 441 472 451 609 909 818 782 772 662 468
2921 468 446 114 4 -132 -548 -664 -870 -848 -997 -1022 -1176 -965 -891 -511 -335 -204 183 356 483 662 1059
2942 1059 842 905 669 735 713 712 617 79 95 -358 -214 -306 -380 -685 -691 -544 -531 -420 -191 -314 -295 49 118 -42
2966 -42 -37 139 296 130 -68 106 69 74 145 161 52 170 170 160 166 182 210 131 192 261 329 69 57 96 132 -189 -249 -486
2994 -486 -353 -599 -544 -626 -561 -307 -375 -290 -180 -119 298 225 347 449 501 396 492 364 292 365 218 108 96 79
3018 79 -56 -116 -86 -250 -290 -227 -265 -459 -216 -208 -251 -331 -127 -249 -113 -300 -205 -74 -155 -129 -121 -68 66 252 258 278
3044 278 354 550 725 646 545 635 430 276 293 19 -37 -235 -415 -495 -565 -687 -766 -736 -688 -592 -644 -393 -271 -43
3068 -43 -3 160 334 332 592 747 527 539 429 268 437 248 250 50 -109 -41 59 -48 -195 -348 -187 -175 -391
3091 -391 -255 -517 -431 -285 -355 -526 -372 -71 -241 19 -118 67 378 437 421 463 383 525 607 485 439 326 -97
3114 -97 -85 -118 -215 -245 -466 -434 -342 -444 -318 -144 71 119 180 114 260 433 392 168 61 132 -13 -102 -204 -339
3138 -339 -546 -613 -593 -477 -92 -370 -62 136 427 732 823 994 819 840 990 594 489 193 -236 -467 -844
3159 -844 -912 -1022 -1114 -1179 -1384 -970 -905 -535 -254 96 236 560 888 1020 1161 1123 1087 1070 906 612 381 69
3181 69 -178 -367 -538 -637 -797 -872 -848 -696 -559 -505 -474 -20 -99 -124 166 224 382 341 60 91 206 178 183 -62 155
3206 155 165 88 180 91 133 110 -3 104 63 91 -173 -121 -183 -195 -210 -250 -195 -343 17 -251 -140 -124 -168 -58 117
3231 117 231 153 250 119 206 148 55 -62 -148 -146 -86 -63 -75 -15 -6 -91 103 198 89 268 501 202 211 353 85 101
3257 101 28 -223 -399 -236 -495 -552 -552 -594 -337 -377 -433 -205 177 52 432 700 651 608 535 423 712 568 246
3280 246 173 -36 -125 -374 -317 -532 -569 -510 -603 -498 -421 -111 -147 -164 6 161 201 124 14 213 117 170 26 51 125
3305 125 6 -174 -95 54 222 344 84 241 139 365 170 210 156 25 -163 -148 -451 -515 -263 -385 -450 -335
3327 -335 -348 -254 -248 51 158 326 344 482 496 286 523 156 419 433 289 237 -271 -77 -357 -291 -256 -432 -234
3350 -234 -284 -414 -206 -61 54 21 -35 259 280 123 67 76 161 -123 -160 -190 -190 15 -79 -102 -30 73 -25 33 166 345
3376 345 216 371 265 177 410 169 63 -11 -22 39 -130 -381 -216 -16 -273 -293 -224 -420 -116 -65 109 44 131
3399 131 98 -16 181 144 333 242 225 70 204 156 37 -88 180 95 -64 75 129 47 174 -17 -145 -188 -314
3422 -314 -302 -324 -312 -430 -270 -312 -171 -154 -314 113 -71 210 259 500 473 492 460 615 546 217 128 266 196 -97
3446 -97 -26 -178 -304 -390 -500 -363 -324 -342 -306 -273 -318 -21 -165 -158 147 60 134 188 269 352 267 204 193 46 104 59 81
3473 81 149 140 -226 -77 8 -191 -160 -157 -28 -126 -14 -15 -20 -114 18 -148 -79 -93 -123 56 135 -136 -4 -19 143 31
3499 31 58 178 -79 193 151 125 -62 33 -104 71 55 6 54 139 26 21 -76 50 -127 139 -131 -101 -47 -57 146
3524 146 -85 -198 -10 -66 -184 55 -30 -16 -75 133 193 109 56 197 83 102 151 -16 241 268 75 93 -132 19
3548 19 -91 -79 -154 -282 -145 -225 -142 -292 -93 -199 -186 -135 -37 -116 16 26 227 93 154 216 90 139 54 250 43
3573 43 81 101 33 -35 -43 183 107 -115 -200 -185 -60 -144 -173 -81 27 -225 -65 12 -154 -134 -223 -18 104 214 164 100
3599 100 124 -73 168 112 78 203 227 277 354 110 40 34 -15 -86 10 -148 -239 -233 -217 -330 -388 -373 -245 -77 -193 -29
3625 -29 -23 100 24 134 300 385 456 137 340 40 316 -43 136 -131 -121 -94 -194 -73 -281 -233 -86 -135 -277
3648 -277 132 6 -35 50 188 125 112 149 98 -31 124 -127 37 -185 -29 -58 -43 -138 25 186 103 169 139 124
3672 124 22 161 5 128 -87 -12 -272 -204 -164 -261 -193 -66 -198 14 -151 -171 -26 -15 55 230 126 123 155 270
3696 270 2 55 11 65 76 195 -40 -96 30 -131 -171 49 -47 45 126 22 50 -67 17 68 -22 -49 -75 -30 -126 -65
3722 -65 126 13 -73 18 36 52 3 -81 0 182 47 61 34 23 14 234 27 131 24 131 1 -64 135 49 175
3747 175 5 224 23 31 -146 64 88 -57 -139 -202 -259 -183 -113 -86 -185 -172 -35 -104 137 41 198 245 327 232 286 351
3773 351 249 171 85 -118 37 -78 -231 -278 -357 -260 -306 -310 -161 -318 -185 -102 91 195 28 255 381 234 286
3796 286 346 106 248 -71 158 -23 -131 -194 -172 -91 -186 -456 -286 -369 -210 -238 -348 -37 -24 12 223 151 83 61
3820 61 139 203 -16 56 -57 -49 -15 -107 74 13 -182 97 12 41 -175 87 -30 162 117 63 -67 25 40 -101 9
3845 9 43 45 103 -78 -115 -89 79 -256 32 129 38 -86 -143 -2 164 11 32 -51 28 41 22 175 28 47 71 38
3871 38 30 10 118 -132 117 42 -46 5 41 -78 -13 4 -22 0 -215 40 -102 -51 -46 43 83 76 192 -53 131 29
3897 29 3 -38 -12 77 91 -39 -88 26 -83 -210 -135 -265 -248 101 -43 -179 -159 84 129 29 -150 15 -24 -57
3921 -57 184 135 -91 18 -85 -1 20 41 91 -46 13 28 127 60 190 209 67 115 128 -19 -82 -59 -133 -144 130 -129
3947 -129 -49 -110 -42 -126 17 -39 20 -59 149 -5 134 274 143 169 148 208 162 126 -185 21 -10 6 132 -61 -100
3972 -100 -86 -111 -232 -82 7 -178 -261 -307 -49 8 161 62 103 160 68 42 185 -29 -194 145 -27 72 171 -31
3996 -31 127 -188 -17 19 9 -43 149 35 -12 -108 -31 -5 -83 -53 -14 -15 31 -2 -43 115 -64 9 -123 148 31 165
4022 165 70 33 -61 20 36 -58 26 -39 -81 111 69 162 36 25 74 -25 72 -53 -17 -212 -36 -37 -83 38 24 -1 224
4049 224 -2 -103 -23 -9 57 33 -98 14 -54 60 -20 -32 -139 0 174 8 45 54 -110 -105 -194 -23 -33 4 41
4074 41 -101 48 -93 -7 2 171 -6 206 38 142 84 72 139 -54 37 59 -62 227 84 51 87 39 -37 43 52
4099 52 -18 135 35 -3 -161 84 3 125 -82 -87 19 68 -1 23 72 -25 67 -184 24 -123 -60 -9 46 -168 33
4124 33 54 -141 110 21 59 143 -186 219 47 104 -56 -11 -122 -106 -36 83 -29 -17 -24 57 -117 -179 -21 -68 70
4149 70 -180 96 -66 -95 12 22 117 -49 -1 48 -11 154 14 -178 -294 -91 30 -146 112 -50 29 33 5 109
4173 109 36 -11 145 34 -70 77 50 130 0 57 -4 27 67 124 69 143 -106 55 127 176 63 -37 11 123 116
4198 116 -136 -68 -14 189 -65 21 64 91 -64 -7 -14 -80 -38 -61 185 -146 -15 137 52 119 35 8 144 23 108
4223 108 -139 -64 -30 48 149 60 27 33 29 -29 -40 -126 68 -114 -97 -33 -218 -38 -45 -219 1 -8 -74 63 100 -24 -65
4250 -65 -92 122 -86 -71 45 -111 -13 109 123 -101 -60 -13 74 -211 -163 71 41 0 -93 86 4 -54 -101 147 -114
4275 -114 274 23 -75 -18 -96 -60 -75 100 -148 -16 -24 -55 60 -158 47 92 -62 56 70 198 82 173 58 -103
4299 -103 -259 -94 -100 -28 -34 -69 -20 140 18 -9 -114 15 151 -30 125 61 16 96 258 42 -38 76 -14 34 -19
4324 -19 -251 -138 -37 -86 -188 13 78 17 -99 -96 51 82 119 -65 -227 12 214 64 -5 34 33 74 -52 29 -138
4349 -138 18 1 147 -81 -113 -38 -22 74 -157 -91 86 72 -27 10 165 73 176 -6 -200 -119 67 129 -148 -137
4373 -137 217 -52 -43 107 -94 -13 -23 -124 4 90 -32 136 216 101 76 98 -44 3 56 136 -50 25 71 -193
4397 -193 -207 -119 44 -7 34 -128 -94 65 167 100 9 140 74 173 161 -79 151 -9 236 33 148 15 -102
4420 -102 -87 -88 -150 -31 19 -68 -120 62 -7 -162 -129 16 -56 4 16 -29 60 -58 -38 -24 -9 140 87 -20 -6 -55 -32
4447 -32 -34 -178 43 19 202 -34 -159 25 89 101 -45 -17 175 -27 68 20 -41 -70 0 14 -36 -143 -57 -29 -103 96
4473 96 93 -40 134 -53 175 135 104 22 -108 -77 -28 71 -47 -57 -108 128 -11 -192 -132 65 -130 -111 253 -53
4497 -53 39 42 96 45 -122 216 93 -5 68 -68 147 50 -86 16 -113 39 43 27 -12 49 131 -62 62 -141 -26
4522 -26 -76 71 35 96 -53 -127 102 56 54 -164 -34 31 92 -48 55 66 -13 157 25 -55 65 112 0 -134 -4
4547 -4 51 -14 -169 -87 -74 -12 146 203 -112 108 64 -74 19 64 -134 -182 -145 -288 -103 -102 -38 108 53 -60 56 -68
4573 -68 58 -64 15 48 -62 83 330 128 -8 -131 -27 156 -47 -66 55 -228 -227 -77 116 10 -83 -7 -95
4596 -95 -35 -137 -32 -2 110 198 -33 42 58 77 146 18 37 -58 -151 38 -40 41 -132 -1 -266 -130 -30 30 -32
4621 -32 -142 -247 125 -93 -155 10 83 138 188 36 248 -105 73 -61 10 -206 7 -27 -120 50 156 -52 78
4644 78 -52 -1 104 -32 147 -7 86 -9 -96 -64 -51 -120 0 54 77 8 -98 -104 -262 -41 -13 -143 -54 -25 -16 95
4670 95 29 26 11 -70 48 -14 -78 6 -28 -209 -154 -144 177 -34 107 7 -170 -36 -88 -90 -161 32 -148 97 -19
4695 -19 162 -16 212 212 -27 27 -86 52 101 4 -39 26 231 -136 -38 -53 -34 -64 -100 110 21 41 5 -6 -116 -109
4721 -109 -4 -35 28 95 87 -110 52 -31 -163 181 -107 51 -21 -35 91 106 30 -18 204 -24 78 -4 31 -53 -17
4746 -17 -109 183 121 -97 -89 -92 -14 -175 107 -7 -123 -6 51 18 -129 -121 -129 1 -62 -75 240 182 -126 183 92 56
4772 56 204 -75 29 40 97 -116 -201 -235 78 47 -62 79 69 -60 -4 -41 -85 66 20 -36 61 -32 22 187 100
4797 100 4 137 36 24 79 143 170 -43 142 -283 6 113 3 2 73 -4 -207 -66 -57 16 31 15 86 -169 -83
4822 -83 38 41 -32 -79 70 -73 166 65 -59 41 -54 3 17 -71 40 59 39 160 -39 48 21 -15 46 -7 -57 -72
4848 -72 120 147 -92 -20 -42 -46 4 193 -71 55 55 -98 35 82 -44 17 -5 32 53 8 33 82 -4 49 18 -114 -14
4875 -14 -42 264 -63 160 57 71 87 23 43 -44 -96 120 154 -188 -131 -131 95 42 24 -85 -4 28 35 34 114 -34 198
4902 198 43 314 -88 -97 -92 71 105 96 259 149 23 -69 -9 47 -153 5 18 142 -77 -186 -81 -132 -134 -97 17
4927 17 65 74 -15 -18 53 77 182 122 -170 219 168 -39 -72 21 -109 -15 98 -78 -27 -143 -132 -192 -57 154 -2 27
4953 27 -85 -122 192 -8 148 128 152 22 228 106 8 -149 -46 -129 -34 91 -61 41 -74 -92 117 -230 121
4976 121 -11 94 39 -33 71 139 71 54 -75 120 -103 52 107 5 61 -36 -29 -72 -70 -263 -84 64 -172 73
5000 73 45 55 -30 16 -146 126 -20 30 196 143 -54 67 -27 -34 59 -72 -77 -95 -5 -64 -243 -108 -195 95 -92 -47
5026 -47 -3 -20 -45 109 119 99 105 -20 -2 86 92 148 74 67 -113 -102 -192 -111 -174 -83 -141 -29 -154 -63 17 42 35 193 -8
5055 -8 240 130 129 141 5 227 -221 -92 -118 -57 73 232 -74 -3 -194 40 67 -67 129 -122 -10 -56 27 77
5079 77 32 160 -43 14 -71 59 34 30 -93 19 -96 -22 -254 61 120 131 -10 34 -37 137 14 100 155 27 20
5104 20 37 134 187 -76 -68 -59 -85 -3 -152 14 -1 -31 0 -14 117 -296 125 164 -129 -62 -37 -3 108 170 80 -89 211
5131 211 -150 151 35 51 -44 99 -95 -130 -162 -128 96 -41 -23 -42 74 -74 115 114 12 128 369 233 13
5154 13 111 -157 -91 11 -17 74 157 61 21 61 27 48 -184 37 -93 -204 -93 120 122 120 19 -27 115 53 -72 -81
5180 -81 -145 -223 -89 -128 133 -159 -132 71 -103 43 -10 183 127 57 172 21 110 16 75 87 -136 154 43 13
5204 13 -100 -7 -287 -184 -158 18 -170 115 -91 -94 95 27 -77 -32 12 152 240 41 56 66 58 -53 -55 -37 11 -53
5230 -53 3 -84 -77 -109 -175 -28 -70 112 163 152 185 -26 46 107 208 92 156 21 18 128 18 -167 -82 -62 47 -72
5256 -72 168 -20 0 -3 0 -20 61 -57 91 18 96 179 220 -8 65 51 55 127 -107 267 -9 102 60 -44 -229 58
5282 58 -2 -91 -182 -135 90 28 -6 139 -67 -67 103 288 237 110 126 140 242 66 -113 -8 -59 -201 -86 -72 -135
5307 -135 41 32 -9 -61 -37 -37 -102 45 46 59 205 113 -158 170 42 198 -21 14 10 33 -113 -173 1 0 -120 -144 77
5334 77 99 121 -94 -87 -162 113 41 16 226 -47 -14 -44 -87 152 -41 -51 -106 -2 84 -163 38 146 138 237 173 7
5360 7 46 115 229 15 163 -3 54 113 102 -184 -13 -119 38 -39 -67 55 -59 -3 -108 -17 -20 -116 75 157 -80
5385 -80 8 -131 68 -45 -178 -80 -39 38 -55 -37 52 -56 30 64 -60 53 -124 150 -128 71 133 -31 58 44
5409 44 -55 -110 85 11 -284 -2 105 23 4 47 -33 15 86 -17 0 -16 229 -53 118 20 242 128 12 161
5433 161 258 69 176 66 134 -50 81 0 33 -102 -45 -83 -127 -215 -60 -164 31 -5 -159 -55 65 -34 47 176
5457 176 -39 -81 38 114 180 14 110 -146 -93 -3 -60 -65 -102 -33 37 -102 -142 -174 -209 -163 193 149 58 168 -157 61
5483 61 91 136 90 79 121 138 217 -140 -15 123 -48 -126 -260 -10 60 -172 -25 -103 -4 26 -8 -8 -48 -21 54 203
5509 203 -14 161 35 -31 -102 92 -80 -80 -6 -6 147 -145 99 95 142 49 30 -193 214 115 -8 68 -214 -100 -85
5534 -85 -154 49 -26 -74 -142 -80 117 -73 -7 -53 -31 -76 -136 22 61 -44 -36 -61 156 104 180 172 5 -36 -44 -6 24 81
5562 81 260 54 -100 -279 -39 14 -181 51 164 -122 6 -78 -66 109 149 170 117 187 74 -37 104 208 31
5585 31 29 -32 -48 -206 -259 -292 24 34 -126 -20 -16 -111 126 55 16 140 -16 81 83 54 128 47 80 -120 65 -57 -379
5612 -379 -135 -229 23 -61 -179 6 -169 -86 -149 72 208 181 143 61 400 0 140 104 119 140 58 119 -39 58
5636 58 -24 -152 -41 -53 13 -373 -55 -236 -201 -51 -24 8 -4 179 139 134 223 349 283 343 133 -52 87 -11 -93
5661 -93 -130 -164 -35 -155 92 -140 -213 -30 -179 -95 34 -67 186 -35 157 134 76 97 -16 235 -59 155 22
5684 22 31 161 60 -43 -166 74 9 -75 -99 -54 -209 -153 -94 -11 39 38 73 151 27 32 148 -21 73 63 123 43 193
5711 193 123 -2 -12 -46 50 -6 -73 44 -268 44 96 6 44 48 51 58 111 50 130 -57 29 142 142 190 7 -118 -50 45
5739 45 -58 -64 75 107 1 -58 14 -183 -23 70 6 187 -56 101 106 207 -73 -9 3 -146 7 44 -61 135
5763 135 -227 31 119 -115 132 38 -90 33 77 18 -58 -68 -41 -99 -29 -125 -139 -4 -128 -36 147 53 -25 186 158
5788 158 192 40 228 40 111 234 35 212 23 -199 18 -46 -175 -38 -19 -96 102 28 -25 -67 -35 68 89
5811 89 40 -13 266 -4 94 90 130 184 84 -43 64 3 -82 -165 -150 -69 3 -161 -261 -199 29 -46 153 -114 83
5836 83 194 7 293 104 165 173 6 -75 -9 100 -176 153 -27 16 -188 42 -46 -65 -59 -53 166 -102 -43 27 -77
5861 -77 101 -16 43 8 -91 106 -117 305 91 -146 71 24 46 17 -125 -180 37 -223 -35 -177 -55 56 16
5884 16 93 -70 102 26 132 69 88 87 39 20 -125 220 -71 -33 149 71 -138 -194 27 14 -97 -54 55 -159 -119
5909 -119 191 36 -57 23 56 61 76 92 -64 172 -1 176 -83 -165 -77 -141 -225 -255 -215 -44 -35 -88 -43 92 -54 26
5935 26 100 193 41 -51 -116 110 108 69 189 -166 -92 54 -9 -109 -25 127 -12 21 155 8 -111 116 -99 80
5959 80 46 2 99 47 250 60 -43 9 -133 143 5 -51 -100 -159 -159 -131 98 -39 -36 48 110 84 151 130 236 30
5985 30 -223 75 -198 91 -16 -171 -59 13 25 -143 -87 -154 -125 -40 49 -168 136 -7 148 -109 -67 39 75
6008 75 -89 113 -8 -21 165 105 138 18 177 -85 36 -1 -103 -60 18 27 77 -24 67 71 71 -44 248 -98 55
6033 55 -12 67 -105 138 88 195 152 -80 111 24 99 -21 146 12 106 -149 -90 -298 -131 17 73 -50 33 125
6057 125 -13 130 106 -30 7 68 -81 41 37 123 -172 70 -86 -84 -150 -3 -6 110 85 -81 44 28 101 205 75
6082 75 -5 -128 -19 -29 -156 220 -79 -134 90 44 -193 -191 -38 107 101 -134 -90 119 167 -52 -13 30 -115 -10
6106 -10 -1 -111 7 -46 -62 -4 -61 -76 74 45 2 146 32 155 67 188 101 168 44 36 130 147 17 136 -44 -75
6132 -75 -61 -143 -128 -51 -161 -88 -203 -62 37 -44 133 -26 95 67 72 24 82 32 -13 -78 171 69 34 37 -16 12 -101
6159 -101 -25 114 -158 1 -7 -202 -11 -37 136 113 296 74 -50 133 127 114 125 31 143 122 13 -8 179 -46
6183 -46 70 89 -134 -275 -270 -101 -262 -122 -55 -327 -37 -147 157 -164 56 132 283 137 92 156 79 88 24 108
6207 108 -13 122 -105 -182 -102 -113 -231 -13 -243 -239 -206 129 -43 45 -38 79 252 196 202 266 186 222 173 146 229 51
6233 51 -57 -59 -16 26 -27 -68 -180 -5 -146 -84 149 -146 -98 -194 54 117 388 132 16 250 204 127 133 -1 1 21
6259 21 40 -87 -35 -107 -259 -169 -194 -138 69 -35 -133 -111 -145 53 -96 47 175 260 102 136 105 129 167 -11 -44
6284 -44 104 91 -53 -111 -49 -80 -60 70 -140 -116 87 -48 39 -77 -78 -1 -119 -151 -55 3 158 3 231 240 -63
6309 -63 82 113 94 162 57 118 78 84 -4 -79 75 -160 -4 -114 -158 -72 41 -63 -35 49 107 131 41 12 137 -9
6335 -9 30 156 -48 33 103 73 -115 8 -51 167 -52 43 -30 -85 -126 -80 112 -22 -110 -16 -12 87 -83 -63 203 105
6361 105 98 40 231 -194 -27 63 82 28 -70 206 178 55 10 32 -78 44 -14 -230 -223 -87 60 -27 -78 -141 -73 55
6387 55 -15 117 171 -10 194 131 -56 -46 -102 6 -97 -161 -209 -187 -216 -203 -100 -56 55 -215 -71 -26 -127 -36 88
6412 88 2 40 105 -15 157 7 -46 150 -13 -55 38 -30 -21 -27 -30 -76 -94 -56 3 25 6 40 246 -39 -15 105 73 184
6440 184 -37 156 158 -14 -116 -72 28 53 8 8 -218 176 297 70 -99 6 -154 81 81 42 29 -102 110 42
6464 42 141 132 1 -3 54 124 110 -29 124 -8 -25 3 -59 60 20 59 93 105 88 57 9 -62 84 -82 -99 90 68
6491 68 0 185 -48 -72 34 177 118 40 -130 89 16 -164 17 31 182 21 -2 25 -5 -38 -15 -168 18 196
6515 196 -56 92 -216 53 -76 7 11 -102 0 54 65 101 102 111 157 96 -109 26 2 241 -31 106 -75 78
6539 78 -95 -136 -145 -138 -3 -209 -200 -61 -230 -56 30 -118 -139 -171 -14 30 -2 116 37 28 -65 211 93 10 -138 -103
6565 -103 140 -112 -130 -117 -114 -115 29 -23 -81 -232 -51 77 138 169 40 195 -34 162 95 36 59 -6 63 160 -109
6590 -109 -113 -22 -45 -20 -7 109 -135 62 116 -13 34 159 113 171 -112 -58 13 -154 50 112 -77 49 107 49 -125
6615 -125 -64 41 -85 -52 -68 -123 -103 -97 -14 -98 -71 81 -75 70 -6 86 -47 80 80 -25 -58 -269 36 44 -31 36
6641 36 -86 -150 5 -87 -117 -40 -176 71 -93 -148 1 -2 68 -64 -24 39 101 13 -106 -9 -16 203 -114 -8 100
6666 100 -75 -19 -47 81 137 45 58 -92 18 -19 26 83 -111 81 -6 86 -58 -23 39 61 5 69 -21 98 68 27
6692 27 -64 -59 -112 -76 25 50 30 67 -25 -31 15 17 -34 45 -2 -6 -202 -53 -111 187 -31 212 159 36 -19 -123 22 -1
6720 -1 111 99 -11 -72 103 -80 -3 -2 90 199 -78 -45 -6 -59 -145 -69 -105 168 -130 70 -12 -29 -13 40 -132 236
6746 236 -121 -130 264 29 14 -2 -26 -48 -13 73 -46 -136 -28 9 -226 51 -276 22 -57 15 90 -194 31 5 -28
6771 -28 -56 -17 102 134 -98 -50 50 93 18 55 -48 -113 94 -52 -50 80 18 73 99 217 -62 201 3 106 119
6796 119 25 126 225 45 -28 153 -79 44 -34 93 -57 -67 15 -4 -82 -72 -210 34 -320 -75 110 12 77 -167
6820 -167 -156 -79 66 30 45 187 15 143 165 -56 -88 -81 29 -8 -28 -3 -96 -77 -50 -52 -28 -120 -39 -142 -81 73 11
6847 11 -43 88 18 97 129 135 80 150 -44 -155 -136 -61 114 -122 -69 3 -107 36 -34 -138 -154 -13 14 54 -26 43
6873 43 169 47 1 100 -51 98 22 -111 -87 20 -8 -24 -105 6 -70 -82 17 55 -75 9 -62 37 104 70 169 5
6899 5 86 36 78 -40 -23 -113 12 52 48 -63 12 -181 37 56 126 -106 50 69 26 154 31 -56 45 -105 137
6924 137 -34 -66 55 2 -116 -87 -74 -69 88 -123 64 -92 -15 -84 -7 -127 -26 -137 31 163 -147 6 95
6947 95 4 -50 -99 -86 -75 -35 15 -167 -66 176 64 -61 149 -128 70 38 -37 127 -123 77 32 -53 16 83 -107
6972 -107 -78 109 61 -14 -111 109 -27 99 -209 66 -15 -160 121 144 43 -105 -58 170 -237 35 -8 -93 65
6995 65 -14 231 -38 8 -2 75 -51 76 23 157 -34 84 -111 103 184 -15 -31 35 113 187 17 43 213 88
7019 88 108 -86 37 91 -59 -29 -25 17 -59 157 -33 -131 57 93 19 37 9 -55 72 155 36 -16 3 131 65 -73
7045 -73 -71 -33 55 41 -47 -17 -74 -117 -87 51 -50 -65 200 -97 -40 -105 -128 -23 75 -17 135 -33 -26 56 143 129 174 -110
7073 -110 -6 1 83 -84 3 -106 191 -88 131 20 -6 148 146 -68 -83 139 162 77 33 56 44 21 -60 -198 -32
7098 -32 36 163 -98 88 -7 -104 41 100 84 21 105 28 277 187 8 -22 171 -37 16 -149 89 -264 -47 6
7122 6 -133 30 -38 51 91 -61 57 -223 -81 -64 194 -54 -135 17 80 -75 -51 97 -40 -54 -58 40 -61 -60 -70
7147 -70 69 -56 -67 -113 -30 -52 58 -113 -104 -39 -12 179 -165 156 56 -61 6 156 5 23 -198 -44 190 -31
7171 -31 39 -1 -84 132 -74 -75 187 -106 -6 -101 -3 12 -46 140 -20 148 124 -189 98 -135 -89 -178 129 -98
7195 -98 -30 -44 -121 130 -34 -189 170 -56 -3 78 45 -160 64 103 -91 74 135 -80 33 6 -14 -102 -44 -101 -140
7220 -140 -66 -68 29 -22 -136 12 92 49 23 76 -112 3 -83 116 -217 97 -68 -21 72 -41 -66 -103 104 -31 -139
7245 -139 164 149 29 -46 173 8 56 118 -130 94 -40 182 2 -155 -125 33 -196 -35 -99 -9 -18 -117 -5
7268 -5 -153 -80 120 -90 12 96 185 197 88 65 -10 -41 31 121 79 52 -25 75 -60 -214 -150 -55 7 -10 69 -100
7294 -100 -79 167 43 129 -19 136 226 -74 56 70 195 -111 -224 8 -132 -88 67 -102 -19 34 -121 -191 58
7317 58 50 -80 30 -87 66 195 -1 161 9 153 -16 -38 101 43 103 40 115 -123 130 -27 -204 50 -152
7340 -152 6 -29 -78 -108 -40 7 154 -6 204 -32 11 115 142 151 -7 -50 16 174 47 115 37 64 -23 30 -32 -189
7366 -189 -7 -241 208 95 -19 -103 -7 19 122 -22 -32 4 158 -67 140 130 94 22 42 -50 219 -106 66
7389 66 42 -37 -44 47 -6 -56 -14 -19 -3 -73 122 136 -154 76 -66 18 105 113 -30 -93 -104 26 5 -36 -32 -9 25 -85 60
7418 60 -147 44 -176 99 -86 128 -57 -34 -17 -19 20 17 -100 9 -158 61 135 160 -134 -38 -54 72 51 -70
7442 -70 110 -121 -23 -156 105 89 -240 -15 -33 -91 156 -69 -205 65 -34 -87 0 159 -127 59 109 76 17 9
7466 9 113 56 36 -32 105 16 -115 17 -145 -71 -144 11 -123 59 36 -104 -208 -70 84 50 79 106 -12 131
7490 131 -102 207 -3 18 58 -18 -53 46 79 87 18 89 127 -39 -103 66 -176 13 119 65 35 6 126 25 13
7515 13 6 -2 -56 15 107 39 207 -43 -19 -84 -4 104 -88 8 -107 66 -25 -41 -10 53 -32 38 20 -39 15 72 5 -112
7543 -112 48 -17 -170 -29 -55 38 76 -40 75 -110 -7 95 -101 104 54 -91 61 -81 -126 105 -67 83
7565 83 -45 89 -28 66 -13 46 -53 -33 21 54 47 46 96 40 294 44 67 66 -146 -109 7 16 -98 -31 72 137 26
7592 26 67 -39 -62 152 52 77 137 105 93 61 -92 -61 14 -15 118 49 177 -40 -76 40 -52 -259 4 169 39
7617 39 -43 -52 -108 -67 -47 -203 -76 31 -9 66 -123 -9 -77 81 79 167 -39 12 69 -56 -4 46 6 -98 -136 117
7643 117 -97 6 158 -27 -184 118 206 85 -191 37 96 173 135 44 39 109 127 -1 96 -45 -92 -106 96 96 -143
7668 -143 -45 -72 -6 96 -56 49 85 6 49 83 69 -32 -170 64 -8 -78 182 141 137 31 72 33 38 -101 -91 -172
7694 -172 -124 40 -36 -37 -143 7 174 80 0 -65 -281 -58 133 -16 52 47 108 -38 93 155 34 115 154 -3 -53
7719 -53 195 -56 12 -172 -88 -176 -40 -30 -53 112 39 -25 75 141 -55 96 62 -25 193 178 95 -65 52 53 79
7744 79 -155 23 -56 -69 101 7 -177 -116 -43 -61 11 41 59 -316 -3 -24 -103 -22 186 39 57 47 -2 2 165 17
7770 17 -90 -12 -33 -103 -59 -50 -33 121 115 34 90 51 -27 37 -60 -69 3 -66 9 1 -68 4 82 -11 -80 164 176 56 -74 -20
7800 -20 -63 156 216 -17 -52 -80 146 -15 206 -55 -51 -52 26 151 147 -43 -54 43 151 134 -103 -42 -75 156 219 98
7826 98 86 43 -43 160 99 28 -34 -131 -108 61 1 -29 -75 -78 -79 -71 -4 -30 -22 -14 106 6 -15 -84 95 -88 -16 92 -15
7855 -15 83 -55 -148 35 51 -142 -45 186 -146 -302 -44 -252 -58 147 -8 -65 -88 40 108 -80 -30 -24 -61 212
7879 212 -51 -50 81 -154 -55 -165 -77 -97 52 -112 -70 -36 -52 -81 24 -25 149 6 -19 103 -25 136 -19 19
7903 19 -55 10 -199 -39 -5 57 -28 -42 -136 139 45 153 33 31 -85 -117 54 89 104 -1 32 125 169 50 76 -75
7929 -75 62 113 -9 -25 -44 57 63 -39 -4 19 -83 -147 24 -1 45 54 -74 92 9 -1 128 -66 63 129 -96
7954 -96 62 42 -28 70 8 -145 105 -78 224 36 -44 134 -70 -88 214 115 -86 44 13 -1 157 -147 16
7977 16 -86 58 -151 88 -54 -74 6 -6 169 21 225 51 205 50 -7 -8 46 -32 18 -36 -188 83 -126 14
8001 14 3 -143 23 -100 99 -24 31 -154 146 -16 -88 61 -40 -134 147 86 -60 -57 -8 42 -84 -60 57 121
8025 121 -106 -26 -58 -65 191 13 -40 41 10 81 34 72 -46 43 89 222 29 49 137 21 9 -163 -145 -129 -63 106
8051 106 -55 -177 -126 -77 12 -265 39 -106 91 -68 120 -39 148 31 -12 64 43 135 136 86 121 124 -101 -191 -203
8076 -203 204 -52 40 -110 48 -9 -39 -63 79 -10 138 66 54 15 -54 -137 -96 56 -38 -83 -70 56 -177 75 -73
8101 -73 28 -15 -5 -118 95 136 -50 -120 70 164 80 -7 24 11 91 -16 -4 94 2 108 40 164 19 88 -14
8126 -14 -22 -94 59 -21 -81 87 7 -49 19 -112 123 -11 -76 14 -132 38 89 144 36 136 178 74 26 81 118 20
8152 20 6 80 88 -199 82 -32 135 -75 -122 44 -41 33 -99 -57 93 -93 25 -12 75 54 107 49 230 -48 -84
8177 -84 -166 -97 3 -113 -170 17 135 -112 46 6 -18 -6 -56 -33
8191c3
$$ Imaginary data points
##PAGE= N=2
##DATA TABLE= (X++(I..I)), XYDATA
0 0 0 0 0 0 0 0 0 0 0 0 0 0 0 0 0 1 -1 32 -32 32 -32 33 -33 64 -65 65 -96 97 -109 129 -158 162 -194 226 -249
35 -249 272 -312 353 -388 426 -484 531 -587 652 -722 805 -883 974 -1073 1182 -1301 1433
52 1433 -1583 1747 -1930 2138 -2372 2642 -2961 3332 -3780 4328 -5026 5936 -7189 9027 -12017
67 -12017 17677 -32424 164159 347360 227908 190373 110220 63414 -23310 -88514 -164865 -209387
79 -209387 -253581 -263748 -261489 -229564 -199052 -154424 -105138 -37737 19855 70811 105146 135481
91 135481 150616 157654 151469 140132 114530 75895 26392 -10517 -28652 -35552 -51516 -73884 -87924
104 -87924 -80212 -60082 -37962 -21348 -6824 6926 18380 24310 27588 28620 23149 9404 -5709
117 -5709 -15278 -20807 -28299 -37457 -43657 -42548 -35770 -24313 -8819 8300 19230 19906 17674 25609
131 25609 41591 48529 37298 18380 7496 5921 4940 -913 -6630 -6874 -2507 1733 7385 16589
145 16589 25745 28951 28416 30007 31872 27191 14244 -2472 -18611 -33482 -48205 -58532 -62144 -62470
159 -62470 -66020 -69088 -59027 -33419 -4459 15202 28135 44256 65126 82957 89354 85721 77887
172 77887 67095 50816 29241 5973 -16909 -40617 -62661 -76478 -81435 -81114 -78874 -72229 -59419
185 -59419 -41504 -22302 -3504 16307 34844 45669 45746 42664 43929 44746 35950 18006 515 -8641
199 -8641 -11407 -15853 -22981 -25699 -19912 -9474 892 11276 21908 29971 34304 37132 39340 38307
213 38307 29767 15217 -579 -13707 -26483 -40798 -52190 -57028 -57949 -59031 -56829 -43476 -22186
226 -22186 -2587 10494 21989 39135 59252 72807 74148 68460 62438 55371 43312 26918 9401
239 9401 -9485 -28797 -44155 -53040 -56795 -59623 -61867 -59879 -49958 -36157 -23396 -12327 302
252 302 12099 19047 21430 25901 32594 34758 28359 17066 9152 9117 10321 5714 -2350 -6552 -5236
267 -5236 -1721 1439 4041 5191 5025 5245 7115 9817 9232 3194 -5605 -10725 -11792 -13462 -17204 -20475
283 -20475 -21293 -21905 -23176 -20580 -11204 127 6231 5851 6407 14393 25065 29775 27249 22949 21381
298 21381 20808 18663 14580 9045 2502 -3736 -6737 -6362 -5455 -8497 -14460 -17393 -15181 -11273 -10323 -10329 -10106
315 -10106 -10770 -14164 -17150 -14490 -8510 -4759 -8113 -12959 -11089 -2585 5209 7342 7969 11553 17288
330 17288 22887 26138 27115 25844 22624 20167 19327 18557 13688 3305 -7768 -13887 -16963 -20474 -24547
345 -24547 -26983 -28231 -30781 -33219 -30635 -21629 -11329 -6494 -6026 -2604 6519 16443 20840 21200 22427
360 22427 25091 27815 27607 24935 20489 15186 9912 7224 6652 4904 -1211 -9075 -13149 -13455 -13289 -14173
376 -14173 -13927 -12670 -12953 -15835 -18016 -15372 -9585 -6521 -9232 -11773 -9125 -3979 -1460 -2069 -1843 2049
392 2049 7903 12613 15197 16881 18079 18880 20469 23824 26551 24169 17764 11658 7534 3111 -3776
407 -3776 -10537 -15106 -18987 -25472 -32582 -35790 -32552 -27618 -25458 -23856 -17978 -8379 315 5287 9783
422 9783 15870 23152 28791 30323 29139 26323 22125 17725 14768 12600 7678 191 -6098 -8836 -9940
437 -9940 -12098 -14134 -13697 -10223 -8030 -9162 -10443 -8594 -5198 -4255 -6955 -7726 -5513 -4487 -6534 -10148
453 -10148 -10348 -6758 -1512 1511 3560 6198 9297 12351 16612 21537 24059 22620 19589 17832 16450
468 16450 11884 4043 -3069 -6924 -9580 -14296 -20229 -23238 -22099 -20421 -19888 -17582 -11788 -5058 -1411
483 -1411 -720 600 4581 9147 10644 9277 6679 4309 2333 1668 2278 2881 1859 707 2924 8118
499 8118 12443 13187 12346 13802 16866 17151 12986 7290 2601 -3146 -11317 -19722 -24904 -27426 -30394 -35006
515 -35006 -37813 -34671 -26370 -17241 -9385 -1361 8135 17229 26301 34827 40981 41953 38407 34172 30853
530 30853 26103 16797 4192 -7142 -13935 -18870 -24706 -29205 -29641 -27289 -24462 -21479 -15372 -6348 2061
545 2061 6064 7295 9182 12705 14529 12400 7535 1942 -3058 -6958 -8279 -8466 -9119 -10661 -9537 -4254
561 -4254 4541 11944 15553 18409 22750 27641 28669 25139 20452 15495 7878 -2477 -12970 -20655 -26485
576 -26485 -33090 -40151 -43993 -41404 -34513 -27479 -20621 -12481 -2848 7463 18439 28588 35701 37821
590 37821 36529 34736 33827 30773 22698 12184 3651 -2069 -8253 -15463 -20888 -22523 -22255 -21781 -21324 -18037
606 -18037 -12149 -7358 -5394 -4337 -1090 3984 6580 6540 4897 3696 2434 2243 3510 5039 4721 3014
622 3014 2442 5056 8391 9405 7648 6825 8294 8725 5943 1377 -1668 -3286 -5065 -8119 -10306 -10134
638 -10134 -9078 -9171 -9807 -8024 -3134 1399 4055 4892 4859 4776 4166 3385 2217 -341 -4830 -9510 -12010
655 -12010 -11815 -11858 -13277 -12364 -7221 422 6605 10481 14653 20958 26756 29614 29418 28197 25526 19176
671 19176 9539 -787 -9195 -16949 -25580 -34184 -40437 -43336 -43543 -40323 -33975 -24988 -15146 -5054 7201
686 7201 20139 31004 37272 40857 44532 47789 46215 38425 27394 16941 7488 -2450 -13322 -22384
700 -22384 -28539 -33359 -37644 -38823 -35568 -29427 -22677 -15985 -8865 -1468 5709 11602 16160 19071 19987
715 19987 18860 17157 16074 13793 8185 1204 -3242 -3019 -1589 -2529 -5221 -6582 -4715 -1332 618
730 618 2219 4080 5527 4580 2072 852 564 -705 -3663 -7111 -9068 -9732 -10231 -10377 -9826 -8671 -7368
747 -7368 -4927 -506 4338 6377 5135 4457 7477 11789 13094 10709 7262 5774 5473 4744 3458 3004
763 3004 3108 1455 -518 -1550 -826 -439 -1559 -3892 -5507 -6115 -6658 -8103 -10111 -11650 -13279 -14011 -12043
780 -12043 -7978 -5103 -4774 -4442 -949 6073 12836 15932 15940 16828 18531 19505 18048 15877 13072 8986 3367
797 3367 -2065 -5961 -8854 -12491 -16417 -18870 -18965 -16877 -14983 -13031 -10277 -7837 -5431 -1900 3992 8599
813 8599 9182 7413 5999 8057 10393 10045 6914 3787 3095 3324 2627 2066 2433 2998 2741 2283 3086 4459
831 4459 4802 3338 572 -967 -1710 -3375 -5742 -8237 -11213 -14196 -15580 -14610 -11791 -10624 -10904 -10321
847 -10321 -6401 90 5498 7956 9374 12291 15734 17648 17573 17019 15847 13537 10134 6495 3686 1147
863 1147 -2960 -7498 -10359 -11650 -12179 -12755 -12789 -12215 -12009 -11157 -8563 -4796 -1925 -1417 -1910 -331 3408
880 3408 6828 6722 5073 4967 6723 7940 8051 7406 7472 7251 6563 5486 5645 5836 4857 2342 96 -532
898 -532 -1881 -3705 -5783 -7284 -8864 -10652 -11050 -10554 -9317 -9493 -10502 -10017 -6181 -1742 495 604 1526
915 1526 4664 8018 10181 10490 10690 11154 10625 9560 8513 7839 6199 3273 711 -766 -1740 -3611 -5716
932 -5716 -7235 -7976 -8309 -8645 -7849 -6480 -6020 -7098 -7673 -5349 -1464 791 -15 -1089 393 3038 5140
949 5140 5619 5637 6039 6896 7317 7459 7788 7762 6593 5173 4800 4565 3455 772 -1483 -3330 -5083 -6279
967 -6279 -7130 -7577 -8309 -10355 -12364 -11652 -8031 -4896 -4316 -4818 -3509 -126 3543 5582 6382 7186 8479
984 8479 9328 9476 9378 8740 6889 4444 3130 3025 2183 95 -2330 -4381 -5250 -5618 -5459 -4640 -3874 -4944
1002 -4944 -7031 -7559 -5040 -2304 -1988 -3546 -4650 -3386 -1016 135 81 387 1812 3383 4998 6490
1018 6490 7983 8336 7843 7844 9053 9891 9127 6522 3601 1050 -1209 -3014 -4410 -5558 -7758 -11386 -13633
1035 -13633 -13164 -10326 -8450 -8404 -8275 -5994 -1921 1657 3324 4643 6048 7808 9028 9980 10159 8984
1051 8984 6723 4543 3607 3610 2906 738 -1463 -3243 -3760 -4123 -3716 -2684 -1913 -3219 -4948 -5184 -3047
1068 -3047 -1573 -2279 -4459 -5286 -4096 -2555 -2625 -3708 -3361 -2263 -628 1129 3297 4879 5427 5778 6653
1085 6653 8718 10211 10092 8798 7117 5703 3852 1832 509 -476 -2862 -6353 -8791 -8849 -7832 -7961
1101 -7961 -9329 -9764 -8167 -5263 -3672 -3080 -2536 -990 1053 2645 4326 5503 5695 5043 4993 5970 7219
1118 7219 7579 6673 5673 5125 4407 3076 2324 2198 1095 -1466 -4178 -5392 -5523 -6110 -8300 -10730 -10655
1135 -10655 -8987 -7664 -7559 -7171 -5509 -2956 -282 2641 5170 6758 7799 8396 9287 10469 10655 8907
1151 8907 6981 5385 4133 1791 -602 -1964 -2799 -4387 -6330 -6699 -5596 -4350 -4270 -5061 -4384 -2029
1167 -2029 79 149 -489 -586 -466 -51 -187 -232 -787 -1586 -2396 -1824 -426 916 1271 1638 3150 5020 6165
1186 6165 6773 7319 8096 7598 6217 4449 3797 2736 160 -3638 -6823 -7799 -8038 -9236 -11241 -12177 -11349
1203 -11349 -9583 -7255 -5000 -2987 -869 1044 3719 6630 9258 9892 9662 9171 9561 9130 7505 5562
1219 5562 4038 2162 -226 -2758 -3707 -3684 -4503 -6047 -7545 -7009 -5077 -3909 -4107 -4466 -3685 -2137 -413
1236 -413 362 679 663 596 570 1578 3094 3235 2318 1605 2220 3137 3694 3345 3223 3497 3205 2286 1726 2235
1256 2235 2530 1022 -1214 -2031 -1460 -1052 -2452 -4129 -5086 -4924 -4235 -3639 -3681 -3817 -4192 -4234 -2892 -1046
1274 -1046 298 206 116 965 2634 3799 4333 5082 5760 6116 5638 5390 5619 5973 4915 2730 879 259
1292 259 -115 -2006 -4539 -7019 -8495 -8202 -8127 -8450 -8637 -8726 -8210 -6668 -3890 -577 1093 2693 4219
1309 4219 6590 8824 9867 10311 10479 10709 9601 7543 5721 4545 2662 -429 -3602 -5058 -5513 -6433
1325 -6433 -8045 -9531 -9835 -8442 -6810 -5397 -3615 -2587 -1896 -614 1447 3663 4610 4327 4279 4660 4778
1342 4778 4485 3379 2782 2628 2273 1041 415 835 1010 211 -671 -791 130 909 244 -1120 -2182 -2290
1360 -2290 -2260 -2178 -2770 -3302 -4466 -5200 -4932 -4046 -3423 -3164 -2836 -1798 -141 1281 1730 2642 4089 5506
1378 5506 6001 5789 5968 5998 5669 4243 2719 2328 2312 1133 -1030 -2650 -3585 -3455 -4008 -4140 -4411 -4595 -4755
1397 -4755 -4584 -3593 -2647 -2574 -2338 -1549 -305 923 949 574 1312 2688 3255 3496 3843 4419 4764 4087 3622
1416 3622 3607 4278 4153 2796 1204 -41 -452 -1103 -2355 -3345 -4278 -5547 -5988 -5988 -5656 -5953 -6018 -5419 -3870
1435 -3870 -1860 -1073 -859 -67 1834 3599 4214 4918 5612 5919 6014 5367 4939 5046 5228 3888 2078 857
1453 857 313 -456 -1383 -2538 -3473 -4351 -4996 -5047 -4829 -5340 -5787 -5902 -4723 -3023 -1890 -1756 -1686 -225 1840
1472 1840 3106 3855 4767 5738 6147 5876 5731 6002 6221 5267 3415 1669 983 184 -1179 -2745 -3875 -4914
1490 -4914 -5720 -5663 -5434 -5219 -5512 -5354 -4579 -2424 -811 -472 -517 408 2030 2910 3159 3187 3446 3431 3038 2402
1510 2402 2234 2625 2475 1419 461 397 1098 973 519 -188 -672 -687 -639 -600 -618 -1230 -2430 -2993 -2673 -1961 -2337
1531 -2337 -3414 -3758 -3051 -1864 -1459 -1070 -789 408 1351 1940 2573 4110 5011 5116 4245 4080 4519 4451 3797
1550 3797 2531 1173 -30 -997 -1884 -2441 -3395 -4370 -5616 -5355 -4356 -4259 -4393 -4492 -3480 -1828 -931 -50
1568 -50 448 1248 2032 2512 2708 3357 4049 3895 3009 2448 2554 2739 2306 1685 893 329 -223 -428 -678 -879
1588 -879 -1487 -2531 -2503 -1945 -1696 -2463 -3530 -3548 -2711 -1987 -2268 -2226 -1788 -879 -427 7 981 2123 2985 3267
1608 3267 3308 3862 4540 4746 4460 3927 3379 2927 1959 961 351 -1084 -2601 -3537 -3492 -3759 -4501 -5819 -6007
1627 -6007 -5170 -4054 -3246 -3015 -2290 -1003 41 999 1733 2914 3987 4371 4383 4531 4698 4616 4156 3347 2749
1646 2749 2114 1391 434 -487 -1385 -2782 -3560 -3505 -3431 -3799 -4666 -5326 -4785 -3287 -2386 -2108 -1881 -670 497
1665 497 1493 1926 3025 3783 4280 4060 4058 4106 4039 3174 1990 1362 811 -68 -868 -1598 -2322 -2874 -3308 -2780 -2026
1686 -2026 -1387 -1698 -1932 -1393 -78 958 881 517 400 783 571 9 -557 -776 -1041 -1513 -1944 -1417 -912
1705 -912 -630 -575 10 1145 2289 2976 3656 4043 3901 3471 3330 3515 3139 2033 -536 -2115 -2644 -3114 -4075
1724 -4075 -5478 -5963 -6005 -5384 -4909 -4275 -3064 -1805 -586 837 2336 3849 4695 5065 5017 5489 5709 5367
1742 5367 4674 3802 2965 1317 338 -210 -347 -1211 -2621 -3588 -3872 -2930 -3015 -3649 -4044 -3601 -3174 -2672 -2499
1761 -2499 -2213 -1642 -1265 -498 113 1296 2243 2262 2510 3193 3717 4421 4332 4426 4127 3260 2173 1553 1185 570
1781 570 -988 -2608 -3479 -3378 -3607 -3918 -4626 -4499 -3565 -2939 -2105 -1731 -770 -59 328 864 1946 2466 2240
1800 2240 1970 1787 1923 1896 2044 1757 1497 1333 1024 1136 1483 2072 1795 1004 510 629 1044 232 -1063 -1874
1820 -1874 -2506 -2844 -3371 -4250 -4610 -4634 -4275 -3827 -3269 -1915 -736 76 1058 2500 3590 4540 4881 5350 4999
1839 4999 4683 4007 3184 2695 1596 -211 -1846 -2478 -2384 -2757 -3638 -4328 -3785 -3114 -2453 -1906 -1556 -500 -19
1858 -19 442 935 1025 1555 900 560 504 381 394 -8 -165 8 -109 55 398 1168 1626 1833 1421 1643 2560
1879 2560 2807 2110 1431 763 419 159 -634 -1675 -2075 -2431 -2834 -3130 -3239 -2962 -2721 -2756 -2081 -1250 -508 -38
1899 -38 478 870 1312 1902 2189 2668 3397 3169 2589 2343 2593 2991 2442 1403 751 374 360 -501 -1510 -2386
1919 -2386 -3045 -3645 -3807 -4071 -4071 -4376 -4396 -4020 -2959 -1583 -596 90 1204 2483 3564 4209 5011 5667 5662 4789
1939 4789 4015 3450 2972 1924 342 -1456 -2268 -2524 -3275 -4053 -4420 -4532 -4122 -3269 -2508 -1477 -780 -455
1957 -455 21 917 1810 2369 2261 1923 1821 1723 1278 985 994 640 -93 -485 -338 75 538 382 -73 129 622
1978 622 1184 706 91 -74 -681 -718 -916 -1220 -1458 -2032 -2476 -2501 -1818 -1456 -1192 -933 -453 96 760 1206 1861
1999 1861 2421 2421 2067 1787 1968 2234 1768 682 100 91 346 -236 -682 -1079 -1373 -1197 -1022 -943 -648 -853 -1273
2020 -1273 -1256 -891 -747 -644 -688 -711 -766 -320 -358 -111 432 845 824 809 1328 2003 2095 1670 1189 1053 1523 1267
2042 1267 847 12 -416 -559 -868 -875 -920 -1272 -1809 -1935 -1572 -1301 -1172 -1192 -1061 -977 -878 -936 -779 -421 -148 17
2064 17 -112 238 994 1705 1736 1819 1971 2759 3234 3204 2734 2267 1929 1220 557 -62 -1144 -2303 -3174 -4049 -4251
2085 -4251 -4502 -4618 -4593 -3970 -3153 -2192 -1255 125 1444 2518 3282 3989 4881 5290 5179 4172 3487 2931 2291
2104 2291 1112 -49 -1261 -2176 -2983 -3088 -3459 -3456 -3244 -3102 -2517 -1666 -907 -303 -58 502 1019 1300 1306 1047
2124 1047 930 775 359 -7 -156 4 78 -132 -498 -1 776 1041 1132 1111 1386 1498 1653 1405 1226 629 162
2145 162 -261 -567 -862 -1229 -2069 -2286 -2322 -1948 -1899 -2064 -1863 -1340 -872 -833 -175 477 1010 983 1099 1376 1798
2166 1798 2289 2226 2094 1870 1868 2004 1613 1209 762 367 -262 -495 -861 -1219 -2109 -2611 -2955 -2953 -2805 -3092 -2911
2187 -2911 -2424 -1886 -1141 -464 409 1255 2031 2249 2491 3128 3829 3450 2831 2081 1609 1047 654 20 -765 -1399
2207 -1399 -2043 -2205 -2023 -1725 -1647 -1590 -1172 -511 100 372 456 630 703 676 287 70 -52 -228 -925 -1404 -1390 -874
2229 -874 -864 -719 -560 -175 613 1158 1826 2412 2543 2446 2387 2403 2325 1492 510 -160 -935 -1429 -2156 -3090 -3414 -3544
2251 -3544 -3255 -3320 -2766 -1929 -1293 -678 -208 775 1720 2547 2676 2574 2684 2624 2821 2275 1904 1367 794 211
2271 211 -109 -368 -515 -1016 -1378 -1530 -1283 -1240 -1378 -1500 -1171 -960 -1167 -961 -731 -574 -470 -487 -394 85 855
2292 855 1011 930 959 1490 1600 1802 1815 1660 1360 975 833 553 300 -269 -647 -1064 -1357 -1168 -1436 -1750 -1503
2313 -1503 -1432 -1200 -960 -637 -222 55 -11 92 52 627 609 327 -8 -50 200 251 308 414 463 343 507 757
2335 757 1120 966 866 713 870 941 746 105 -358 -644 -893 -1230 -1541 -1625 -1493 -1634 -1965 -1617 -1141 -573 -221
2356 -221 19 250 925 1302 1529 1582 1570 1545 1533 1549 1476 1011 447 152 -30 59 -138 -689 -931 -970 -915 -1015 -1049
2379 -1049 -1278 -765 -880 -1257 -1029 -905 -701 -652 -474 -469 -115 398 389 715 1039 1035 1227 1365 1531 1555 1164 894
2401 894 826 783 578 72 -457 -539 -714 -1032 -998 -1179 -1287 -996 -1208 -1106 -977 -427 -378 -397 -407 -34 269 185 340
2424 340 377 391 647 824 841 1099 1045 859 797 1118 1179 1127 667 587 345 204 -187 -779 -1187 -1430 -1463 -1764 -1837
2447 -1837 -1738 -1368 -1603 -1486 -1042 -567 131 415 823 1102 1398 1734 1946 2012 1945 1569 1140 966 870 568 217
2468 217 -523 -808 -879 -1043 -1350 -1328 -1328 -1233 -1127 -1169 -867 -531 -538 -299 -150 202 462 586 829 660 762 859 965
2491 965 1067 739 515 520 308 242 379 -214 -311 -583 -493 -282 -561 -683 -428 -354 -310 -79 81 322 171 115 224
2514 224 119 333 67 -155 -481 -575 -845 -1050 -1070 -847 -1061 -658 -509 -11 613 676 1087 1435 1732 2309 2194
2535 2194 1753 1726 1323 1044 204 -245 -890 -1451 -1999 -2559 -2885 -2834 -2566 -2540 -2123 -1541 -936 -248 745 1376 1986
2556 1986 2292 2574 3047 2888 2783 2211 1596 1273 802 -73 -505 -1110 -1509 -1810 -1846 -1862 -1783 -1357 -1351 -1040 -741
2577 -741 -194 121 -26 167 330 393 457 279 320 190 206 -118 -142 360 345 330 534 719 1028 1107 828 761 649
2600 649 512 416 171 -214 -454 -742 -1042 -1231 -1254 -1138 -1121 -1136 -823 -506 -329 -185 214 485 576 594 782 911
2622 911 1000 700 412 141 194 390 229 -4 135 139 156 263 102 296 83 70 -24 -126 -406 -461 -651 -858 -1008
2645 -1008 -950 -1254 -1056 -946 -712 -653 -442 38 588 1001 1007 1186 1327 1663 1471 1143 1041 765 438 224 -244
2666 -244 -753 -684 -949 -1082 -915 -935 -751 -500 -368 -242 -33 262 95 357 233 -39 -168 -163 -309 -433 -547
2687 -547 -783 -699 -488 -9 -36 127 641 1087 1339 1431 1449 1497 1279 1089 634 337 14 -553 -1002 -1618 -1847 -1968
2709 -1968 -1918 -1934 -1516 -1353 -871 -467 102 768 1139 1183 1591 1846 1993 1710 1298 795 818 356 -54 -636 -864
2730 -864 -1151 -1165 -1184 -1134 -916 -557 -436 -149 317 395 650 760 814 452 410 98 -145 -308 -558 -649 -981 -845
2752 -845 -650 -560 -632 -261 -74 267 864 1169 1192 1429 1455 1184 1255 1131 857 418 -192 -442 -527 -930 -1103 -1172
2774 -1172 -1332 -1394 -1406 -1379 -821 -447 -272 -255 29 223 598 723 639 648 682 925 752 700 710 799 372 490 399 475
2798 475 260 -175 -395 -503 -620 -648 -1001 -1239 -1136 -1301 -1114 -1074 -831 -589 -547 -252 370 641 886 967 1167
2819 1167 1388 1653 1405 1239 1015 844 494 214 -155 -469 -915 -996 -1228 -1210 -1147 -921 -763 -729 -490 -18 140
2840 140 366 600 563 443 431 470 288 429 115 -239 -108 -433 -368 -312 -504 -255 -149 -13 172 468 429 557
2862 557 604 623 537 609 303 145 69 -267 -472 -575 -655 -706 -873 -954 -964 -582 -409 -248 -316 -162 219 314 433 479
2886 479 550 745 504 391 581 410 453 167 160 328 40 99 -102 -55 -101 -180 -223 -204 -296 -264 -685 -534 -546 -448 -486
2911 -486 -787 -559 -442 -161 -73 39 161 477 568 733 859 969 1031 872 922 889 668 324 110 -78 -440 -501
2933 -501 -742 -883 -1004 -993 -1124 -954 -892 -657 -385 -428 -287 209 320 730 771 735 762 802 683 623 585 632 298
2956 298 224 78 -51 -63 -181 -352 -295 -371 -276 -336 -175 -178 -189 -148 -217 138 -13 -253 -122 -135 -91 81 -215 146
2980 146 -233 -83 25 105 17 179 234 412 403 360 395 475 321 253 244 115 -52 -65 -236 -211 -451 -510 -481 -370 -642
3005 -642 -501 -603 -418 -104 -114 125 56 26 384 483 428 489 321 243 362 408 372 244 79 27 153 -116 47
3028 47 13 -4 -164 -13 -44 -188 -157 -235 -211 -474 -444 -360 -166 -232 -419 -518 -300 7 -57 11 160 254 395 512 540
3053 540 743 484 786 599 638 403 279 154 123 -178 -513 -528 -668 -526 -564 -616 -745 -573 -290 -309 -190 -84
3075 -84 -40 50 213 493 427 375 256 320 536 429 390 302 363 81 222 230 62 -79 11 11 -273 -93 -220 -300 -388
3100 -388 -522 -502 -239 -289 -470 -210 77 95 215 163 384 288 413 675 589 459 366 454 213 83 -73 -152 -171
3123 -171 -297 -257 -395 -211 -165 59 11 204 78 123 435 475 162 403 -50 103 -242 -185 -460 -557 -578 -911 -677
3146 -677 -595 -513 -378 -198 248 351 544 743 800 918 1060 1071 1114 789 518 298 -190 -151 -712 -860 -1110 -1249
3168 -1249 -1431 -1197 -1065 -861 -675 -541 -1 77 514 504 1019 939 890 1015 945 782 465 397 221 -48 -106 -245
3190 -245 -693 -457 -656 -618 -564 -513 -393 -248 -236 -227 -326 -138 15 76 54 82 -66 -128 179 8 309 -105 205 268
3214 268 201 241 375 224 124 115 1 122 -2 -117 -194 -232 -95 -18 -154 -400 -201 -208 -312 62 60 38 -156 139
3238 139 -4 34 209 77 -99 -72 -101 -165 -247 -102 26 -210 -170 -148 -35 343 288 438 342 691 551 398 328
3261 328 266 108 -95 -238 -363 -384 -476 -748 -505 -651 -653 -324 -267 -181 47 141 461 481 624 557 582 446 456 549
3285 549 185 181 -149 -133 -284 -252 -421 -558 -157 -177 -319 -303 10 -101 3 46 -12 22 147 -51 -125 -61 -5 12
3309 12 -59 -75 -71 29 181 106 229 492 185 471 473 448 483 320 183 -152 -111 -364 -171 -304 -186 -702 -453 -370
3333 -370 -483 -206 -100 -226 60 157 266 315 441 299 630 277 335 223 203 173 -99 -151 -135 -280 -157 -64 -343
3356 -343 -251 -76 35 -62 -92 181 195 112 124 40 180 -141 -140 -168 44 6 -200 -112 -107 -235 55 2 18 344 265 492
3382 492 423 338 412 59 240 215 21 94 16 -195 -113 -302 -241 -362 -54 -303 -331 -247 -261 -66 232 -62 10 -29
3406 -29 120 -8 190 85 82 61 80 103 207 217 131 345 297 315 368 239 28 26 168 -130 -150 -210 -372 -193 -368
3431 -368 -571 -479 -385 -559 -167 -208 -139 116 102 235 199 437 401 358 525 306 367 282 -4 52 6 -142 -82 -261
3455 -261 -293 -373 -506 -285 -527 -320 -341 -291 -226 -165 10 -21 -59 230 284 49 127 151 147 97 386 223 -61 -51 -36
3480 -36 -10 95 -260 -44 -108 34 -97 -107 43 -137 -29 -237 -372 -135 -171 -112 -83 -211 -41 -127 73 -46 127
3503 127 2 122 -62 63 -31 -66 173 276 96 -73 164 94 58 156 -110 -2 5 -97 28 -18 51 62 -92
3526 -92 -13 -123 73 -153 -149 -118 -207 -18 -152 -38 52 -3 -81 27 84 42 38 -8 173 72 98 252 -29 184 164
3551 164 181 91 82 -47 -139 -106 -80 -201 -128 -219 -236 -177 -240 -147 -181 -183 54 -139 -230 32 19 86 142 139 13 222 119
3578 119 64 53 71 134 -95 38 -7 252 55 -10 -73 -86 -105 -80 41 -190 -84 -72 -79 -71 -139 -298 -27 -152 -252
3603 -252 -188 -25 39 -110 111 220 302 288 391 472 335 74 280 356 125 -128 27 87 -247 -276 -273 -255 -271 -400
3627 -400 -358 -188 -261 -186 -166 -172 110 180 290 205 291 60 253 232 182 205 -83 -130 -128 -106 -228 -213 -162 -59 -96 3 48
3654 48 -164 -40 -21 -120 67 18 -79 28 -111 151 -58 -267 17 -97 -251 147 43 79 8 9 262 152 420
3677 420 299 115 -19 -58 16 170 46 -140 -89 -146 -265 -278 -170 -170 -268 -80 121 -47 45 -16 123 107 -64 122
3701 122 232 152 -58 46 14 -112 46 -214 -91 8 139 25 -95 44 249 -60 -55 -92 -60 38 -106 16 -146
3724 -146 -108 100 -95 -79 93 -7 -27 66 -14 -68 -109 35 -55 -109 81 -45 31 -19 31 -10 -87 -72 -13 -65 -179 -95
3750 -95 76 54 47 21 117 -94 87 -39 37 181 102 -7 -240 -203 -275 -170 -193 -132 -140 -172 -33 -63 100 224 190 355
3776 355 434 355 270 239 381 184 -72 85 -134 -130 -312 -391 -454 -336 -238 -332 -277 -212 -88 59 23 209 198 304 280
3801 280 308 316 228 233 135 79 179 23 9 43 -74 -336 -225 -257 -135 -190 -38 -105 -136 184 96 24 204 69 -79
3826 -79 79 -14 74 -9 10 189 39 104 -80 89 121 5 76 -17 -42 169 100 -80 95 29 -51 -148 50 52 49 -89
3852 -89 47 -214 -22 65 20 50 173 -13 -39 43 17 168 -25 -4 -73 -1 54 -102 4 41 184 20 149 -77
3876 -77 -32 146 48 99 31 34 -101 75 -97 3 -96 -28 -85 -110 -49 -40 -149 -160 -71 71 35 43 -207 152 53 31 -26
3903 -26 78 84 172 170 86 30 5 -200 133 -116 -57 -18 -101 -154 -56 127 -85 25 68 -110 41 -65 -60 185 4 -101
3929 -101 -76 62 -156 4 151 283 94 60 142 143 37 92 194 116 -31 150 -1 -155 -302 -204 52 -165 -73
3952 -73 16 -309 -198 42 -125 -56 -50 -57 -6 159 75 187 21 85 -35 112 19 54 0 -37 -95 -64 57 -152 -106 50
3978 50 -213 -114 -112 -132 -49 44 46 -221 174 75 21 -43 4 115 52 -73 3 96 89 -84 4 53 -26 123 -1 86 121 128
4006 128 -28 40 88 110 -13 -134 14 -52 -158 -23 -80 -184 79 -62 -2 42 -108 14 22 -102 -19 125 19
4029 19 1 -16 67 25 179 89 67 198 66 136 -50 55 187 114 3 124 191 -94 187 113 -171 23 -29 -24 -100
4054 -100 -166 33 74 15 38 67 -184 -61 -109 11 64 109 33 159 63 108 -162 49 -138 98 14 -116 14 88
4078 88 25 -71 -101 -138 42 -54 -25 102 -33 163 -33 -61 120 -8 95 47 -2 3 -6 54 196 64 -89 -37 59 159
4104 159 -17 -42 -147 -63 182 116 95 -54 -174 -146 26 9 -34 97 -182 -112 -79 -121 -36 70 -113 -133 42 2
4128 2 77 40 24 80 103 360 -135 -42 -18 88 42 9 -32 85 -63 -20 -173 15 175 -51 -21 -114 49 37 7 86
4154 86 35 14 26 9 38 -79 -38 -45 -131 -41 -101 -72 -139 32 -71 -8 -112 -92 -99 -2 -87 -5 337 15 151 26 -91
4181 -91 -12 -9 128 -32 -50 34 -70 147 94 -208 -8 144 -18 -23 -106 21 28 -49 -101 -214 -27 36 -17 -40 74 -3
4207 -3 29 12 22 -176 50 160 69 -153 -62 -63 39 -131 -94 92 -27 39 -44 -155 141 30 142 -240 60 -15
4231 -15 76 -114 -38 218 100 42 113 -114 -147 11 84 -80 -73 -57 -195 -119 -80 -83 116 -18 4 17 -63 9 64 122 -116
4258 -116 143 -156 -149 -108 -3 -58 -5 -1 51 20 -14 -161 140 21 59 21 43 43 -28 76 -176 4 -91 11 96 73
4284 73 89 -162 -98 14 34 33 23 106 -14 152 -84 77 143 -47 -112 -75 -35 -4 -63 18 -320 -119 52 -67 -183
4309 -183 -193 -127 33 -72 -104 -61 77 104 -5 70 51 -95 43 -158 63 -90 6 62 75 80 17 -143 46 -71
4333 -71 -31 -75 -16 -66 -30 -119 70 -12 59 76 -77 276 -153 93 -155 76 107 -56 54 -46 -51 -18 -102 -147 -56 -246
4359 -246 -83 -8 -72 -36 35 66 118 -12 63 90 -46 35 146 46 123 -10 -55 105 -21 -17 -85 99 -23 -267 -194
4384 -194 -73 -223 49 -2 33 -152 18 147 89 112 8 -129 -88 77 128 -66 -48 -55 -151 -111 -155 -139 11 -77 -103
4409 -103 -242 -103 60 30 -117 18 109 125 101 -4 44 103 6 28 191 92 -26 174 -192 -259 77 -138 5
4432 5 -3 26 -11 8 -80 -95 16 -110 -145 65 -85 53 138 13 51 -7 -41 -115 -3 -12 -48 128 10 254 29 -6
4458 -6 -39 -69 191 -52 83 21 -109 31 31 74 -93 -38 -88 -126 -156 -61 -13 -109 214 -156 23 -131 -89 46 -88
4483 -88 -27 217 47 64 39 125 115 29 -33 -139 38 -27 39 121 8 186 -43 -2 5 105 37 -28 -79 -102 123 -188
4509 -188 -66 3 -50 -2 149 97 -37 -97 -78 -134 -264 -81 -129 -116 -40 -144 9 -81 95 29 28 -79 -20 -38 121
4534 121 -79 138 -123 31 14 -125 83 106 167 -157 0 -108 -100 72 -13 -27 213 -148 -48 98 43 75 15
4557 15 16 -29 62 -45 18 -120 108 -36 43 -21 -108 8 -221 -162 -182 -55 -59 -193 -85 -75 10 -222 -31 -54 50
4582 50 86 44 178 77 9 -37 -31 68 -126 -30 17 -163 24 58 -5 -82 -19 -79 89 178 118 117 138 -13 -19 106 196 66
4610 66 75 108 -73 67 -62 -21 154 -152 -81 -39 11 22 -38 -168 -16 -32 -77 -66 47 -23 -12 52 -227 196 70
4635 70 -19 -159 -27 89 72 105 19 -29 29 142 159 177 15 44 71 52 70 -66 -71 -16 96 -121 -108 -49 123 -108
4661 -108 97 -61 -50 -81 -114 -213 -20 -170 70 -50 -206 34 73 53 28 71 -23 -46 48 19 -2 119 41 25 -46
4686 -46 -33 -105 20 107 33 -64 28 -31 34 -64 6 -75 -56 13 -43 20 -78 7 -38 37 14 132 41 41 -76 -83 -7 -230 -60
4715 -60 -45 25 71 -81 -10 -47 -34 -44 -159 246 58 33 -32 21 -127 94 33 -23 -205 -169 -120 43 -2 -77 -26 -112
4741 -112 57 -103 158 -93 70 125 86 -35 181 49 -18 162 -68 -52 -20 -184 -72 -39 -72 -72 -44 -115 -217 -78
4765 -78 -104 -18 52 -172 -136 -22 56 -20 -129 54 -197 51 -4 -8 -62 58 20 -69 95 -16 -70 45 -36 101 65
4790 65 -26 -90 -81 -3 57 128 56 -48 -67 0 39 54 156 60 60 63 82 -136 -25 -35 34 -41 -37 17 -77 43 147 -42 -218
4819 -218 78 -27 -50 38 69 33 31 -137 34 -112 -49 72 3 -1 36 119 -99 64 -6 -32 -244 -142 178 92 65
4844 65 -21 143 34 194 25 -41 183 24 -59 -176 99 48 48 -7 27 29 -44 80 128 -38 79 -25 79 65 71
4869 71 5 -60 -29 -75 -52 -61 -36 -90 -126 -23 -72 55 -34 79 208 -88 -22 19 100 -101 1 -130 3 4 -25 -218
4895 -218 101 35 -90 -49 -144 -34 -140 -157 -192 146 -13 -16 10 35 -219 12 201 142 148 -106 -106 28 -178 -64 84
4920 84 62 34 -7 -39 -185 -146 -69 -86 75 -151 -83 -32 28 -76 144 128 -22 49 34 45 123 -28 70 7 -2 40 21
4947 21 -81 59 -124 61 -44 -24 -85 -7 8 -166 -133 -94 32 -50 -144 -36 196 49 138 194 135 249 19 -101
4971 -101 -149 60 -35 -88 -117 -143 -30 -330 -36 192 54 -148 -9 112 130 70 20 136 -48 36 140 48 42 -51
4995 -51 190 -133 -96 -119 -35 -38 30 9 -110 -73 -23 -58 -25 137 -25 31 133 -23 33 23 -240 162 53 -41 -123 -39
5021 -39 -21 -157 85 -46 -151 -146 109 -33 45 -276 63 63 223 124 38 83 47 171 68 -86 -9 -123 222 50
5045 50 -6 48 -102 -20 -61 -143 -41 -21 -58 -21 64 46 139 -75 25 145 253 -11 72 98 -41 105 46 -135 51
5070 51 -33 -65 -79 -135 -203 0 108 -284 116 -184 -109 28 -42 55 12 9 140 -34 44 -4 103 15 -107 -21 139
5095 139 22 -7 -203 -46 -12 -118 -16 -19 80 106 48 55 72 217 26 59 80 102 114 40 90 -105 69 -7 -160 -3
5121 -3 -187 -193 -23 -71 -13 57 -125 -94 -16 37 -27 58 49 -155 306 13 44 198 -65 87 -50 -74 83 -91 -53 -51
5147 -51 10 -74 -35 -69 26 21 255 6 -24 104 151 162 79 164 27 -202 -121 -85 127 -225 79 141 -49 -83 150 6
5173 6 -52 39 -178 -42 216 176 -155 84 81 148 145 -89 -26 24 -103 -168 -133 -271 -150 -115 69 -86 -128 -20 -185
5198 -185 95 211 24 -46 -147 22 153 -7 32 123 69 -18 -88 -65 1 -25 -65 -55 -261 -165 -269 -117 -120 124 84
5223 84 128 89 86 253 17 126 -35 -59 -2 -168 -174 -170 26 -178 11 -121 26 9 -143 35 -4 174 66 -37
5247 -37 87 18 188 62 -53 31 14 70 128 52 -13 -141 71 -156 -42 26 -32 -169 -17 -201 22 64 -96 -39
5271 -39 152 222 124 280 106 191 196 75 81 71 -75 -25 -11 -132 -276 -12 48 -266 -177 11 -108 -25 111 -52 90
5296 90 -20 -67 186 75 184 249 -3 289 3 -24 -26 230 154 -198 -87 -230 -54 -141 -147 -33 -50 -69 76 -16
5320 -16 -110 22 289 131 -11 235 25 89 121 -155 -150 -98 -80 -9 -36 51 -54 -187 -79 -34 5 80 -42 97 68
5345 68 53 -73 -30 21 -89 -152 4 20 -113 -184 -212 -20 112 -20 101 -38 71 124 38 142 165 7 6 11 -119
5370 -119 -182 80 -6 -120 -124 -85 -188 27 68 1 124 62 82 -59 -125 39 -73 89 172 -32 -58 -43 18 -96 91
5395 91 -122 106 27 222 -34 -83 57 92 132 -84 -190 21 35 45 43 -7 -90 -35 158 -100 -37 34 -40 -46 -86 69
5421 69 -82 -14 -164 12 108 -204 -52 87 -24 92 3 11 53 -35 4 98 47 81 75 116 129 -2 73 96 -4 132
5447 132 -90 -164 -25 -288 -130 -150 -54 -189 -169 -66 67 -36 218 0 -49 128 28 269 298 253 82 76 169
5470 169 -93 148 -169 -128 -58 -237 -189 -245 -201 -106 46 -17 -56 38 -118 42 59 94 163 -92 -11 152 69 -43 1
5495 1 -38 10 5 8 -24 -1 -8 -88 60 11 -70 114 -125 -150 -21 -55 -15 74 26 23 -4 -65 -28 -124 -2 -15 -20 -36 -27 117 -83
5526 -83 -25 -18 -77 24 -40 81 -65 90 -44 44 -168 -59 -41 -31 96 -183 -121 -313 -27 39 -103 -120 -106 37
5550 37 -48 -52 30 -140 -113 -148 -101 13 137 -6 18 -119 166 22 -10 9 -188 142 118 12 51 -25 -36 33 -21 273
5576 273 -9 -20 -89 60 84 10 31 13 8 118 -13 2 37 60 -2 41 -106 154 -162 -133 -89 -186 -127 83 -154 -227
5602 -227 36 23 -278 -70 193 169 148 96 125 170 87 98 -1 -58 -86 -294 -155 50 -62 -97 -175 -163 -148 -279 -180
5627 -180 -20 26 36 209 47 199 264 266 271 30 98 63 43 36 -13 -107 -225 -206 -234 -286 -217 -152 -149 -61 -64 -10 104 183 64
5656 64 123 38 249 148 288 226 123 128 87 137 -45 -2 -11 -12 -138 20 -156 -107 -181 -309 -195 85 -151 73 -69
5681 -69 -5 -25 -154 182 141 120 49 42 47 39 -45 -35 -23 -36 -36 -39 -25 -159 -16 -91 -140 15 -63 -37 -62 -25 90 82 20 41
5711 41 -23 81 41 71 131 120 163 -41 113 -172 8 -194 -127 -71 -229 -97 84 -6 -59 -47 -46 82 28 57 -71
5736 -71 10 152 157 249 35 -61 94 -12 2 -198 -54 -114 -18 -112 3 -58 -147 -60 -142 43 -71 15 -78 147 -11
5761 -11 -154 -49 -78 -8 54 196 272 144 105 43 -27 98 101 -85 -79 66 -44 21 123 -165 34 -178 -62 -148 -56
5786 -56 -39 -76 -47 -99 46 -60 58 229 63 123 110 89 278 119 109 66 102 200 54 -86 -100 -175 -171 -176 -102 -79 -78
5813 -78 -171 45 -27 -15 307 88 226 173 248 82 166 47 103 85 56 77 -97 -247 -76 -266 -112 -120 -225 -62
5837 -62 -93 -31 -116 -107 58 99 188 89 109 165 97 60 97 146 112 58 -90 -93 19 -80 -103 -72 -83 -181 -8 -146 -46 -86
5865 -86 -28 138 72 -31 57 125 -33 162 173 81 64 -3 93 -144 -81 -247 -19 -167 -126 -94 -205 -201 21 -40 27 -26
5891 -26 -97 28 33 155 23 249 131 -49 89 254 -67 238 52 51 26 -156 123 2 0 -35 -21 -226 -107 -145
5915 -145 14 186 36 40 -24 116 56 19 208 108 68 -22 37 107 -178 -198 -132 -133 -157 -5 -110 -80 28 26 25 84 299
5942 299 266 251 153 -53 145 170 57 -209 -48 60 -154 74 63 -44 150 21 72 -79 62 69 123 89 16 17
5966 17 128 114 194 143 101 -96 131 9 -22 -94 -47 8 -219 91 8 124 -4 -96 -12 91 -62 -180 57 -82
5990 -82 -54 -48 -1 55 -197 -20 -69 -21 -130 -137 -49 -195 -32 -63 -5 -188 -67 80 -22 -198 56 178 17 -64 12
6015 12 7 -144 -60 68 71 93 76 122 164 122 -50 54 -55 -24 2 -43 -68 -62 -83 -1 90 -93 37 -67 27 46 209
6042 209 84 -47 -59 38 -105 -33 191 -17 -82 93 -4 -132 -41 -123 -124 -35 -238 76 55 5 214 -23 -184 203
6066 203 -59 190 88 133 11 -59 -16 -16 -78 -103 -145 -112 -33 -20 22 -53 -103 104 -27 -1 -82 96 -78 -4 -56 -44
6092 -44 106 -15 33 50 -94 9 142 17 -122 -31 102 -57 73 92 -56 179 65 49 120 -62 93 37 16
6115 16 -36 37 -7 212 -3 -211 57 72 -49 36 169 42 173 137 -155 195 -104 -118 199 -80 46 83 -25
6138 -25 -198 -135 -95 -143 -45 -190 -185 -128 -141 -11 13 -31 -13 101 5 215 100 196 93 7 178 125 112 -46 113 22
6164 22 -56 -70 -160 35 198 -162 -37 -89 -37 39 -120 229 165 -120 320 50 248 169 169 75 183 225 329 28
6188 28 -204 15 -107 -87 -83 -303 -260 -5 -63 -63 -150 -182 -26 -205 21 -86 209 3 159 129 168 168 43 118 195
6213 195 153 -8 -47 -90 10 -150 -159 -38 -161 -223 -261 -7 -2 -75 -83 85 -39 96 82 148 23 -147 129 -40 47
6238 47 142 12 85 -113 -39 -53 -102 -97 -268 -175 -81 -268 -50 -209 -140 -128 162 257 144 262 73 202 -99 341
6262 341 135 52 -121 -145 53 -114 -98 -89 -68 -112 -105 67 -44 15 88 123 -80 10 -32 54 -92 39 -4 84 100 31
6288 31 65 -117 2 -117 -169 -52 -147 -69 -72 1 -117 -152 -213 -49 -26 -26 12 -37 -39 108 112 58 -1 77 16 3 66 88 158
6317 158 201 70 125 -34 -1 -15 -80 44 -81 66 -153 -142 -88 -115 11 74 -117 -46 -70 143 95 -19 108 -161
6341 -161 -5 272 -78 47 28 54 -99 -105 -85 -14 42 -112 -106 0 -206 -137 9 -4 34 -109 -48 -44 101 -5 24
6366 24 52 -67 83 78 -37 98 176 108 104 137 -72 -166 56 -41 -148 85 -183 80 109 -87 -96 -187 -148 -49 92 -174
6392 -174 20 -45 195 -7 203 -105 76 128 -74 112 67 -70 -312 91 28 114 -45 -56 -101 -26 27 -65 169
6415 169 76 77 40 176 -3 240 -85 103 18 62 -26 190 46 -152 -46 0 -249 7 -182 -55 -43 -211 61
6438 61 -9 220 16 125 132 38 82 30 181 -66 -27 -88 -139 -31 -110 3 3 107 -149 -91 -32 -54 -92 44 -109 21
6464 21 37 14 88 -85 105 -14 44 -88 128 5 33 157 45 -56 69 282 48 9 -61 -74 -98 63 -115
6487 -115 242 -17 179 29 -9 40 -40 -84 -72 170 -9 42 -166 -76 -120 6 -48 -32 -59 39 69 50 -31 -28 -43 29
6513 29 28 160 118 -34 68 173 67 29 144 36 -111 48 -11 -87 54 28 -47 -38 106 -93 -213 -63 169 -132
6537 -132 97 -24 -81 88 100 4 26 170 50 9 -227 -116 95 4 -146 -164 -148 -70 -69 -164 -167 -299 35 104 -5
6562 -5 -28 135 138 135 47 117 258 -97 -34 -132 -223 125 -110 -1 68 -30 -137 -284 22 0 34 -51 67 117 -118 206
6588 206 -16 53 11 33 -65 17 49 63 -79 -126 -106 55 46 22 -273 -26 14 -109 -46 22 -64 -40 -135 89 -78 120
6614 120 195 -17 86 -101 56 -36 110 5 27 11 -137 -50 -54 -221 66 -98 144 -126 102 -52 -31 -2 -16
6637 -16 -145 40 5 85 202 -62 -32 74 105 -32 -164 -193 4 -122 220 76 69 -83 -276 20 -188 -53 -186
6660 -186 -2 50 -33 5 81 85 24 88 101 -27 55 133 -60 -132 100 135 13 -93 -89 -50 -104 -78 66 -9 108 -36
6686 -36 -10 6 -77 -203 -20 77 -6 -39 -131 115 121 137 -21 90 22 36 247 -5 -187 6 42 -61 -106 -60 74
6711 74 14 -116 32 8 -55 -232 -23 -51 22 87 -100 -106 53 -47 62 -4 -87 4 -82 -31 87 113 30 2 -52 -67
6737 -67 -74 67 53 -39 22 -261 66 69 46 -184 -52 -99 51 -132 248 -119 -3 120 -79 67 -58 35 122 -56
6761 -56 -179 -47 -85 -172 -113 -19 214 78 -118 -56 182 22 24 46 -56 104 84 138 86 -123 113 64 99 109 -74
6786 -74 285 -53 -115 -63 -131 -71 17 -89 -192 177 -225 79 33 22 -184 141 -221 149 -23 -133 -22 -67 101
6809 101 -42 12 -71 112 -2 -36 -142 66 -17 65 -177 139 83 -64 200 94 122 82 154 -20 5 -52 157 362
6833 362 -75 -32 31 44 118 -21 25 86 121 -167 -64 23 -18 -164 65 78 -171 -110 48 194 27 24 131 -6
6857 -6 76 162 35 61 -31 22 -11 -100 -66 -3 119 47 -76 -68 174 -17 50 29 -85 17 -22 157 -40 47 160 -24
6883 -24 -130 99 111 -44 -15 47 41 -67 -46 119 23 -126 -155 24 -116 -43 -33 -31 -82 -101 81 -284 -50 -93 16
6908 16 -100 33 33 32 63 -82 17 -57 25 74 -21 -62 10 -58 130 71 120 25 217 17 105 -55 30 -107 -99 74 -128
6935 -128 -44 -130 349 76 -86 -40 -84 -143 -38 25 -80 51 33 33 -82 12 160 -49 12 133 16 10 34 19 -36
6960 -36 -29 -119 -83 -201 -86 80 -28 -8 -22 7 80 158 106 -65 17 89 22 -116 26 10 170 -23 150 -127 0
6985 0 93 25 2 -204 -33 -27 3 23 45 0 13 34 12 -3 -21 115 -91 114 4 -22 -10 -38 -99 -44 -18 45 -42 73
7013 73 39 26 -77 -55 -48 87 147 -29 71 65 -25 204 100 79 266 97 38 -105 50 -48 231 -32 19 -119 -2
7038 -2 37 12 38 -151 -95 -111 -12 100 -46 -47 -129 -70 -109 -25 -38 -159 18 -134 -56 15 40 40 88 -201 -166 -95 94 32
7066 32 134 -63 -96 -131 32 101 -146 68 31 156 -55 52 215 103 -22 -86 -47 -22 6 -6 95 -90 222
7089 222 -154 43 30 20 -74 -68 66 117 -39 -68 -37 -135 -65 -83 8 11 -57 -82 -6 -108 -147 -81 -152 -115 -31 -123 -1 -77
7117 -77 52 -2 -63 -51 -85 -44 -21 -35 118 -137 49 -255 -27 -134 45 32 41 49 17 148 40 146 154 183 65 129
7143 129 107 169 96 124 -28 7 60 27 -55 -109 -1 -17 7 26 71 69 39 -139 43 -20 -25 -26 -54 143 -147 -101 -93 -67 -16
7172 -16 52 -141 92 -70 -127 77 30 -162 136 91 -21 65 172 3 -48 83 86 -65 124 -58 -98 127 56 -11
7196 -11 -67 43 -63 -83 43 -77 16 85 -87 -52 -13 -145 -23 -175 -14 -130 -164 74 -97 38 99 -110 -71
7219 -71 41 -18 -46 82 11 -6 142 -53 77 28 -105 62 116 -173 8 -70 -23 94 99 -30 -40 -162 82 120
7243 120 -99 -20 29 -10 -41 32 48 -140 -138 10 -172 -11 -79 76 -124 -66 11 -187 2 99 5 112 -118 30
7267 30 -71 -54 -95 -20 -151 -71 -105 10 -44 90 166 72 -34 165 130 39 -6 72 -144 -86 77 -121 21 -60 -17
7292 -17 -6 40 -56 50 90 56 104 -144 -89 -102 -55 -166 -6 185 46 81 12 47 -52 -44 -47 -82 22 -11 -41 -125 -124 40
7320 40 -140 -89 -159 -70 23 98 29 90 112 -112 -166 96 -91 -27 2 79 100 33 111 264 57 -175 28 -62 -146 -71
7346 -71 -8 -129 -199 -119 9 -78 -113 -76 212 -3 10 -32 128 83 -89 52 -20 -67 -5 19 -56 -120 -91 -87 6 -149 1
7373 1 19 -37 -20 46 39 114 200 -64 -62 -28 181 -61 -91 22 -94 157 39 43 21 -216 18 45 -77 -121 85 60 -16
7400 -16 58 71 -47 91 -54 14 125 26 89 -196 -161 -21 -86 -85 -16 27 30 69 32 76 -62 6 65 -15 -76 41 -71
7427 -71 4 -26 85 -9 -82 -5 17 82 56 -7 65 -21 -137 204 59 118 -36 246 32 47 0 -30 -35 127 9 -4
7453 -4 34 56 -63 -52 -65 34 -4 15 -37 20 -31 182 -144 -25 0 -4 -13 92 -75 88 140 -192 51 59 132 -14 -25
7480 -25 205 23 -162 -114 25 106 -92 28 76 -173 125 -118 -21 78 -76 117 44 -51 58 -82 19 144 -21
7503 -21 98 -38 -7 -170 45 83 -126 -41 -69 -104 -17 -113 -128 -56 -111 66 161 52 169 32 -270 21 111 -122
7527 -122 90 -60 42 -149 124 57 -213 182 33 -111 17 145 -86 74 -136 -67 160 91 -7 185 24
7548 24 45 -85 42 0 -48 28 -220 -27 -104 -108 -108 80 -15 0 -97 1 174 2 -100 -150 -89 15 58 25 60 -143
7574 -143 155 -27 49 -3 -2 -84 98 81 -130 164 44 -119 14 -145 -191 40 -18 65 -45 156 -61 -34 85
7597 85 221 126 48 -203 111 -61 -89 156 -37 43 -4 27 -147 -14 -2 137 -62 -80 48 -22 105 -68 -61 -81
7621 -81 -15 -216 -172 -40 -77 0 -80 105 -5 87 -119 -98 20 -108 -62 -4 18 25 53 145 -12 101 41 127 -54 -8
7647 -8 -51 -216 -29 -105 -117 -92 12 36 -70 -75 176 -11 6 -260 22 50 -47 16 -11 0 87 -35 -122 -3 47 27
7673 27 -71 20 15 -63 -30 -153 -121 -33 -51 -68 -178 22 157 -55 130 142 -26 174 39 145 41 58 -15 21 92
7698 92 28 92 -245 23 28 -45 -143 22 -22 -209 -46 -159 137 60 93 -136 -32 22 64 119 35 -97 3 53 131
7723 131 -7 -156 -156 -65 -40 -46 -17 -120 -150 50 -145 -39 -76 -80 73 73 70 170 -35 76 26 -88 -25 -75 -64 -101 -94
7750 -94 -228 -52 -75 -46 13 -71 -91 -54 -58 -39 55 234 -71 -37 41 -54 33 124 -40 -75 90 41 -35 -107 87 62 100
7777 100 -41 -86 51 -111 -55 -137 63 27 -86 -71 -110 79 14 -62 -21 5 -22 225 5 33 22 9 35 65 -72
7802 -72 22 17 -103 -83 -132 -26 117 -17 41 2 -97 81 106 52 56 4 -17 68 -16 -2 116 63 -213 56 -33 23 -58
7829 -58 154 -104 4 -17 -51 -26 37 7 -3 4 110 81 68 -166 -55 60 -86 13 96 22 -123 17 128 229 20
7854 20 42 -71 19 132 71 41 37 14 5 -50 14 -9 -119 -35 -39 -126 -158 -101 -219 -112 -24 16 22 31 121 -123 37 -61 63
7883 63 99 70 129 -93 -52 -43 -15 33 -55 -64 81 112 -16 40 -123 47 -196 67 101 36 -40 -58 21 -10 164 -55 171
7910 171 131 -225 -11 -106 8 81 -46 35 -84 -83 -212 -105 -24 -82 -2 -91 126 -40 39 20 -48 -115 154 106 205
7935 205 -91 13 199 -68 -101 104 173 64 -88 169 57 -33 69 27 40 -7 -17 36 51 -3 -92 73 8 58
7959 58 -1 44 -12 -12 15 53 -7 -40 128 38 -12 -86 79 -76 4 40 157 -108 -4 -165 -106 16 72 58 22 -44 6
7986 6 -62 -5 -42 102 40 219 21 227 236 43 -80 214 -4 -86 93 -241 166 -47 -155 -39 -63 15 68 -64
8010 -64 -56 -1 -106 -83 -93 1 126 148 31 94 69 69 111 83 -38 33 31 -169 -110 -70 -11 67 -98 15 -59 -12 -229 -98
8038 -98 -76 -103 29 -35 130 87 -69 -40 119 61 -20 -117 -25 -180 -121 -70 -80 -69 -51 39 -216 -83 31 -115 -12
8063 -12 -18 -40 43 -66 -95 1 -196 17 133 28 -13 -98 -65 30 -91 -142 17 -48 131 104 -103 -149 -142 120 -188 -119
8089 -119 -58 78 45 68 191 143 33 78 61 -27 79 -45 78 159 144 106 68 -36 10 -62 146 2 -83 48 -87
8114 -87 -92 -22 -16 -8 139 127 43 105 8 53 -31 -58 63 125 2 -97 24 -52 -95 -67 -89 -29 -206 46 94 -52 -69 -83
8142 -83 64 -9 -13 -30 -17 101 156 -76 -97 4 109 114 32 115 -11 -177 -31 26 -120 26 29 -2 -138 67 -55
8167 -55 -113 -191 -147 -92 174 -26 47 -70 141 43 27 101 94 77 54 -62 -5 80 -83 -72 -18 129 -85 46
8191D6
##END NTUPLES=NMR FID
##END=
