##TITLE=1H ikalashn
AM_NV triethyl(nlock)
13.12.2024
##JCAMPDX= 6.0         $$ Bruker NMR JCAMP-DX V2.0
##DATA TYPE= NMR FID
##DATA CLASS= NTUPLES
##ORIGIN= UXNMR, Bruker Analytische Messtechnik GmbH
##OWNER= root
$$ TOPSPIN		Version 1.3
$$ 2024-12-13 13:50:41.359 +0400  Irina@DPX200
$$ Compression mode = diff/dup
##.OBSERVE FREQUENCY= 200.131300845
##.OBSERVE NUCLEUS= ^1H
##.DELAY= (6, 6)
##.ACQUISITION MODE= SIMULTANEOUS
##.ACQUISITION SCHEME= undefined
##.AVERAGES= 8
##.DIGITISER RES= 18
##SPECTROMETER/DATA SYSTEM= spect
##.PULSE SEQUENCE= zg
##.SOLVENT NAME= CDCl3
##.SHIFT REFERENCE= INTERNAL, CDCl3, 1, 17.49637
##AUDIT TRAIL= $$ (NUMBER, WHEN, WHO, WHERE, WHAT)
$$ ##TITLE= Audit trail, TOPSPIN		Version 1.3
$$ ##JCAMPDX= 5.01
$$ ##ORIGIN= Bruker BioSpin GmbH
$$ ##OWNER= Irina
$$ $$ F:/spectra/data/iren/nmr/1H/4/audita.txt
$$ ##AUDIT TRAIL=  $$ (NUMBER, WHEN, WHO, WHERE, VERSION, WHAT)
(   1,<2024-12-13 13:50:12.296 +0400>,<Irina>,<DPX200>,<TOPSPIN 1.3>,
      <created by zg
	started at 2024-12-13 13:49:34.796 +0400,
	POWCHK disabled, PULCHK disabled
       configuration hash MD5:
       BE 6D 3F 07 2A EA 11 49 91 17 2B D3 AF B3 58 0D
       data hash MD5: 16K
       D2 C0 2A 95 B5 2B C0 0A D3 5E 17 B6 9E 56 67 B0>)
$$ ##END=
$$ 
$$ $$ hash MD5
$$ $$ 73 43 4B D4 F6 CB 91 FE 8B 6E E8 8A 14 7D 61 16
##$RELAX= 
##$RELAX= 
##$RELAX= 
##$RELAX= 
##$RELAX= 
##$RELAX= 
##$RELAX= 
##$RELAX= 
##$RELAX= 
$$ Bruker specific parameters
$$ --------------------------
##$DU= <F:/spectra>
##$EXPNO= 4
##$NAME= <1H>
##$PROCNO= 1
##$TYPE= <nmr>
##$USER= <iren>
##$AMP= (0..31)
100 100 100 100 100 100 100 100 100 100 100 100 100 100 100 100 100 100 
100 100 100 100 100 100 100 100 100 100 100 100 100 100 
##$ANAVPT= -1
##$AQSEQ= 0
##$AQ_mod= 1
##$AUNM= <au_zg>
##$AUTOPOS= <>
##$BF1= 200.13
##$BF2= 200.13
##$BF3= 200.13
##$BF4= 200.13
##$BF5= 200.13
##$BF6= 200.13
##$BF7= 200.13
##$BF8= 200.13
##$BYTORDA= 1
##$CFDGTYP= 0
##$CFRGTYP= 5
##$CHEMSTR= <none>
##$CNST= (0..63)
1 1 145 1 1 1 1 1 1 1 1 1 1 1 1 1 1 1 1 1 1 1 1 1 1 1 1 1 1 1 1 1 1 1 
1 1 1 1 1 1 1 1 1 1 1 1 1 1 1 1 1 1 1 1 1 1 1 1 1 1 1 1 1 1 
##$CPDPRG= <>
##$CPDPRG1= <>
##$CPDPRG2= <>
##$CPDPRG3= <>
##$CPDPRG4= <mlev>
##$CPDPRG5= <mlev>
##$CPDPRG6= <mlev>
##$CPDPRG7= <mlev>
##$CPDPRG8= <mlev>
##$CPDPRGB= <>
##$CPDPRGT= <>
##$D= (0..63)
0 2 0 0 0 0 0 0 0 0.06 0 0.03 0 0 0 0 0.0002 0 0 0 0 0 0 0 0 0 0 0 0 0 
0 0 0 0 0 0 0 0 0 0 0 0 0 0 0 0 0 0 0 0 0 0 0 0 0 0 0 0 0 0 0 0 0 0 
##$DATE= 1734083408
##$DBL= (0..7)
120 120 120 120 120 120 120 120 
##$DBP= (0..7)
150 150 150 150 150 150 150 150 
##$DBP07= 0
##$DBPNAM0= <>
##$DBPNAM1= <>
##$DBPNAM2= <>
##$DBPNAM3= <>
##$DBPNAM4= <>
##$DBPNAM5= <>
##$DBPNAM6= <>
##$DBPNAM7= <>
##$DBPOAL= (0..7)
0.5 0.5 0.5 0.5 0.5 0.5 0.5 0.5 
##$DBPOFFS= (0..7)
0 0 0 0 0 0 0 0 
##$DE= 6
##$DECBNUC= <off>
##$DECIM= 32
##$DECNUC= <off>
##$DECSTAT= 4
##$DIGMOD= 1
##$DIGTYP= 9
##$DL= (0..7)
0 120 120 120 120 120 120 120 
##$DP= (0..7)
150 150 150 150 150 150 150 150 
##$DP07= 0
$$ [...]
##$SW= 21.9926040160658
##$SWIBOX= (0..15)
0 0 2 0 0 0 0 0 0 0 0 0 0 0 0 0 
##$SW_h= 4401.40845070422
##$TD= 16384
##$TD0= 1
##$TE= 300
##$TE2= 300
##$TE3= 300
##$TEG= 300
##$TL= (0..7)
0 120 120 120 120 120 120 120 
##$TP= (0..7)
150 150 150 150 150 150 150 150 
##$TP07= 0
##$TPNAME0= <>
##$TPNAME1= <>
##$TPNAME2= <>
##$TPNAME3= <>
##$TPNAME4= <>
##$TPNAME5= <>
##$TPNAME6= <>
##$TPNAME7= <>
##$TPOAL= (0..7)
0.5 0.5 0.5 0.5 0.5 0.5 0.5 0.5 
##$TPOFFS= (0..7)
0 0 0 0 0 0 0 0 
##$TUNHIN= 0
##$TUNHOUT= 0
##$TUNXOUT= 0
##$USERA1= <user>
##$USERA2= <user>
##$USERA3= <user>
##$USERA4= <user>
##$USERA5= <user>
##$V9= 5
##$VALIST= <valist>
##$VCLIST= <CCCCCCCCCCCCCCC>
##$VD= 0
##$VDLIST= <DDDDDDDDDDDDDDD>
##$VPLIST= <PPPPPPPPPPPPPPP>
##$VTLIST= <TTTTTTTTTTTTTTT>
##$WBST= 1024
##$WBSW= 25
##$XGAIN= (0..3)
0 0 0 0 
##$XL= 0
##$YL= 0
##$YMAX_a= 583201
##$YMIN_a= -625087
##$ZGOPTNS= <>
##$ZL1= 120
##$ZL2= 120
##$ZL3= 120
##$ZL4= 120
##$ABSF1= 10
##$ABSF2= 0
##$ABSG= 5
##$ABSL= 3
##$ALPHA= 0
##$AQORDER= 0
##$ASSFAC= 0
##$ASSFACI= 0
##$ASSFACX= 0
##$ASSWID= 0
##$AUNMP= <proc_1d>
##$AXLEFT= 0
##$AXRIGHT= 0
##$AXTYPE= 0
##$AXUNIT= <>
##$AZFE= 0.1
##$AZFW= 0.1
##$BCFW= 1
##$BC_mod= 2
##$BYTORDP= 1
##$COROFFS= 0
##$CY= 7568.61572265625
##$DATMOD= 1
##$DC= 2
##$DFILT= <>
##$DTYPP= 0
##$F1P= 17.9538593292236
##$F2P= -4.03888763876832
##$FCOR= 0.5
##$FTSIZE= 32768
##$FT_mod= 4
##$GAMMA= 1
##$GB= 1
##$INTBC= 1
##$INTSCL= 1
##$ISEN= 128
##$LB= -0.5
##$LEV0= 0
##$LPBIN= 0
##$MAXI= 945.577
##$MC2= 0
##$MEAN= 0
##$ME_mod= 0
##$MI= -402.1523
##$NCOEF= 0
##$NC_proc= 0
##$NLEV= 6
##$NOISF1= 8.587773
##$NOISF2= 6.764455
##$NSP= 1
##$NTH_PI= 0
##$NZP= 0
##$OFFSET= 17.49637
##$PC= 1
##$PHC0= 62.46885
##$PHC1= -14.71319
##$PH_mod= 0
##$PKNL= yes
##$PPARMOD= 0
##$PPDIAG= 0
##$PPIPTYP= 0
##$PPMPNUM= 100
##$PPRESOL= 1
##$PSCAL= 0
##$PSIGN= 0
##$REVERSE= no
##$SF= 200.13
##$SI= 32768
##$SIGF1= 18.5376
##$SIGF2= -6.396296
##$SINO= 400
##$SIOLD= 32768
##$SREGLST= <1H.CDCl3>
##$SSB= 3
##$STSI= 0
##$STSR= 0
##$SW_p= 4401.40845070422
##$SYMM= 0
##$S_DEV= 0
##$TDeff= 0
##$TDoff= 0
##$TI= <>
##$TILT= no
##$TM1= 0
##$TM2= 0
##$TOPLEV= 0
##$USERP1= <user>
##$USERP2= <user>
##$USERP3= <user>
##$USERP4= <user>
##$USERP5= <user>
##$WDW= 1
##$XDIM= 8192
##$YMAX_p= 0
##$YMIN_p= 0
$$ End of Bruker specific parameters
$$ ---------------------------------
##NTUPLES= NMR FID
##VAR_NAME=  TIME,          FID/REAL,        FID/IMAG
##SYMBOL=    X,             R,               I
##VAR_TYPE=  INDEPENDENT,   DEPENDENT,       DEPENDENT
##VAR_FORM=  AFFN,          ASDF,            ASDF
##VAR_DIM=   8192,          8192,            8192
##UNITS=     SECONDS,       ARBITRARY UNITS, ARBITRARY UNITS
##FACTOR=    0.0002272,     1,               1
##FIRST=     0,             0,               0
##LAST=      1.8609952,     7,               3
##MIN=       0,             -625087,         -625087
##MAX=       1.8609952,     583201,          583201
$$ Real data points
##PAGE= N=1
##DATA TABLE= (X++(R..R)), XYDATA
$$ [...]
2165A62O2n42L43J41l10J73n6l9K71l79k1N87n13k29P65m13l86O89k60l01N16
$$ 162 224 -318 25 166 -144 29 -27 -66 205 -174 -195 392 -121 -350 415 2 -384 305 45 -256 260
2186B60l53p9N40n99pP73p57j62R56o87l28R47n49l08P78n54j74P94p20j10R49
$$ 260 -93 -172 368 -231 -238 535 -222 -384 572 -115 -443 504 -45 -353 425 -129 -303 491 -229 -339 610
2207F10q33k48J085p44l74J061o24l92R54o09k79R25o95k71J019p53l29J117p22
$$ 610 -223 -471 614 -130 -504 557 -67 -459 495 -114 -393 532 -163 -434 585 -168 -497 620 -102
2226a02m29J107o13m78J038n47m55R86n41m37R85n51m34R83n30m88J011m72n26
$$ -102 -531 576 -37 -515 523 -24 -479 507 -34 -471 514 -37 -471 512 -18 -506 505 33 -493
2245d93R44l95n32Q86l42n08Q27l47m81Q19l37n00Q29k92n54P76j47n86O61q8
$$ -493 451 56 -476 410 68 -440 387 40 -441 378 41 -459 370 78 -476 300 153 -433 228 140
2265A40m95N36r0m10N35j30m20N49j01m78N09N3m90L34J37l75K32O9k54K22M4
$$ 140 -355 181 91 -319 216 86 -334 215 114 -364 145 198 -292 42 179 -196 36 105 -149 73 117
2286A17l13K50J46l90J12L18k99j38L42n5k50J89M2j35J31r7r9L37j93l54N42
$$ 117 -196 54 200 -190 -78 240 -59 -197 145 90 -160 29 71 -64 67 -30 -129 208 15 -339 203
2307B03K9o55M52L31o64K06L53m48K26J16n12N55J16r34P21N36j255M15R15j050
$$ 203 232 -423 29 360 -304 -98 255 -193 33 149 -363 192 308 -626 95 631 -624 -209 706 -344
2327c44L2P75p05J72L91q43O84M63j469P80J108j768K33J532j365k55J247q80
$$ -344 -312 463 -242 -70 321 -522 162 625 -844 -64 1044 -724 -491 1041 -324 -579 668 -212
2345b12K1P19j179O92R21j973O74J785k195j86K260j487p44J662q64k37R86j389
$$ -212 -191 528 -651 41 962 -1011 -337 1448 -747 -933 1327 -160 -904 758 -106 -343 643 -746
2363g46O48J391k459M67K586k570p09K969j531j282K069q35m53J278j662N54J963
$$ -746 -98 1293 -1166 -699 1887 -683 -1392 1577 46 -1236 833 -2 -455 823 -839 -285 1678
2380A678k894R1L416k783j389L621j375j881K362p27o73J525j873M11K553l277
$$ 1678 -1216 -1125 2291 -492 -1881 1740 365 -1516 846 119 -554 971 -902 -491 2062 -1215
2396a215l78M205k823k196M218j043k581K562l96j035J684j874J22L054l360j032
$$ -1215 -1593 2612 -211 -2407 1811 768 -1813 749 353 -682 1002 -872 -750 2304 -1056 -2088
2412b088M874k576l105M597m69l274K574N7j367J786j802k42L535l308j785N438
$$ -2088 2786 210 -2895 1702 1233 -2041 533 590 -777 1009 -793 -1035 2500 -808 -2593 2845
2428B845k101m072M808K75l915K424N62j629J800j668o31L952l117k575N849j510
$$ 2845 744 -3328 1480 1755 -2160 264 826 -803 997 -671 -1302 2650 -467 -3042 2807 1297
2444A297m872M739J021m341K172R42j780J856j592j035M326k825l369O088p85
$$ 1297 -3575 1164 2185 -2156 16 958 -822 1034 -558 -1593 2733 -92 -3461 2627 1842
2459A842n617M527J796m615J778J341j848J778j420j377M507k380m042O037L7
$$ 1842 -3775 752 2548 -2067 -289 1052 -796 982 -438 -1815 2692 312 -3730 2307 2344
2474B344o142M062K614m785J283J835j937J566j052j737M440j744m573N700R45
$$ 2344 -3798 264 2878 -1907 -624 1211 -726 840 -212 -1949 2491 747 -3826 1874 2819
2489B819o466L401L371m740O70K225j873J295p17k005M276j089m998N222J792
$$ 2819 -3647 -246 3125 -1615 -945 1280 -593 702 -15 -2020 2256 1167 -3831 1391 3183
2504C183o585K652L959m505J02K424j747J110m41k274M097m57n293M659K515o473
$$ 3183 -3402 -750 3209 -1296 -1194 1230 -517 593 152 -2122 1975 1518 -3775 884 3399 -3074
2520c074J906M308m134l50K499j608R80k17k478L842J25n392M011L113o206J177
$$ -3074 -1168 3140 -994 -1344 1155 -453 527 310 -2168 1674 1799 -3593 418 3531 -2675 -1498
2536a498M537l714p89K556j420P21N5k504L388O51n241L232L551n733M29M662
$$ -1498 3039 -675 -1464 1092 -328 393 448 -2056 1332 1983 -3258 -26 3525 -2208 -1779 2883
2552B883l207j256K573j170L86L24k404K830J123m955K415L851n131k76M606k595
$$ 2883 -324 -1580 993 -177 209 533 -1871 959 2082 -2873 -458 3393 -1738 -2014 2592 -3
2568cj612K463r13J58M93k291K319J516m606J677M000m476q33M387k045j785K257
$$ -3 -1615 848 -65 93 586 -1705 614 2130 -2476 -799 3201 -1275 -2108 2279 234 -1551 706
2585G06p08K7O46k204J866J769m191J069L956l814j215M054j553j837K020n46
$$ 706 -2 25 671 -1533 333 2102 -2089 -1020 2936 -878 -2093 1961 408 -1429 591 45
2601D5p5P29k023J427J906l689N29L775l157j491L657j092j882J807l47k59P78
$$ 45 -30 699 -1324 103 2009 -1680 -1151 2624 -533 -2024 1633 541 -1341 466 119 -140 638
2618F38j703R62J885l055K1L464k443j688L219o45j883J552j17l99P50j363N34
$$ 638 -1065 -103 1782 -1273 -1252 2212 -231 -1919 1300 655 -1228 324 207 -192 558 -805 -271
2635b71J834k440l69L082j759j780K696k57j761J226M4m43P09j103K45J678j895
$$ -271 1563 -877 -1246 1836 77 -1703 993 736 -1025 201 245 -198 511 -592 -347 1331 -564
2652e64o06K633j225j713K183qj561R88J19m71O53q46K3J472j439o94K150p77
$$ -564 -1170 1463 238 -1475 708 700 -861 127 246 -225 428 -418 -395 1077 -362 -1056 1094 317
2670C17j539J703J60j347P45J83m20N17n84r6J162r81o91J655m35j322J266K81
$$ 317 -1222 481 641 -706 39 222 -198 319 -265 -361 801 -180 -871 784 349 -973 293 574
2688E74j098M91K86m06L34k94j73Q33n74o13J147j59j044Q32L46q34K75K90l12
$$ 574 -524 -33 253 -153 181 -113 -286 547 -27 -640 507 348 -696 136 482 -352 -77 213 -99
2707i9J85j37j58N34l00m76P26J0p46M71L28n50P9K80j61Rk8n3K36j41k46L63
$$ -99 86 -51 -209 325 25 -451 275 285 -461 10 338 -212 -133 147 -14 -5 -33 -86 150 9 -237 126
2729A26M3m00K13K09k80k3J97n3p1J3M5M0q6k3J14j1j14K9J18n5j18J09J00j83
$$ 126 169 -231 -18 191 -89 -112 85 32 -39 -26 19 59 -27 -50 64 53 -61 -32 86 31 -87 22 122 -61
2753f1mJ85j20q4J60m8q3J10o6j4J16j65K2K07k24o2L28k33j38L33j65j63L01
$$ -61 -65 120 0 -84 76 28 -55 55 -11 -25 91 -74 -52 155 -69 -131 197 -36 -174 159 -6 -169 132
2776A32j40j37K91j86j10L41k48j36M26k41k28M58j83k88M41j41k60L76j54k06
$$ 132 -8 -145 146 -40 -150 191 -57 -193 233 -8 -236 222 39 -249 192 51 -209 167 13 -193
2796a93M06k08k30M74k12l21N27j48l79M65p9l58M29r6l22M50j59l17N01j61l85
$$ -193 213 5 -225 249 37 -284 243 95 -284 181 102 -256 173 77 -245 205 46 -271 230 69 -316
2817c16N26r7m25M84n5m14M55n6l80M44q0l83M80o3m36N02m1m70M79J1m70M52
$$ -316 210 113 -312 172 117 -297 158 102 -278 166 86 -297 183 120 -316 186 145 -325 154 165 -305 147
2839A47km36M36lm30M45j4m43M48Mm47M44L0m65M10N4m54L97O1m53L75O9m46L85
$$ 147 145 -291 145 142 -288 157 143 -300 148 152 -295 149 179 -286 124 178 -276 121 182 -271 104 173 -273 112
2863A12O4m62L98N7m56L81P9m55L61R7m27L19Q3m04L22Q6m10L24R0m28L22J23
$$ 112 176 -286 112 169 -287 94 173 -282 79 176 -251 68 151 -253 69 155 -255 69 159 -269 53 176
2885A76m32L01J22l98K58J32l55K61P1l48K83Q3l72K83R8l73K59J13l48K22J11
$$ 176 -256 45 167 -231 27 159 -196 65 136 -212 71 154 -218 65 163 -210 49 162 -186 36 147
2906A47l28K36P1l13K49P9l40K58Q1l21K18J15l21K16O7k94K38M9k93K49M3l02
$$ 147 -181 55 126 -187 62 141 -199 59 140 -181 37 152 -169 47 114 -180 58 107 -186 63 106 -196
2928a96K54N0k91K53K2k84K69K0k85K65J5k67K55Kk44K56l2k28K86m1k69L16k9
$$ -196 58 108 -183 70 92 -192 77 97 -188 77 92 -175 80 82 -162 94 62 -166 120 79 -190 126 97
2951I7k93K84J8k56K50l9k03K88j20k12L60j13l09M03l7l64L50pk84L00r0j97
$$ 97 -196 88 106 -150 100 61 -142 146 26 -186 174 61 -248 155 118 -246 104 97 -187 113 23 -174
2973a74L55j89k45M86j69m07N25l6m55L93M7l49L16p4k22M36k44l25O38j78n70
$$ -174 181 -8 -253 233 64 -343 182 146 -309 84 131 -218 98 24 -198 238 -6 -331 307 129 -441
2994d41O62K0o04M53J01m14L52q7k88N66k75m85Q13j50p54P53J38p59M52J87m79
$$ -441 221 241 -363 90 191 -223 129 42 -246 320 45 -440 373 223 -531 222 360 -399 53 240 -239
3015b39L77r4l51O78l02o23R54q6r78Q26L03r35M46L15n64L96n7m62P87k48q46
$$ -239 138 44 -307 371 69 -554 400 314 -664 162 465 -470 -24 291 -273 123 66 -396 391 143 -703
3036g03J079R0j240Q54N36j102L79M75o34L92ko04R12j47j123J172L44j511P73
$$ -703 376 466 -774 80 616 -486 -107 368 -266 126 124 -480 432 285 -838 334 678 -833 -60
3055f0Q33j238K49O70p20L52J14p58R69L3j385J156O62j745O40J123j325R4Q12
$$ -60 773 -465 -216 454 -266 86 200 -558 411 444 -941 215 877 -868 -228 895 -430 -336 476
3074D76p38L17K13r12R97K34j605J104R54j890M34J398j353q1R60p42K37L24j010
$$ 476 -262 55 268 -644 353 587 -1018 86 1040 -850 -416 982 -371 -452 508 -234 3 327 -683
3093f83R74M64j803R83J269j995J94J681j326l28J118p25J40M63j133Q90P30j955
$$ -683 291 755 -1048 -65 1204 -791 -597 1084 -242 -570 548 -177 -37 426 -707 183 913 -1042
3111a042P71J638k054j19J924j215n84J207o56J7N81j187P72R89k032M76J968
$$ -1042 -271 1367 -687 -806 1118 -97 -681 526 -130 -113 468 -719 53 1042 -990 -514 1454
3128A454j993m78K122j054q49J292n53j19P06j235O08J263k066J86K226j870q12
$$ 1454 -539 -1017 1105 51 -798 494 -59 -178 528 -707 -99 1164 -902 -716 1510 -360 -1172
3145a172K240q65j053J300m49k14P77j210M26J448j997r5K375j683j106K277o57
$$ -1172 1068 203 -850 450 1 -213 564 -646 -220 1228 -769 -864 1511 -172 -1278 999 342
3162C42j222J293l43l42Q75j191K51J598j895l88K480j443j388K246l98j387J253
$$ 342 -880 413 70 -272 603 -588 -337 1261 -634 -1022 1458 15 -1373 873 475 -912 341
3179C41k17m52R24j106NJ770j741p18K564j142j676K189j16j553J190o5n76R66
$$ 341 124 -328 596 -510 -505 1265 -476 -1194 1370 228 -1448 741 625 -928 262 197 -379 587
3197E87r64k47J859j485j047K548q10j883K038J59j642J085P6o78R87q37m52J865
$$ 587 -377 -624 1235 -250 -1297 1251 441 -1442 596 755 -887 198 274 -404 583 -254 -706 1159
3215A159j238j262K432m90k021J856L71j655R66J88p48R60o83o15J811r48j440
$$ 1159 -79 -1341 1091 601 -1420 436 807 -848 118 306 -442 518 -165 -780 1031 83 -1357
3232a357K260k02k060J648N57j628Q11L23q15R18n05p60J712o43j579K022J21
$$ -1357 903 701 -1359 289 846 -782 29 352 -463 455 -50 -810 902 259 -1320 702 823
3249H23k076J375P79j585O27M66q45Q14k77r15J560l13j677J737M36k038J087
$$ 823 -1253 122 901 -684 -57 409 -436 378 101 -814 746 433 -1244 493 929 -1109 -22
3266b2R32j502M55N75q52O86o1r96J345l1j659J410O56j878P68J034j358K75O66
$$ -22 910 -592 -137 438 -414 272 211 -785 560 529 -1130 280 936 -942 -174 860 -498 -223 443
3285D43q34N54J15j009J107K04j576J108Q01j703N23J065j200J51O90p77M12K62
$$ 443 -391 163 278 -731 376 580 -996 112 913 -790 -267 798 -402 -251 439 -338 74 336
3303C36r53Q43L90j419P84Q78j465K85J053j005j6P04o75K50L73q78N89N32j247
$$ 336 -617 226 616 -803 -19 859 -606 -321 732 -273 -289 415 -260 -10 363 -515 74 606 -641
3322f41M88R17j197L4J028q03j52O95n66Q9M58p33L25O09j025K24R03r46j24R52
$$ -641 -153 764 -433 -399 629 -174 -326 369 -197 -108 350 -383 -58 551 -474 -250 653 -293 -417 535
3342E35o31k44O78m45o0M95n96J22O30p79OQ33o84k35Q05m43k97O00l32j36M74
$$ 535 -96 -340 338 -107 -167 328 -268 -146 484 -295 -289 544 -140 -375 430 -13 -310 290 -42 -178 296
3363B96m32m8N73n47j31P14m76l05O94k95l37N15j92k39M20k76j47M98l52k14
$$ 296 -136 -184 389 -158 -289 425 -51 -356 338 43 -294 221 29 -210 210 -66 -213 285 -67 -281
3383b81N70k71l48N49j45l58M38r1k68L55j34k26M17j90k87M66j17l47M19l2l51
$$ -281 289 18 -330 219 74 -284 154 63 -205 150 16 -210 207 17 -270 196 79 -268 151 119 -232
3404b32L34Pk95K94l4k55L08m2k90L28%l33K97M8l27K51P7l13K30O5k92K45M8
$$ -232 102 109 -186 108 74 -181 127 85 -205 123 123 -210 87 135 -192 59 136 -177 53 118 -174 71 119
3427A19k95K29Q0l16K13J11l07J73J16k68J47J14k53J46J12k79J74J13k72J43
$$ 119 -176 53 133 -183 30 141 -166 7 123 -145 2 116 -137 9 121 -158 16 129 -143 0
3447@J41k67J09J54k61J15J46k46J08J43k55R1J63k35Q3J51k49J02J56k49Q5J54
$$ 0 141 -126 -17 137 -124 -9 137 -109 -1 142 -113 -22 141 -94 -11 140 -109 -7 149 -100 -15 139
3469A39k44R2J69k55Q1J57k43Q1J64k60J04J57k66Q5J84k69R1J83k70R2J53k49
$$ 139 -105 -13 156 -99 -18 139 -104 -23 141 -119 -15 142 -124 -39 145 -124 -33 150 -120 -28 125 -124
3491a24Q8J64k80J34J54k91J36J81l12J17K00k94J15J58k81J38J51l20J92J58
$$ -124 -36 128 -152 -18 136 -155 -19 162 -150 -33 167 -127 -12 146 -135 3 154 -166 26 184
3511A84l66J73K18l77J35K31l35J38J58l16J95J42m08K51K17m88K43K73m79J60
$$ 184 -182 -9 209 -168 -33 198 -137 1 159 -157 38 180 -228 23 240 -248 -5 268 -211 -51
3531e1K75m06J68J81l94K71J71n23L35K69o23K68L91n77J48L80m90J94K38n11
$$ -51 224 -182 -14 167 -227 44 215 -308 27 296 -327 -59 332 -245 -97 283 -207 -13 225 -286
3551b86L67K21p04M33L99q26K98N57p43J51M78n83K25K93o32M45K88q81N21N36
$$ -286 81 302 -402 31 430 -396 -98 459 -284 -133 345 -238 -13 280 -352 93 381 -500 21 557
3571E57j018L04P29q77J03O14o48J93L69p60N11M15j122N72P69j264K53R95j007
$$ 557 -461 -157 572 -305 -202 412 -236 -43 326 -434 77 492 -630 -58 711 -553 -300 695 -312
3590c12LP69p37J99M49q97N87N65j353N95J032j484J26J294j106j44R47p79J30
$$ -312 -309 460 -277 -78 371 -526 61 626 -727 -132 900 -584 -458 836 -270 -414 533 -246 -116
3609a16N93j054O01P72j584N09J383j661p5J586j157l41J128p99N9P25j207N80
$$ -116 477 -577 24 796 -788 -279 1104 -557 -632 954 -203 -544 584 -215 -156 569 -638 -58
3627e8J041j828M04J728j811l29J910j154o14J324p80o7Q51j315N55J293k044
$$ -58 983 -845 -441 1287 -524 -853 1057 -97 -711 613 -167 -234 617 -698 -143 1150 -894
3644h94K44K115j914o23K198j099q57J448p53j41R69j418M81J555k184K3K474
$$ -894 -650 1465 -449 -1072 1126 27 -830 618 -135 -276 693 -725 -244 1311 -873 -850 1624
3661A624j944r66K463r80j138J537o51k74J088j486L55J849k291k77K827j865
$$ 1624 -320 -1286 1177 197 -941 596 -55 -329 759 -727 -372 1477 -814 -1091 1736 -129
3677a29j387K676p84j441J623n28m49J241j511J48K139k303o52L147j732j815
$$ -129 -1516 1160 376 -1065 558 30 -419 822 -689 -541 1598 -705 -1357 1790 58 -1757
3693a757K866n14j768J674l60o36J339j494o1K405k260j026L427j536k215K949
$$ -1757 1109 595 -1173 501 141 -495 844 -650 -711 1694 -566 -1592 1835 299 -1916 1033
3709A033k30k025J641j85p63J424j467k55K609k194j380L605j263k594K951P8
$$ 1033 803 -1222 419 234 -529 895 -572 -827 1782 -412 -1792 1813 550 -2044 907 985
3725I85k225J579m5q44J461j444m63K825k070j759L743r52k954K876M59k436J457
$$ 985 -1240 339 294 -550 911 -533 -996 1829 -241 -2000 1743 791 -2163 713 1172 -1264 193
3742A93J77r64J468j300p31K937j791k161L767n37l285K762Q09k593J337L97j126
$$ 193 370 -594 874 -426 -1157 1780 -11 -2172 1595 1058 -2227 535 1344 -1249 88 485 -641
3759f41J475j081j040L000j471k524L704r1l545K542J182k698J133O43j247J457
$$ -641 834 -247 -1287 1713 242 -2282 1422 1331 -2214 328 1510 -1188 -55 588 -659 798
3775G98r03j267K982j150k789L535L14l683K278J483k703R31P85j267J378p06
$$ 798 -105 -1372 1610 460 -2329 1206 1520 -2163 115 1598 -1105 -174 611 -656 722 16
3791A6j466K910p96l008L313P21l748J940J754k616P02R17j282J295n15j611K783
$$ 16 -1450 1460 664 -2344 969 1690 -2058 -118 1636 -980 -278 639 -643 652 137 -1474 1309
3808A309m27l171K995J127l727J575K004k524M31J099j301J135k28j763K529J3
$$ 1309 882 -2289 706 1833 -1894 -319 1685 -839 -408 691 -610 525 297 -1466 1063 1076
3824A076l228K567J500l613J160K220k400J94J263j310R39P0j846K210L94l180
$$ 1076 -2152 415 1915 -1698 -538 1682 -718 -524 739 -571 368 438 -1408 802 1196 -1984
3840a984K120J789l401P50K346k193l9J335j236P71K61j829J905O67l045J710
$$ -1984 136 1925 -1476 -726 1620 -573 -612 723 -513 258 519 -1310 595 1262 -1783 -73
3856g3J966l122L96K348j917k45J337j118N91M13j754J573Q97k822J268K053k755
$$ -73 1893 -1229 -833 1515 -402 -647 690 -428 163 576 -1178 395 1292 -1530 -262 1791 -964
3873i64N7K278j615m29J320r87L85N66j632J212J075k543Q51K076k384k24K184
$$ -964 -907 1371 -244 -673 647 -340 45 611 -1021 191 1266 -1277 -426 1650 -734 -958 1226
3890A226j352n86J316q57J45P08j444Q27J191k185M34K042j970m58K016j063o94
$$ 1226 -126 -712 604 -253 -108 600 -844 -17 1174 -1011 -577 1465 -505 -963 1053 -10 -704
3907g04J242o93k3P64j236N18J200j828J45J890j591o07J825q03p58J132n20j68
$$ -704 538 -155 -178 586 -650 -132 1068 -760 -615 1275 -316 -923 902 99 -659 473 -47 -215
3925b15P46j011K75J148j493p0J687j233o79J575n92p28R55l71k42O87p87Q3J035
$$ -215 531 -480 -205 943 -550 -620 1067 -166 -845 730 138 -590 365 -6 -248 439 -348 -265 770
3944G70j158k17J451q94p18J325l72p38Q27k10l38O22n48r1R11q33l32J210o22
$$ 770 -388 -605 846 -48 -766 559 187 -551 276 66 -272 350 -198 -289 622 -211 -543 667 45
3963D5p10J094j93p12O81q7l76N26l49j96P53n47m01R67l71o67Q46n2o43N32L
$$ 45 -665 429 236 -476 205 118 -258 268 -81 -277 476 -71 -472 495 124 -543 303 251 -392 140 143
3984A43l73M08j97k20N55l26l76P28k02n85O34M6n66L91Q7l47K95o5k34L92j65
$$ 143 -230 178 -19 -239 316 -10 -386 342 140 -445 189 235 -331 60 147 -200 95 30 -204 188 23
4005B3l32N21p5m73M52Q8m39K55J23k88J94J0k04K65m8k94L45L3l88K76J46l58
$$ 23 -309 212 137 -336 116 204 -235 20 143 -145 49 59 -145 120 72 -222 123 156 -232 44 190 -168
4027a68J56J70k48R0Q4j81J32M2k18J90P3k86J58J62k76P6J63j99M2J25j65O4
$$ -168 -12 158 -90 0 84 -97 35 77 -141 49 122 -164 -6 156 -120 -44 119 -80 -38 87 -78 -14
4049a4Q4j76R9J10k07O5J64k05J1J75j49jJ19j12J0R0j20L7J21j68K8J58j60%
$$ -14 70 -106 -7 103 -104 -39 125 -80 -69 106 -43 -44 75 -37 -27 63 -57 -20 101 -67 -39 119 -41 -41
4073d1J45j33j0J38j23j1J39j23k6J32j09k5J22j16%J25j29pJ48j56nJ49j23k4
$$ -41 104 -29 -39 99 -24 -35 104 -19 -45 87 -22 -47 75 -41 -41 84 -45 -52 96 -60 -65 84 -39 -63
4097f3J50j38MJ24j37QJ47j81J6J97j93k0K11j64m1J72j43J6J46k03O9J76k61
$$ -63 87 -51 -47 77 -60 -52 95 -86 -70 127 -66 -86 125 -39 -80 92 -51 -35 111 -92 -23 153 -108
4120a08M5K50k63k2K65k13k9K08j98L4J87k84J00K48l73N5L59l61l8L42k67l5
$$ -108 -63 187 -76 -98 167 -46 -75 133 -65 -31 156 -128 -28 220 -153 -98 261 -100 -138 204 -63 -98
4142i8K49k67P5K27l99J42L56n10N3N25m65j02M75l28p1L38l52J05L22n40J51
$$ -98 151 -116 -41 186 -213 -71 285 -225 -172 353 -112 -214 261 -67 -138 200 -152 -47 275 -265 -114
4163a14N31o46k1O88n38j84N97l69r9M10m37J03M79p14J24P52q02j51R31n93l31
$$ -114 417 -229 -250 438 -100 -284 313 -56 -155 255 -182 -79 400 -314 -190 562 -240 -391 540 -53 -384
4184c84P47l83k03N43n35Q0O38q71N5J021r45l22J185o28n16R10m03k66O52o43
$$ -384 363 -20 -223 320 -215 -135 503 -368 -313 708 -237 -559 626 -2 -518 392 -11 -277 375 -268
4204b68N1Q47j016q3J322j046n40J435o02p21J038l70l64P49p21PJ055j176k02
$$ -268 -217 630 -386 -469 853 -193 -733 702 100 -621 417 47 -317 432 -289 -282 773 -403 -605
4223f05J597j095p85J651n42r52J146k93n01Q79p76j16J301j264m59J911j072
$$ -605 992 -103 -888 763 221 -731 415 122 -379 500 -276 -392 909 -355 -814 1097 25
4240B5j126J868l89j239J250k03o54R87p90k54J543j333p30K220r71j530K062
$$ 25 -1101 767 378 -861 389 186 -468 519 -271 -525 1018 -315 -1045 1175 204 -1326 736
4257G36j74j542J302l2q09J073p89m43J804j325j073K504q02j945K189J05j812
$$ 736 562 -980 322 290 -519 554 -235 -678 1126 -199 -1272 1232 430 -1515 674 779 -1033
4274a033J288J09q96J128p94n86K016j280j436K729o00k295K212M16k040J207
$$ -1033 255 364 -532 596 -198 -784 1232 -48 -1484 1245 645 -1650 562 978 -1062 145
4290A45L17j036J166p26p96K203j175j785K864k98k668K199P33k248J123N19j152
$$ 145 462 -574 592 -134 -930 1273 98 -1687 1177 879 -1789 410 1143 -1105 18 537 -615
4307f15J190o19j041K361r68k179K950J02l044K067J167k450R55P75j256J153
$$ -615 575 -44 -1085 1276 308 -1871 1079 1181 -1863 204 1371 -1079 -124 651 -605 548
4323E48m78j265K442p12k551K958N32l376J903J554k566P33J007j340J113l12
$$ 548 70 -1195 1247 535 -2016 942 1474 -1902 1 1555 -1011 -278 729 -611 502 190
4339A90j496K483l97k902K855R61l577J620J940k590M96J176j363J034j54j673
$$ 190 -1306 1177 780 -2122 733 1694 -1883 -263 1677 -913 -417 759 -604 430 276 -1397
4355a397K455r0l131K675J364l672J327K205k541K62J328j352R36K6j810K325
$$ -1397 1058 968 -2163 512 1876 -1796 -469 1736 -805 -543 785 -567 369 395 -1415 910
4371I10K51l274K383J762l695R64K493k454j8J500j341P89K58j929K123O38l409
$$ 910 1161 -2113 270 2032 -1663 -699 1794 -660 -678 822 -519 270 528 -1401 722 1360 -2049
4388b049K038K187l657N15K791k301l59J663j264N88M57j990J889R91l427J640
$$ -2049 -11 2176 -1481 -966 1825 -476 -835 828 -436 152 609 -1381 508 1499 -1928 -288
4404b88K517l497J05K937k073o28J714j156M05O51k002J644J270l333J225K721
$$ -288 2229 -1268 -1163 1774 -299 -927 787 -369 36 687 -1315 329 1599 -1734 -509 2212
4420B212l238k75K970j794q34J711j037K74P42j928J353J464l138Q23K835k916
$$ 2212 -1026 -1301 1669 -125 -959 752 -285 -11 731 -1197 156 1620 -1518 -695 2140 -776
4436g76o05K930j526j008J699r14P2Q89j823J019J642k880M04K882k524r51K853
$$ -776 -1381 1549 23 -985 714 -200 -128 761 -1062 -43 1599 -1281 -877 2005 -519 -1470 1383
4453A383j198j209J630p21j22R81j670O89J780k596J2K902k150j225K746q97j376
$$ 1383 185 -1024 606 -115 -237 744 -926 -237 1543 -1053 -1041 1861 -289 -1514 1232 335 -1041
4470a041J577n29l13J043j477L71J845k268l06K764j737j378K497o20j402J441
$$ -1041 536 7 -306 737 -740 -369 1476 -792 -1098 1666 -71 -1449 1048 428 -974 467
4486D67l85m11J024j266J13J792j907n35K549j368j448K227l74j378J252k28m88
$$ 467 82 -329 695 -571 -458 1334 -573 -1108 1441 73 -1375 852 478 -900 352 124 -364
4503c64R65j022q3J650j527p01K291j013j468J949j60j347J100p3n79Q89p80k62
$$ -364 601 -421 -504 1146 -381 -1082 1209 196 -1272 677 517 -830 270 197 -382 507 -273 -535
4521e35J524j183q43K033o73j467J662O2j317R21P6o14P77n68l77J362q80r08
$$ -535 989 -194 -1037 996 323 -1144 518 580 -737 184 260 -354 423 -145 -522 840 -40 -948
4539i48J762m14j427J405K03j231P36K08o35O44l52m51J137n77q94J429j73j300
$$ -948 814 400 -1027 378 581 -650 86 294 -341 303 -49 -500 637 60 -834 595 422 -878
4557h78J096L27j097N85K56n94N24k10m47R26l85q14J154k2j143Q67L69r52M21
$$ -878 218 545 -552 33 289 -305 219 9 -438 488 103 -711 443 421 -722 145 514 -438 -17
4576a7L09n37L81n7m28O94j83p34Q73J00r48O00M08p92K58L31m41K55L0l89N17
$$ -17 292 -245 136 79 -349 345 162 -572 301 401 -547 53 461 -331 -73 258 -183 72 102 -287 230
4597B30m3o39O30J90q12M14M38o58J29L48l53J33Q5k99L37K6m99M32K14o35K60
$$ 230 187 -452 178 368 -444 -30 408 -250 -121 227 -126 7 92 -207 130 156 -343 89 303 -332 -72
4618g2L97n06N0L41l03O3J48k55J99Q7l83K58K21m51J36L36l66k8K84j81j7J32
$$ -72 325 -181 -131 210 -93 -30 118 -137 62 149 -234 24 245 -206 -70 266 -100 -128 156 -25 -42 90
4640I0j66J04R3k67J55J79l27N9K77k46o6K32j23o4J21j10K9J06j66M1J75k04
$$ 90 -76 28 121 -146 9 188 -139 -80 197 -49 -115 117 -6 -70 51 -59 -30 76 -90 -49 126 -78
4662g8j3K26j63p6J92r4o9J27o6l4J22j13k0J65j39m9J80r0r5J59n0q2J18m7m9
$$ -78 -91 135 -28 -104 88 -6 -75 52 -14 -48 74 -39 -59 106 -33 -82 98 8 -87 72 22 -60 58 11 -38
4687c8J08p0n2J34p5p2J35o0p5J36o2p0J37o8q3J33m4r0J23l6q4J28n5q0J40o9
$$ -38 70 0 -52 82 7 -65 70 10 -65 71 9 -61 76 8 -75 58 14 -76 47 11 -73 55 0 -80 60 -9
4713ip5J61p5r5J49m2r5J26m0n7J14q4m0J58j26p6K30j10j39K12k8j47J52n3o2
$$ -9 -84 77 2 -93 56 14 -81 45 5 -52 62 -22 -62 96 -30 -106 124 14 -125 87 59 -88 64 11 -51
4738e1J40j14o1K37j68j34L01j16k14K81k7j99J93n9r7K15j78r9L48k18k12M24
$$ -51 89 -25 -86 151 -17 -151 150 34 -180 101 74 -125 68 9 -88 127 -51 -150 198 -20 -232 192
4760A92j22l16L57k5k50K36p0j27K91k27j41M43k34l12N34j14m16M34j0l19K99
$$ 192 70 -246 111 86 -164 72 2 -125 166 -61 -202 241 7 -305 229 115 -301 133 123 -196 103
4781A03q2j77L82k76k13N96k76m53O64p7n48M81M3l82L41r8k28M87l20l55P73
$$ 103 21 -156 226 -50 -263 333 57 -396 268 191 -357 124 167 -215 126 28 -200 287 -33 -388 385
4802C85k73o28P95Jp28N37J45n14M05q1l30O17l27n18R41k09q70Q98J35q93N64
$$ 385 112 -516 279 280 -448 89 234 -280 125 44 -286 331 4 -514 427 218 -652 246 381 -512 52
4823E2K49o11M48n4m44P69l27p28J092r0j129R97L17j101N82L50o98M77k0n52
$$ 52 301 -310 138 84 -360 409 82 -646 446 356 -773 224 541 -560 22 372 -326 151 131 -421
4843d21Q54k64r19J214L9j357J014M90j226N14M83p65M84J2o77R86j96j157J323
$$ -421 433 169 -750 464 503 -854 160 650 -576 -62 421 -344 140 152 -525 461 265 -892 431
4862D31K24j592R66P66j381M18O58q29M53R1q08J068o7j413J380M91j862R14J036
$$ 431 655 -937 29 795 -586 -168 490 -339 114 205 -603 465 398 -1015 365 856 -1006 -92 944
4881I44j514K91Q38q91M27J81r40J101J22j663J357Q08k077P48J351j597J16J012
$$ 944 -570 -279 559 -332 95 276 -664 437 559 -1104 253 1061 -1016 -268 1083 -514 -398 614
4899F14r32L65K94j078J141L01j885J289J102k222N67J614j615o5J137r13K78
$$ 614 -318 47 341 -737 404 705 -1180 109 1211 -1011 -444 1170 -445 -510 627 -286 -8
4916hL96j171J098N19k039J166J398k298L09J859j555k80J249q87K04M92j265
$$ -8 388 -783 315 834 -1205 -39 1359 -939 -630 1229 -326 -606 643 -244 -40 452 -813
4933h13J069P27k191J003J717k361L1K112j496n33J375q10Q6O06j323R46R64k286
$$ -813 256 983 -1208 -205 1512 -849 -818 1294 -202 -735 640 -170 -84 522 -801 145 1109 -1177
4951a177P71K006k336k77K321j387p71J485p55o5P56j370P92J231k319M73K280
$$ -1177 -406 1600 -736 -1013 1308 -79 -850 635 -120 -185 571 -799 -7 1224 -1095 -622 1658
4968A658k230o27K450j173j014J528o53j75Q44j365O27J418k272K04K449k057
$$ 1658 -572 -1199 1251 78 -936 592 -61 -236 608 -757 -130 1288 -984 -780 1669 -388
4984c88r08K492r68j192J497n02k97Q81j307M59J559k173r2K591j844j204K485
$$ -388 -1296 1196 228 -964 533 31 -266 615 -692 -233 1326 -847 -939 1652 -192 -1396 1089
5001A089o98j386J450l52m01R12j235K72J692k051l92K681j586j487K463m58j537
$$ 1089 391 -995 455 103 -298 614 -621 -349 1343 -708 -1100 1581 -5 -1492 971 513 -1024
5018a024J390j87n41R61j114K6J798j825o98K690j281j727K372j87j649J294m2
$$ -1024 366 179 -362 599 -515 -489 1309 -516 -1214 1476 195 -1532 840 653 -996 298 256
5035B56o49R84r82j87J847j584r53K608r59j901K204Q3j718J160J13p38R56q26
$$ 256 -393 591 -391 -578 1269 -315 -1268 1340 381 -1520 684 767 -951 209 322 -416 540 -286
5053b86l47J799j328j132K452o55j968J988K85j694R93K31p42Q85o83m77J725
$$ -286 -633 1166 -162 -1294 1158 503 -1465 523 808 -886 107 338 -404 481 -202 -679 1046
5070A046j077j255K267l66k012J749N06j673Q30L69p68P81m94n93J630q16j372
$$ 1046 -31 -1286 981 615 -1397 352 858 -815 15 384 -384 397 -97 -690 940 124 -1248
5087a248K067r5k010J523O67j629O72M86q12P07l06p10J473n32j428J807J52j941
$$ -1248 819 724 -1286 237 904 -725 -53 433 -379 328 22 -688 785 253 -1175 632 784 -1157
5105a157J232Q15j531N05N76p99N98j56p43J292l05j403J534L44j822R87Q83j387
$$ -1157 75 890 -641 -136 440 -359 239 83 -660 632 327 -1076 458 802 -1020 -33 850 -537
5123e37L44O19p25M60k4p39J090j14j332J281M61j638P25R20j218K03O32o32L37
$$ -537 -193 426 -299 161 137 -602 488 374 -958 323 784 -854 -129 791 -427 -224 408 -224 113
5142A13N4o80Q91L4j250J036N66j488N15R49j062M9O65n63J98J62o32O87J70j120
$$ 113 167 -513 378 412 -838 198 764 -724 -209 740 -322 -273 392 -171 27 189 -443 244 414 -706
5162g06P70O34j287L25R18r10m4O34m74J10K21n65N09K64r65N34O62j078J63Q47
$$ -706 64 698 -589 -264 654 -256 -300 334 -140 -30 191 -374 135 399 -566 -32 630 -448 -285 562
5182E62p23j44O04l76J2K48m53L42K76p73L69O06q63L2P57n58j97N43k92m6K26
$$ 562 -161 -305 299 -77 -65 183 -270 72 348 -425 -56 550 -313 -281 476 -82 -279 264 -28 -74 152
5203A52l35K11K86o35K08N58o69n9O56m01k32M49j79r9K09k59J24K44m74J26M86
$$ 152 -183 28 314 -321 -113 445 -224 -283 373 -28 -260 189 10 -89 120 -139 -15 229 -245 -119 367
5224C67n04j36N68k92k40L82j18j32J95j66L7K19l30K8M00l47j45M44j89k33L11
$$ 367 -137 -273 295 3 -237 145 27 -105 90 -76 -39 180 -150 -122 278 -69 -214 230 41 -192 119
5245A19n3j45J62j21kJ91k33j7L12k31j69L59j09k28K22Nj42J21m0m6J33j43m8
$$ 119 66 -79 83 -38 -40 151 -82 -99 213 -18 -187 172 63 -165 57 62 -80 41 1 -45 88 -55 -103
5268a03K37j44j60K79n7j83J67K0j35J02qo5J05o7p4J74o3j40J85%j61J23L0j20
$$ -103 134 -10 -170 109 52 -131 36 56 -79 23 15 -50 55 -12 -86 88 25 -115 70 70 -91 32 62 -58
5292e8Q1Np4R8k6q5J20j4j37J42J7j53J23K0j28R2L8j25J04J3j06P7J4j04Q8L1
$$ -58 23 28 -46 52 26 -59 61 47 -90 52 69 -84 39 59 -69 23 61 -64 40 53 -53 24 38 -66 22 53
5318E3j33R4L6j35J07K2j36J09L3j32Q4M8j29J03K0j33J21J9j63J43M6j80J07
$$ 53 -80 14 50 -85 22 44 -92 17 50 -82 2 50 -79 24 44 -89 32 51 -112 31 77 -103 4
5341DQ6j56O9N0j05Q2Nj20J53j1j90J92M9k31J33J16k08Q6N5j12R4rj50K00Rk69
$$ 4 90 -66 3 53 -52 30 35 -85 68 57 -133 59 108 -123 10 126 -82 4 59 -53 41 32 -118 82 91 -178
5367a78K16J07l01J33J59k30P8R4j70J45kk32K76L6l80K85J74l92J44K22k90P3
$$ -178 38 145 -156 -23 136 -94 -16 78 -92 53 51 -181 95 131 -249 36 210 -182 -38 184 -106 -33
5389c3J37k11J72K4l07L40Q2m83K98K69n01J44L03l50Q9J54k63K23N6m29M00J62
$$ -33 104 -107 65 89 -218 122 204 -279 19 288 -213 -69 234 -116 -27 127 -136 87 143 -286 114 276
5411B76o25L23L85n82J07L89l82M8J88k94K51P8n23M58K54p57L22N12o78M8N14
$$ 276 -349 -26 359 -223 -116 273 -109 -61 127 -167 84 162 -361 97 351 -406 -84 428 -250 -202 312
5432C12m32M2K46l84K97J55o40M58M07q85K55O95p58j5O05m55mL09m41L16K63
$$ 312 -120 -78 168 -216 81 236 -404 54 461 -424 -169 526 -232 -247 358 -97 -101 208 -233 83 346
5453C46q14M76N90j043J85Q81q12j42P32m71n9L82n25L13L81r38M35P72j124P1
$$ 346 -468 8 598 -445 -260 621 -191 -333 399 -72 -131 251 -274 39 420 -518 -83 689 -435 -364
5473c64J052q30k87Q26m56r5M17n57L15M79j039L67R72j205p6J214q10m29R20
$$ -364 688 -142 -429 397 -59 -154 263 -294 21 500 -539 -172 800 -405 -481 733 -77 -506 414
5492D14m22j75M84o09L01N97j133K68J152j236k63J401p59n92R89l71k65N58o56
$$ 414 -8 -183 301 -308 -7 590 -543 -275 877 -359 -622 779 20 -572 417 46 -219 339 -317
5511c17K27P62j199J19J373j244m88J553o80p73J068l11l68O35o66J25R33j244
$$ -317 -90 672 -527 -408 965 -279 -767 786 106 -667 401 90 -278 357 -309 -184 749 -495
5529d95m8J559j205p07J671n57r61J100j90m69O66o53N2J052j257k19J726j114
$$ -495 -543 1016 -189 -896 775 218 -743 357 167 -302 364 -289 -237 815 -442 -661 1065 -49
5547d9r40J736l99j117J076r0n12O62o33j9J143j238l68J813r97j144J769k23
$$ -49 -989 747 348 -769 307 217 -295 367 -266 -285 858 -380 -748 1065 68 -1076 693 470
5565D70j262J031L4o03O85n83j37J230j143n92J892q23j349J733k1j374R78J45
$$ 470 -792 239 273 -330 355 -228 -365 865 -278 -870 1022 199 -1150 583 562 -812 166 311
5583C11o61P09n47k75J334j035q21J960o28j562J718J76j496R26K72p38O96m56
$$ 311 -350 359 -188 -463 871 -164 -985 975 347 -1215 503 679 -817 109 381 -357 339 -117
5601a17l91J368r14r90J959m23j720J623L84j560Q04L97p83O65l71m88J375p81
$$ -117 -508 860 -54 -1044 915 492 -1228 395 779 -781 23 420 -363 302 -69 -557 818 37
5619C7j137J913k12j821J485N58j554O65M82p43N83k89n50J349o32j230J794o
$$ 37 -1100 813 601 -1220 265 823 -731 -66 416 -327 256 -33 -583 766 134 -1096 698 692
5637F92j862J307P47j548N41N79p69N43j72o55J282m21j358J660K39j899J130
$$ 692 -1170 137 884 -664 -123 456 -313 230 58 -597 685 264 -1094 566 805 -1094 36
5654C6Q89j511L80O91p76M73n4p33J207k41j442J518M38j893R23J033j466K55
$$ 36 925 -586 -206 485 -291 182 128 -605 602 361 -1081 437 875 -1018 -95 938 -528 -273
5672b73P62p51L70M6p53J088n8j475J351N93j844P39J119j362J16P93o86K95J10
$$ -273 489 -262 108 154 -599 489 431 -1044 307 900 -944 -205 914 -448 -332 461 -225 70 180
5691A80p54R83O5j409J118P21j721N31J173j230k2Q14o16K10J70p25Q27J96j351
$$ 180 -574 409 474 -935 183 904 -817 -286 887 -343 -365 449 -167 43 213 -512 315 511 -840
5710h40R16Q15j573L29J185j082j44Q12n52J15K59p07O74L14j271P15Q89j426
$$ -840 76 891 -682 -353 832 -250 -394 418 -134 -19 240 -467 207 521 -750 -35 854 -572
5728e72J57J192r50k56Q16m65KL11o38N23M03j166N38R10j272J6J165q08l28P76
$$ -572 -415 777 -173 -429 387 -78 -76 235 -403 120 523 -643 -105 805 -467 -451 714 -94 -422 354
5748C54m00n1L42n67L80M49j024L56R02j082j13J070o33l89O99k77j16L07m69
$$ 354 -46 -97 245 -322 58 507 -517 -161 741 -341 -454 616 -17 -406 293 16 -100 207 -262
5767b62K70M49q75K14Q55q95k03R60m88m19O22j88j71L03l86J70M30p23J06P85
$$ -262 8 457 -418 -204 651 -244 -447 513 25 -394 228 40 -131 172 -214 -44 386 -337 -231 554
5787E54p11k77Q61l50m25N28j04k08K90k94P8M01n79JP14n43l36P56k32m49M73
$$ 554 -157 -434 427 77 -348 180 76 -132 158 -136 -58 343 -236 -235 479 -64 -400 356 124 -325 148
5808A48n4k23K62k18K3L47m42o4O14m11l40O37j49l99L81ok16K06j53j2K89l29
$$ 148 94 -129 133 -85 -62 285 -157 -221 393 -18 -358 279 130 -269 112 106 -110 96 -57 -69 220 -109
5830a09r3N07l03l19N19p2l67K98L7j91J49q9l8K45k50r6M06j91k92M02k3l19
$$ -109 -202 305 2 -317 202 130 -237 61 98 -93 56 -33 -71 174 -76 -172 234 43 -249 153 130 -189
5852a89K25N4j63J19m0p3K00j62j11L16j22k50K87K9k63J64P0j55Q7nq5J58j01
$$ -189 36 90 -73 46 6 -67 133 -29 -140 176 54 -196 91 120 -143 21 91 -64 23 18 -67 91 -10
5875a0j25K52p1k24K40N8k48J27Q5j44N8L6r4J14m0j18J77k0j61J45N9j77P8Q1
$$ -10 -135 117 46 -178 62 120 -128 -1 84 -60 -2 34 -60 54 14 -104 73 53 -108 37 96 -81 -3 78
5899G8j18N0K9p9R4j2j20J29J5j48R8Q0j56O9O5j19M4N0q4N6K2j13J01K2j31R2
$$ 78 -40 10 39 -40 54 42 -78 51 66 -82 16 96 -60 9 74 -45 -1 49 -35 21 43 -70 31 53 -78 14
5925A4N0j13N7N2j19O6N8j32O0O3j24O4M8j08M8O9j33Q5N6j23N7Q2j46N3R2j27
$$ 14 64 -49 8 60 -59 7 65 -67 -7 56 -68 -4 44 -64 -16 53 -80 5 61 -62 -5 77 -69 -16 76 -51
5951e1K9R4j14M0O8j28P6O7j70Q8J25j80J3J38j32PR5r9M8M5j41J09N5j94J02
$$ -51 -22 72 -42 -2 66 -62 14 81 -89 -1 124 -56 -43 95 -37 -30 65 -34 14 59 -82 27 82 -112 -10
5976a0J41k16K6J75j59j5J28j17N8N4j79J28J06k52R5J98k37kK08j51l9J26j08
$$ -10 131 -85 -59 116 -43 -58 70 -47 11 65 -114 14 120 -132 -37 161 -76 -78 130 -21 -60 66 -42
5999d2N6N7j87J38J49l20J05K63l04k8K78j74o1J75j51N6R9k39J43K17l81M2L73
$$ -42 14 71 -116 22 171 -149 -44 219 -85 -113 165 -9 -70 105 -46 10 109 -130 13 230 -151 -109 264
6022B64l37r1L35j81r3K03j55O0J35l12J35L04m41QM58l43j60M06j87j36K44j83
$$ 264 -73 -164 171 -10 -103 100 -55 5 140 -172 -37 267 -174 -166 292 -51 -211 195 8 -128 116 -67
6044f7M0J95l55J12L89m83k5N27l57k18M41j53j78K49j87L9K53m16Q1M87n15j34
$$ -67 -27 168 -187 -75 314 -169 -194 333 -24 -242 199 46 -132 117 -70 -31 222 -194 -113 374 -141 -275
6066b75O50l58l22N13j43k16K82j93ML22m62K1O10n58k48P57l09m45N74j13k79
$$ -275 375 17 -305 208 65 -151 131 -62 -58 264 -198 -177 433 -125 -373 384 75 -370 204 91 -188
6087a88L22k05k5L91m90n8P08n40l50Q32k63n41N85m2l34L45k06n2M65n31j31
$$ -188 134 -71 -96 295 -195 -253 455 -85 -435 397 134 -407 178 136 -198 147 -59 -111 354 -177 -308
6108c08Q26n36m88R06k09o33O02Rl74L48j98r7N27n10k52R01m77n97R14q9p22
$$ -308 518 -18 -506 400 191 -442 160 169 -205 143 -55 -152 375 -135 -387 514 37 -560 354 265 -457
6129d57N77Q3m12L48j80j63N93m96l46R69l97p55R54K6q32N66J71m85L61j49k20
$$ -457 120 203 -209 139 -41 -204 389 -107 -453 516 119 -636 318 344 -488 78 249 -236 125 -24 -244
6150b44O67m79m61J038l18q89R63J52r26N44K60n35L57r7l18P12m15n95J063j73
$$ -244 423 -56 -517 521 203 -686 277 429 -497 47 307 -228 129 32 -286 426 11 -584 479 306
6170C06j008R20K78r79M65L29n21L26p8l36P03l42o82J052o6j089Q57L98r96L73
$$ 306 -702 218 496 -483 -18 311 -210 116 38 -298 405 63 -619 433 367 -722 135 533 -463 -90
6190i0M20n45L06k8l99P12k31p93J021P5j162P69N51j028K76M89n27K54J1m16
$$ -90 330 -215 91 63 -336 376 145 -648 373 448 -714 55 606 -422 -146 343 -184 70 81 -335
6210c35O86j45q68R82K15j232O76O66j024J84N72n45K09P5m72O70m1r34Q99L58
$$ -335 351 206 -662 320 535 -697 -21 645 -379 -195 377 -168 41 116 -356 314 273 -661 238 596
6230E96j267N63P74j007R3O13n18J59J43n23O29N5r82Q13M92j240M08Q65r40k4
$$ 596 -671 -108 666 -341 -248 365 -153 6 149 -374 255 310 -672 141 633 -607 -199 666 -274 -298
6250b98O68m99J02J86n06N54J46r63O79N95j194K85R02q70j02O61m08J5K26n05
$$ -298 370 -129 -27 159 -347 207 353 -610 69 664 -530 -245 657 -213 -315 346 -62 -47 179 -326
6270c26N01K16r63N69O87j143J36R57p75k11O80l66m5K70m84M01L00r35M45P49
$$ -326 175 391 -572 -3 684 -459 -323 634 -141 -352 328 -38 -83 187 -297 104 404 -531 -86 663
6290F63j055J5R79o97k93O75l10p5K91m68L10L81q98L23Q15r66j04R69n84l63
$$ 663 -392 -377 602 -95 -388 287 -23 -98 193 -275 35 416 -482 -159 656 -310 -414 555 -29 -392
6310c92O61k60j02K90m38K48M08q10J93Q20q40k13R35m55m29O06j73j67K96l69
$$ -392 269 9 -93 197 -241 7 415 -395 -202 618 -222 -435 500 45 -384 222 49 -118 178 -191
6330a91J51M25p12R6P95p18k83Q80l64m42N47j22j99K72l00J03M27o23lP67n98
$$ -191 -40 385 -327 -231 564 -154 -437 443 79 -363 184 62 -137 135 -165 -62 365 -258 -261 506 -92
6351i2l47Q09k48m71M94l9k33K65k48K8M24n32q2P28m78m04P61j59n00M38Mk35
$$ -92 -439 370 122 -349 145 106 -127 138 -110 -82 342 -190 -272 456 -22 -426 335 176 -324 114 118 -117
6373a17K35j94j2L80m16j56O68l49m42O66q5m76L73M7k35K07j59l1L44l50j68
$$ -117 118 -76 -88 292 -124 -280 388 39 -403 263 178 -298 75 122 -113 94 -65 -96 248 -102 -270
6394b70N82k69m13N63k0m36L10Q1k34J80r3o9K92k68j75N09j86l98M59M6m08K31
$$ -270 312 43 -370 193 173 -263 47 128 -106 74 -19 -88 204 -64 -239 270 84 -314 145 191 -217 14
6416A4J20k23J42o3p6K71k10j83M24j15l77L77R6l81J75J28j97J01j0j06K23j35
$$ 14 134 -89 53 -10 -86 185 -25 -208 216 101 -276 101 197 -184 -9 119 -78 23 13 -93 130 -5
6438ej94L46l5l46K93J08l21J22J46j72O6Mr9J96j02j82K85mk98K26J17k60O7
$$ -5 -199 147 112 -234 59 167 -154 -32 114 -58 8 12 -87 109 7 -175 110 106 -192 34 151 -109 -42
6461d2J42j32L2K2q2J30n2j47K15J8k61J73J34k30N3J19j28L2M3r6R9oj53J63
$$ -42 100 -32 0 22 -60 70 18 -129 86 104 -157 16 150 -80 -27 92 -36 -4 39 -57 42 36 -117 46
6485D6M5k25J15J28j78J2J29j08J7M6p5P3nj16J14O8j88P4J23j51LJ09r1J3M7
$$ 46 91 -134 -19 109 -69 -57 72 -36 -19 27 -48 25 20 -96 18 86 -102 -28 95 -56 -53 56 -35 -22 25
6510B5o8N6M5j13N0Q0j43M3J12j09k1J15o9j1N0o9K9M1q1L7O2j08J9J00r9j5J01
$$ 25 -43 13 58 -55 -5 75 -68 -25 87 -22 -43 72 3 -8 42 -27 2 43 -38 -1 61 -47 -28 72 -27 -42 59
6537E9p3%N4p3J1O4p7J3O9q4LQ9p9j6P8p1MP0p8jR1p5lQ1p3j1P6p0pR3p7k2J03
$$ 59 -14 -14 40 -33 -22 42 -35 -22 47 -37 -34 55 -24 -40 38 -33 -29 41 -37 -38 53 -22 -25 56 -17 -28 48 -22 -29 64 -13 -35 68
6570F8p2m6J07o2l4P3m5j7P8p5QR0j00k0J44j02o2J30n9n1Q8o0j1P1q4JJ13j03
$$ 68 -4 -50 57 -5 -39 34 -11 -28 50 -25 -17 73 -27 -47 97 -5 -67 63 4 -47 41 -19 -30 41 -43 -42 71 -32
6598c2l3J55r4p5J47n3q0J00m1l4R1q6nJ36j33m1J89j08j07J69l2j03J05k6l6
$$ -32 -65 90 -4 -79 68 15 -65 35 -6 -40 51 -35 -40 96 -37 -78 111 3 -104 65 33 -70 35 9 -27
6623b7R0j01kJ61j50q8K50j01j52K03l4j27J11k6m7J03j11l3J96j46j16K69q3
$$ -27 63 -38 -40 121 -29 -117 133 32 -120 83 49 -78 33 7 -40 63 -48 -81 115 -31 -147 122 39
6646C9j96K10J5j82J36j6o2J33j23n0K31j48j64L18o8k47K37J6j79J37j9p9J51
$$ 39 -157 53 68 -114 22 6 -56 77 -46 -96 135 -13 -177 141 73 -174 63 79 -100 37 18 -61 90
6669I0j24q5K82j35k33L41k7k96K34O4k03J27j5q7J75j35j28L30j32k93L89Ol50
$$ 90 -34 -119 163 28 -205 136 109 -187 47 111 -92 35 20 -67 108 -27 -155 175 43 -250 139 145 -205
6692b05K30J00k42J24L1j28K07j32j75L76j12l50L94N0m03K32J59k76J45J6j57
$$ -205 25 125 -117 7 38 -90 117 -15 -190 186 74 -276 118 168 -235 -3 156 -120 25 41 -116
6713a16K47j28k23M08o6m19M00J24m56K08K04k94J19M6j70K51q8k92M34j6n05
$$ -116 131 3 -220 188 122 -297 103 227 -229 -21 183 -111 8 54 -116 135 47 -245 189 173 -332
6734c32L93K06n03J92K50l15J00P1k00K59o2l41M31N4n51L71K66n21J34L05l10
$$ -332 61 267 -236 -44 206 -109 -9 62 -138 121 59 -282 149 203 -348 23 289 -232 -98 207 -103
6755a03P2R6k08K56k7l87M34J25o12L34L55n31P9L43l15N0J20k14K60Mm34M11
$$ -103 -31 65 -143 113 86 -301 133 258 -354 -20 335 -196 -117 226 -89 -39 81 -133 127 131 -303 108
6777A08K06o38K70M27n51L5L71l04L5J44k57K51P1m89L93K71o59K11M83n35k6
$$ 108 314 -324 -54 373 -178 -143 228 -76 -41 103 -154 97 168 -321 72 343 -316 -105 378 -157 -183
6798a83M20k92pJ70k74K37J19n27L62L38o62J34N61n28q6M37k55l6J71k52K18
$$ -183 237 -55 -62 108 -166 71 190 -337 25 363 -299 -165 396 -132 -218 219 -36 -72 99 -153 65
6819F5J44n16L04L95o58O9N99m76j69M66k44n9J91k46J79K00n36K32M64o37nO25
$$ 65 209 -307 -3 392 -266 -197 402 -74 -243 223 -21 -80 111 -135 44 244 -292 -60 404 -233 -238 387
6841C87m28k28M69j89j03J99k47J40K45n23J62N13n86q6O44l64k86M63j57j37
$$ 387 -41 -269 200 11 -92 107 -140 0 245 -278 -116 397 -189 -275 369 5 -281 182 25 -112
6861a12K24k37J09K86n15R9N56n51j56O59l25l15M57j34j53K47k35N8L02m61K9
$$ -112 112 -125 -16 270 -245 -146 410 -141 -297 362 37 -278 179 45 -108 139 -96 -38 264 -197 -168
6882a68N74m95k25O38k41l59M18o2j93K20j87K8L12m33k3N53m10k82O11j71l96
$$ -168 406 -89 -314 324 83 -276 142 80 -113 107 -80 -52 260 -173 -196 357 -53 -335 276 105 -291
6903b91M00j5k06K05j57j2L14l70q9N56l37l39N83r4m16L47L2k20K01j51l6L32
$$ -291 109 94 -112 93 -64 -76 238 -132 -221 335 -2 -341 242 148 -268 79 111 -109 92 -59 -95 237
6925B37l19j46N37k60l67N16k8m23L20L4k05J74j08n3K97k77j59N02k07l86M80
$$ 237 -82 -228 309 49 -318 198 170 -253 67 101 -104 70 -38 -91 206 -71 -230 272 65 -321 159
6946A59J1m12K65R3k20J48m7r8K80k26j90M54j25m00M17Q0m04K14J21k03J18m3
$$ 159 170 -242 23 116 -104 44 -3 -101 179 -47 -237 217 92 -308 109 189 -215 -1 120 -83 35 -8
6968hp8K51j79j92M11r5l74L56J02l71J73J40k03J03j9r1K14j31k17L70k8l77
$$ -8 -86 165 -14 -206 205 110 -264 92 194 -177 -4 136 -67 36 17 -74 140 9 -208 162 134 -243
6990b43L00J36l55J37J32j77Q0Qj24K08p6k24L13J8l53K48J55l28Q5J72j61M3
$$ -243 57 193 -162 -25 107 -70 10 18 -106 102 26 -198 115 133 -220 28 183 -145 -60 112 -49 -6
7012fL0j07J73n8k01K52N4l19J87J68k79M9J68j47L9K8r9J47l4j82K13N9k78J38
$$ -6 24 -83 90 32 -169 83 137 -182 5 173 -106 -57 111 -36 3 31 -68 79 45 -137 76 135 -143 -5
7036eJ69k41J9J58j15J2L3p9R7jj74J69O9k56J12J62j95KJ43j02NM1p0R2Lj56
$$ -5 164 -77 -58 100 -15 -3 30 -49 48 47 -127 42 111 -145 -33 129 -66 -64 79 -23 -18 23 -47 45 48 -108
7062a08J20J00k11N2J74j57m0J36p4j2M7o4O2L1j39R5R9j89M0J47j30n2J41o6
$$ -108 12 112 -99 -47 127 -30 -70 66 -8 -20 27 -37 25 56 -83 12 111 -78 -38 109 -21 -73 68 2
7086Bj8N5o3M4K3j02N3R6j46KJ37r8m3J00m0k8L4l9K9M5r9L5Q2j03j5J21p8l9
$$ 2 -16 39 -24 20 43 -59 -6 90 -56 -54 83 -15 -58 42 2 -26 8 -31 -2 43 -56 -21 61 -42 -57 64 -14 -53
7114e3P6l0k5N1m1J9M0p5J9Q3r6pR5m2n1Q4l7k9M3l8MN0n9J1P9q6j9Q7n3m9Q4
$$ -53 23 -7 -32 19 -22 -3 37 -38 -19 64 -32 -39 56 14 -37 47 10 -19 24 -14 -10 40 -19 -8 71 -15 -34 53 0 -49 35
7145C5k5l5M8k3j6N1n2rN6l9k6P1m2l7P0j3m6N3l0k9O6k8l3N3k6l4N8k6k2N8k0
$$ 35 10 -25 23 0 -16 35 -17 -26 30 -9 -35 36 -6 -43 27 14 -32 21 -9 -38 28 0 -33 20 -6 -40 18 -8 -30 28 8
7176Hm3O0k2k4N8k2m5N0rk3M7l6l1N7k7l4P2j6o3N9J9p0L8Lm0N8l6k0O6k7n9Q0
$$ 8 -35 25 3 -21 37 15 -30 20 11 -12 35 -1 -32 25 -2 -36 36 20 -43 16 35 -35 3 6 -34 24 -12 -32 34 7 -52 28
7208B8Lq6P4On9L7ml1N8k9l3O0k0p1R9np8N9K8o4L7Ql2N1l3l2Q0l5q2J07Mj01
$$ 28 31 -55 19 25 -34 3 -1 -32 26 -3 -36 24 4 -67 32 27 -51 8 36 -28 9 17 -15 36 3 -29 51 16 -66 41 45 -56
7240e6O3M0q2M1K1n6M6j2n1Q9l7q4J07J5j26N7O5q1L0K8n4M4j2n8J07k5j17J22
$$ -56 7 47 -35 6 27 -29 17 5 -46 43 6 -78 29 44 -82 -25 40 -41 -11 17 -37 7 -5 -63 44 19 -98 24
7268B4N6j49O0O8r3K3M3n1M3pp8J18k1j29J12Q3j77N1R9j04RN8o5N7%r3J19Jj70
$$ 24 80 -69 -9 59 -34 -11 32 -19 24 17 -61 57 36 -93 19 102 -75 -24 75 -29 -20 38 -27 30 30 -63 56 57 -113
7297a13J22R5j78L4J26j08j9P4n8N8rj18J39L1j89J05J18j87K6J33j00j6O1n6
$$ -113 9 104 -74 -40 86 -22 -41 33 -25 33 24 -94 45 76 -113 -8 110 -77 -51 82 -18 -34 27 -29
7321b9O0Nj39J37O1k14J05J44j84j1J64j12k2P9p4O4K4j55J22R2k14O1J92k07
$$ -29 31 36 -103 34 95 -119 -14 130 -54 -65 99 -13 -35 44 -30 34 58 -97 25 117 -97 -36 156 -51
7345e1k0J76j03m2Q2q1M5M8j55J11J13k42N6K15k08m2J99j13m4R4p7M6N7j68R5
$$ -51 -71 105 2 -40 42 -39 6 54 -101 10 123 -119 -63 152 -56 -98 101 -12 -56 38 -39 7 64 -104 -9
7370iJ34k26QK43j77q7J99p3n3Q0o8L0Q3j75P4J75k40j5K48j63r4J97o5p7R5o8
$$ -9 125 -101 -93 150 -27 -114 85 12 -41 39 -29 1 84 -91 -17 158 -82 -97 151 -12 -106 91 26 -51 44 -24
7396b4K3Q6j70M1J92k16m7K59j31j49K09l0j02R8p2K8R5j76K0K17k12p3K72j24
$$ -24 -1 85 -85 -44 148 -68 -115 144 13 -136 73 43 -59 39 -33 -5 90 -86 -66 151 -61 -134 138 14
7420A4j44J88j4j11J00n8NJ20j80RK41j98j05K69q1j87J89j3j04R5n3qJ26j52
$$ 14 -130 58 44 -67 33 -25 -20 100 -80 -71 170 -28 -133 136 55 -132 57 44 -60 35 -18 -26 100 -52
7444e2k3K31j65j37K63n3j86J66J8j17P7l7k0J30j51m4K40j35j72K63k5k06J47
$$ -52 -75 156 -9 -146 117 64 -122 44 62 -55 22 -15 -35 95 -56 -100 140 5 -167 96 71 -135 12
7467A2M4j20P4k4l0J32j33p1K38q9j99K43J7k05J10O9j17O3j8l7J30j01j05K42
$$ 12 56 -64 10 -14 -44 88 -45 -116 122 33 -166 77 94 -111 -1 68 -49 14 -4 -41 89 -12 -117 125
7491A25o7k25K33L9k25J21Q5j36P1j4n4J24p9j10K12l5k29K12N8k05Q6Q2j13M3
$$ 125 58 -167 66 105 -120 1 86 -50 21 7 -47 77 -2 -112 100 65 -164 48 106 -99 -13 69 -44 -1
7515aJn4J08m9j19J98j2k21J65Q9j91O2R2r3J8J4n1J00m2j33J88J3k09J42R9j86
$$ -1 0 -54 54 5 -114 84 72 -149 16 105 -86 -24 68 -25 -7 7 -44 56 14 -119 69 82 -127 15 114 -72
7541g2L4J09p3OK0o3J00l7j26J64K2j99J04J20j70J9J09p7qL2o0P5qj20J30N0
$$ -72 -38 71 -2 4 24 -39 61 24 -102 62 84 -115 -11 109 -61 -42 67 -10 -18 14 -46 29 21 -99 31 81
7567H1k01R5J30j59%J09p0%K8o1P5J4j35J18O2j70M9J34j28k3J10n6j2J4l4N9
$$ 81 -120 -25 105 -54 -54 55 -15 -15 13 -48 27 41 -94 24 86 -84 -35 99 -29 -52 58 2 -10 4 -30 29
7593B9K3j24R2P2j58L0J33j15l6Q8k3k7K2l9M5K1j00M8R7j40OJ12p1l2P1k4k0
$$ 29 52 -72 20 92 -66 -36 97 -18 -54 34 11 -16 6 -33 12 33 -67 -19 78 -62 -56 56 -15 -47 24 0 -20
7620b0J4l2L7K7r5M9Q4j10mJ20p4o4R6j1l8K6j9J4K8p6L2R0j03k2J01l7n2N6j
$$ -20 -6 -38 -1 26 -69 -20 64 -46 -50 70 -4 -68 28 17 -21 5 -14 0 28 -48 -16 74 -29 -51 50 13 -39 17 16
7649A6l0K6j6J0K6o8J2P9q1k5R9l1o9N3Pk5K0k0K3J9n5lP4n8l7Q6l4n0N6J0k8
$$ 16 -14 12 -4 6 32 -36 -24 55 -26 -51 48 17 -52 1 8 -17 3 -17 6 25 -30 -33 41 -17 -54 32 -2 -52 4 14 -14
7680a4K2k1J0K3l8jO1m7k9O6j5l5K4J6k9J0JoK2l5nM3j6l8M3J3n1K6J7k7J5qj0
$$ -14 8 -13 -3 20 -18 -19 42 -5 -34 32 17 -18 6 22 -7 3 4 -2 20 -15 -20 23 7 -31 12 25 -26 0 17 -10 5 -3 -13
7713a3K7k0j4M0j4m9M7J1n2L3Pj4LpJ1J4j7j0L1j0k5K1K4m7K0J7k5J8pqK4j1p
$$ -13 14 -6 -20 20 6 -43 4 15 -37 -4 3 -11 -8 -15 -4 10 -7 -17 14 4 -21 0 24 -23 -3 14 -11 7 0 -8 16 5 -2
7746bJ4oj7K4%j7mK5k9MQ%Pkj5J3Qk5J3K2l6RJ6j2%kpNJ4j9J7Mj5JKlJ2J1l7J2
$$ -2 12 6 -11 13 13 -4 -8 17 -12 -8 0 0 7 5 -10 3 11 -14 -1 21 -15 -6 10 -2 -2 -4 -11 -6 8 -11 6 10 -5 -4 -2 -5 7 18 -19 -7
7786gK0k4NPmlK1k1KK1k2RJ8l1RJ4j6MJ1j1Kjo%kJ2rRj9LJ7j8KJ4kj3J0Nk5K1
$$ -7 13 -11 -6 1 -3 -6 15 -6 -4 17 -5 4 22 -9 0 14 -2 2 13 2 4 3 -3 -3 -5 7 -2 7 -12 -9 8 -10 -8 6 4 -9 1 6 -19 2
7826BmoJ4k1RJ7j3nJ8rj3K1j6PQj2OJ8k0%J5j8PJ7j0j5MRj1NpJ7kk9J0K2j8pK6
$$ 2 -2 -8 6 -15 -6 11 -2 -7 11 2 -11 10 -6 1 9 -3 3 21 1 1 16 -2 5 22 12 -3 1 10 -1 4 -3 14 12 -17 -7 15 -3 -10 16
7865A6ml1PPJnN%K0m0NL7k1j3K1pj5KJ2PQj7jK9l2JL2qm7M8Jl3J8J0mJ4k7J3J4
$$ 16 12 -19 -12 -5 -4 -9 -4 -4 16 -24 -19 18 -3 -16 5 -2 -17 -15 -3 4 12 -5 -6 23 -9 -8 24 16 -31 17 18 -15 3 13 9 23 -4 9 23
7904B3k4j8M3k9k1M0%j7K%KJ1l0RK0l1%L5j1m0L8Mk6J4K%Qj3JM4n6LL2qk5K9R
$$ 23 -1 -19 24 -5 -26 14 14 -3 -1 -1 1 12 -18 -9 11 -20 -20 15 4 -36 2 6 -20 -6 -4 -4 4 -9 -8 36 -20 -17 15 7 -18 11 20
7941B0k6OMLRk0%L6l2j7N1Lm9K8Oj9pRoK0k9J7J6l1k6M8Om6K3K4l1JJ0mJ4k1j0
$$ 20 -6 0 4 7 16 -4 -4 32 0 -17 34 37 -12 16 22 3 -4 5 -1 19 -10 7 23 -8 -34 14 20 -26 -3 21 -10 -9 1 -3 11 -10 -20
7978b0M5j7n7O2Pm6J5L0j7j6J2J1Nj5l0O3j6m8M5J6o2K6L0k5llJ7J3k6j4L8Jm8
$$ -20 25 8 -49 13 20 -26 -11 19 2 -14 -2 9 14 -1 -31 32 16 -32 13 29 -33 -7 23 -2 -5 -8 9 22 -4 -18 20 21 -27
8011b7M2K2m4j0K6j9%J8j0J3j5k2L1Pm8L8L5n2oM2k8MJ4oNpk4M2Ln0J3N6n7pL5
$$ -27 15 37 -7 -17 9 -10 -10 8 -2 11 -4 -26 5 12 -36 2 37 -15 -21 21 -7 -3 11 5 10 3 -21 21 24 -26 -13 43 -14 -21 14
8046A4mj2NORj8k1K9K2n3J9L3l0j0L6j7k8J7mJ2Ml8M4Pm6KM7m0j5L7jk2MNJNk6
$$ 14 10 -2 3 9 18 0 -21 8 30 -23 -4 29 -1 -11 25 8 -20 -3 -7 5 9 -29 15 22 -24 -22 25 -15 -30 7 6 -16 -12 -7 -6 -1 -27
8083b7J3K8l6lO2m2k2L6oqjJ0K2k0k0K1K5n1ML3j1l1L2J1plj2J6kl5K3K3l5LJ9
$$ -27 -14 14 -22 -25 37 -5 -27 9 3 -5 -6 4 26 6 -14 7 32 -19 -15 18 7 -24 8 19 12 9 -3 13 11 -24 -1 22 -13 -10 9
8118Imk7K4Oj6llnK6k5kK9k5j1L9%l7J6O%QrlJ4j6j1M6k5k2L2Lk4J3K3l0oJ0J1
$$ 9 5 -22 2 8 -8 -11 -14 -19 7 -18 -20 9 -16 -27 12 12 -25 -9 -3 -3 5 -4 -7 7 -9 -20 26 1 -21 11 14 -10 3 26 -4 -10 0 11
8156A1kj3j5M4k4j8L6ok3%L0rj6jnJ7j1rK8j4j8J3J8l0RJ0jj1nJ2J2j8KK2q
$$ 11 9 -4 -19 25 1 -17 19 13 -10 -10 20 11 -5 -6 -11 6 -5 -14 14 0 -18 -5 13 -17 -8 2 1 -10 -15 -3 9 -9 -7 15 7
8191G
$$ Imaginary data points
##PAGE= N=2
##DATA TABLE= (X++(I..I)), XYDATA
0@%%%%%%%%qJ6j6J6j7K5l3M2n8P1q5J05j32J57j82K15k55L01l51M05m65N39o21
$$ 0 0 0 0 0 0 0 0 0 -8 8 -8 8 -9 16 -17 25 -33 38 -47 58 -74 83 -99 116 -139 162 -189 216 -249 290 -331
31c31P09q08R18j039J172j319J483j665J860k072K305k563K845l150L485l848
$$ -331 378 -430 488 -551 621 -698 785 -880 980 -1092 1213 -1350 1495 -1655 1830 -2018
47b018M244m680N158n684O261o894P600q388R266j0255J1380j2673J4173j5941
$$ -2018 2226 -2454 2704 -2980 3281 -3613 3987 -4401 4865 -5390 5990 -6683 7490 -8451
61h451J8062k0657K3917k8152L3908m2238N5480q0538J97226o17513K65869P86288
$$ -8451 9611 -11046 12871 -15281 18627 -23611 31869 -48669 148557 -468956 -203087 583201
73E83201q26983M2359M37513l26785J28943O1527m48917O02974L6959q58739O38629
$$ 583201 -243782 -201423 236090 -90695 38248 99775 -349142 253832 290791 -567948 70681
84G0681N00784j031767K43910P28886o61621r3211M72392l08707J03015Q4554
$$ 70681 571465 -460302 -216392 512494 -149127 -242338 230054 -78653 24362 108916
94A08916m16709M76097J51934q12524M84851N44640q90697R1075P21748n46250
$$ 108916 -307793 168304 320238 -492286 -7435 537205 -353492 -262417 459331 -86919
104h6919j55841M39308k47002M7570J25045l91748L74986K14573p30234L38468
$$ -86919 -242760 196548 -50454 -2884 122161 -269587 105399 319972 -410262 -71794
114g1794N70433p65342j6297O84467m37841k03657M11733k02225P902J50249l59868
$$ -71794 498639 -266703 -283000 401467 -36374 -240031 171702 -30523 -22621 127628 -232240
125b32240K83812K64135o52605K15946N75433o43794j03712O38537l40241k36250
$$ -232240 51572 315707 -336898 -120952 454481 -189313 -293025 345512 5271 -230979
135b30979L75934j56949k5862J65024l19925J99543K90176n60414J10975N50475
$$ -230979 144955 -11994 -37856 127168 -192757 6786 296962 -263452 -152477 397998
145C97998n19430j64079N71033k49525k48434L31037j15955n2449J70198k70331
$$ 397998 -121432 -285511 285522 35997 -212437 118600 2645 -49804 120394 -149937
155a49937J21272K93424m56768K4779M99313l95504j99785M87627j67724k43567
$$ -149937 -28665 264759 -192009 -167230 332083 -63421 -263206 224421 56697 -186870
165a86870K79051p8100o9072J62355k18844O0822K78470l60867l5299M38710k91372
$$ -186870 92181 14081 -54991 107364 -111480 -50658 227812 -133055 -168354 270356 -21016
176b1016k14778M08872j04250k31473K32807m7204q0331J50453j71867J5068K55330
$$ -21016 -235794 173078 68828 -162645 70162 22958 -57373 93080 -78787 -63719 191611
187A91611k78266p4562L77727k08269k15064L38053n7605k12991J92359k5129
$$ 191611 -86655 -161217 216510 8241 -206823 131230 73625 -139366 52993 27864
197B7864q5170J37009j32126j7975K28283k08172r8463L17512j40828k04429K72491
$$ 27864 -57306 79703 -52423 -70398 157885 -50287 -148750 168762 27934 -176495 95996
208I5996k2994j89813J55397p749q5755J19616r4421m0307J93285j45594j06686
$$ 95996 73002 -116811 38586 30837 -54918 64698 -29723 -70030 123255 -22339 -129025
219a29025K53836q6681j81502K09975K99j60920J20788M253q0773R9662o2183
$$ -129025 124811 38130 -143372 66603 66902 -94018 26770 31023 -49750 49912 -12271
230a2271n2282J55988r3981j04230J94282m5450j54183J55075J5912j31887Q9651
$$ -12271 -64553 91435 -2546 -106776 87506 42056 -112127 42948 58860 -73027 16624
241A6624J2917p1890P8503l7073n4503J20714n6737r3740J44791j8979j26669
$$ 16624 29541 -42349 36154 -919 -55422 65292 8555 -85185 59606 40627 -86042
252h6042J12717K3433j06490O6010J7790o2984O0443j8180n2642R0249k9515q0383
$$ -86042 26675 50108 -56382 9628 27418 -35566 24877 6697 -45945 44304 14789 -65594
264f5594J03852j834j00052P8770K5494q2715M7035J8914n2528M4775n618m6601
$$ -65594 38258 36424 -63628 15142 40636 -42079 4956 23870 -28658 16117 10499 -36102
276c6102O4194j1421o4548P0514P490p4817N2048K3911o1112L1350J8241m1041
$$ -36102 28092 16671 -47877 22637 30127 -44690 7358 31269 -29843 1507 19748 -21293
288b1293K9975K727l6955M0973m23m6578M3172J0561n0753L1286J9129m1314J9201
$$ -21293 8682 11409 -25546 15427 15004 -31574 11598 22159 -28594 2692 21821 -19493 -292
301b92J5055k9238J8167O264k6357K3439M598l0500K3554J0105l1347J6615J3852
$$ -292 14763 -14475 3692 9956 -16401 7038 11636 -18864 4690 14795 -16552 63 13915
314A3915k5269J0059J1130j8292R182O277j5978J1392M888j7039J1240O794j6797
$$ 13915 -11354 -1295 9835 -8457 725 7002 -8976 2416 7304 -9735 1505 8299 -8498
327h498Q043Q140j3655M822O923j0043L694M721p947L931L394p120L775L091o385
$$ -8498 -455 7685 -5970 -1148 5775 -4268 -574 4147 -3800 131 3525 -3595 180 3271 -3114
342c114K920L034n058J819K526l482R49J603j935O92M78q87Q61m22n05J052n99
$$ -3114 -194 2840 -2218 -399 2127 -1355 -406 1197 -738 -46 432 -455 406 -16 -521 531 -68
359f8k61O60n39M10q5r42J575l06j949K307K73k875K144J048k905J551J220k432
$$ -68 -329 331 -208 202 117 -825 750 444 -1505 802 1075 -1800 344 1392 -1513 38 1258 -1174
377a174J284Q55k222J579P37k461J627J129k680J078J653k274L37J738j662j16
$$ -1174 110 965 -1257 322 1059 -1402 225 1354 -1326 -248 1405 -869 -532 1206 -456 -572
393e72J532j304l27J718j227q90K312q98k169K868K84l638K696J879m532J840
$$ -572 960 -344 -671 1047 -180 -1070 1242 344 -1825 1043 1327 -2311 385 2264 -2268 -428
409d28L055m666J399L363n044J924L702o627K713N346q734K238P917r798M74R609
$$ -428 2627 -2039 -640 2723 -2321 -397 3305 -3322 -609 4737 -3997 -1759 6158 -3640 -3166 6443
425F443r332m76R512r461O63R688j2146K006J2806j5674L11J7548j6251l945J9658
$$ 6443 -2889 -3365 6147 -3314 -2651 7037 -5109 -3103 9703 -5971 -5660 11888 -4363 -8308 11350
440A1350j3500n974J7736j2295l358J6512j6409l88K1128k2132l323K8715k2230
$$ 11350 -2150 -8124 9612 -2683 -6041 10471 -5938 -6326 14802 -7330 -10653 18062 -4168
453d168j0725L1259j6534j3819K6837j4050q941K4330k0630m355L1742k8866j0013
$$ -4168 -14893 16366 -168 -13987 12850 -1200 -10141 14189 -6441 -10796 20946 -7920 -17933
466a7933M3017k7023k1945M4850j6559k5532L5951j2821j6470L1618k3465r380
$$ -17933 25084 -1939 -23884 20966 4407 -21125 14826 2005 -14465 17153 -6312 -15692
478a5692M3061l5206j8736N9035l0643l6187N9520j4408l9878M5216r565k5985
$$ -15692 27369 -7837 -26573 32462 1819 -34368 25152 10744 -29134 16082 6517 -19468
490a9468L9314k4728j7032N5388l9012l1170P5082k9916n3860P2114p317n5685
$$ -19468 19846 -4882 -21914 33474 -5538 -36708 38374 8458 -45402 26712 19395 -36290
502c6290N1067k773l5298M4325k4088k4744O6566m0885m5245R0325k5801p3840
$$ -36290 14777 12004 -23294 21031 -3057 -27801 38765 -2120 -47365 42960 17159 -56681
514e6681Q2638M141p2894N3787P788m4964M6679k0720l3222P6117l9713o1121
$$ -56681 25957 30098 -42796 10991 18779 -26185 20494 -226 -33448 42669 2956 -58165
526e8165J03615j7425r5299Q9784J9557q9742N3006K0189n3526M7619j6941m2274
$$ -58165 45450 28025 -67274 22510 42067 -47675 5331 25520 -28006 19613 2672 -39602
538c9602Q6109l6955p9507J16577n623j18738R4702L8227j06834M9976L4320o2212
$$ -39602 46507 9552 -69955 46622 40999 -77739 16963 55190 -51644 -1668 32652 -29560
550b9560M7516j1244n2698R4569l0595r8828J25689R986j40586R4800N8420j20725
$$ -29560 17956 6712 -45986 48583 17988 -80840 44849 54835 -85751 9049 67469 -53256
562e3256M3812M8279o9060M5974m456o3222J00489k0732j17742J29581K9544j59630
$$ -53256 -9444 38835 -30225 15749 11293 -51929 48560 27828 -89914 39667 69211 -90419
574i0419Q8407Q0989j30257L1844O3204p1655L9742L108p0253J01938r506j33390
$$ -90419 -2012 78977 -51280 -19436 43768 -27887 11855 14963 -55290 46648 37142 -96248
586i6248J28544N0519j74782P6998J04021j35540J6211P7575p1251L1452J0863
$$ -96248 32296 82815 -91967 -14969 89052 -46488 -30277 47298 -23953 7499 18362
597A8362p6179J01139L717j47969J23523P3563j86952O1452J26778j37117j162
$$ 18362 -57817 43322 47039 -100930 22593 96156 -90796 -29344 97434 -39683 -40845
608d0845R0256o9234K3284J8650q2513R9022J9005j61478J14865R7172j95192
$$ -40845 49411 -19823 3461 22111 -60402 38620 57625 -103853 11012 108184 -87008
619h7008M3427J46883j35466j7647J00707o7433J5720K7906q9051R3213L6650
$$ -87008 -43581 103302 -32164 -49811 50896 -16537 -817 27089 -61962 31251 67901
630F7901j70718J00403J19306j96091K2137J62281j27832l4634J07170o1951P178
$$ 67901 -102817 -2414 116892 -79199 -57062 105219 -22613 -57247 49923 -12028 -4850
641d850L5318r1642Q4343N2574j74098Q2298J38167j90424j428J73569j14756
$$ -4850 30468 -61174 23169 75743 -98355 -16057 122110 -68314 -69742 103827 -10929
652a0929n3004J10387n1892l395M0202q9075P2944O5079j71655O2839J52307j79768
$$ -10929 -63933 46454 -5438 -8833 31369 -57706 15238 80317 -91338 -28499 123808 -55960
664e5960k4427J80087r8864o9513J10441m1154j2671M4117q5985O0898P7040j66874
$$ -55960 -80387 99700 836 -68677 41764 610 -12061 32056 -53929 6969 84009 -82865
676h2865M2348J63735j66103m5869J82536q2607q2355J08718l2571k0245M9034
$$ -82865 -40517 123218 -42885 -88754 93782 11175 -71180 37538 4967 -15278 33756
687C3756q3315M7344Q8607j58784K1065J70791j49025o4280J79830o6259r1192
$$ 33756 -49559 -2215 86392 -72392 -51327 119464 -29561 -93841 85989 19730 -71462
698g1462J04919k5064k6902N3526p8786L2469R7303j46024o0J72200j27936q0205
$$ -71462 33457 8393 -18509 35017 -43769 -11300 86003 -60021 -60081 112119 -15817 -96022
710i6022J71680m7697r7686R7139j5057l2546N3605p0311J9017R9995j29741j7773
$$ -96022 75658 27961 -69725 27414 12357 -20189 33416 -36895 -17878 82117 -47624 -65397
722f5397J67645j05484r2228J59661k8908j01804Q6909l979l7073N0766n9828
$$ -65397 102248 -3236 -95464 64197 35289 -66515 20394 16415 -20658 30108 -29720
733b9720P196R8768j11917l2509J59173q3194j00172J45034j2294j02213P6338
$$ -29720 -22524 76244 -35673 -68182 90991 7797 -92375 52659 40365 -61848 14490
744A4490M310l9806M8669n0596l991R6818r4096m5002J48362o2420j03964J29331
$$ 14490 18800 -21006 27663 -22933 -26924 69894 -24202 -69204 79158 16738 -87226 42105
756D2105O65r9429O7003R630m1790M7444m1728j4563R3112p5872n4621J34679
$$ 42105 42770 -56659 10344 19974 -21816 25628 -16100 -30663 62449 -13423 -68044 66635
768F6635m3069j03615J12210J1046r3853N7284J3887m2376M4461l2244k2610Q5895
$$ 66635 23566 -80049 32161 43207 -50646 6638 20525 -21851 22610 -9634 -32244 53651
780E3651n7855o0072J18109k5428r9733R3745K0324q6431M5865J8654m0812L8127
$$ 53651 -4204 -64276 53833 28405 -71328 22417 42741 -43690 2175 20829 -19983 18144
792A8144k2446k6811P5264m1390o1049R9967j0684r2665P5487K7062p7440L4961
$$ 18144 -4302 -31113 44151 2761 -58288 41679 30995 -61670 13817 40879 -36561 -1600
804a600K2032l8188L1509j3581k9164O3848k6795n9267Q1810Q35q3133N8772L0288
$$ -1600 20432 -17756 13753 172 -28992 34856 8061 -51206 30604 31439 -51694 7078 37366
817C7366o7331K6271K2893l5228K6408o558l0552N3296j4698n5807O5171R066
$$ 37366 -29965 -3694 19199 -16029 10379 3821 -26731 26565 11867 -43940 21231 30297
829C0297p2561M4485L0877n7359J9461K2567l2088K1496o39l0041M2469n189m9802
$$ 30297 -42264 2221 33098 -24261 -4800 17767 -14321 7175 6536 -23505 18964 13775 -36027
842c6027M9556J3954o0662L2060K9300m7052J3428K1245k7746J6147L595k7127
$$ -36027 13529 27483 -33179 -1119 28181 -18871 -5443 15802 -11944 4203 7798 -19329
854a9329L1809J364m1925L5547J6238m8490K1255K6657l6762P632J9281k2166
$$ -19329 12480 13844 -28081 7466 23704 -24786 -3531 23126 -13636 -6004 13277 -8889
866h889J0504N960k2196K2044M848l2891K3971J5713l6693J3214K2409k7539L863
$$ -8889 1615 7575 -14621 7423 12271 -20620 3351 19064 -17629 -4415 17994 -9545 -5682
879e682J6454j7260O336P160j7531J4120O692k4509J4839J3833k6198P380J7561
$$ -5682 10772 -6488 -152 7008 -10523 3597 10289 -14220 619 14452 -11746 -4366 13195
892A3195j9521J578J2965j2748L580O785j2996Q500O537j7156Q688J0831j7755
$$ 13195 -6326 -4748 8217 -4531 -951 5834 -7162 1338 7875 -9281 -593 10238 -7517
905g517L943J2765j3274L75R707q883J440N801q552M199N192j0454M356P145j0493
$$ -7517 -3574 9191 -4083 -3708 5999 -2884 -1444 4357 -4195 4 5196 -5258 -902 6243 -4250
920d250J872P912p860r1O104n251M12L737m692J868L010n424K135L703n389J009
$$ -4250 -2378 5534 -2326 -2417 3687 -1564 -1152 2585 -2107 -239 2771 -2653 -518 3185 -2204 -1195
936a195M020l969j43L050k272j41J539j459O60N23j566J305L77j744J206N66j427
$$ -1195 2825 -1144 -1287 1763 -509 -650 889 -570 90 613 -953 352 729 -1015 191 757 -670
953f70O70L71n79L56l64K05O42j255M03J220j655K07J484j553J52J226j548O38
$$ -670 0 371 -208 148 -216 -11 631 -624 -221 999 -656 -449 1035 -518 -366 860 -688 -50
971e0R49k008J210J214k738J243J852l014Q34K190k718M98J959k422P25J604k578
$$ -50 899 -1109 101 1315 -1423 -180 1672 -1342 -508 1682 -1036 -538 1421 -1001 -276 1328 -1250
988a250J138J675l034J195K104l226Q54K394k986M95K323k683M07K169k593M59
$$ -1250 -112 1563 -1471 -276 1828 -1398 -544 1850 -1136 -641 1682 -1001 -594 1575 -1018 -559
1004e59K189k609K96K306k411l3K324k019l14K078j620l87J826j413l36J703j307
$$ -559 1630 -979 -683 1623 -788 -821 1503 -516 -830 1248 -372 -759 1067 -346 -682 1021 -286
1021b86m85J753j082q28J773n71j273J492Q9j479R97O33j401N65Q62j391M37J161
$$ -286 -771 982 -100 -928 845 274 -999 493 582 -897 100 733 -668 -103 759 -632 -195 966
1039I66j754L57J878k241k15K815k201j171L326j710j691L185j589j434L364k397
$$ 966 -788 -431 1447 -794 -1009 1806 -395 -1566 1760 50 -1641 1544 -45 -1479 1885 -512
1055e12j327M653l289k501O301k877m332O698j437n059N793r79m213N649k366
$$ -512 -1839 2814 -475 -2976 3325 448 -3884 2814 1377 -3682 2111 1132 -3081 2568 202
1070B02l782P589l655n709R885k512q513R778R7r026P675N87p060P408j955o380
$$ 202 -3580 4009 354 -5355 4530 2018 -6495 3283 3380 -5646 2029 2616 -4444 2964 1009 -5371
1086e371J0622l728r729J3879j316j3915J2857K926j3968R098L318j0411Q700
$$ -5371 5251 1523 -8206 5673 4357 -9558 3299 6225 -7743 1355 4673 -5738 2962
1099B962p27r532J3542l008j4563J7691J032k0063J5327O902j9181R824O665j3812
$$ 2962 2235 -7297 6245 3237 -11326 6365 7397 -12666 2661 9563 -9618 206 6871 -6941
1113f941R785P64j3114J6662j659k0355K1451M692k7175J7021J2433k4655R198
$$ -6941 2844 3608 -9506 7156 5497 -14858 6593 11285 -15890 1131 13564 -11091 -1893
1126a893J1213j6885R639K941j6334J8928M09k6155K4253R456l4138J7206J9124
$$ -1893 9320 -7565 2074 5015 -11319 7609 8018 -18137 6116 15572 -18566 -1360 17764
1139A7764k9476O946J6376j9075Q381N518j9206K0280L436l1878K5549J5650m0536
$$ 17764 -11712 -4766 11610 -7465 916 6434 -12772 7508 10944 -20934 4615 20265 -20271
1152b0271J5314K6770l2995K977K1659k0112O212Q145k1667K0971P114l7487K5705
$$ -20271 -4957 21813 -11182 -8205 13454 -6658 -446 7699 -13968 7003 14117 -23370 2335
1165B335K2685m6262J2091L4654l5570j710K6792k0828L919J1076k4408K1178
$$ 2335 25020 -21242 -9151 25503 -10067 -11777 15015 -5813 -1894 9182 -15226 5952
1177E952J1759m3106K4638L0571n1223P534M2679l7048p183L1561k0731J280J3798
$$ 5952 17711 -25395 -757 29814 -21409 -13875 28804 -8244 -15427 16134 -4597 -3317 10481
1190A0481k6694K0874J6621m8175K2561L8770n5141J613N0662l6975j3950L5928
$$ 10481 -16213 4661 21282 -26893 -4332 34438 -20703 -19090 31572 -5403 -19353 16575
1202A6575j9030k503J6197k7541J9251K1352n1454J8706M6484n6574n852N7329
$$ 16575 -2455 -4958 11239 -16302 2949 24301 -27153 -8447 38037 -18537 -24389 32940
1214C2940l4495k1316L8809j5882o420J7972k7502J6656K6136n3153J3191N3577
$$ 32940 -1555 -22871 15938 56 -6364 11608 -15894 762 26898 -26255 -13064 40513
1226D0513n5571j4330O2304l0146k8342M0222j2260r898J9496k7350J3585L1029
$$ 40513 -15058 -29388 32916 2770 -25572 14650 2390 -7508 11988 -15362 -1777 29252
1238B9252n3869O892N9871n3314k2542O5937k5399l4448M1017r056j2931K1162
$$ 29252 -24617 -17725 42146 -11168 -33710 32227 6828 -27620 13397 4341 -8590 12572
1250A2572k7211J0178L5796n3873L56O5341n0174l0535O8536k0076m0181M0963
$$ 12572 -14639 -4461 31335 -22538 -22182 43159 -7015 -37550 30986 10910 -29271 11692
1262A1692n219j5922K2037k6092O619L9426n2458o261O9264m5521l8266O9384
$$ 11692 6473 -9449 12588 -13504 -6885 32541 -19917 -26178 43086 -2435 -40701 28683
1274B8683j3469m5462L9412l56j8775K1786k3511K516M1643m8698j3284P0662
$$ 28683 15214 -30248 9164 8808 -9967 11819 -11692 -9176 32467 -16231 -29515 41147
1286D1147l8381m5176O7275n669m9033L6001M477k0696K1054k0615j869M3176
$$ 41147 2766 -42410 24865 19196 -29837 6164 10641 -10055 10999 -9616 -11485 31691
1298C1691m3520k0393P0227l0013n0848O3306J951n1031L2033Q492k1961K0375
$$ 31691 -11829 -32222 38005 7992 -42856 20450 22401 -28630 3403 11895 -10066 10309
1310A0309j7795o150M4069l7922k6622O8586k2028n4898N8748Q385n1855K8314
$$ 10309 -7486 -13636 30433 -7489 -34111 34475 12447 -42451 16297 24682 -27173 1141
1322A141J1649k2942J9730j4918j0069M4092l2164l1692O5811j4401n7564N3479
$$ 1141 12790 -10152 9578 -5340 -15409 28683 -3481 -35173 30638 16237 -41327 12152
1334A2152J4287n1722K3989J4865k3284J7966j1488j2993M2306k5843l5134O0974
$$ 12152 26439 -25283 -1294 13571 -9713 8253 -3235 -16228 26078 235 -34899 26075
1346B6075o804n8142M6629J9569m9881J8879J7594k2827J5507p584j5454L8950
$$ 26075 19271 -38871 7758 27327 -22554 -3675 13919 -8908 6599 -985 -16439 22511
1358B2511j8584l7256N3912R25n6472L8196K3778m6096J3475J9147k1461J3065
$$ 22511 3927 -33329 20583 21508 -34964 3232 27010 -19086 -5611 13536 -7925 5140
1370E140m154j7251L5043j1731l8062M6351P331n3432L0324K6369m1886R063J9902
$$ 5140 986 -16265 18778 7047 -31015 15336 22667 -30765 -441 25928 -15958 -6895 13007
1383A3007k0182J0893r92j8358L0774n908l7425L9036J1894m9345K3501K7391
$$ 13007 -7175 3718 2726 -15632 15142 9234 -28191 10845 22739 -26606 -3105 24286
1395B4286l7464N561J9916j8657Q806J578j8566K6331j200l5559L1952J5101m4475
$$ 24286 -13178 -7617 12299 -6358 2448 4026 -14540 11791 10591 -24968 6984 22085 -22390
1408b2390J7186K7471l2633K187J9524j6504O167L794j7499K1126K589l2047K4567
$$ -22390 -5204 22267 -10366 -8179 11345 -5159 1008 4802 -12697 8429 11018 -21029 3538
1421C538J6786l8171J1231K6061k7032o03J8168j3994L839N379j5871J5995N528
$$ 3538 20324 -17847 -6616 19445 -7587 -8190 9978 -4016 -177 5202 -10669 5326 10854
1434A0854k7739J7499J7348l1400O082K3678k1457k661J6252j1396J955O138j3767
$$ 10854 -16885 614 17962 -13438 -7356 16322 -5135 -7796 8456 -2940 -985 5153 -8614
1447h614J1595P010k3181J2042J6443k5265K740K0710j6951l575J4265r380N81
$$ -8614 2981 9991 -13190 -1148 15295 -9970 -7230 13480 -3471 -7046 7219 -2161 -1580
1460a580O522j1642P933P587j8765P767J4791j9747M81J7447j2996l925J2030
$$ -1580 4942 -6700 1233 8820 -9945 -2178 12613 -7134 -6653 10794 -2202 -6127 5903
1473E903p362l85O180r326N098P179j4483M626J2480j4789q81J4034r495l939
$$ 5903 -1459 -1844 4336 -4990 108 7287 -7196 -2570 9910 -4879 -5760 8274 -1221 -5160
1487e160R772n393j221N536o837K660O198j0255K183R692j0148j570J0385o363
$$ -5160 4612 -781 -2002 3534 -3303 -643 5555 -4700 -2517 7175 -2973 -4543 5842 -521
1501e21l435P301l657j445M410m693J152M859o852P93O996o597j645P303m099
$$ -521 -3956 3345 -312 -1757 2653 -2040 -888 3971 -2881 -2088 4908 -1689 -3334 3969 -130
1516a30k772N187k275j422L161k827L34L228m175L10M446m118j063M633k620j769
$$ -130 -2902 2285 10 -1412 1749 -1078 -744 2484 -1691 -1381 3065 -1053 -2116 2517 -103 -1872
1532a872L340j420j018J991j583J05J797k307K88K343k351l62K450j542q05J698
$$ -1872 1468 48 -970 1021 -562 -457 1340 -967 -679 1664 -687 -1049 1401 -141 -946 752
1548G52p25m13P29o28L49L77j073P13N94j287M94P56r40J24M38l53K07k09j15
$$ 752 27 -386 343 -285 64 441 -632 81 675 -612 -118 638 -302 -178 260 -93 114 -95 -210
1567b10P16o92l14J182p09o04J219n15o03J009n65k69R78r70m7J270j315j84J651
$$ -210 506 -186 -500 682 -27 -631 588 73 -530 479 -86 -355 623 -347 -394 876 -439 -623 1028
1586A028j311m95J717j082n63J510j030l34J443j295j57J641j549k73J953j532
$$ 1028 -283 -778 939 -143 -706 804 -226 -560 883 -412 -569 1072 -477 -750 1203 -329
1602c29n66K019j297p04J872j130o31J735j186n16J779j295n78J904j255p18J920
$$ -329 -895 1124 -173 -877 995 -135 -766 969 -217 -733 1046 -249 -827 1077 -178 -896 1024
1619A024j103q18J833r59q09J676q60p86J631q50p82J609p68q74J576n95r94J449
$$ 1024 -79 -897 936 -23 -832 844 -16 -802 829 -21 -803 806 38 -836 740 145 -849 600
1637F00l66r98J220k01q97R97j41p86R24j23q26R10L7r41P16L48r34L59N64p05
$$ 600 234 -764 456 255 -642 355 214 -572 352 229 -597 313 350 -591 125 473 -461 -102 462 -243
1657b43N4N66n40JN57o05m3Q44p64m15J296n75r77J386p3j297J103J76j124J061
$$ -243 -189 377 -163 -162 395 -210 -253 591 -173 -588 708 133 -844 542 469 -828 275 451 -673 388
1677C88j35j102J609l98j774K257Q1k655K135R69k854J477J189k337J404N72k327
$$ 388 253 -849 760 362 -1412 845 926 -1729 406 1375 -1479 -2 1187 -1150 254 826 -1501
1694a501K334K76l410L052J275m569K486K561m390J290K571l357J361J405l395
$$ -1501 833 1109 -2301 751 2026 -2543 -57 2504 -1886 -596 1975 -1382 -21 1384 -2011
1709b011K822J157n150L670K849o575K393M605n848O25M254m215R33K472m426
$$ -2011 811 1968 -3182 488 3337 -3238 -845 3760 -2088 -1463 2791 -1424 -491 1981 -2445
1724b445L046K327o866L887M751q445J827O915p031m91N988m738K79L486n378
$$ -2445 601 2928 -3938 -51 4700 -3745 -1918 4997 -2034 -2525 3463 -1275 -996 2490 -2888
1739b888L258L594q717L981P064j0456Q88R616q097k027P859n028o18M545o144
$$ -2888 370 3964 -4753 -772 6292 -4164 -3276 6340 -1757 -3784 4075 -953 -1571 2974 -3170
1754c170L216N032j0462L647R617j2132n82J2306q581l936R500m887j700N524
$$ -3170 46 5078 -5384 -1737 7880 -4252 -4834 7472 -1109 -5045 4455 -432 -2132 3392
1768C392o753K886O702j1952K683J2377j3137k864J4918q226o391J0813m078l041
$$ 3392 -3361 -475 6227 -5725 -3042 9335 -3802 -6666 8252 26 -6365 4448 370 -2671
1782b671O223o887K253Q263j2922J270J4993j3549n482J7206p339q987J1869k952
$$ -2671 3552 -3335 -1082 7181 -5741 -4471 10522 -3027 -8509 8697 1358 -7629 4240 1288
1796A288m487O838o822J398R877j3665m27J7546j3538q324J9268o075j1636J2599
$$ 1288 -3199 3639 -3183 -1785 8092 -5573 -6000 11546 -1992 -10316 8952 2877 -8759 3840
1810C840j609n807P235o701O21J1395j4259k270J9985j3219j1285K1002m466j4163
$$ 3840 2231 -3576 3659 -3042 -2421 8974 -5285 -7555 12430 -789 -12074 8928 4462 -9701
1824i701J2975j36p027P530o433m39J2890j4277m560K1968j1989j4328K1805k156
$$ -9701 3274 3138 -3889 3641 -2792 -3231 9659 -4618 -9178 12790 801 -13527 8278 6122
1838F122j6299J2544J571p941P475n907j625J4104j3622p101K3262r874j7366
$$ 6122 -10177 2367 3938 -4003 3472 -2435 -4060 10044 -3578 -10679 12583 2709 -14657
1851a4657K1769P76j8242J1501L688q780O994m900k846J4731j2385r491K3842
$$ -14657 7112 7888 -10354 1147 4835 -3945 3049 -1851 -4697 10034 -2351 -11842 12000
1864A2000p425j9932K1164L628j9683J0208N631r402O438l939l981J5217j1041
$$ 12000 4575 -15357 5807 9435 -10248 -40 5591 -3811 2627 -1312 -5293 9924 -1117
1877a117j1730K4100m896k2186K0198O419k0728Q730P319r708N846l044n067J5501
$$ -1117 -12847 11253 6357 -15829 4369 10788 -9940 -1210 6109 -3599 2247 -797 -5864 9637
1891I637r455j3820K3808k179k3805J8584Q957k1002O995Q622r713N313k123o247
$$ 9637 182 -13638 10170 7991 -15814 2770 11727 -9275 -2280 6342 -3371 1942 -181 -6428
1905f428J5440p309j5680K2482J053k4661J5942J1505k0441M705R766r228M305
$$ -6428 9012 1703 -13977 8505 9558 -15103 839 12344 -8097 -3392 6374 -2854 1451
1918A451j012p023J4601m937j6843K0413M046k4685J3002J3587j9420K420J0744
$$ 1451 439 -6584 8017 3080 -13763 6650 10696 -13989 -987 12600 -6820 -4400 6344
1931F344q630L068K23p477J3265k645j7278J7961O519k3988J0094J4992j8024
$$ 6344 -2286 782 1005 -6472 6793 4148 -13130 4831 11350 -12638 -2544 12448 -5576
1944e576M30J1256p907K086J157p742J1977o80j7382J5594Q460k2914P501J5750
$$ -5576 -5146 6110 -1797 289 1446 -6296 5681 5001 -12381 3213 11673 -11241 -3740 12010
1958A2010j6412j142J1292p152J345J937p897J0555J146j6967J2900R981k1115
$$ 12010 -4402 -5544 5748 -1404 -59 1878 -6019 4536 5682 -11285 1615 11596 -9519
1971i519M822J5861j4327k500J0866o237O50K600p812Q885K803j6003R983J1024
$$ -9519 -4697 11164 -3163 -5663 5203 -1034 -384 2216 -5596 3289 6092 -9911 72 11096
1985A1096j8752K202J5486j1947l818J0285n063l00L109p127O943L927j4370P231
$$ 11096 -7656 -5454 10032 -1915 -5733 4552 -511 -811 2298 -4829 2114 6041 -8329 -1098
1999a098J1311j6132R9J4654r735m715R561m002j086L425o309N171M626j2600
$$ -1098 10213 -5919 -5820 8834 -901 -5616 3945 -57 -1143 2282 -4027 1144 5770 -6830
2013f830M958J1050j3603j382J3417p770n098Q623l115j524L504n579L774M951
$$ -6830 -1872 9178 -4425 -5807 7610 -160 -5258 3365 250 -1274 2230 -3349 425 5376
2027E376j0878L136J0418j1245k351J1951o079n065P571k472j729L511m859K518
$$ 5376 -5502 -2366 8052 -3193 -5544 6407 328 -4737 2834 362 -1367 2144 -2715 -197
2041a97N040r072J567R443q871k987J0218m440m843O396j758j864L261l929J407
$$ -197 4843 -4229 -2662 6781 -2090 -5077 5141 701 -4142 2254 496 -1368 1893 -2036 -629
2056f29M770p191L68Q178o678l293Q495l040m546N284j036j999K858k871N07M154
$$ -629 4141 -3050 -2682 5496 -1182 -4475 4020 980 -3566 1718 682 -1317 1541 -1330 -823 3331
2072C331n379m00O735m835l213O819j986m029M228n35j952K428k047m8L461l922
$$ 3331 -2048 -2448 4287 -548 -3761 3058 1072 -2957 1271 736 -1216 1212 -835 -883 2578 -1344
2088a344p83N368l423k883N303j256l343L285k52j728J974j423l14K733k767q63
$$ -1344 -2127 3241 -182 -3065 2238 982 -2361 924 672 -1056 918 -505 -819 1914 -853 -1716
2104a716M085k362k326L920p88k584K431q3j412J486q91m11J964j791p43K817
$$ -1716 2369 7 -2319 1601 813 -1771 660 577 -835 651 -240 -651 1313 -478 -1221 1596
2120A596j499j693K661m37j846J641L6j009R15m59k93J184j103m39J735r56j034
$$ 1596 97 -1596 1065 628 -1218 423 459 -550 365 -94 -387 797 -306 -745 990 34 -1000
2137a000J663k75j155R96Q7o22M35j88o8N12o62j8Q66o85l76R09k99m93M96qj95
$$ -1000 663 388 -767 229 316 -306 129 -59 -127 385 -277 -295 571 -114 -490 419 120 -373 123 115 -80
2158h0J01j51K38M2m61L42K87n77J63L72l92N7J65j77K15j55k15N37k55m67P18
$$ -80 21 -130 108 150 -311 31 318 -259 -96 276 -116 -59 106 -71 144 -11 -226 311 56 -411 307
2179C07r6o47O17N0n59M60k7l69N23k72l49P76l92n35R42k85p22R07j26p06P87
$$ 307 211 -436 181 231 -328 132 105 -264 259 -13 -362 414 22 -513 429 144 -578 329 203 -503 284
2200B84j51n68P95l02n61R69l93o78J075k78q37J028j42q17R13j41p09Q92k26
$$ 284 133 -435 360 58 -503 466 73 -605 470 192 -645 383 241 -576 337 196 -513 379 153
2219A53p06R97k86p83J071k14q87J056j14r00R58o1q56Q96o0q19Q83q2q15Q92
$$ 153 -553 444 158 -625 446 232 -655 401 287 -613 345 284 -572 324 264 -555 328 246 -569 323
2239C23n2q47Q61pq53Q20O4q45P40R9q04O89Q7p56O85P2p73O65J41p96O11K13
$$ 323 271 -576 285 278 -575 245 309 -536 204 303 -501 188 275 -481 204 276 -497 168 309 -487 124 337
2261C37p55M61K76o53L69K24n36L52J51n34L98J77n85L36K90n52J71L35l77L0
$$ 337 -418 43 319 -334 35 259 -277 75 226 -308 90 267 -318 18 308 -244 -73 262 -115 -85
2281h5K63k68P6J70k97J12K35l32j9L69k07k43L24L9l07J45J32j64N3L5j57K32
$$ -85 178 -90 -14 156 -141 -29 206 -126 -145 224 17 -226 98 137 -170 -25 107 -57 -4 31 -126 106
2303A06j6l89L78K23o41K12N41o09n6N65l85n7L53m39K10M02q25K92Q30j062q0
$$ 106 90 -299 79 302 -339 -127 414 -195 -251 314 -71 -128 225 -214 -4 398 -427 -135 695 -367 -447
2324d47J178q22m59J033m52l41O76o06J04P86j165J16J429j366n15J828q92r78
$$ -447 731 -91 -550 483 31 -310 366 -240 -136 650 -515 -399 1030 -336 -851 977 85 -893
2342h93J478m04o98R86p00j06J237j434k20K101j556j110K467p65j630J809j53
$$ -893 585 181 -517 469 -231 -337 900 -534 -754 1347 -209 -1319 1148 383 -1247 562 409
2359D09j094J181p06k95J650j668o11K795j636j823L072n20k324K103J19j471
$$ 409 -685 496 -210 -505 1145 -523 -1134 1661 25 -1798 1274 754 -1570 533 652 -819
2375h19J378p07n63K126j833j168L494j538k646L546p1l028K200N22j797J471
$$ -819 559 -148 -711 1415 -418 -1586 1908 370 -2276 1270 1199 -1829 371 893 -904 567
2391E67o75q29K576j926j755M098j281l524L896N31l735K166J073k133J414m49
$$ 567 -108 -937 1639 -287 -2042 2056 775 -2749 1147 1678 -2057 109 1182 -951 463 14
2407A4j137K836j741k417M490p62m391L986J331m331J874J719k371J216j60j428
$$ 14 -1123 1713 -28 -2445 2045 1283 -3108 878 2209 -2122 -248 1471 -900 316 156 -1272
2423a272L033j486l084M743q9n192L811K279m824J420K354k497R76Q6j675L172
$$ -1272 1761 275 -2809 1934 1845 -3347 464 2743 -2081 -661 1693 -804 172 258 -1417 1755
2439A755j133l754M856O66n878L478L130n059R10K800k479P82K64j941L300p13
$$ 1755 622 -3132 1724 2390 -3488 -10 3120 -1939 -1029 1771 -708 74 338 -1603 1697 984
2455I84m379M791J491o375K969L940n105K70L245k364M97M74k106L240k31m829
$$ 984 -3395 1396 2887 -3488 -519 3421 -1684 -1414 1831 -533 -36 438 -1668 1572 1341 -3488
2471c488M489K313o628K274M674m985m28L624k155J08P46k185K967L14n035L917
$$ -3488 1001 3314 -3314 -1040 3634 -1351 -1779 1845 -310 -202 544 -1641 1326 1640 -3395 522
2487E22L097o630J431N268m593j205L847j777l23R48k177K650Q21n144L282L801
$$ 522 3619 -3011 -1580 3688 -905 -2110 1737 -40 -363 585 -1592 1058 1879 -3265 17 3818
2503C818o429N30N681m073j842L885j415n95J073k186K361J315n178K619M326
$$ 3818 -2611 -2081 3600 -473 -2315 1570 155 -440 633 -1553 808 2123 -3055 -436 3890
2518C890o037k68N829l474k331L767j078p41J117k179K069J731n077J949M693
$$ 3890 -2147 -2415 3414 -60 -2391 1376 298 -443 674 -1505 564 2295 -2782 -833 3860
2533C860n540r82N827k868k721L594p18r65J188k015J642J992m699J245M834m880
$$ 3860 -1680 -2662 3165 297 -2424 1170 452 -513 675 -1340 302 2294 -2405 -1160 3674 -1206
2549a206j628N653k182l056L326k88j192J174j724J154K193m219N40M831m085
$$ -1206 -2834 2819 637 -2419 907 619 -573 601 -1123 31 2224 -1995 -1455 3376 -709
2564g09k184N295j433l270K954Q4j296J112j493P70K313l722n7M703l335k579
$$ -709 -2893 2402 969 -2301 653 737 -559 553 -940 -170 2143 -1579 -1636 3067 -268 -2847
2580b847M838q20l269K542L30j300J060j322M45K363l224n46M463k647k770M315
$$ -2847 1991 1171 -2098 444 774 -526 534 -788 -343 2020 -1204 -1750 2713 66 -2704 1611
2596A611l49l151K157M74j238R98j137J59K297k698q93M078j980k832L738P8k992
$$ 1611 1262 -1889 268 742 -496 502 -635 -476 1821 -877 -1770 2308 328 -2504 1234 1312 -1680
2613a680J776O69j242Q79q45r4K095k112j133L570j334k777L121M40k761J375
$$ -1680 96 765 -477 402 -443 -537 1558 -554 -1687 1883 549 -2228 893 1333 -1428 -53
2629e3Q33j186O95n32l29J866j545j293L017p59k634K475P33k436R59Q91j028
$$ -53 780 -406 289 -243 -572 1294 -251 -1544 1473 714 -1920 555 1288 -1148 -189 702 -326
2646c26N24l41m11J591j097j323K468l28k371J903Q53k067O84Q51q99M28k01m70
$$ -326 198 -143 -554 1037 -60 -1383 1085 757 -1614 289 1142 -925 -241 610 -289 139 -62 -532
2664e32J318p13j245J938l2k009J397Q71j673M20P78p33K85n2m39R94m17j073
$$ -532 786 73 -1172 766 734 -1275 122 993 -680 -260 518 -215 70 18 -421 573 156 -917
2682i17J437J50j624R68Q25j312J95P17n56J05Q0l59O39j78q25R45K45j194N43
$$ -917 520 670 -954 14 839 -473 -278 439 -117 -12 68 -291 348 170 -655 290 535 -659 -116
2701a16P36r17J0N94l58k1J28k54L65m3n57N42K72p92K57N72n60j06M48j72j04
$$ -116 620 -297 -287 307 -51 -72 56 -198 167 124 -433 109 381 -411 -154 418 -142 -248 200 28 -76
2722g6R0q3J67l7k72K79J57m25J09L35k81j23K64k1j36K3O7J5o5n3J06J2j05K3
$$ -76 14 -69 98 61 -211 68 225 -200 -91 244 -37 -160 104 83 -53 -30 37 52 -13 -66 40 52 -53 -30
2746c0J05l7j39R2J19j40p7K06p0j57J60K6j48J01Pq7J31q0q1K00j07j64K98p8
$$ -30 75 38 -101 -9 110 -30 -107 99 29 -128 32 58 -90 11 18 -69 62 -18 -99 101 -6 -170 128 50
2770E0k51L12j2k88K73J0k43K36k4k35L05p5k70L66m8l60L86L0m10L23R8l91L03
$$ 50 -201 111 99 -189 84 94 -149 87 63 -172 133 58 -212 154 106 -254 132 162 -248 75 173 -218 85
2793H5N8l46L10J8l81L94J6m57M16R1m95L46J53m80L07J53m31L01R8m29L60R2
$$ 85 143 -203 107 125 -256 138 154 -303 113 204 -291 55 208 -272 35 188 -243 58 156 -273 87 179
2815A79m95L83J63n39L39K07n13K91K10m83L06J68m89L20J98n32L28K36n59K93
$$ 179 -316 67 230 -309 30 237 -276 15 225 -258 48 216 -273 47 245 -287 41 277 -282 11
2835A1K68n42K59K64n03K42K61n11K63K45n08K62K56n25K46K87n30K31K87n10
$$ 11 279 -263 -4 260 -243 -1 260 -251 12 257 -251 11 267 -258 -12 275 -255 -24 263 -247
2855b47J98L07m95K00K83m68J73K98m81J91K91m84J80L10m75J61L10m50J44L01
$$ -247 -49 258 -237 -37 246 -222 -49 249 -232 -41 250 -234 -54 256 -219 -58 252 -198 -54 247
2875B47m33J30K80m13J54K84m41J44L04m26R7L33l95P0K90l72J03K54l75J33K50
$$ 247 -186 -56 224 -189 -35 249 -192 -48 256 -170 -73 260 -135 -65 225 -147 -44 210 -165 -32 218
2896B18l86J21K78l84Q9K83l61P5K67l32P6K18l14J06K20l32J11K33l33Q6K38
$$ 218 -168 -47 231 -153 -64 219 -142 -67 200 -132 -56 162 -152 -46 174 -158 -47 186 -147 -61 177
2917A77l17R8K04k94R6J92k99J10J90l09J21J99l14J24J87l16J43J76l09J30J74
$$ 177 -140 -42 162 -132 -36 156 -143 -33 157 -152 -31 168 -146 -22 165 -151 -8 168 -141 -11 163
2938A63k82J03J64k80J34J27k79J95J02l10J98J34l42J77J57l08J42J41k86J86
$$ 163 -119 -16 148 -132 2 129 -150 45 147 -163 35 169 -173 4 161 -147 -5 136 -150 36
2958C6P6l00K54O8l86L03J46m26K13K07l65J74J21k87K42L6l60L63O3n07L97K15
$$ 36 112 -188 66 134 -252 51 197 -229 -16 191 -174 0 121 -166 76 112 -248 115 178 -329 68 283
2980B83n68K56K80m37J82J46l34L08J7m56M92R0o68M70L21p15K63L82n11J73J99
$$ 283 -285 -29 251 -186 -4 142 -192 116 133 -323 169 259 -409 61 382 -333 -70 312 -199 -26 173
3001A73m14L79L7n99O09J80q82N12M88q44K09N23n82J50K28m39M20O9p42O90L31
$$ 173 -241 138 175 -424 185 365 -517 -5 483 -361 -152 371 -211 -61 167 -272 148 217 -525 165 496
3022D96j087N13O90r87J29O77o31J00L24n37M71J76r30P12N39j283M32R61j085
$$ 496 -591 -78 612 -375 -246 431 -200 -100 224 -313 158 334 -596 116 655 -628 -196 765 -320
3041c20l5Q70o48KM19o23M63L44j143O79Q25j464K44J278j145k68J071o34j18
$$ -320 -355 515 -133 -131 288 -335 128 472 -671 8 833 -631 -387 891 -254 -522 549 -85 -203
3060b03N15o88M38N29j307N55J151j592mJ565j124n08J219n56k78O38p50L79P24
$$ -203 312 -376 62 591 -716 -161 990 -602 -606 959 -165 -673 546 -10 -288 350 -400 -21 703
3079G03j435M17J449j640k81J812j027p80J313m47l98P01p70L04R07j530K28J713
$$ 703 -732 -315 1134 -506 -787 1025 -2 -782 531 84 -314 387 -383 -79 828 -702 -474 1239
3097A239j629n79K005q76j050J387l20n38P79p75J72J112j554n5J978j516r66
$$ 1239 -390 -969 1036 160 -890 497 177 -361 418 -357 -185 927 -627 -682 1296 -220 -1186
3114a186K177o62j330J415j41p00Q19p14KJ309j532l41K215j350j324K269l95
$$ -1186 991 329 -1001 414 273 -427 392 -322 -320 989 -543 -884 1331 -19 -1343 926 531
3131E31j591J382N0q07Q40o47j75J456j434o46K347j107j640K244q5j789J297
$$ 531 -1060 322 372 -435 405 -242 -417 1039 -395 -1041 1306 199 -1441 803 718 -1071 226
3148B26K33r20Q47n74l29J556j302r12K402q60j891K196J64j913J186M01r92Q37
$$ 226 459 -461 386 -188 -517 1039 -263 -1175 1227 367 -1524 672 836 -1077 109 510 -482 355
3166C55m81m72J592j100j173K401n57k115K048M76k005J028N79j046P82l51o47
$$ 355 -126 -598 994 -106 -1279 1122 565 -1550 498 974 -1031 -3 576 -470 312 -39 -686
3183f86J654q87j443K347k02k311J849P95k072Q29P62j071P01j87p96J593o12
$$ -686 968 81 -1362 985 783 -1528 321 1116 -956 -127 635 -436 265 78 -718 875 263
3200B63j652K193J39k409J596J057k052O22R16j097O10k5r34J510l29j785J972
$$ 263 -1389 804 943 -1466 130 1187 -865 -243 673 -424 186 161 -773 737 408 -1377 595
3217E95M52k423J326J251j973M33R98j056N19J09r97J381j09j817J741O95k373
$$ 595 1047 -1376 -50 1201 -772 -339 659 -397 122 231 -766 615 506 -1311 430 1125 -1248
3234a248J045J409j853K55J059j018M12K44j044J225J48j836J444R46k258P11
$$ -1248 -203 1206 -647 -392 667 -351 61 305 -739 486 634 -1202 242 1188 -1070 -359
3250c59J536j667J8J124r37K70L80j062J014L99j808J096J174k063L79J606j467
$$ -359 1177 -490 -472 652 -285 -15 365 -697 317 716 -1092 4 1178 -885 -506 1100 -367
3267c67j88J170q41J20N07j023P65O18j687P66J285j826J15J586j227l50J147
$$ -367 -555 615 -226 -106 401 -622 143 761 -926 -160 1125 -701 -586 1000 -227 -577 570
3284E70p20k2O05r43N29P36j487M58J319j547j15J511j000m63J089n95j44O43
$$ 570 -150 -172 433 -510 19 755 -732 -274 1045 -502 -617 894 -106 -569 520 -75 -219 424
3302D24q15K99Q04j268J98J278j249l05J392p75n44R88m51k44O58o74Q5Q31j014
$$ 424 -391 -92 712 -556 -358 920 -329 -634 758 -17 -561 427 -24 -268 390 -284 -199 632 -382
3321c82n1J201r28m84J243n08o28Q74k85l58O24m85r7P83p33k38J076o51n68J054
$$ -382 -433 768 -160 -644 599 91 -537 337 52 -306 318 -167 -264 519 -214 -452 624 -27 -595 459
3341D59l01o31P48j58m14N65l01k34O99m96l62R05m00n91Q49j40o14O09l6m43
$$ 459 158 -473 275 117 -297 268 -33 -267 432 -64 -426 479 79 -512 337 197 -417 192 156 -287
3361b87M74j52l22N83k84m03P11j96n58O45jn68M67N4m23L74l0l32M30j02m09
$$ -287 187 35 -287 296 12 -391 320 124 -434 211 210 -358 109 163 -260 114 84 -248 182 80 -329
3382c29N23m2m97M68R5m94L30J25l91K78Q0l56L22K8l93L52J03m57L04J81m50
$$ -329 194 152 -345 123 218 -276 54 179 -212 66 146 -210 112 140 -253 99 202 -255 49 230 -220
3403b20K09K17l69J62J62l25K05J14l40K08J58l84J77K22l65J09K36l21R7K03
$$ -220 -11 206 -163 -1 161 -164 41 155 -185 23 181 -203 -26 196 -169 -60 176 -145 -48 155
3423A55k88R5J86k88J03K04k97O1K39k80M2K34k67K9K19k34K6K19k45K6K27k52
$$ 155 -133 -38 148 -140 -37 167 -130 -69 170 -110 -68 166 -101 -72 147 -87 -61 158 -87 -61 166 -86
3445h6K0K40k51jK49k28k2K33k16k0K39k23j5K24j91l5K40k18l6K52k16l2K33
$$ -86 -66 174 -77 -78 171 -57 -79 154 -62 -82 157 -66 -81 143 -48 -83 157 -61 -97 155 -61 -93 140
3468A40j99k9K34k05m6K52k09l6K34j97l2K37k15l9K67k18n2K64j95m8K36j99
$$ 140 -59 -88 146 -59 -105 147 -62 -98 136 -61 -93 144 -71 -110 157 -61 -113 151 -44 -92 144 -55
3490e5l6K52k28j7K60k51k2K96k62m8K96k24o9K73k21j8K45k62J2K82l15oL55
$$ -55 -91 161 -67 -84 176 -75 -97 199 -63 -111 185 -39 -108 165 -56 -74 171 -91 -79 203 -112 -118 237
3513B37l28m4L38k70m9L02k84J6K78l46M1L66m19J5M33l99p4M34l27o7L49l28
$$ 237 -91 -135 203 -67 -116 186 -98 -82 196 -150 -109 257 -162 -147 286 -113 -187 247 -80 -147 202 -126
3535a26M1L40m51R1M45n28lN69m95j24N61m02q7M43m14M1M50n82Q9O23p02o0P73
$$ -126 -85 255 -196 -105 340 -188 -191 378 -117 -241 320 -82 -169 274 -140 -99 351 -231 -142 481 -221 -281 492
3558D92o01k06O79m24j52N23m86M3N55p44R2Q30q72j30R99o95l36Q59m81k14O27
$$ 492 -109 -315 364 -60 -212 311 -175 -132 423 -321 -229 601 -271 -401 598 -97 -433 426 -55 -269 358
3579C58n80N8O85q98N8J063j017k86J254p23n23J011m49l30P27o56L0Q91j091
$$ 358 -222 -164 521 -377 -319 744 -273 -559 695 -28 -551 460 11 -319 408 -248 -218 673 -418
3598d18k2J346j140n01J540p23p66J175m11m63Q42o97n5J077j197k06J661j188
$$ -418 -440 906 -234 -735 805 82 -684 491 80 -383 459 -238 -293 784 -413 -619 1042 -146
3616a46q00J804o51j054J333l21o42R53p17j64J312j304m20J989j211j130K051
$$ -146 -946 858 207 -847 486 165 -477 476 -241 -405 907 -397 -817 1172 -39 -1169 882
3633H82n13j365J442j83p92J025p13k73J503j377o35K279j167j477K266l32j654
$$ 882 369 -996 446 263 -529 496 -217 -490 1013 -364 -999 1280 113 -1364 902 570 -1084
3650a084J487k6r27J079p38l89J739j422r24K565j059j886K446p5j965J496J66
$$ -1084 403 377 -550 529 -209 -598 1141 -281 -1205 1360 301 -1585 861 786 -1179 317 483
3667D83j089J129o95n43J918j381j256K830q83k289K539K34k271J463M10j246
$$ 483 -606 523 -172 -715 1203 -178 -1434 1396 513 -1776 763 997 -1274 189 599 -647
3683f47J133n80p44K093j273j623K997n79k714K559O22k545J347O93j385J103
$$ -647 486 -94 -838 1255 -18 -1641 1356 777 -1937 622 1244 -1301 46 739 -646 457
3699D57m59r45K223j118j968L107k58l077K498J014k783J212R41j487J061l50
$$ 457 -2 -947 1276 158 -1810 1297 1039 -2038 460 1474 -1309 -97 844 -643 418 68
3715F8j121K319r34k302L169Q0l402K374J393k908R92J154j510J006k57j256K376
$$ 68 -1053 1266 332 -1970 1199 1279 -2123 251 1644 -1264 -272 882 -628 378 121 -1135 1241
3732A241p38k605L157M74l661K144J773k960P32J397j524Q84q4j431K358m41k877
$$ 1241 503 -2102 1055 1529 -2132 12 1785 -1175 -443 954 -570 314 230 -1201 1157 716 -2161
3749b161L009R18l855J871K162l000M52J650j574P44J39j593K262q3l109K778
$$ -2161 848 1766 -2089 -218 1944 -1056 -604 1046 -528 216 355 -1238 1024 941 -2168 610
3765F10J367l968J512K515k969J57J835j534N76L32j692K113K32l234K510J737
$$ 610 1977 -1991 -479 2036 -933 -776 1059 -475 101 433 -1259 854 1086 -2148 362 2099
3781B099l967J138K795k845j21J939j445M54M68j758J960N32l308K185K076l872
$$ 2099 -1868 -730 2065 -780 -901 1038 -407 47 515 -1243 717 1249 -2059 126 2202 -1670
3797a670P43K954k612m14J989j310K96N98j771J757Q09l299J805K384l692L11
$$ -1670 -927 2027 -585 -999 990 -320 -24 574 -1197 560 1369 -1930 -125 2259 -1433 -1122
3813a122L114k366p21K072j203P7P99j752J425J121l172J342K609l402j30L179
$$ -1122 1992 -374 -1095 977 -226 -149 650 -1102 323 1444 -1728 -386 2223 -1179 -1309 1870
3829A870k076r72K087j035j40R45j665J080J378k967Q79K746l032n22L157j750
$$ 1870 -206 -1178 909 -126 -266 679 -986 94 1472 -1495 -616 2130 -902 -1424 1733 -17
3845a7j193K032q41l10J009j524P96J512k717M99K758k639q10K982j382j337J900
$$ -17 -1210 822 -19 -329 680 -844 -48 1464 -1253 -754 2004 -635 -1445 1537 155 -1182 718
3862G18o70m01J013j381N43J571k402J26K700k225j040K769j040j414J717m51
$$ 718 48 -353 660 -721 -178 1393 -1009 -883 1817 -408 -1448 1321 281 -1133 584 133
3878A33n35J008j190K77J588k054j88K543j763j233K523p26j455J565k92o63R97
$$ 133 -402 606 -584 -307 1281 -773 -961 1582 -181 -1414 1109 383 -1072 493 201 -462 535
3895E35r23k5J542j646m60K332j325j346K211m12j467J373j06p37R27p12k05J409
$$ 535 -388 -413 1129 -517 -977 1355 30 -1316 895 483 -984 389 283 -454 473 -239 -444 965
3913I65j275o30K064r63j363J892j73j398J151L8p49Q16m95l52J246r37p02J744
$$ 965 -310 -940 1124 161 -1202 690 517 -881 270 308 -441 375 -120 -472 774 -163 -865 879
3931H79o40j287J551J1j268R27J25o95O75l13m17J066o51p32J429l74j177J256
$$ 879 239 -1048 503 514 -754 173 298 -397 278 -35 -452 614 -37 -769 660 286 -891 365
3949C65J33j123P28K31o85N50j38m41Q35l84p16J129j39j054R31K59j004N50L08
$$ 365 498 -625 103 334 -351 199 61 -380 455 71 -645 484 345 -709 222 481 -523 27 335
3968C35o25L95J7m48O26j72o54Q23J7q85O75L15q32L80L25n20K51J04l81M32l5
$$ 335 -290 105 122 -326 300 128 -526 297 314 -571 104 419 -413 -33 292 -228 23 127 -254 178 143
3989A43n50N91R8p16M81L07o58K33L29m24J44J64l30K84N0m16L65J63n50K92L09
$$ 143 -407 184 282 -434 47 354 -304 -71 258 -166 -22 142 -188 96 146 -270 95 258 -292 0 309
4010C09n10J25L01l18M4J87k47J40J07l06K05J63l95J58K79l81L2K84k34k5J79
$$ 309 -201 -76 225 -93 -49 138 -109 31 138 -168 37 200 -195 -37 242 -139 -107 177 -57 -82 97
4031I7j66L4J40k30Q9J82k66M2K48k49m2K53j56p2J85j13l3J47j47MJ78j79l3
$$ 97 -69 -35 105 -125 -36 146 -120 -78 170 -79 -121 132 -24 -96 89 -24 -57 90 -57 -53 125 -54 -87
4054h7K22j45q2K03r3j01J64o8p1J30p9m9J57j13n3J66j11p2J69q6p9J57p4q8
$$ -87 135 -10 -92 111 18 -83 81 13 -58 72 -7 -56 101 -12 -65 101 -10 -82 87 1 -78 79 5 -83
4078h3J40m6r2J37n2q9J52q1o1J34o3q5J67p3r5J68p0j04J58n0q3J47r2o0J82
$$ -83 57 11 -81 56 4 -85 67 -14 -75 59 -4 -89 78 5 -90 78 8 -96 62 12 -71 76 -16 -76 106
4103A06j10q6K19j15j22K23p3j51K06n7j03J57j21l5K14j90p8K94j85j54L13j18
$$ 106 -4 -90 129 14 -108 115 42 -109 97 40 -63 94 -27 -62 152 -38 -116 178 -7 -161 152 34
4125C4j74K47j04j03K26j70o2K93k41j33L96k15k26L92j16k16K90j30r9K90k65
$$ 34 -140 107 3 -100 126 -44 -106 187 -54 -187 209 -6 -232 160 44 -172 118 -12 -111 179 -86
4146h6o2M22l56j79N64k76l45N29j38k99L87j66j62M15l45j30O08m36l03P28k90
$$ -86 -148 274 -82 -261 303 27 -318 211 73 -226 161 -5 -167 248 -97 -227 381 -55 -358 370 80
4167H0m74O47j28m12M91k09k07N46m39k23Q08m99n04R60k81o79P68n6n40N68k00
$$ 80 -394 253 125 -287 204 -5 -212 334 -105 -328 480 -19 -523 437 156 -523 245 189 -351 217 17
4188A7l02O75n01l65J057n30p42J165j89r28Q82L2o77O51k18l99Q71n68n60J306
$$ 17 -285 390 -111 -476 581 51 -691 474 285 -643 239 271 -406 245 27 -372 499 -69 -629 677
4208F77n18j017J358o2j174R56J54q07O85j99m89J032o22p56J540m60j320J513
$$ 677 159 -858 500 438 -736 220 374 -433 252 53 -436 596 -26 -782 758 298 -1022 491
4226D91J10j451J005L00r71P68j60o30J182n86j037J758l30j677J640L76j707
$$ 491 601 -850 155 455 -516 252 92 -538 644 58 -979 779 449 -1228 412 788 -919
4243i19R58N32j114P56o0p95J334n24j319J940q6k085J697P18k006R04P83j247
$$ -919 39 571 -543 213 153 -642 692 168 -1151 789 703 -1382 315 1033 -973 -69 714 -533
4261e33P18L9r53J467m19j649K088J89k434J657J080k234P55J038j340O81J21
$$ -533 185 224 -729 738 319 -1330 758 947 -1487 170 1250 -984 -229 809 -531 150 271
4278B71j101J574k77j968K184M89k770J582J440k388N75J256j372N96K41j233
$$ 271 -830 744 467 -1501 683 1172 -1598 -16 1424 -964 -389 867 -505 91 332 -901
4294i01J629j00k250K183Q47l039J402J821k501L62J501j415M91M00j402J637
$$ -901 728 628 -1622 561 1408 -1631 -229 1592 -909 -547 954 -461 30 430 -972 665
4310F65J72k541K090J290l287J128K276k567J6J782j398L13N77j513J572M61k801
$$ 665 837 -1704 386 1676 -1611 -483 1793 -774 -758 1024 -374 -61 516 -997 575 1036 -1765
4327a765J937J735l460P85K670k536l22K000j357J60P14j610J489P75l001J722
$$ -1765 172 1907 -1553 -768 1902 -634 -956 1044 -313 -153 561 -1049 440 1215 -1786 -64
4343f4K146l525M12K982k415o36K126j241%Q35j660J373J025l078J440K488l478
$$ -64 2082 -1443 -1031 1951 -464 -1100 1026 -215 -215 620 -1040 333 1358 -1720 -280 2208 -1270
4360a270L1L195k220r51K203j107j70R71j660J166J292l094J077K811l333m06
$$ -1270 -1239 1956 -264 -1215 988 -119 -289 682 -978 188 1480 -1614 -537 2274 -1059 -1465
4376a465L384j972j276K252r33l67J076j640R36J571l049O90L079l109q78L536
$$ -1465 1919 -53 -1329 923 -10 -377 699 -941 -5 1566 -1483 -793 2286 -823 -1701 1835
4392A835j669j616K288p03n97J163j532O48J795k897K60L275k794j299L546j321
$$ 1835 166 -1450 838 135 -462 701 -831 -183 1612 -1285 -1025 2250 -544 -1843 1703 382
4408C82j864K206m89p35J208j427M07J954k712j19L343k438j595L403r60k019
$$ 382 -1482 724 235 -500 708 -719 -312 1642 -1070 -1189 2154 -284 -1879 1524 564 -1455
4424a455K068k94q47J209j287J69K009k428m50L299k057j837L216o28k111J906
$$ -1455 613 319 -528 681 -606 -437 1572 -856 -1306 1993 -64 -1901 1315 687 -1424 482
4440D82r6r38J174j096o8K013k107p58L187j614k060K970k63k183J706J34j049
$$ 482 386 -552 622 -474 -542 1471 -636 -1394 1793 179 -1881 1089 826 -1357 349 483 -566
4457e66J125q86k97J983j743j059L034j184k232K711O4k222J504L27j113J042
$$ -566 559 -327 -624 1359 -384 -1443 1591 407 -1825 886 950 -1272 232 559 -554 488
4473D88o72m86J888j395j229K742p76k275K377L41k151J250M58j094R17m69o19
$$ 488 -184 -670 1218 -177 -1406 1336 560 -1715 662 1003 -1148 102 560 -534 383 -86 -705
4490g05J732j058j333K449m50k180K009N17j996J017N57j058P93k88o77J533p51
$$ -705 1027 -31 -1364 1085 635 -1545 464 981 -1015 2 559 -499 294 6 -671 862 111
4507A11j346K103j77k059J676O51j833Q07O49j011O37r3p48J315m50j341J758
$$ 111 -1235 868 691 -1368 308 959 -874 -67 582 -429 208 115 -633 682 232 -1109 649
4524F49R8j915J301P96j658N75P31r41M83N8p40J078k21j273J431K70j719R99
$$ 649 747 -1168 133 929 -729 -154 577 -364 119 177 -563 515 294 -979 452 722 -997 2
4542BQ65j464L64P68q48L39J84o93Q39l1j139J101M02j493P23Q49j222K03P34
$$ 2 867 -597 -233 535 -313 26 210 -483 356 325 -814 287 689 -804 -81 768 -454 -251 483
4561D83p08K06K27n96O30R5r90Q32M40j244M93Q08j018R5O71n70P4K84n10M37
$$ 483 -225 -19 208 -388 242 337 -653 179 619 -625 -132 676 -342 -247 424 -146 -72 212 -298 139
4581A39J69q10N76M55j012L11P26p91l1O10m51lK89l80K38K16o26L58M62p93J33
$$ 139 308 -502 74 529 -483 -172 554 -237 -268 342 -109 -112 177 -203 35 251 -375 -17 445 -348 -215
4602b15O64n93j28N49l10j02K88k71J22K12m59K01L99n72K7N53m14j84M47k00
$$ -215 449 -144 -272 277 -33 -135 153 -118 4 216 -243 -42 357 -215 -188 365 -49 -233 214 14
4622A4j24K48k06L6K10l20Q1L25l90n1M40k75j95L53j14j44J95j08k8J64k03J2
$$ 14 -110 138 -68 -32 178 -142 -61 264 -126 -177 263 -12 -207 146 32 -112 83 -25 -53 111 -92 -80
4644h0K54k39j05L43j72j86K84m7j70J59l8o8J40j07m0J81j35j00K36o6j68J86
$$ -80 174 -65 -170 173 1 -185 99 52 -118 41 3 -65 75 -32 -72 109 -26 -126 110 44 -124 62
4666F2oj37J13Or2J10n1o7J50n8j20J64k9j49J41K5j37R5K7j12R3Nr1J03j2j10
$$ 62 56 -81 32 38 -54 56 5 -62 88 30 -90 74 45 -104 37 62 -75 20 47 -65 28 33 -58 45 33 -77
4692g7J13J0j30J08K5j44J18Mj13J07Lj08J04K0j14Q8K5j04J10qj35J49Mj35J16
$$ -77 36 46 -84 24 49 -95 23 27 -86 21 24 -84 20 40 -74 14 39 -65 45 37 -98 51 55 -80 36
4717C6L9j59J16L0j20J06j3j05J50l1j52J81J6k24J67P1k10J18N4j45J18j7j45
$$ 36 75 -84 32 62 -58 48 35 -70 80 49 -103 78 94 -130 37 108 -102 16 70 -75 43 26 -119
$$ [...]
8191C
##END NTUPLES=NMR FID
##END=
