##TITLE=1H ikalashn
AM_NV Styrene(nlock)
23.10.2024
##JCAMPDX= 6.0         $$ Bruker NMR JCAMP-DX V2.0
##DATA TYPE= NMR FID
##DATA CLASS= NTUPLES
##ORIGIN= UXNMR, Bruker Analytische Messtechnik GmbH
##OWNER= root
$$ TOPSPIN		Version 1.3
$$ 2024-10-23 13:42:54.843 +0400  Irina@DPX200
$$ Compression mode = diff/dup
##.OBSERVE FREQUENCY= 200.131300845
##.OBSERVE NUCLEUS= ^1H
##.DELAY= (6, 6)
##.ACQUISITION MODE= SIMULTANEOUS
##.ACQUISITION SCHEME= undefined
##.AVERAGES= 8
##.DIGITISER RES= 18
##SPECTROMETER/DATA SYSTEM= spect
##.PULSE SEQUENCE= zg
##.SOLVENT NAME= D2O
##.SHIFT REFERENCE= INTERNAL, D2O, 1, 17.49637
##AUDIT TRAIL= $$ (NUMBER, WHEN, WHO, WHERE, WHAT)
$$ ##TITLE= Audit trail, TOPSPIN		Version 1.3
$$ ##JCAMPDX= 5.01
$$ ##ORIGIN= Bruker BioSpin GmbH
$$ ##OWNER= Irina
$$ $$ F:/spectra/data/iren/nmr/1H/4/audita.txt
$$ ##AUDIT TRAIL=  $$ (NUMBER, WHEN, WHO, WHERE, VERSION, WHAT)
(   1,<2024-10-23 13:42:38.046 +0400>,<Irina>,<DPX200>,<TOPSPIN 1.3>,
      <created by zg
	started at 2024-10-23 13:42:00.328 +0400,
	POWCHK disabled, PULCHK disabled
       terminated by command 'halt'
       configuration hash MD5:
       BE 6D 3F 07 2A EA 11 49 91 17 2B D3 AF B3 58 0D
       data hash MD5: 16K
       59 DB 75 50 8D 02 E2 72 E3 12 D0 F3 78 BB 9A 08>)
$$ ##END=
$$ 
$$ $$ hash MD5
$$ $$ 35 4E 36 23 41 8C BB 03 EA EB 18 39 91 A9 5E AA
##$RELAX= 
##$RELAX= 
##$RELAX= 
##$RELAX= 
##$RELAX= 
##$RELAX= 
##$RELAX= 
##$RELAX= 
##$RELAX= 
$$ Bruker specific parameters
$$ --------------------------
##$DU= <F:/spectra>
##$EXPNO= 4
##$NAME= <1H>
##$PROCNO= 1
##$TYPE= <nmr>
##$USER= <iren>
##$AMP= (0..31)
100 100 100 100 100 100 100 100 100 100 100 100 100 100 100 100 100 100 
100 100 100 100 100 100 100 100 100 100 100 100 100 100 
##$ANAVPT= -1
##$AQSEQ= 0
##$AQ_mod= 1
##$AUNM= <au_zg>
##$AUTOPOS= <>
##$BF1= 200.13
##$BF2= 200.13
##$BF3= 200.13
##$BF4= 200.13
##$BF5= 200.13
##$BF6= 200.13
##$BF7= 200.13
##$BF8= 200.13
##$BYTORDA= 1
##$CFDGTYP= 0
##$CFRGTYP= 5
##$CHEMSTR= <none>
##$CNST= (0..63)
1 1 145 1 1 1 1 1 1 1 1 1 1 1 1 1 1 1 1 1 1 1 1 1 1 1 1 1 1 1 1 1 1 1 
1 1 1 1 1 1 1 1 1 1 1 1 1 1 1 1 1 1 1 1 1 1 1 1 1 1 1 1 1 1 
##$CPDPRG= <>
##$CPDPRG1= <>
##$CPDPRG2= <>
##$CPDPRG3= <>
##$CPDPRG4= <mlev>
##$CPDPRG5= <mlev>
##$CPDPRG6= <mlev>
##$CPDPRG7= <mlev>
##$CPDPRG8= <mlev>
##$CPDPRGB= <>
##$CPDPRGT= <>
##$D= (0..63)
0 2 0 0 0 0 0 0 0 0.06 0 0.03 0 0 0 0 0.0002 0 0 0 0 0 0 0 0 0 0 0 0 0 
0 0 0 0 0 0 0 0 0 0 0 0 0 0 0 0 0 0 0 0 0 0 0 0 0 0 0 0 0 0 0 0 0 0 
##$DATE= 1729676553
##$DBL= (0..7)
120 120 120 120 120 120 120 120 
##$DBP= (0..7)
150 150 150 150 150 150 150 150 
##$DBP07= 0
##$DBPNAM0= <>
##$DBPNAM1= <>
##$DBPNAM2= <>
##$DBPNAM3= <>
##$DBPNAM4= <>
##$DBPNAM5= <>
##$DBPNAM6= <>
##$DBPNAM7= <>
##$DBPOAL= (0..7)
0.5 0.5 0.5 0.5 0.5 0.5 0.5 0.5 
##$DBPOFFS= (0..7)
0 0 0 0 0 0 0 0 
##$DE= 6
##$DECBNUC= <off>
##$DECIM= 32
##$DECNUC= <off>
##$DECSTAT= 4
##$DIGMOD= 1
##$DIGTYP= 9
##$DL= (0..7)
0 120 120 120 120 120 120 120 
##$DP= (0..7)
$$ [...]
##$SW= 21.9926040160658
##$SWIBOX= (0..15)
0 0 2 0 0 0 0 0 0 0 0 0 0 0 0 0 
##$SW_h= 4401.40845070422
##$TD= 16384
##$TD0= 1
##$TE= 300
##$TE2= 300
##$TE3= 300
##$TEG= 300
##$TL= (0..7)
0 120 120 120 120 120 120 120 
##$TP= (0..7)
150 150 150 150 150 150 150 150 
##$TP07= 0
##$TPNAME0= <>
##$TPNAME1= <>
##$TPNAME2= <>
##$TPNAME3= <>
##$TPNAME4= <>
##$TPNAME5= <>
##$TPNAME6= <>
##$TPNAME7= <>
##$TPOAL= (0..7)
0.5 0.5 0.5 0.5 0.5 0.5 0.5 0.5 
##$TPOFFS= (0..7)
0 0 0 0 0 0 0 0 
##$TUNHIN= 0
##$TUNHOUT= 0
##$TUNXOUT= 0
##$USERA1= <user>
##$USERA2= <user>
##$USERA3= <user>
##$USERA4= <user>
##$USERA5= <user>
##$V9= 5
##$VALIST= <valist>
##$VCLIST= <CCCCCCCCCCCCCCC>
##$VD= 0
##$VDLIST= <DDDDDDDDDDDDDDD>
##$VPLIST= <PPPPPPPPPPPPPPP>
##$VTLIST= <TTTTTTTTTTTTTTT>
##$WBST= 1024
##$WBSW= 25
##$XGAIN= (0..3)
0 0 0 0 
##$XL= 0
##$YL= 0
##$YMAX_a= 273881
##$YMIN_a= -220529
##$ZGOPTNS= <>
##$ZL1= 120
##$ZL2= 120
##$ZL3= 120
##$ZL4= 120
##$ABSF1= 10
##$ABSF2= 0
##$ABSG= 5
##$ABSL= 3
##$ALPHA= 0
##$AQORDER= 0
##$ASSFAC= 0
##$ASSFACI= 0
##$ASSFACX= 0
##$ASSWID= 0
##$AUNMP= <proc_1d>
##$AXLEFT= 0
##$AXRIGHT= 0
##$AXTYPE= 0
##$AXUNIT= <>
##$AZFE= 0.1
##$AZFW= 0.1
##$BCFW= 1
##$BC_mod= 2
##$BYTORDP= 1
##$COROFFS= 0
##$CY= 7568.61572265625
##$DATMOD= 1
##$DC= 2
##$DFILT= <>
##$DTYPP= 0
##$F1P= 17.9538593292236
##$F2P= -4.03888763876832
##$FCOR= 0.5
##$FTSIZE= 32768
##$FT_mod= 4
##$GAMMA= 1
##$GB= 1
##$INTBC= 1
##$INTSCL= 1
##$ISEN= 128
##$LB= 0.02
##$LEV0= 0
##$LPBIN= 0
##$MAXI= 945.577
##$MC2= 0
##$MEAN= 0
##$ME_mod= 0
##$MI= -402.1523
##$NCOEF= 0
##$NC_proc= 0
##$NLEV= 6
##$NOISF1= 8.587773
##$NOISF2= 6.764455
##$NSP= 1
##$NTH_PI= 0
##$NZP= 0
##$OFFSET= 17.49637
##$PC= 1
##$PHC0= 47.95196
##$PHC1= -14.99111
##$PH_mod= 0
##$PKNL= yes
##$PPARMOD= 0
##$PPDIAG= 0
##$PPIPTYP= 0
##$PPMPNUM= 100
##$PPRESOL= 1
##$PSCAL= 0
##$PSIGN= 0
##$REVERSE= no
##$SF= 200.13
##$SI= 32768
##$SIGF1= 18.5376
##$SIGF2= -6.396296
##$SINO= 400
##$SIOLD= 32768
##$SREGLST= <1H.CDCl3>
##$SSB= 3
##$STSI= 0
##$STSR= 0
##$SW_p= 4401.40845070422
##$SYMM= 0
##$S_DEV= 0
##$TDeff= 0
##$TDoff= 0
##$TI= <>
##$TILT= no
##$TM1= 0
##$TM2= 0
##$TOPLEV= 0
##$USERP1= <user>
##$USERP2= <user>
##$USERP3= <user>
##$USERP4= <user>
##$USERP5= <user>
##$WDW= 1
##$XDIM= 8192
##$YMAX_p= 0
##$YMIN_p= 0
$$ End of Bruker specific parameters
$$ ---------------------------------
##NTUPLES= NMR FID
##VAR_NAME=  TIME,          FID/REAL,        FID/IMAG
##SYMBOL=    X,             R,               I
##VAR_TYPE=  INDEPENDENT,   DEPENDENT,       DEPENDENT
##VAR_FORM=  AFFN,          ASDF,            ASDF
##VAR_DIM=   8192,          8192,            8192
##UNITS=     SECONDS,       ARBITRARY UNITS, ARBITRARY UNITS
##FACTOR=    0.0002272,     1,               1
##FIRST=     0,             0,               0
##LAST=      1.8609952,     3,               -7
##MIN=       0,             -220529,         -220529
##MAX=       1.8609952,     273881,          273881
$$ Real data points
##PAGE= N=1
##DATA TABLE= (X++(R..R)), XYDATA
0@%%%%%%%%%%%JkRj6J7j8K0k8L4l6M5o0O9p8R4j11J28j45J64j89K15k43K77l11
$$ 0 0 0 0 0 0 0 0 0 0 0 0 1 -1 8 -8 9 -9 11 -17 17 -19 26 -34 35 -43 51 -60 68 -77 87 -102 113 -130 147 -164
35a64L53l99M47n00N57o22O91p66Q48r40J042j148J264j394J537j695J867k057
$$ -164 189 -210 237 -263 294 -328 363 -403 445 -495 547 -601 663 -731 806 -889 978 -1079
53a079K268k504K772l074L418l818M287m847N529o379P478q956J1068j4360K0263
$$ -1079 1189 -1315 1457 -1617 1801 -2017 2270 -2577 2952 -3427 4051 -4905 6163 -8197 12066
68A2066l4207J30032J39033q0706l4969p5013n1807p1845n0050n3087k7249k2727
$$ 12066 -22141 107891 246924 166218 131249 56236 4429 -67416 -117466 -170553 -197802 -220529
80b20529K228J0253L2301L7392N1273N0083N4272M4805M0067K5278J5269j925
$$ -220529 -218301 -208048 -175747 -138355 -87082 -36999 17273 62078 102145 127423 142692 140767
92A40767j2852k6969l4017m2360m3221m3573l7352l1239k0616j0858J378J1085
$$ 140767 127915 100946 66929 24569 -18652 -62225 -99577 -130816 -151432 -162290 -160912 -149827
104a49827K0843K7162L2144L3454L3245K9868K5222J8481J1988N144r90o863j1080
$$ -149827 -128984 -101822 -69678 -36224 -2979 26889 52111 70592 82580 87724 86734 79871 68791
117F8791j4020j5358j5747j4852j3221j1224r217o835m497k572j146K94J878L420
$$ 68791 54771 39413 23666 8814 -4407 -15631 -24848 -31683 -36180 -38752 -39898 -39604 -37726 -34306
131c4306M764O160P844R479J0727J1813J2640J2713J1812J0035P661M685J071
$$ -34306 -29542 -23382 -15538 -6059 4668 16481 29121 41834 53646 63681 71342 76027 77098
144G7098k887o665j0095j2978j5047j6027j5746j4568j2411r436o063k580P55
$$ 77098 74211 67546 57451 44473 29426 13399 -2347 -16915 -29326 -38762 -44825 -47405 -46650
157d6650L739N989P369P882P640O535M788K899J194l20j552k138j737o73P05K252
$$ -46650 -42911 -36922 -29553 -21671 -14031 -7496 -2708 191 1385 1065 -487 -2625 -4362 -5035 -4330 -2078
173b078M014N563O602O910O422N072K808r6l212o278r321j1869j3434j3815j3020
$$ -2078 1936 7499 14101 21011 27433 32505 35313 35217 32005 25727 16406 4537 -8897 -22712 -35732
188c5732j1225q349m496j75M205Q325J1921J4708J6249J6397J5354J3098R795
$$ -35732 -46957 -55306 -59802 -59977 -55772 -47447 -35526 -20818 -4569 11828 27182 40280 50075
201E0075N782J383l037p166j0691j3331j4835j5156j4458j2701j0041o758l116
$$ 50075 55857 57240 54203 47037 36346 23015 8180 -6976 -21434 -34135 -44176 -50934 -54050
214e4050N97M172P387R961J1685J2597J2662J2146J0851Q796O315L668R07j823
$$ -54050 -53453 -49281 -41894 -31933 -20248 -7651 5011 17157 28008 36804 43119 46787 47694 45871
228D5871m416o678q530r947j0787j0979j0716r908q526o640m350j876P36L435
$$ 45871 41455 34777 26247 16300 5513 -5466 -16182 -26090 -34616 -41256 -45606 -47482 -46746 -43311
242d3311O071Q296J0027J1232J1882J1892J1109R607P652N193K390m92l260n805
$$ -43311 -37240 -28944 -18917 -7685 4197 16089 27198 36805 44457 49650 52040 51548 48288 42483
256D2483q004r738j0746j1030j0658r762q286o373m200j994K43K393M158N443
$$ 42483 34479 24741 13995 2965 -7693 -17455 -25741 -32114 -36314 -38308 -38065 -35672 -31514 -26071
270b6071O326O828O965O647N938N033M003K903J781P00k48j043j689k197k501
$$ -26071 -19745 -12917 -5952 695 6633 11666 15669 18572 20353 21053 20805 19762 18073 15876 13375
285A3375k619k568k384k088j780j480j118p08l64j16K1jq4k23n06q77j285j679
$$ 13375 10756 8188 5804 3716 1936 456 -662 -1370 -1734 -1850 -1829 -1830 -1914 -2137 -2643 -3520 -4805 -6484
303f484j997k160k200j940j438p06J08J093K197L321M275M909N268N253M869M007
$$ -6484 -8481 -10641 -12841 -14781 -16219 -16925 -16817 -15724 -13527 -10206 -5931 -1022 4246 9499 14368 18375
319A8375K845J335l65k173l810n227o285o975p158o795n893m597l000j157P13
$$ 18375 21220 22555 22190 20017 16207 10980 4695 -2280 -9438 -16233 -22126 -26723 -29723 -30880 -30167
334c0167K394L782M826N486N708N417M769L824K775J712P73K0m93p23p09l96O6
$$ -30167 -27773 -23991 -19165 -13679 -7971 -2554 2215 6039 8814 10526 11299 11319 10826 10103 9394 8998 9064
351I064N49R86J325J428J317Q87K98m42j223k018k755l255l351l184k695j983
$$ 9064 9613 10599 11924 13352 14669 15556 15854 15412 14189 12171 9416 6161 2810 -374 -3069 -5052
367e052j109q7R54J818K406K745K628K191J470N05n21j572k455l066l376l136
$$ -5052 -6161 -6248 -5294 -3476 -1070 1675 4303 6494 7964 8469 7948 6376 3921 855 -2521 -5657
383e657k606j652m24R06K211L310M125M547M386L723K498R53q67k745m536n958
$$ -5657 -8263 -9915 -10339 -9433 -7222 -3912 213 4760 9146 12869 15367 16320 15453 12708 8172 2214
399B214o936p355p093o224m747k803o57J571L619N341O648P349P359O758N681
$$ 2214 -4722 -12077 -19170 -25394 -30141 -32944 -33601 -32030 -28411 -23070 -16422 -9073 -1714 5044 10725
414A0725M234K585Q65p63k124l099l632l679l276k635j735q02Q7P99J237J379
$$ 10725 14959 17544 18409 17646 15522 12423 8791 5112 1836 -799 -2534 -3336 -3249 -2450 -1213 166
430A66J151O92oq14j549k078k271k279j914j225j79J001K176L157L944M346M266
$$ 166 1317 2009 2003 1189 -360 -2438 -4709 -6988 -8902 -10127 -10306 -9305 -7129 -3972 -28 4318 8584
447H584L742K756J440r0j675l190m410n142n346m958m104k741j024Q56K776M430
$$ 8584 12326 15082 16522 16432 14757 11567 7157 2015 -3331 -8289 -12393 -15134 -16158 -15302 -12526 -8096
463h096N612O244O311N785M646L036J073r48k871m487n696o275o238n610m491
$$ -8096 -2484 3760 10071 15856 20502 23538 24611 23663 20792 16305 10609 4334 -1904 -7514 -12005
478a2005k943j166O85K365L768M639N004M798M078L035J598Rj517k823l750m189
$$ -12005 -14948 -16114 -15429 -13064 -9296 -4657 347 5145 9223 12258 13856 13865 12348 9525 5775 1586
494A586m258l685k828j629l29J024K213L050L434L437K902K005Q24n35j870l114
$$ 1586 -2672 -6357 -9185 -10814 -11143 -10119 -7906 -4856 -1422 2015 4917 6922 7746 7211 5341 2227
510B227m174m784m938m675m024l021j765l86R32K146L130L829M145M178L915L503
$$ 2227 -1947 -6731 -11669 -16344 -20368 -23389 -25154 -25540 -24608 -22462 -19332 -15503 -11358 -7180 -3265 238
526B38K991K345J853J457J169J008J006J070J118J086Q98N57K2p21j633k598l576
$$ 238 3229 5574 7427 8884 10053 11061 12067 13137 14255 15341 16239 16796 16818 16097 14464 11866 8290
543H290m410m960n235n082m486l415j943k48J705L661N451O891P819Q232Q058
$$ 8290 3880 -1080 -6315 -11397 -15883 -19298 -21241 -21489 -19784 -16123 -10672 -3781 4038 12270 20328
558B0328P196N719L797J507r20l271n343o988q159q682q530p801o570m897k988
$$ 20328 27524 33243 37040 38547 37627 34356 29013 22025 13866 5184 -3346 -11147 -17717 -22614 -25602
573b5602j027Q38K405L672M512M867M756M177L374K287J158Q9r15j663k220k466
$$ -25602 -26629 -25791 -23386 -19714 -15202 -10335 -5579 -1402 1972 4259 5417 5506 4591 2928 708 -1758
589a758k374k124j686j078m09J41O71J111J414J553J528J479J382J170R61Q32
$$ -1758 -4132 -6256 -7942 -9020 -9429 -9288 -8617 -7506 -6092 -4539 -3011 -1532 -150 1020 1981 2813
605B813P24N58L49K10J17m3k82n69q54j164j506j740j838j803j703j455r70l00
$$ 2813 3537 4095 4444 4654 4771 4728 4446 3877 3023 1859 353 -1387 -3225 -5028 -6731 -8186 -9156 -9456
623i456M41J187J919K557L115L447L464L384K974K321J467N36m13j312k211k864
$$ -9456 -9015 -7828 -5909 -3352 -237 3210 6674 10058 13032 15353 16820 17356 16943 15631 13420 10556
639A0556l336l482l538l394k889k311j654j019l72K84Q53J200J449J582J621J479
$$ 10556 7220 3738 200 -3194 -6083 -8394 -10048 -11067 -11439 -11155 -10302 -9102 -7653 -6071 -4450 -2971
655b971J313J235J154R53P59P07P11O44N81N42M94L97J58p7k83n61q92j198j412
$$ -2971 -1658 -423 731 1684 2443 3150 3861 4505 5086 5628 6122 6519 6677 6600 6317 5756 4864 3666 2254
674B254j579j750j796j702j525j313j023o35k04K52O82J116J516J838K053K242
$$ 2254 675 -1075 -2871 -4573 -6098 -7411 -8434 -9069 -9273 -9021 -8339 -7223 -5707 -3869 -1816 426
690D26K295K193J984J696J275P62K02m37j116j762k269k644k938l056k937k633
$$ 426 2721 4914 6898 8594 9869 10631 10833 10396 9280 7518 5249 2605 -333 -3389 -6326 -8959
706h959k074j363n23L81J314K175K900L442L786L787L529L023K237J261J87r04
$$ -8959 -11033 -12396 -12919 -12538 -11224 -9049 -6149 -2707 1079 4866 8395 11418 13655 14916 15103 14199
722A4199j971k935l667m112m308m120l748l094k242j214j63Q42J746K511L091
$$ 14199 12228 9293 5626 1514 -2794 -6914 -10662 -13756 -15998 -17212 -17375 -16533 -14787 -12276 -9185
737i185L459L514L455L182K765K275J650J020M18j54p07j202j617j986k306k492
$$ -9185 -5726 -2212 1243 4425 7190 9465 11115 12135 12553 12399 11692 10490 8873 6887 4581 2089
753B089k658k728k710k632k347j942j434p87k7Q57J707K542L340L946M379M515
$$ 2089 -569 -3297 -6007 -8639 -10986 -12928 -14362 -15149 -15176 -14319 -12612 -10070 -6730 -2784 1595 6110
769F110M362L967L311K374J258R1j117k219l153l790m162m183l970l382k576j680
$$ 6110 10472 14439 17750 20124 21382 21473 20356 18137 14984 11194 7032 2849 -1121 -4503 -7079 -8759
785h759p27K46J061J671K052K115K048J743J203N55r0o31j089j381j433j287r87
$$ -8759 -9486 -9240 -8179 -6508 -4456 -2341 -293 1450 2653 3208 3118 2487 1398 17 -1416 -2703 -3690
802c690n95r4M16Q86J175J303J287J079O46J35m53r99j543j962k115k120j907
$$ -3690 -4285 -4379 -3963 -3077 -1902 -599 688 1767 2413 2548 2095 1096 -447 -2409 -4524 -6644 -8551
819h551j518r77l31L39R61J516J857K032J936J676J334Q54L14j97n99q27q87p42
$$ -8551 -10069 -11046 -11377 -11038 -10077 -8561 -6704 -4672 -2736 -1060 274 1128 1442 1245 646 -181 -1068 -1810
837a810m07Q2O54J202J689K069K286K327K080J626R94K87n00j244j884k343k582
$$ -1810 -2217 -2135 -1481 -279 1410 3479 5765 8092 10172 11798 12792 13079 12579 11335 9451 7108 4526
854D526k610k408j988j358o86oO37J163J508J681J655J377R41M36q9n71r39j234
$$ 4526 1916 -492 -2480 -3838 -4524 -4530 -3893 -2730 -1222 459 2114 3491 4432 4868 4779 4208 3269 2035
872B035j329j271r69n61j03L85Q27J152J309J253J001N88M0n92j282j897k376
$$ 2035 706 -565 -1534 -2095 -2198 -1813 -986 166 1475 2728 3729 4317 4357 3765 2483 586 -1790
889a790k604k646k440k017j355n95L21J154J901K487K825K930K845K450J861J206
$$ -1790 -4394 -7040 -9480 -11497 -12852 -13447 -13126 -11972 -10071 -7584 -4759 -1829 1016 3466 5327 6533
905F533N06k50q68j334j556j696j624j343r16m28K4M94Q13J032J072R52P60L94
$$ 6533 7039 6789 5921 4587 3031 1335 -289 -1632 -2548 -2976 -2952 -2458 -1645 -613 459 1411 2171 2565
923B565L1l71o82r18j028r94p97m87j31K70O75R96J220J294J204R52O05J80k67
$$ 2565 2596 2225 1543 625 -403 -1397 -2194 -2681 -2812 -2542 -1867 -871 349 1643 2847 3799 4404 4584 4317
942D317o99j092j363j488j410j197p92l26J76O85J117J507J723J714J538J208
$$ 4317 3618 2526 1163 -325 -1735 -2932 -3724 -4050 -3874 -3189 -2072 -565 1158 2872 4410 5618
958E618P93K44l52q48j297j618j812j840j627j295q58l92J27O09R87J268J427
$$ 5618 6411 6655 6303 5455 4158 2540 728 -1112 -2739 -4034 -4892 -5284 -5157 -4548 -3561 -2293 -866
975h66J453J287J052P19L35l7l71o49p99q82q66p22n05k84m6J59K97L60L64K87
$$ -866 587 1874 2926 3645 3980 3943 3572 2923 2124 1242 376 -346 -851 -1135 -1181 -1022 -725 -365 -1 286
995B86J37r9l01m93o77p58p80p32n70m13j85O5K92M90O29P10P22O72N72M30K82
$$ 286 423 324 23 -470 -1147 -1905 -2685 -3417 -3987 -4400 -4585 -4520 -4228 -3738 -3109 -2399 -1677 -1005 -433 -3 279
1016B79J18J2n1o8m9M4J66L09M45N49O32N90N20L63J62j05l84o72r23j118j273
$$ 279 397 409 358 290 241 285 451 760 1205 1754 2386 2976 3496 3859 4021 3916 3532 2860 1937 819 -454
1037d54j283j191j012p83m67j28K65O24R61J228J410J529J505J402J203R75O99
$$ -454 -1737 -2928 -3940 -4723 -5190 -5318 -5053 -4429 -3468 -2240 -830 699 2204 3606 4809 5784 6483
1054F483L81N0k94n63p82r91j116j204j259j237j179j048q92p18n30l29r8J16
$$ 6483 6864 6914 6620 6057 5275 4284 3168 1964 705 -532 -1711 -2759 -3651 -4369 -4899 -5228 -5326 -5210
1072e210L45N34O89Q12R25R81J023R88Q52P40N77M09K18lj60l12m30m97n79n89
$$ -5210 -4865 -4331 -3642 -2830 -1905 -924 99 1087 1939 2679 3256 3665 3883 3880 3720 3408 2978 2481 1902 1313
1092A313n53n37m87m25l40k95k51k15j58j60j20q0l6NN0J26J90K57L37L47L87
$$ 1313 760 223 -264 -689 -1029 -1324 -1575 -1790 -1948 -2108 -2228 -2308 -2344 -2339 -2289 -2163 -1973 -1716 -1379 -1032 -645
1113f45L82L48L09K28J57N5m0j21j53j78j80j22q9j4N3J19J64J75J50R1k7j13
$$ -645 -263 85 394 622 779 834 794 673 520 342 162 40 -49 -63 -10 109 273 448 598 689 662 549
1135E49k64l65m86n22n42n10m15k52m9J52L64N97P93R24R94R76Q94P23M92K62
$$ 549 285 -80 -566 -1088 -1630 -2140 -2555 -2807 -2856 -2704 -2340 -1743 -950 -26 968 1944 2838 3561 4053 4315
1155D315nk60m77o26p83q00p46o79n09l26j51K8J56K51K74K38J80N2n7j96k73
$$ 4315 4310 4050 3573 2947 2164 1364 618 -61 -570 -896 -1047 -1019 -863 -612 -338 -100 80 132 75 -121 -394
1176c94l25l18k79j69m3J49L27M57O10O79O62N78M53K56Ok44m79o65p84q80q49
$$ -394 -719 -1037 -1316 -1485 -1528 -1379 -1052 -595 15 694 1356 1934 2387 2643 2649 2405 1926 1261 477 -403 -1252
1197a252p28n21k90jK73N51P24Q59Q82Q60P03M54J80r7l75o73q25r47r44q66p28
$$ -1252 -1980 -2501 -2791 -2792 -2519 -1968 -1244 -385 497 1357 2060 2514 2694 2597 2222 1549 724 -223 -1167 -2033 -2761
1218b761m90k17L0K99M92O30O77O56N61M36K48J6j59k96l54l85l33k06o1J18K90
$$ -2761 -3251 -3468 -3438 -3139 -2647 -2017 -1340 -684 -123 313 561 577 418 122 -232 -617 -950 -1156 -1217 -1099 -809
1239h09M50N46N81M97L81K11k2k78n24p38r01r39r10p52n38k30J40M83Q56J166
$$ -809 -359 187 768 1265 1646 1857 1835 1557 1033 295 -606 -1545 -2455 -3207 -3745 -3975 -3835 -3352 -2496 -1330
1259a330J396J520J515J371J151Q70M92J25k75o11q96j055j124j115j045q84o78
$$ -1330 66 1586 3101 4472 5623 6493 6985 7110 6835 6224 5328 4273 3149 2034 989 105 -573
1276e73m65k32o4R9J66J72J35O0k7j15j69k26j94j65o7Q5K29L54M69N54N41M80
$$ -573 -1038 -1270 -1334 -1235 -1069 -897 -762 -702 -729 -844 -1013 -1239 -1433 -1598 -1665 -1580 -1351 -997 -528 26 567 1047
1298A047L57J79n2l16n50p54r18j015r91q87p11n13k09Q4M15O56Q55R37J015R61
$$ 1047 1404 1583 1531 1215 665 -89 -1007 -2022 -3013 -3900 -4611 -5124 -5333 -5249 -4834 -4178 -3323 -2386 -1371 -410
1318d10P99N91L39O5k03l91n30n75n68m36k33mK47M88P37Q89R50R58Q70P10M42
$$ -410 389 980 1319 1384 1181 790 260 -315 -883 -1319 -1552 -1556 -1309 -821 -84 805 1755 2713 3583 4293 4735
1339D735J99n8l36n52p00q21q90q31p49o04l90j92l2J31K50L13L48L23K64J82
$$ 4735 4934 4876 4540 3988 3288 2467 1577 746 -3 -607 -997 -1189 -1221 -1090 -840 -527 -179 144 408 590
1359E90R4Pm0r1r9p6k8K1J02J40J75J70J36P0n1j68k95m25n37o65o52o55n69m70
$$ 590 684 691 651 560 461 385 357 378 480 620 795 965 1101 1171 1120 952 657 232 -305 -970 -1622 -2277 -2846 -3316
1383c316l07j36P7K39M09N53O40O73O41N74M95L69K16R1j2r5j91j79j66j03q6
$$ -3316 -3623 -3759 -3682 -3443 -3034 -2481 -1841 -1168 -527 47 542 911 1127 1218 1206 1111 920 741 575 472 386
1404C86k2N1R5Q8R4O1Pq1j70k54l19l45l78l39k69j75m7P9K29L67M52N49N66N26
$$ 386 364 415 510 598 692 753 760 679 509 255 -64 -409 -787 -1126 -1395 -1570 -1617 -1538 -1309 -942 -490 59 625 1151
1428A151M78L69K29O6q5k22l86m68n34n68n34m81l70k57r6J3J47K65L54L88M50
$$ 1151 1629 1998 2227 2293 2208 1986 1600 1132 598 30 -504 -985 -1355 -1612 -1708 -1695 -1548 -1283 -929 -541 -91
1449i1M25L89L17K37J77O1j8j18j96k32l19l43l52l42l33k87k36j59r5kP2J51
$$ -91 334 723 1040 1277 1454 1515 1497 1379 1183 951 632 289 -63 -405 -738 -1025 -1261 -1420 -1515 -1517 -1445 -1294
1471a294K23L16L50L99L95M08L51L11K34J30M0o2j81k61l19l79m19m30m03l47
$$ -1294 -1071 -755 -405 -6 389 797 1148 1459 1693 1823 1863 1801 1620 1359 1040 661 242 -188 -591 -938
1491i38k82k00j16l9M9J10J69K36K59K39K87K72K19K06J81J63R7M8M0Ll5o7j07
$$ -938 -1220 -1420 -1536 -1575 -1526 -1416 -1247 -1011 -752 -513 -226 46 265 471 652 815 912 960 1000 1003 968 901 794
1514G94j15j60j79j74j83k01j91j70j33j10o6m0j0OL0L5J2K3Qj2l1l2m7j2L0N2
$$ 794 679 519 340 166 -17 -218 -409 -579 -712 -822 -888 -928 -938 -932 -902 -867 -855 -832 -824 -836 -867 -899 -946 -958 -928 -876
1540h76J06J58K44K82L25L42L35L28K59J74Q7k6j46k48l42l82m47m55l98l19k46
$$ -876 -770 -612 -368 -86 239 581 916 1244 1503 1677 1764 1738 1592 1344 1002 620 173 -282 -680 -999 -1245
1561a245j23NJ34K57L15M09M50M44L92L62K75J84J05Nn3j19j77j78j96j87j67
$$ -1245 -1368 -1363 -1229 -972 -657 -248 202 646 1038 1400 1675 1859 1964 1969 1916 1797 1620 1442 1246 1059 892
1582H92j45j38j33j37j41j70j95k22k40k61k56k16j89j07m3M1J36K17K75L01L23
$$ 892 747 609 476 339 198 28 -167 -389 -629 -890 -1146 -1362 -1551 -1658 -1701 -1660 -1524 -1307 -1032 -731 -408
1603d08K95K34J55O1n9j43k57l15l42l47l07k29j38k0R8K52L31M26M77M79M44
$$ -408 -113 121 276 337 278 135 -122 -437 -779 -1126 -1433 -1662 -1800 -1820 -1722 -1470 -1139 -713 -236 243 687
1624F87L68K59J35nj07k42l08l81m14l87l17k42j26l2R8J73K69L36L85L81L31
$$ 687 1055 1314 1449 1444 1337 1095 787 406 -8 -395 -712 -954 -1080 -1112 -1014 -841 -572 -236 149 530 861
1645H61L06K55J83J10O8j1l4q4r6j20j40j64j72k17k49k89l01l60l52l58l44k45
$$ 861 1167 1422 1605 1715 1783 1772 1738 1654 1558 1438 1298 1134 962 745 496 207 -94 -454 -806 -1164 -1508 -1753
1667a753j66p2M0J89K97M22N15N76O09N72M74L71K31N9j06k93m33n79o28o90o48
$$ -1753 -1919 -1991 -1951 -1762 -1465 -1043 -528 48 657 1229 1703 2074 2305 2364 2258 1965 1532 953 325 -365 -1013
1688a013n59m50k93j41N0K24L59M48N28N45N45M65L84K61J37Pr5k06k80l06l54
$$ -1013 -1572 -2022 -2315 -2456 -2406 -2182 -1823 -1375 -847 -302 243 708 1092 1353 1490 1497 1402 1196 916 610 256
1709B56l19l00k52j92j30r2j7l0ML0L9M3N4P8P7J28J52J88K30K25K51K42K32J68
$$ 256 -63 -363 -615 -807 -937 -1029 -1046 -1076 -1072 -1042 -1003 -960 -906 -828 -751 -623 -471 -283 -53 172 423 665 897 1065
1733A065J32N6m9j04k19k59l22l57l70l42k61k08j19rJ09J98K75L57M14M29M13
$$ 1065 1197 1253 1204 1100 881 622 300 -57 -427 -769 -1030 -1238 -1357 -1366 -1257 -1059 -784 -427 -13 416 829
1754H29L61L25K30J81J00j3o0j34j89k19k49k55k58k84k61k61k33k29k21j87j52
$$ 829 1190 1515 1745 1926 2026 2013 1953 1819 1630 1411 1162 907 649 365 104 -157 -390 -619 -840 -1027 -1179
1775a179j38o6j9M0J06J63K30K97L33L53L47L27K59J66R3Nj28k27l22m17m43m93
$$ -1179 -1317 -1383 -1402 -1362 -1256 -1093 -863 -566 -233 120 467 794 1053 1219 1312 1317 1189 962 640 223 -220 -713
1797g13m60m00l48k39j24%J32K39L29M20M64M79M80M09L59K63J54M2m9j36k05
$$ -713 -1173 -1573 -1921 -2160 -2284 -2284 -2152 -1913 -1584 -1164 -700 -221 259 668 1027 1290 1444 1486 1437 1301 1096
1818A096k76l02l17k90k68k08j52q5j3P0J37J68K29K59K59K59K29K15J58J25M7
$$ 1096 820 518 201 -89 -357 -565 -717 -802 -815 -745 -608 -440 -211 48 307 566 795 1010 1168 1293 1340
1839A340j6p9j42j79k51k73l08k81k78k59k11j32r2j0Q1J40J91K43K82K83K96
$$ 1340 1324 1245 1103 924 673 400 92 -189 -467 -726 -937 -1069 -1161 -1171 -1090 -950 -759 -516 -234 49 345
1860C45K49K14J79R3K3m6j06j59k36k49k62k63k60k11j74j13p2j6M8R2J40J56
$$ 345 594 808 987 1080 1103 1057 951 792 556 307 45 -218 -478 -689 -863 -976 -1048 -1064 -1016 -924 -784 -628
1882f28J91J98J98J65J61J48R3P5K8%j2m5p7q9j10r9j08j08r4p5q2o8l2l7j5J0
$$ -628 -437 -239 -41 124 285 433 526 601 629 629 617 572 495 406 296 197 89 -19 -113 -188 -270 -338 -370 -407 -422 -412
1908d12oK9K0M6M2M7N4M5N6O6O0O3P6O6O4L6M4K2J4k6m6o8r3j02j15j28j39j03
$$ -412 -418 -389 -369 -323 -281 -234 -180 -135 -79 -13 47 110 186 252 316 352 396 418 432 406 360 292 199 97 -18 -146 -285 -388
1936c88j11q3m5J1M1Q2R7J53J61J66J70J55J28R2O5J8l6p8j02j65j60j78j74j63
$$ -388 -499 -582 -627 -616 -575 -493 -396 -243 -82 84 254 409 537 629 694 712 676 598 496 331 171 -7 -181 -344
1960c44j33j08p9k6K0P0R7J31J44J63J63J75J47J39R9P2N0J5j8m5p6j08j12j40
$$ -344 -477 -585 -664 -690 -670 -600 -503 -372 -228 -65 98 273 420 559 658 730 780 795 777 732 656 548 436 296
1984B96j48j43j40j28j27j05o1l1pK5Q0J07J42J52J70J55J45J32J13O8J3k6q2
$$ 296 148 5 -135 -263 -390 -495 -556 -587 -594 -569 -489 -382 -240 -88 82 237 382 514 627 695 708 682 600
2007F00j23j50j91k05k13k10j86j63j40p3m0K5M3Q3J24J21J59J58J59J49J30J22
$$ 600 477 327 136 -69 -282 -492 -678 -841 -981 -1054 -1094 -1069 -1026 -943 -819 -698 -539 -381 -222 -73 57 179
2029A79Q7P1L1Oj9k4l9p8o8q3o4q7o8n7l4k1qK6O3P8R7J17J36J42J39J46J37P2
$$ 179 266 337 368 374 355 331 292 214 146 63 -1 -88 -156 -213 -247 -268 -276 -250 -187 -109 -12 105 241 383 522 668 805 877
2057H77P3L8k5m3p2j12j39j57j71j44j52j05j09m7k5mL0N9O7R6R1N8O8L3K1rn6
$$ 877 950 988 963 920 848 736 597 440 269 125 -27 -132 -241 -288 -313 -317 -287 -228 -161 -65 26 84 152 185 206 197 141
2084A41n0p6q5j06r4r7r7o1p1k4j9RK1K7M2N3M5N5P4M5N3J9L5L7J6K8JL8K6J2
$$ 141 91 15 -70 -176 -270 -367 -464 -525 -596 -620 -639 -630 -609 -582 -540 -487 -442 -387 -313 -268 -215 -196 -161 -124 -108 -80 -79 -41 -15 -3
2114cM2K7L4L1N4J0M4K6QkOJm4j5m5n2l6l2n7j3L%L0M7L6P1P3Q6P2O7N8L4Qj7
$$ -3 39 66 100 131 185 195 239 265 273 271 277 278 234 219 174 122 86 54 -3 -16 -13 -13 17 64 100 171 244 330 402 469 527 561 569 552
2148E52l6r0j14j16j42j29j53j41j11j08o2j5J1N2J03J22J46J48J63J58J32J17
$$ 552 516 426 312 196 54 -75 -228 -369 -480 -588 -650 -665 -654 -602 -499 -377 -231 -83 80 238 370 487
2170D87P0L9Pn5q4j20j64j69j81j69j52j31j01n4qM1P9J34J49J85J91K05J70J60
$$ 487 557 596 603 548 464 344 180 11 -170 -339 -491 -622 -723 -777 -785 -744 -665 -531 -382 -197 -6 199 369 529
2194E29J18Q0L6k8o2j34j44j82j74k00j78j80j11p1n2lN5J00J31J66J63J79J65
$$ 529 647 727 763 735 673 539 395 213 39 -161 -339 -519 -630 -701 -753 -756 -701 -601 -470 -304 -141 38 203
2217B03J50J30P1K6Rl6q6j01j33j30j35j31j02p9n9k2J9M2O2J04R2J11J02R8Q6
$$ 203 353 483 554 580 589 553 467 366 233 103 -32 -163 -265 -344 -403 -425 -406 -364 -302 -198 -106 5 107 205 291
2242B91O1L3J7j5l0n7m8p5p9o6p2l1m8k3k8J9J3K8K9N0K0L8J3J4Mj4j9pk5k7j3
$$ 291 352 385 402 387 357 300 252 177 98 32 -40 -71 -119 -142 -170 -151 -138 -110 -81 -31 -11 27 40 54 58 44 25 18 -7 -34 -47
2273d7k2loK1L0J4L4L9L5K8K3mPl1m0m8p9p1p1o8o3m3m4K0K0O1P6R7J30J35J20
$$ -47 -69 -72 -78 -57 -27 -13 21 60 95 123 146 142 149 118 78 30 -49 -120 -191 -259 -322 -365 -409 -389 -369 -308 -232 -135 -5 130 250
2304B50J22R4O8M9Ll1o3j15j39j66j61j70j61j56j25o4l1nN5R0J55J72J83K08
$$ 250 372 466 534 583 586 555 492 377 238 72 -89 -259 -420 -576 -701 -765 -796 -801 -746 -656 -501 -329 -146 62
2328F2J94J90J49J09P0M6l0p0j03j57j80j98k01j87j80j31j09l4j2O3R7J53J80
$$ 62 256 446 595 704 774 820 790 720 617 460 280 82 -119 -306 -486 -617 -726 -760 -772 -709 -612 -459 -279
2351b79K09J89K13J81J50J24N7K3n2p9j23j69j81j94j85j69j51q8p7k1J6O5R0
$$ -279 -70 119 332 513 663 787 844 867 815 736 613 444 263 69 -116 -285 -436 -524 -601 -622 -606 -541 -451
2374d51J27J38J42J41J28J08P3M2J5k6m8p7q9j03j02j28r7q9o1o0n4mML3N2O5
$$ -451 -324 -186 -44 97 225 333 406 448 463 437 389 312 223 120 18 -110 -207 -296 -357 -417 -471 -475 -471 -438 -386 -321
2400c21O8P0R2R2P3Q8N3P2L0J4Nk3l1n7n8p2p8o5p2n9n0k8jj2J5L7M6M9N1N2M5
$$ -321 -253 -183 -91 1 74 162 215 287 317 331 336 313 282 225 167 95 17 -48 -120 -179 -229 -257 -258 -270 -255 -218 -172 -123 -72 -20 25
2431B5L2M1K5kJ7nnmMMmLL0kJJ1j5l3m2m1n7p0o0o7o2l9k6QM9M7P6J08R7J18J19
$$ 25 57 98 123 121 138 133 128 124 128 132 128 131 161 159 160 171 156 123 81 40 -17 -87 -147 -214 -276 -315 -341 -333 -284 -237 -161 -53 44 162 281
2466B81R8P7M2J2j5n4r1j17j21j22j36j09j07o2l7j1N5N0R1R9J10J07J03R8O4
$$ 281 379 456 498 510 495 441 350 233 112 -10 -146 -255 -362 -424 -461 -472 -417 -367 -276 -177 -67 40 143 241 305
2491C05M0J3j3l4m5o2q0j01q5p4q5q6p1n1l5k8rK4K5N7N9R3J07J10J22J11J21
$$ 305 345 358 345 311 266 204 124 23 -62 -136 -221 -307 -378 -429 -464 -492 -501 -477 -452 -395 -336 -243 -136 -26 96 207 328
2518C28R5R0L5K7j5m6j07j16j37j44j65j51j26r7n5k2K3O9R9J49J58J65J75J55
$$ 328 423 513 548 575 560 514 407 291 154 10 -155 -306 -432 -529 -584 -606 -583 -514 -415 -266 -108 57 232 387
2542C87J33J00O3L7j9l1p9j11j15j37j27j13r8p9o4k4k4mJ5J2M5K1M8K8L1K0K2
$$ 387 520 620 683 720 701 670 591 480 365 228 101 -12 -110 -189 -253 -277 -301 -305 -290 -278 -233 -212 -164 -136 -105 -85 -63
2569f3L1K5J0K6J9J8Pklrl0k6l6l7n3m2m5k8rPJ7M1L5N7O6N0N0L8K8J3Ok0l3n3
$$ -63 -32 -7 3 29 48 66 73 71 68 59 29 3 -33 -70 -123 -165 -210 -238 -247 -240 -223 -182 -147 -90 -24 26 76 114 142 155 161 141 108 55
2603E5m0n2l5m3j0j0J3K6M5M0N5M6O1M5K1K4Nj2k5m0l4l2n2l3l7j7rj3lJ7mJ2
$$ 55 15 -37 -72 -115 -125 -135 -122 -96 -51 -11 44 90 151 196 217 241 246 234 209 169 135 103 51 18 -19 -36 -45 -58 -61 -44 -48 -36
2635c6j5Ljj7j7j0l1ppQLK3L0L0M1M2M2L1M8K8J9j0krl0m7l2n9n1l0n4m5m1l3
$$ -36 -51 -48 -49 -66 -83 -93 -124 -131 -138 -130 -127 -104 -74 -44 -3 39 81 112 160 188 207 197 195 186 156 109 77 18 -33 -63 -117 -162 -203 -236
2669b36mlQK1K7L2M7L8O4M7N7N2N2J4M8J0j2j0m8l7o2o8o2p2n7n9l5k2pJ4K2M9
$$ -236 -240 -243 -235 -214 -187 -155 -108 -70 -6 41 98 150 202 216 264 274 262 252 204 167 105 37 -25 -97 -154 -213 -248 -270 -277 -263 -241 -192
2701a92N3O0O5P6P1M9M5L9J3j7qm4n8n5o8p4n8p8l2m2l5jOK6L9O2O6P5O5P0O7
$$ -192 -139 -79 -14 62 133 182 227 266 279 262 254 210 152 97 29 -45 -103 -181 -213 -255 -290 -291 -285 -259 -220 -158 -92 -17 48 118 185
2732A85O2M4K4Rol5l6p7o8q8q9o3j08n5m0k8J3pM8P3P1Q8Q3Q0P5P3M1L0J1lk6
$$ 185 247 291 315 324 318 283 247 170 102 14 -75 -138 -246 -301 -341 -369 -356 -363 -315 -242 -171 -83 0 80 155 228 269 299 310 307 281
2763B81j9l5l9n5l7k6m1k2j4lk1oj7k3j6j8l0k1k3k7j1pKM4L3M3N6O6N8N8M5M1
$$ 281 262 227 188 133 96 70 29 7 -7 -10 -31 -37 -54 -77 -93 -111 -141 -162 -185 -212 -223 -230 -228 -184 -151 -108 -52 14 72 130 175 216
2795B16jJ1j8k8m3n1n5o8n9n0k8k3j6lJ5J4K6J6K9RK8PJ4J5J3K2%L0K9K9K2L5
$$ 216 215 226 208 180 137 86 31 -37 -96 -146 -174 -197 -213 -216 -201 -187 -161 -145 -116 -107 -79 -72 -58 -43 -30 -8 -8 22 51 80 102 137
2827A37M6J6K2Pj1qm0l4l2n6l4l9j8qj4K7K1L5J3M2J9J0kk3l8m5n6o1p1m5k1k1
$$ 137 183 199 221 228 217 209 169 135 103 47 13 -26 -44 -52 -66 -39 -18 17 30 72 91 101 99 76 38 -7 -63 -124 -195 -240 -261 -282
2859b82J8M4P5P6J02J02R5O9P4K5Rm3o1r1j29j11j14j11j12o5m6k3K4M0Q7R7R4
$$ -282 -264 -220 -145 -69 33 135 230 299 373 398 407 364 303 212 83 -28 -142 -253 -365 -430 -476 -499 -475 -435 -348 -251 -157
2886a57J04Q0Q5O6N3J1pk9rn0m7l7j5k4j4j9MOQ%oqlk5rk2j5RKQL3L7M5K6M2K7
$$ -157 -53 27 112 178 231 242 235 206 197 147 100 63 48 24 10 -9 -5 1 9 9 3 -5 -8 -33 -42 -64 -79 -70 -68 -60 -27 10 55 81 123 150
2922A50K0j2lm3l5p5m4o8n7l8k1J0K5M8O4O8R5P0P7O1J6J3m0n9o8p9r8q3r5q0
$$ 150 170 158 155 112 77 2 -42 -110 -167 -205 -226 -216 -191 -143 -79 -11 84 154 231 292 308 321 281 222 154 75 -23 -106 -201 -281
2952b81l3oJM8O4R2O9R6O2O2M0K2%l3n4n4p3o6o0k9k7j7J8K7M9L8M9M8L3L6RN
$$ -281 -314 -320 -319 -271 -207 -115 -46 50 112 174 214 236 236 203 149 95 22 -44 -104 -133 -160 -177 -159 -132 -83 -45 4 52 85 121 130 135
2984A35j1k9m5l0l7k9m0j3j3nmJ3LlNlj4nnPJJ2L2K8N9N7O8P2P6O9L1K2j4j8o6
$$ 135 124 95 50 20 -17 -46 -86 -99 -112 -117 -121 -108 -105 -108 -103 -106 -120 -125 -130 -123 -122 -110 -78 -50 9 66 134 206 282 351 382 404 390 372 306
3019C06o8r7r6j21r3j06o1m9l2J9K7M6Q1R6Q8J00P3P8M8M7Rj3rl7l3l0o6l5k1
$$ 306 238 141 45 -76 -169 -275 -336 -385 -417 -398 -371 -325 -244 -148 -60 40 113 191 239 286 295 282 273 236 203 173 107 72 51
3048E1l3k5j2k6j1j7j6rk0k0j8k1%k1mJ7K6K1L0K3M9M1M3J0L4L3oK0m%j6Kj7q
$$ 51 18 -7 -19 -45 -56 -73 -89 -98 -118 -138 -156 -177 -177 -198 -202 -185 -159 -138 -108 -85 -36 5 48 58 92 125 119 139 135 135 119 121 104 96
3082I6%j4jj9Kj2l2lk9k3k7l6k0m5k7j4pJ4%K6L4L9M0M1M0M9L8L6K2K0K9Pmrj0
$$ 96 96 82 81 62 64 52 20 17 -12 -35 -62 -98 -118 -163 -190 -204 -211 -197 -197 -171 -137 -98 -58 -17 23 72 110 146 168 188 217 224 220 211 201
3117B01j9j7l6k8m3l8n4m1k9l8m8k0j2j7OJ4K5L1M5M1M1N1K9M6L8K3J0K5lpNn
$$ 201 182 165 129 101 58 20 -34 -75 -104 -142 -190 -210 -222 -239 -233 -219 -194 -163 -118 -77 -36 15 44 90 128 151 161 186 183 176 181 176
3149A76lj0j2k3k5k7m5m1m8n7m8n8o6lk6k4L9L8M9Q0R3Q4R1Q1Q1M4K2%l0m8p8
$$ 176 173 163 151 128 103 76 31 -10 -58 -115 -163 -221 -287 -290 -316 -340 -301 -263 -214 -134 -41 43 134 215 296 340 362 362 332 284 206
3180B06r1r5j01q4o6m9k6nK5N4P2O5Q9P6N6N5K9J8j4k9m1m6n9l7m3m5l8%k3Qk
$$ 206 115 20 -81 -165 -231 -280 -306 -311 -286 -232 -160 -95 -6 70 126 181 210 228 214 185 144 98 39 2 -41 -86 -124 -124 -147 -139 -141
3211a41RJ5%oK0MKJ0J6K9M6N4O7O4O2N7N4K3nk0m9q5j08j09j08j26q7q9n7j4J4
$$ -141 -132 -117 -117 -123 -103 -99 -97 -87 -71 -42 4 58 125 189 251 308 362 385 380 360 311 226 118 9 -99 -225 -312 -401 -458 -472 -458
3242d58N0R9Q7J29J18J10J00O1L9Rl2m9n8o5p5n1n5j5kPL2N3M6M4J1J2Ql5o4p1
$$ -458 -408 -309 -222 -93 25 135 235 296 335 344 312 263 205 140 65 14 -41 -56 -58 -51 -19 34 80 124 135 147 155 120 56 -15
3272a5j01q9j03p2o6j7LK6R0R6J15J19J11J31Q1O2K3ll0o2q2q0p6o9p3l1j2j0
$$ -15 -116 -205 -308 -380 -446 -463 -460 -434 -344 -248 -133 -14 97 228 309 371 394 391 361 299 217 137 61 -8 -81 -112 -124 -134
3300a34J5K9J4L4J8j5mk8j9m6k8m4oJ2J8L8O4R0Q3J03P3M8N6K8k1l9n8p1q1j06
$$ -134 -119 -90 -76 -42 -24 -39 -43 -71 -90 -136 -164 -208 -214 -202 -184 -146 -82 8 91 194 267 315 371 399 378 339 281 210 129 23
3330B3o2o6m1oJ7L4M3N0O0M7L0Ml4m5q7q5j04j08p6p0k0NM8R1J28J45J55J77J38
$$ 23 -39 -105 -146 -152 -135 -101 -58 -8 52 99 129 133 99 54 -33 -118 -222 -330 -406 -476 -496 -491 -443 -352 -224 -79 76 253 391
3359C91J19Q6M1j8m5r3j28j59j47j43j55j17p7n8j9K5L7P7P4Q8P5P6O0O3M0L1
$$ 391 510 596 637 619 574 481 353 194 47 -96 -251 -368 -445 -503 -522 -497 -460 -383 -309 -221 -146 -70 -10 53 93 124
3385A24K1K4J6J3K3M4J0K3NK0j0l6n2o4p0r7r8r2q1p0l8pOM7O8R0Q9R5Q3Q7N3
$$ 124 145 169 185 198 221 265 275 298 303 323 313 277 225 161 91 -6 -104 -196 -277 -347 -385 -392 -386 -339 -271 -181 -92 3 86 173 226
3416B26K8J0k3m0n0o2p0n9l8m2j4LL6M5L6M9M6L1K5kj2j5m8l8o7l5m0k3loJ6L3
$$ 226 254 264 241 201 151 89 19 -40 -78 -120 -134 -131 -95 -50 -14 35 81 112 137 135 123 108 60 22 -45 -80 -120 -143 -146 -152 -136 -103
3448a03N1N1N4L7K5QMk2l2l5o0m3n6j9k0qJ1J3L3N4M9N8L7N0N5QJ6mKk2l3m2l9
$$ -103 -52 -1 53 90 115 123 127 105 73 38 -22 -65 -121 -140 -160 -168 -157 -144 -111 -57 -8 50 87 137 192 200 216 212 214 192 159 117 78
3481G8m2m1m7m1j6l6m3ol6j0nJ4J3J7L3M2M5P5N3O5P7N5N4L2K8Kll4l5n0p5q0
$$ 78 36 -5 -52 -93 -109 -145 -188 -194 -230 -240 -245 -231 -218 -201 -168 -126 -81 -6 47 112 189 244 298 330 358 360 357 323 288 238 163 83
3513H3p9p5p3p2n9n8l1l0oJ3K1K7N5O7P7P0Q0Q1R5O8P4N4N3Mnk4l4n9o7r7o6r0
$$ 83 4 -71 -144 -216 -275 -333 -364 -394 -400 -387 -366 -339 -284 -217 -140 -70 10 91 186 254 328 382 435 439 434 410 376 317 250 153 87 -3
3545cr5n6n3m7l4j5%RK5L4L4L7K8L2J5L3K5L8J1M3L3M8M3K9L3M4J2mk1k4l5p7
$$ -3 -98 -154 -207 -254 -288 -303 -303 -294 -269 -235 -201 -164 -136 -104 -89 -56 -31 7 18 61 94 142 185 214 247 291 303 299 278 254 219 142
3577A42p8p8o5q1p4n0k0j1J2L0M3O0N6N7M5N0NK1rj9k8k5k2j4MJ6L2N2O7M2O2
$$ 142 64 -14 -79 -160 -234 -284 -304 -315 -303 -273 -230 -170 -114 -57 -12 38 43 64 55 36 8 -17 -39 -53 -49 -33 -1 51 118 160 222
3608B22N3M4K7k5m0m7q3j03r4r4q5p3m6j8OK4N0O4P4P8N8N7L7K0Lkk4j2k4QjM3
$$ 222 275 319 346 321 281 234 151 48 -46 -140 -225 -298 -344 -362 -356 -332 -282 -218 -144 -66 -8 49 86 106 109 107 83 71 47 55 54 97
3640I7L6M9N7N6L3K0j0l2o8r0j14j35j20j27j18q8m4nM8O4J25J46J58J44J48J25
$$ 97 133 182 239 295 328 348 338 306 238 148 34 -101 -221 -348 -466 -554 -598 -603 -555 -491 -366 -220 -62 82 230 355
3666C55Q2N2J5k4p1r5j08j16j05q0p4m2k3J6L4N3M3M6M2KJ3J1m2j6l3k3j6kQN2
$$ 355 437 489 504 480 409 314 206 90 -15 -95 -169 -211 -234 -218 -184 -131 -88 -42 0 2 15 26 -16 -32 -65 -88 -104 -106 -98 -46
3696d6M7N3P8M8N5K2lk9n6q5q4j09j08q1p9k6MM5P6J17J34J49J37J31R1N4Nk0
$$ -46 1 54 132 180 235 257 254 225 169 84 0 -109 -217 -298 -377 -403 -399 -354 -278 -161 -27 122 259 390 481 535 540 520
3724E20o8j29j31j67j39j53j14p6m5nM5P4R0R8J19R1Q0P3L0J5j0j8k6k2k7%J3
$$ 520 452 323 192 25 -114 -267 -381 -457 -502 -507 -462 -388 -298 -200 -81 10 90 163 193 208 198 180 154 132 105 105 118
3751A18J0M9K5L6J8K9j8l3q6p2r6j25j28j26r1o6n6K6M8P8J01J35J40J61J29J13
$$ 118 128 177 202 238 256 285 267 234 148 76 -20 -145 -273 -399 -490 -556 -612 -586 -538 -460 -359 -224 -84 77 206 319
3777C19P3O0Nmm4r2p9p4o9p0m5k3lj0J3K8ROJl3l4m5p4m6o5l5mLL7O9N3J24R6
$$ 319 392 452 457 453 409 317 238 164 95 25 -20 -43 -46 -56 -43 -15 -6 0 1 -32 -66 -111 -185 -231 -296 -331 -335 -332 -295 -226 -173 -49 47
3810D7J07J04Q2M5N5ok9n5p2q0q4p8r2m5l3k1jJ7K5L7K1J9J2j8k6k5l2m7m2l8
$$ 47 154 258 340 385 440 434 405 350 278 198 114 36 -56 -101 -134 -155 -156 -139 -114 -77 -56 -37 -25 -43 -69 -94 -126 -173 -215 -253
3840b53j5KJ7M7P9Q2Q4J15Q5R1M7M2K9j7k5p3n5r3r2r8r2o8p1n1k9k2j0moK5K7
$$ -253 -268 -266 -249 -202 -123 -41 43 158 243 334 381 423 452 435 410 337 282 189 97 -1 -93 -161 -232 -283 -312 -334 -344 -348 -354 -329 -302
3871c02L6L7L6N4O8N1O4P6P3P1N9M8L5K5k3k2n5o5q3r1r2j04q5q5o4l7k4QK9M1
$$ -302 -266 -229 -193 -139 -71 -20 44 120 193 264 323 371 406 431 408 386 331 266 183 92 0 -104 -189 -274 -338 -375 -399 -391 -362 -321
3901c21O3P2P2Q2O9O8M8N9K3L4j7nj9m6l7m5m8m2m9m4m1j2k5%JK4K1M8K7L7M9
$$ -321 -258 -186 -114 -32 37 105 153 212 235 269 252 247 228 182 145 100 52 10 -39 -83 -124 -136 -161 -161 -160 -136 -115 -67 -40 -3 46
3932D6K7M4K8Pnpl4l7n2k3n8l7l8k2j5jJ7K2M8L3L7M2L1L1J1J7J7m%j1JOoj0Q
$$ 46 73 117 145 152 147 140 106 69 17 -6 -64 -101 -139 -161 -176 -177 -160 -138 -90 -57 -20 22 53 84 95 112 129 125 125 114 115 121 115 105 113
3967A13Mj1ol5m0l6n8m4n2n8l9m1j9%K7L9O3O7P5P8Q4P8N6M4K8rj5l7m7o2m8n6
$$ 113 117 106 100 65 25 -11 -69 -113 -165 -223 -262 -303 -322 -322 -295 -256 -193 -126 -51 27 111 189 245 289 317 308 293 256 209 147 99 43
3999D3n1k8j4%Jj2J7J8Oj4j0l4l6m0n2l2k6qJ6K1N3Q3Q1Q7R4Q2O9N3K4rl9m3p9
$$ 43 -8 -36 -50 -50 -49 -61 -44 -26 -20 -34 -44 -78 -114 -154 -206 -238 -264 -272 -256 -235 -182 -99 -18 69 163 245 314 367 391 382 343 300 221
4032B21p6j01n5q2m6j9k5J6K8K3M9J3M6kpk9l3m2n1n3m1pNK9O2Q3J16J03J03J08
$$ 221 145 44 -11 -93 -139 -158 -183 -167 -139 -116 -67 -54 -8 -10 -17 -46 -79 -121 -172 -225 -266 -273 -268 -239 -177 -94 22 125 228 336
4062C36Q1O2J1j1n0p2j10j19j16j15j00q6m8m3mK7N3K9O7M3M2M1J5kJ3j3jQQL8
$$ 336 417 479 490 479 429 357 247 128 12 -103 -203 -289 -337 -380 -384 -357 -304 -275 -208 -165 -123 -82 -67 -69 -56 -69 -70 -62 -54 -16
4092a6N0N4Q1R3P3P6L3L9j1k6p1j03j23j46j36j30j14q0m6nL1M3P9J07J09J13
$$ -16 34 88 169 262 335 411 444 483 472 446 375 272 149 3 -133 -263 -377 -457 -503 -508 -477 -434 -355 -248 -139 -26
4118b6J05P8L7L2kj7l5l5m5k3l4nJ7K5L0N0K4M7J2j6l8o9q8q6r1j03j01p3m0p
$$ -26 79 157 194 226 224 207 172 137 92 69 35 30 47 72 102 152 176 223 235 219 181 112 24 -62 -153 -256 -357 -430 -470 -477
4148d77L9N3J01Q6J42J24J03J06P7K6J4j8m7p2p6r4p4p4m9k2j8K0J9M2K9L0K9
$$ -477 -438 -385 -284 -198 -56 68 171 277 354 380 394 376 329 257 181 87 13 -61 -110 -132 -150 -130 -111 -69 -40 -10 19
4175A9Qkj5l2k3m5j9k5qJ3J9M2N5O0M3N6L4K6j9rn4o5o6p0o0o7k7KJO1N2P4J02
$$ 19 27 25 10 -22 -45 -90 -109 -134 -142 -129 -110 -68 -13 47 90 146 180 206 187 178 124 59 -7 -77 -137 -204 -231 -229 -228 -167 -115 -41 61
4208F1P2Q2O7N4J0k0m5n1q5q9r0q9p1n3n6pQK7M3L7O9N1N9L0K1K3J0J2KRnK7K1
$$ 61 133 215 282 336 346 326 281 230 145 56 -34 -123 -194 -247 -303 -310 -302 -275 -232 -195 -126 -75 -16 14 35 58 68 80 82 91 86 113 134
4241A34J4K2J5J9NNk1k8m4n1p8p0p7p9p3k9l5qK4M3M7Q0Q7P4Q0P1Q0L7L4OPpk3
$$ 134 148 170 185 204 209 214 193 165 121 70 -8 -78 -155 -234 -307 -336 -371 -379 -355 -312 -265 -185 -98 -24 56 127 207 244 278 284 291 284 261
4274B61m4m0l3l4l5m6k2k5j8k9k1k6nk1k7j8kk6J2QJ5K4M5L5M1M0L6M3M3K1J9
$$ 261 217 177 144 110 75 29 7 -18 -36 -65 -86 -112 -117 -138 -165 -183 -185 -211 -199 -191 -176 -152 -107 -72 -31 9 45 88 131 152 171
4305A71OOJ2j3j3jj4l2mk6j6k2l6k3l0k9l6k3m0j9k5k2j2%RJ6L6K4M0M9M8N1M6
$$ 171 177 183 195 182 169 168 154 122 118 92 76 54 18 -5 -35 -64 -100 -123 -163 -182 -207 -229 -241 -241 -232 -216 -180 -156 -116 -67 -19 32 78
4338G8N0M6L4L8J1K5J5j2mk5k7n9n6o6p4q0o5p7n2n1l7j0JL2M6P6O1R8R1J00P8
$$ 78 128 174 208 246 257 282 297 285 281 256 229 170 114 48 -26 -106 -171 -248 -300 -351 -388 -398 -397 -365 -319 -243 -182 -84 7 107 185
4369A85O3N5M2K1jj5m6m2o9o2o4n1n4l0l3m2j7j6k0rNqmMJ5J9K7K9O4M6N2M8N5
$$ 185 248 303 345 366 365 350 304 262 193 131 67 16 -38 -68 -101 -143 -160 -176 -196 -205 -200 -208 -212 -208 -193 -174 -147 -118 -54 -8 44 92 147
4402A47O1L5L3jkl3m3p0n7q2p6n4n5qk1ON0L7N4O3O1N5L3M0%nk9m6n2n1n0m6l8
$$ 147 208 243 276 275 273 240 197 127 70 -12 -88 -142 -197 -205 -226 -220 -170 -133 -79 -16 45 100 133 173 173 168 139 93 41 -10 -60 -106 -144
4435a44k7pJ8J2L8N7M0M5K2J1K0o%k1j5j4j0qOJ0M2K0L2K3OKj8l1m9p2o4n4o5
$$ -144 -171 -178 -160 -148 -110 -53 -13 32 54 65 85 79 79 58 43 29 19 11 17 27 69 89 121 144 150 152 134 103 54 -18 -82 -136 -201
4468b01n3m5j5J5L5N3P8R2P5R5Q4N3N5Pl6k3o1o6p6p2o8n0k4j9LMO8J9N1L7J9
$$ -201 -254 -299 -314 -299 -264 -211 -133 -41 34 129 213 266 321 328 292 269 208 142 66 -6 -74 -124 -148 -167 -164 -160 -92 -73 -22 15 34
4499C4J2Mj8l4k0n5m7k3qk4J6K9M2O5N9N1N3N2K2Ok0k3l5l4m7m1k4k6j3lK7K4
$$ 34 46 50 32 -2 -22 -77 -124 -147 -155 -179 -163 -134 -92 -27 32 83 136 188 210 216 196 173 138 104 57 16 -8 -34 -47 -50 -23 1
4531AK4J9K1J2j4k8k6p2n5p2n6m5m3j0K0L8Q8Q1J00J20R0R1P2N5K4rl0n8p7j06
$$ 1 25 44 65 77 63 35 9 -63 -118 -190 -246 -291 -334 -344 -324 -286 -198 -117 -17 103 193 284 356 411 435 426 396 338 261 155
4561A55r5q5q5m7n7k4j6lOJ5J7L4J1J5K5QJ0K2K9K1M3N0O3M9O0O3M9J7L1j8j9
$$ 155 60 -25 -110 -157 -214 -238 -254 -257 -251 -236 -219 -185 -174 -159 -134 -126 -116 -94 -65 -44 -1 49 112 161 221 284 333 350 381 363 344
4592C44n7q6r3j03r4r1r3p4n4j7MK0O5N8Q5R2Q0O4P0L4M5J1Nk3k6k1qj9j0j0j1
$$ 344 287 201 108 5 -89 -180 -273 -347 -401 -418 -414 -394 -329 -271 -186 -94 -14 50 120 154 199 210 215 192 166 145 137 118 108 98 87
4623H7Jkj4rj0k4l1l6k9l9m3k3l3pPQL1L9N5N3M6N1K3L4QMj2k1k4m9j9k2k3k0
$$ 87 88 86 72 63 53 29 -2 -38 -67 -106 -149 -172 -205 -212 -205 -197 -166 -127 -72 -19 27 78 101 135 143 147 135 114 90 41 22 0 -23 -43
4657d3noPJ8J3K3NJ0J1Qj2j0j0j1k0j4nj5jNJ3J6J0J4J3JJ1qKk8Plj9ojmNJ5J7
$$ -43 -48 -54 -47 -29 -16 7 12 22 33 41 29 19 9 -2 -22 -36 -41 -56 -57 -52 -39 -23 -13 1 14 15 26 18 20 -8 -1 -4 -23 -29 -30 -34 -29 -14 3
4696CJ7J0K2J7OQnKj8j2l1k4j9k7j8j9ok1oJRmK8J4K2J9K5K7K7K9kL6PQJ3pj0
$$ 3 20 30 52 69 75 83 78 80 62 50 19 -5 -24 -51 -69 -88 -94 -115 -121 -120 -111 -115 -87 -73 -51 -32 -7 20 47 76 74 110 117 125 138 131 121
4733A21oj0k8k1k2l2l1j4k5l0pNpj4JJ0J6KJ0J8J1K1OJ0K5RL0kK0J7J5J8lJ2k
$$ 121 115 105 77 56 34 2 -29 -43 -68 -98 -105 -100 -107 -121 -120 -110 -94 -92 -82 -64 -53 -32 -26 -16 9 18 48 46 66 83 98 116 113 125 123
4768A23j1j7k1l9j9k7k4j8j7j2pKRMJ0J3L1kOMk2pKj2j%J6JJ3K7M4J9L1K3L0J5
$$ 123 112 95 74 35 16 -11 -35 -53 -70 -82 -89 -87 -78 -74 -64 -51 -20 -22 -16 -12 -34 -41 -39 -51 -52 -52 -36 -35 -22 5 49 68 99 122 152 167
4804A67J2Mk1j7m4l7n8n1l7l3k4k9rJkK5J1J7L3K9K1J9K0K0J1K0K2J8K7M0J1L5
$$ 167 179 183 162 145 101 64 6 -45 -82 -115 -139 -168 -177 -176 -178 -153 -142 -125 -92 -63 -42 -23 -3 17 28 48 70 88 115 155 166 201
4836B01L2J4npk3m8n6o2n6p5q0p0o4l6k0j0K3L0O2O8P4Q9O8Q1N1M0M3oKj4m0k0
$$ 201 233 247 242 235 212 164 108 46 -10 -85 -165 -235 -299 -335 -355 -365 -342 -312 -250 -182 -108 -19 49 130 181 221 264 258 260 246 206 186
4868A86n7l1l9l2l2j8j9rk5k2j2mj2j2j6j3%nL9L7K8M6M5N6O3M2K3K5K5k3k3n2
$$ 186 129 98 59 27 -5 -23 -42 -51 -76 -98 -110 -114 -126 -138 -154 -167 -167 -172 -133 -96 -68 -22 23 79 142 184 207 232 257 234 211 159
4900A59n9o3n8n7o3l2k6nK0K0M9L8N1L7N4L5K3Poj6k2l3l4m6k4j6k1PMJ5K7OK2
$$ 159 100 37 -21 -78 -141 -173 -199 -204 -184 -164 -115 -77 -26 11 65 100 123 130 124 108 86 53 19 -27 -51 -67 -88 -81 -77 -62 -35 -29 -7
4933gK9KlJ2k2Oj7mpNMJ3RJ8K3K3J8J6j2j0l3k4n8n5l0m7m3ok0J2K0L4M5O7N4
$$ -7 22 24 21 33 11 17 0 -4 -11 -6 -2 11 20 38 61 84 102 118 106 96 63 39 -19 -74 -104 -151 -194 -200 -220 -208 -188 -154 -109 -42 12
4968A2O3L3N2J7J3Pk1l4k8l8n4l4k1k2Mj5JJ0J7RK1MLMj4j4rj7Kk0LJ3%K5J4M0
$$ 12 75 108 160 177 190 197 176 142 114 76 22 -12 -33 -55 -51 -66 -65 -55 -38 -29 -8 -4 -1 3 -11 -25 -34 -51 -49 -69 -66 -53 -53 -28 -14 26
5004B6RK6J9K0pok0j8j6k7j9pj3lJJ5J5L8lK2Pjjj3j4l2k8m0k2l1ml2JK4K5L8
$$ 26 35 61 80 100 93 87 67 49 33 6 -13 -20 -33 -36 -35 -20 -5 33 30 52 59 58 57 44 30 -2 -30 -70 -92 -123 -127 -159 -158 -134 -109 -71
5040g1L2N5L3M9L8K1K4kkk1j5j9m4l8k3m1k2k1k2l0rooMk4QoJ5J9L0J4L5L9M1
$$ -71 -39 16 49 98 136 157 181 179 177 156 141 122 78 40 17 -24 -46 -67 -89 -119 -128 -134 -140 -136 -160 -152 -158 -143 -124 -94 -80 -45 -6 35
5074C5L8K5N5K5K9K1Pk9ml0m0m1m9m5n0l3m7k3l9KLLJ5K8K9K9L0K9K6L2K7L2J4
$$ 35 73 98 153 178 207 228 235 206 202 172 132 91 42 -3 -53 -86 -133 -156 -195 -193 -190 -187 -172 -144 -115 -86 -56 -27 -1 31 58 90 104
5107A04oK7kOj1mj8k6rl5pl2j9k3j1j7rqJ3rPJ8K7J2J3K2mJ6J6QJQMo%%j2Rmj4
$$ 104 98 125 123 129 118 114 96 70 61 26 19 -13 -32 -55 -66 -83 -92 -100 -87 -96 -89 -71 -44 -32 -19 3 -1 15 31 39 40 48 52 46 46 46 34 43 39 25
5147B5K%ljj5Jkj8mj1O%pJ1Pj9QJmJ4rj0Oqj2O%J3LJ4OJ5J0J2K6LKpRk3J1l2j2
$$ 25 27 27 24 23 8 9 7 -11 -15 -26 -20 -20 -27 -16 -9 -28 -20 -19 -23 -9 -18 -28 -22 -30 -42 -36 -36 -23 -20 -6 0 15 25 37 63 66 68 61 70 47 58 26 14
5190A4j6qrqnKJ1kJJ1K0nJ7j6lj2q%j0k1k5J6lQJ9J5K3J9PK1J5jJ2pqj4j1k0k1
$$ 14 -2 -10 -19 -27 -32 -30 -19 -21 -20 -9 11 6 23 7 4 -8 -16 -16 -26 -47 -72 -56 -59 -51 -32 -17 6 25 32 53 68 67 79 72 64 50 39 19 -2
5229bk1jj2QJJ5%QK0j1J6%plj8mj5mj2kJ0mK9RJ8J1K3MJ2PKLk5k2qj9j5qk9p%
$$ -2 -23 -24 -36 -28 -27 -12 -12 -4 16 5 21 21 14 11 -7 -11 -26 -30 -42 -44 -34 -38 -9 0 18 29 52 56 68 75 77 80 55 33 25 6 -9 -17 -46 -53 -53
5270e3qJ3J4pJ3jJ1k0Jjk4j0J1oJ9J0OL0K9L0L6L5J2J9jkj5k5l7l6l9l8l2k7k9
$$ -53 -61 -48 -34 -41 -28 -29 -18 -38 -37 -38 -62 -72 -61 -67 -48 -38 -32 -2 27 57 93 128 140 159 158 156 141 116 79 43 4 -34 -66 -93 -122
5305a22j9oRJ7K0L6L1NL2J7J8MnKkLmOPj4J0J9JOMOj3Qk2k5j7k8j7l3k5j0j9M
$$ -122 -141 -147 -138 -121 -101 -65 -34 -29 3 20 38 42 37 39 37 40 36 42 49 35 45 64 65 71 75 81 68 76 54 29 12 -16 -33 -66 -91 -101 -120 -116
5343a16OOK2K1K5J8J9K0K5QJ0qMjmmrnJ3%%%pqj6rk3j9k8k4k4j9Mj8RJ0K7K5L0
$$ -116 -110 -104 -82 -61 -36 -18 1 21 46 54 64 56 60 59 55 51 42 37 50 50 50 50 43 35 19 10 -13 -32 -60 -84 -108 -127 -123 -141 -132 -122 -95 -70 -40
5382d0M4M4K4L2K1J7J0j3kl4j0l7k5l1l7Ok8lkLJ2RJ2J1K0%J8jOqoOj2JqrNMN
$$ -40 4 48 72 104 125 142 152 139 137 103 93 56 31 0 -37 -31 -59 -62 -64 -61 -49 -40 -28 -17 3 3 21 20 26 18 12 18 6 7 -1 -10 -5 -1 4
5421DrJ0qQj2JkpMnj0KJ6lJ0J0OJ3L3qkmlj1lk3k0prk6Oj0NLMJ3jK6QKK2PKnJ3
$$ 4 -5 5 -3 5 -7 -6 -8 -15 -11 -16 -26 -24 -8 -11 -1 9 15 28 61 53 51 47 44 33 30 7 -13 -20 -29 -55 -49 -59 -54 -51 -47 -34 -35 -9 -1 1 23 30 32 27 40
5466D0k0mJ5k2RmOj5J0j8JlLqqJJj8j0JJj0J9nnK6OK6K2LJ4J2J2%qj4Nj2Jk6o
$$ 40 20 16 31 9 18 14 20 5 15 -3 -2 -5 -2 -10 -18 -17 -16 -34 -44 -43 -42 -52 -33 -38 -43 -17 -11 15 37 40 54 66 78 78 70 56 61 49 50 24 18
5507A8j8pj0mNk0Rj3J2jKQQLJjJPnLlpLpO%Mj5K5POj0J9OOOOJ2m%Jj3j3j6j1k4
$$ 18 0 -7 -17 -21 -16 -36 -27 -40 -28 -29 -27 -19 -11 -8 -7 -8 -7 0 -5 -2 -5 -12 -9 -16 -10 -10 -6 -21 4 11 17 7 26 32 38 44 50 62 58 58 59 46 33 17 6 -18
5553a8j2pk5j0nkrJ5PQK0J6K3J1K4J9L0jJ3L%j8oj2j9j0l3k2k3j0l1lj1rjJ0Q
$$ -18 -30 -37 -62 -72 -77 -79 -88 -73 -66 -58 -38 -22 1 12 36 55 85 84 97 100 100 82 76 64 45 35 2 -20 -43 -53 -84 -87 -98 -107 -108 -98 -90
5590i0J8KL3K9K7K6OL9MK0%Jj2j1j0k5j5k4j8j5j8nnorK3OjJ7QOqPPkNj0kKmK
$$ -90 -72 -70 -37 -8 19 45 51 90 94 114 114 115 103 92 82 57 42 18 0 -15 -33 -38 -43 -49 -58 -35 -29 -30 -13 -5 1 -7 0 7 5 10 0 -2 0 -4 -2
5631bpJ3MJ2j9K0%mOo%Mlj6nOjJ%qMJ2Kk3J4l%Oj1lj7PnK0nLKNLJ5K2k%%qmnj5
$$ -2 -9 4 8 20 1 21 21 17 23 17 17 21 18 2 -3 3 2 3 3 -5 -1 11 13 -10 4 1 1 7 -4 -7 -24 -17 -22 -2 -7 -4 -2 3 6 21 43 41 41 41 33 29 24 9
5679Ij0qlj2qKkJ2kJ3J3jJ4J3Mkj2nplj1lj3JkNJ3J5kK5lJ9OonKj2kj5j7j4mp
$$ 9 -1 -9 -12 -24 -32 -30 -32 -20 -22 -9 4 3 17 30 34 32 20 15 8 5 -6 -9 -22 -21 -23 -18 -5 10 8 33 30 49 55 49 44 46 34 32 17 0 -14 -18 -25
5722b5nJnlJ3MJ2NKL%NpJ1j2jpPj2OJ1lKKJ9j4J1%nMQj1jKJ2j0mll%Rm%rj0Kk3
$$ -25 -30 -29 -34 -37 -24 -20 -8 -3 -1 2 2 7 0 11 -1 -2 -9 -2 -14 -8 3 0 2 4 23 9 20 20 15 19 27 16 15 17 29 19 15 12 9 9 18 14 14 5 -5 -3 -26
5769b6Mj1j9ooNMJ3J8J8j2L9K5PJ4MNJok0nk0k3j8j2j2j5j0J2mNMM0j0J2K6Nm
$$ -26 -22 -33 -52 -58 -64 -59 -55 -42 -24 -6 -18 21 46 53 67 71 76 77 71 51 46 26 3 -15 -27 -39 -54 -64 -52 -56 -51 -47 -7 -17 -5 21 26 22
5807B2J3K1qj0OqRkj1j2pqrj%Pqrj1PL%NpPnNJj3lJ0K0k1LKKlOQmnJ1J3PPQPK
$$ 22 35 56 48 38 44 36 45 43 32 20 13 5 -4 -5 -5 2 -6 -15 -26 -19 -16 -16 -11 -18 -11 -16 -11 -10 -23 -26 -16 4 -17 -14 -12 -10 -13 -7 1 -3 -8 3 16 23 30 38 45 47
5855D7Qkj1lj4Mj9pnj5Mk3nJ1j1J6nJ1J3J0%MJ6Rl%Qkj4j1ooj0jMpmLNo%KRLL
$$ 47 55 53 42 39 25 29 10 3 -2 -17 -13 -36 -41 -30 -41 -25 -30 -19 -6 4 4 8 24 33 30 30 38 36 22 11 5 -1 -11 -12 -8 -15 -19 -16 -11 -17 -17 -15 -6 -3 0
5900@JJpRmOJ1j3Qk2OJ3JkOMnR%kkLqO%j0Jpj8mmOj0jrJ4MJNJ1pJ3J1jPmjJj6
$$ 0 1 2 -5 4 0 6 17 4 12 -10 -4 9 10 8 14 18 13 22 22 20 18 21 13 19 19 9 10 3 -15 -19 -23 -17 -27 -28 -37 -23 -19 -18 -13 -2 -9 4 15 14 21 17 16 17 1
5949AJ4rnKj2j1JlP%KOJ5kORjJ2rJ2qOmj3nrrOk4%j0JJmKJ0kNJ6nJ2MLMK0jJj1
$$ 1 15 6 1 3 -9 -20 -19 -22 -15 -15 -13 -7 8 6 12 21 20 32 23 35 27 33 29 16 11 2 -7 -1 -25 -25 -35 -34 -33 -37 -35 -25 -27 -22 -6 -11 1 5 8 12 32 31 32 21
5997B1j1J7j8jj0j0j2jokJ4j0K5%J3POK%MkPLpqmKj8lj4lMj3J8J7j1Q%QJ8j5J4
$$ 21 10 27 9 8 -2 -12 -24 -25 -31 -33 -19 -29 -4 -4 9 16 22 24 24 28 26 33 36 29 21 17 19 1 -2 -16 -19 -15 -28 -10 7 -4 4 4 12 30 15 29
6039B9j2rNJj1J2j8j6Lj9nJ8j8J3KjRPJ3J0%lRP%J2mmKjoJk3J8j7oj2Oj3j1Rj6
$$ 29 17 8 13 14 3 15 -3 -19 -16 -35 -40 -22 -40 -27 -25 -26 -17 -10 3 13 13 10 19 26 26 38 34 30 32 31 25 26 3 21 4 -2 -14 -8 -21 -32 -23 -39
6081c9LK0lKMRJ2jQn%oOOQmqkj1Nk1J8Lk2RNK3pj3J6nnMPnLllOPj4JlKmJ5j1k
$$ -39 -36 -16 -19 -17 -13 -4 8 7 15 10 10 4 10 16 24 20 12 10 -1 4 -17 1 4 -18 -9 -4 19 12 -1 15 10 5 9 16 11 14 11 8 14 21 7 8 5 7 3 18 7 5
6129ELj0Jj8%K1nlJ0j6JnjNmjJ0JpRj1PJ8n%pJ0J5j0rJMnJ3Nlo%Mj0J7k1NJrK
$$ 5 8 -2 -1 -19 -19 2 -3 -6 4 -12 -11 -16 -17 -12 -16 -17 -7 -6 -13 -4 -15 -8 10 5 5 -2 8 23 13 4 5 9 4 17 22 19 13 13 17 7 24 3 8 9 0 2
6175B%J0j4J4j0jmKmPj0NmkLMprJ8j8nR%MNPoNMrpK0KoRj3J0%j1OJMKnmkJKJ4
$$ 2 2 12 -2 12 2 1 -3 -1 -5 2 -8 -3 -7 -9 -6 -2 -9 -18 0 -18 -23 -14 -14 -10 -5 2 -4 1 5 -4 -11 9 11 5 14 1 11 11 0 6 7 11 13 8 4 2 3 5 19
6224A9oMr%Moj1MnnPpj1JLMNJKp%nJ5l%nJ4jj1PPoj3J2qJ1j6J8j1mLNkLJ1%Ok
$$ 19 13 17 8 8 12 6 -5 -1 -6 -11 -4 -11 -22 -21 -18 -14 -9 -8 -6 -13 -13 -18 -3 -6 -6 -11 3 2 -9 -2 5 -1 -14 -2 -10 1 -15 3 -8 -12 -9 -4 -6 -3 8 8 14 12
6272A2J1Oj2PjrRqJ0rj0oonk1K0j6pK7Qk4J4RJ1Oj1pMJ1Lj2MqkJkpkjpLNNj%p
$$ 12 23 29 17 24 23 14 23 15 25 16 6 0 -6 -11 -32 -12 -28 -35 -8 0 -24 -10 -1 10 16 5 -2 2 13 16 4 8 0 -2 -1 -3 -10 -12 -13 -20 -17 -12 -7 -8 -8 -15
6318a5J7KOJ2kJ0j1NrKjqj0J0j2qqK%jo%jOqJ8J1j5RJ2j7RkMMqj0J0j8OMOllP
$$ -15 2 4 10 22 20 30 19 24 15 17 16 8 -2 8 -4 -12 -20 -18 -18 -19 -25 -25 -26 -20 -28 -10 1 -14 -5 7 -10 -1 -3 1 5 -3 -13 -3 -21 -15 -11 -5 -8 -11 -4
6363drOJ2pKOlKkjOjj8K5j3MrJ9krONj1J0oOk1J2PrNKk3K0mr%rpKMMkj7K4j8J4
$$ -4 -13 -7 5 -2 0 6 3 5 3 2 8 7 -11 14 1 5 -4 15 13 4 10 15 4 14 8 14 -7 5 12 3 8 10 -13 7 3 -6 -6 -15 -22 -20 -16 -12 -14 -31 -7 -25 -11
6410a1J5lLJ2n%KJ1j0j0jlkm%Or%J0qJ1JkNLQpJ1nkkjk1%nmMj4%KMj6OJ2%MJ2
$$ -11 4 1 4 16 11 11 13 24 14 4 3 0 -2 -6 -6 0 -9 -9 1 -7 4 5 3 8 11 19 12 23 18 16 14 13 -8 -8 -13 -17 -13 -27 -27 -25 -21 -37 -31 -19 -19 -15 -3
6457cjjJ1nJ1kKOj5MllKkj2lNPlJ6j0kPJ5q%KpNJmlkjrj3lj0RKj0J5QJKMLRk%
$$ -3 -4 -5 6 1 12 10 12 18 3 7 4 1 3 1 -11 -14 -9 -2 -5 11 1 -1 6 21 13 13 15 8 13 14 10 7 5 4 -5 -18 -21 -31 -22 -20 -30 -15 -7 -6 -4 0 3 12 10 10
6507A0%Kj5J2j0Prj1jJ1rnJ3rONjpQj2J0POkMljNkRj1ln%J2j4rJ6j1oJ3kopJ5
$$ 10 10 12 -3 9 -1 6 -3 -14 -15 -4 -13 -18 -5 -14 -8 -3 -4 -11 -3 -15 -5 2 8 6 10 7 6 11 9 18 7 4 -1 -1 11 -3 -12 4 -7 -13 0 -2 -8 -15 0
6552@j1J2rQppjRj0qJ3j8J1NkNJ2MPjJ2J1kkJ5j6nMmj0qj0JKjj3LJ0plM%LlJ1
$$ 0 -11 1 -8 0 -7 -14 -15 -6 -16 -24 -11 -29 -18 -13 -15 -10 2 6 13 12 24 35 33 31 46 30 25 29 25 15 7 -3 -2 0 -1 -14 -11 -1 -8 -11 -7 -7 -4 -7 4
6597DljqO%lMloNJ0Lj4PnpJ2j2RnnMq%J6mqnMJ6NoNj4J1J7Jk0LJJ3prJ6okOj5
$$ 4 1 0 -8 -2 -2 -5 -1 -4 -10 -5 5 8 -6 1 -4 -11 1 -11 -2 -7 -12 -8 -16 -16 0 -4 -12 -17 -13 3 8 2 7 -7 4 21 22 2 5 6 19 12 3 19 13 11 17 2
6645BLlqOKj3jkk0J6J1qnJ1nORjKkNPj2Rlk0OpRj7LJ1mJ6JMRqQMMjJqpnJ1j1j1
$$ 2 5 2 -6 0 2 -11 -12 -14 -34 -18 -7 -15 -20 -9 -14 -8 1 0 2 0 5 12 0 9 6 -14 -8 -15 -6 -23 -20 -9 -13 3 4 8 17 9 17 21 25 24 25 17 10 5 16 5 -6
6694fOlj1lRj2pJ3j4L0j2nJ0lJ1oNj6K0LnkKj6JJ3j4J5qJ1j2qRjJ2klJlJ2nOJ
$$ -6 0 -3 -14 -17 -8 -20 -27 -14 -28 2 -10 -15 -5 -8 3 -3 2 -14 6 9 4 2 4 -12 -11 2 -12 3 -5 6 -6 -14 -5 -6 6 4 1 2 -1 11 6 12 13
6737A3j%j1J2j2Qj9PNrQj3KJ3Mkj0J4mnoONnnnJjpLJplMjlmKQQJ2Kj9MJ3KjOJ2
$$ 13 12 12 1 13 1 9 -10 -3 2 -7 1 -12 -10 3 7 5 -5 9 5 0 -6 0 5 0 -5 -10 -9 -10 -17 -14 -13 -20 -23 -19 -20 -23 -27 -25 -17 -9 3 5 -14 -10 3 5 4 10 22
6786B2j3RmLMj0Rj3nQrmjJj0J%mkrLlKlJ2J%ROk%RRLJ0roMJ0j4%j2lrjmqlj1M
$$ 22 9 18 14 17 21 11 20 7 2 10 1 -3 -4 -3 -13 -12 -12 -16 -18 -27 -24 -27 -25 -28 -16 -15 -15 -6 0 -2 -2 7 16 19 29 20 14 18 28 14 14 2 -1 -10 -11 -15 -23 -26 -37 -33
6836c3PlMK2JJ1%MNjOmKKj0lMj9J0j1j0PJNqJKjomMj3J7j8K1qJMJ2j5J1Oj3K7
$$ -33 -26 -29 -25 -3 -2 9 9 13 18 17 23 19 21 23 13 10 14 -5 5 -6 -16 -9 -8 -3 -11 -10 -8 -9 -15 -19 -15 -28 -11 -29 -8 -16 -15 -11 1 -14 -3 3 -10 17
6880A7oj4LK3j2ljJ3j5QmLQMj6No%j3J7qj0mmmOnkJKjJ3JmOJrJ1jmlkM%rlJ0K
$$ 17 11 -3 0 23 11 8 7 20 5 13 9 12 20 24 8 13 7 7 -6 11 3 -7 -11 -15 -19 -13 -18 -20 -19 -17 -18 -5 -4 -8 -2 -1 -10 1 0 -4 -7 -9 -5 -5 -14 -17 -7 -5
6928e%jKlMMPj0OnLJmj0RnJ5j0lkQlOJ0%%komKqmkM%lkj0%J3J0jnnJ%KKn%j2J4
$$ -5 -5 -6 -4 -7 -3 1 8 -2 4 -1 2 3 -1 -11 -2 -7 8 -2 -5 -7 1 -2 4 14 14 14 12 6 2 4 -4 -8 -10 -6 -6 -9 -11 -21 -21 -8 2 1 -4 -9 -8 -8 -6 -4 -9 -9 -21 -7
6980gkNl%JMmK0p%KPMj3oJ8j3PJ0mkj4K3j5NLj1Jk%mj2Pk0Lrlkj0%R%Pj7K3KK
$$ -7 -9 -4 -7 -7 -6 -2 -6 14 7 7 9 16 20 7 1 19 6 13 23 19 17 3 26 11 16 19 8 9 7 7 3 -9 -2 -22 -19 -28 -31 -33 -43 -43 -34 -34 -27 -44 -21 -19 -17
7027a7J2%jQRJJ0pNqJ0%j6jJ2j7Qj9PlJpj1J2prjJ2rJ2PP%J6LkJ3mJ0qjoNj5p
$$ -17 -5 -5 -6 2 11 12 22 15 20 12 22 22 6 5 17 0 8 -11 -4 -7 -6 -13 -24 -12 -19 -28 -29 -17 -26 -14 -7 0 0 16 19 17 30 26 36 28 27 21 26 11 4
7072Dplj5Rk1J1Mk2J4KPqJ6rJ8rJ0NMnOJ2KpJ0oJ1k3J2rJQj4pMkj3Kj6J1rlOP
$$ 4 -3 -6 -21 -12 -33 -22 -18 -40 -26 -24 -17 -25 -9 -18 0 -9 1 6 10 5 11 23 25 18 28 22 33 10 22 13 14 22 8 1 5 3 -10 -8 -24 -13 -22 -25 -19 -12
7116a2r%RnrJ0jJ1j0lJ0QJ%LKRolRm%jNj0pM%oJ5j8J3j2RnOj4QJ0%onJ4Jmj8N
$$ -12 -21 -21 -12 -17 -26 -16 -17 -6 -16 -19 -9 -1 0 0 3 5 14 8 5 14 10 10 9 14 4 -3 1 1 -5 10 -8 5 -7 2 -3 3 -11 -3 7 7 1 -4 10 11 7 -11 -6
7163fJ7j7oJ2kj5J3NpNrLJ4k1J1LnKRj8J3j2J0qmJ0j4J5%mOMrRM%jO%rQJmnJ1
$$ -6 11 -6 -12 0 -2 -17 -4 1 -6 -1 -10 -7 7 -14 -3 0 -5 -3 6 -12 1 -11 -1 -9 -13 -3 -17 -2 -2 -6 0 4 -5 4 8 8 7 13 13 4 12 13 9 4 15
7208A5n%mj0j1KJ2nmOpQolJ6j1J0pRk0LLrpNk%QK%rK4rJ3J2NKj9J%JJ2pj0J5j3
$$ 15 10 10 6 -4 -15 -13 -1 -6 -10 -4 -11 -3 -9 -12 4 -7 3 -4 5 -15 -12 -9 -18 -25 -20 -22 -22 -14 -12 -12 -21 3 -6 7 19 24 26 7 8 8 9 21 14 4 19 6
7254FoJ2j3Ljj1pkL%mJ0j7jPJ7jKoONJ9j3rJ5NoMNkj0Lj0mNqkJr%RJ1lNj2J1j3
$$ 6 0 12 -1 2 1 -10 -17 -19 -16 -16 -20 -10 -27 -28 -21 -4 -5 -3 -9 -3 2 21 8 -1 14 19 13 17 22 20 10 13 3 -1 4 -4 -6 -5 -14 -14 -5 6 3 8 -4 7 -6
7301fnqLQMrJ0J0QJ0kJ0r%J1j5Ljj7%j0j1oj1j6mjLMKNN%OJ2KOJ3RKjPLlJ1Lm
$$ -6 -11 -19 -16 -8 -4 -13 -3 7 15 25 23 33 24 24 35 20 23 22 5 5 -5 -16 -22 -33 -49 -53 -54 -51 -47 -45 -40 -35 -35 -29 -17 -15 -9 4 13 15 14 21 24 21 32 35 31
7348C1MRk1nRj0j1%j3pNNk2QnLRKPJ3%lQJ3mj2Jj4KQj6KqlkQJJnLMLl%Mjj3No
$$ 31 35 44 23 18 27 17 6 6 -7 -14 -9 -4 -26 -18 -23 -20 -11 -9 -2 11 11 8 16 29 25 13 14 0 2 10 -6 -4 -12 -15 -17 -9 -8 -7 -12 -9 -5 -2 -5 -5 -1 -2 -15 -10 -16
7397a6jJRq%MOLLLJ2LojlJLmkLKlKj5J1Kj7J2j9QNj3Nj0jMqlRmPkJ1lJ2J0LpP
$$ -16 -17 -16 -7 -15 -15 -11 -5 -2 1 4 16 19 13 12 9 10 13 9 7 10 12 9 11 -4 7 9 -8 4 -15 -7 -2 -15 -10 -20 -21 -17 -25 -28 -19 -23 -16 -18 -7 -10 2 12 15 8 15
7446A5KLkrNppl%NMj2OJ1kJMMnJ3j3lq%nnjnJ1j5J0j8J4j%JJOoQj1J1OMj3J2N
$$ 15 17 20 18 9 14 7 0 -3 -3 2 6 -6 0 11 9 10 14 18 13 26 13 10 2 2 -3 -8 -9 -14 -3 -18 -8 -26 -12 -13 -13 -12 -11 -5 -11 -3 -14 -3 3 7 -6 6 11
7493A1j1MpNKlOnj1JJ0q%rMJnOkJNOj1J4kMmQloJ9pNkKQqnNj0j4J1j4LrnnjRj8
$$ 11 0 4 -3 2 4 1 7 2 -9 -8 2 -6 -6 -15 -11 -10 -15 -9 -11 -10 -5 1 -10 4 2 6 2 10 7 1 20 13 18 16 18 26 18 13 18 8 -6 5 -9 -6 -15 -20 -25 -26 -17 -35
7543c5RoJjJ0J5kjK1jJ3Lj0K2%JojKnnokj5Poj1lmlj8J1jQPqJ0JNJ1j2J4kqRq
$$ -35 -26 -32 -31 -32 -22 -7 -9 -10 11 10 23 26 16 38 38 39 33 32 34 29 24 18 16 1 8 2 -9 -12 -16 -19 -37 -26 -27 -19 -12 -20 -10 -9 -4 7 -5 9 7 -1 8 0
7589@kJNJ8k0P%qkNjNo%Qj1lj1Rj3Ln%OlMJ0QlNK0j1jJ2j2K5k5J2kj0Lj3kj9J
$$ 0 -2 -1 4 22 2 9 9 1 -1 4 3 8 2 2 10 -1 -4 -15 -6 -19 -16 -21 -21 -15 -18 -14 -4 4 1 6 26 15 14 26 14 39 14 26 24 14 17 4 2 -17 -16
7634a6Mj8jpJ5j2lKMmJ3K%J6J0NJNp%jJ3kpL%qqjLoJ9k2KMPrQP%M%qjlmjJj3J3
$$ -16 -12 -30 -31 -38 -23 -35 -38 -36 -32 -36 -23 -21 -21 -5 5 10 11 16 9 9 8 21 19 12 15 15 7 -1 -2 1 -5 14 -8 -6 -2 5 -4 4 11 11 15 15 7 6 3 -1 -2 -1 -14 -1
7684aj8oJMj1J1OJ1JMLlJ0MqkJ6Mj5k0J5qkj3QJPnRpJ%J4Nj2J5qr%J0j3J3rj0
$$ -1 -19 -25 -24 -20 -31 -20 -14 -3 -2 2 5 2 12 16 8 6 22 26 11 -9 6 -2 -4 -17 -9 -8 -1 -6 3 -4 -3 -3 11 16 4 19 11 2 2 12 -1 12 3 -7
7728gKQ%qjj1J1j0MLRmlkLj0J5%jRj8PrOj7J4%j7RKj2J7oPJ7oJ1MJ6NoM%OQrj2
$$ -7 -5 3 3 -5 -6 -17 -6 -16 -12 -9 0 -4 -7 -9 -6 -16 -1 -1 -2 7 -11 -4 -13 -7 -24 -10 -10 -27 -18 -16 -28 -11 -17 -10 7 1 12 16 32 37 31 35 35 41 49 40 28
7775B8lpMk0joqRj1LJ0j0kjRlj1%lK0j1MmJ2mjJ2mJ7lMLql%Pj1Kkrj0%MlrM%k
$$ 28 25 18 22 2 1 -5 -13 -4 -15 -12 -2 -12 -14 -15 -6 -9 -20 -20 -23 -3 -14 -10 -14 -2 -6 -7 5 1 18 15 19 22 14 11 11 18 7 9 7 -2 -12 -12 -8 -11 -20 -16 -16 -18
7823a8nLJ4qMJ5krLMJ0MKjMkQlnjnj9krMj3%Rk0MK%J4kJ3JMJ0J2jpOKNoNj2%O
$$ -18 -23 -20 -6 -14 -10 5 3 -6 -3 1 11 15 17 16 20 18 26 23 18 17 12 -7 -9 -18 -14 -27 -27 -18 -38 -34 -32 -32 -18 -20 -7 -6 -2 8 20 19 12 18 20 25 19 24 12 12 18
7872A8Mlj2QJj6J1%k1PLrkollNrNq%KKQOOMLRqpJ3j6J3KjkkMpRrnMmmJ4qKnNl
$$ 18 22 19 7 15 16 0 11 11 -10 -3 0 -9 -11 -17 -20 -23 -18 -27 -22 -30 -30 -28 -26 -18 -12 -6 -2 1 10 2 -5 8 -8 5 7 6 4 2 6 -1 8 -1 -6 -2 -6 -10 4 -4 -2 -7 -2 -5
7924e%P%mJ0%qKMj5J1Oj6MQj2Nj9LKJ6j2PnJ5qmmLO%oJNjmJjMlJnNJ0KPj2Pnj
$$ -5 -5 2 2 -2 8 8 0 2 6 -9 2 8 -8 -4 4 -8 -3 -22 -19 -17 -1 -13 -6 -11 4 -4 -8 -12 -9 -3 -3 -9 -8 -3 -4 -8 -7 -8 -4 -7 -6 -11 -6 4 6 13 1 8 3 2
7974BOO%rJ3k1J3K%j0LpJ1lj9LoJ3j6J7j2j0K1%j9KPJ%mPj4Nj2J2MlQnQjPPoJ3
$$ 2 8 14 14 5 18 -3 10 12 12 2 5 -2 9 6 -13 -10 -16 -3 -19 -2 -14 -24 -3 -3 -22 -20 -13 -12 -12 -16 -9 -23 -18 -30 -18 -14 -17 -9 -14 -6 -7 0 7 1 14
8019A4lJ1%MpkLl0J2rpJkj4LQj6J2Pj1K1j0J7j5OKJ0jRj4OkOPj1Mj6Pj7J2j0j4
$$ 14 11 22 22 26 19 17 20 -10 2 -7 -14 -13 -15 -29 -26 -18 -34 -22 -15 -26 -5 -15 2 -13 -7 -5 5 4 13 -1 5 3 9 16 5 9 -7 0 -17 -5 -15 -29
8061b9JJ3j6OLJLMJ4JJjJ1qJ1jMnJ0mmnNj3j1K1kKJrjj2N%j4%L%ojj0LM%mLmJ3
$$ -29 -28 -15 -31 -25 -22 -21 -18 -14 0 1 2 1 12 4 15 14 18 13 23 19 15 10 15 2 -9 12 10 12 13 4 3 -9 -4 -4 -18 -18 -15 -15 -21 -22 -32 -29 -25 -25 -29 -26 -30 -17
8109a7RJkLJ8rQmqJ1j0PQqkLJj5J0mrMkm%%%PLNlKqQjJ3j2NpKOnkpKnjOj2kK1
$$ -17 -8 -7 -9 -6 12 3 11 7 -1 10 0 7 15 7 5 8 9 -6 4 0 -9 -5 -7 -11 -11 -11 -11 -4 -1 4 1 3 -5 3 2 15 3 8 1 3 9 4 2 -5 -3 -8 -9 -3 -15 -17 4
8160Dmj5qJ9oj4J9KrJ8rnLPnJ5j1MJ0lrNQj0Nj0J2lnmK
$$ 4 0 -15 -23 -4 -10 -24 -5 -3 -12 6 -3 -8 -5 2 -3 12 1 5 15 12 3 8 16 6 11 1 13 10 5 1 3
8191C
$$ Imaginary data points
##PAGE= N=2
##DATA TABLE= (X++(I..I)), XYDATA
0@%%%%%%%%%%%%jRj6J6j7J8k5L3l5M3n1O0p6Q6r6J12j30J52j76J98k25K59k93
$$ 0 0 0 0 0 0 0 0 0 0 0 0 0 -1 8 -8 8 -9 9 -16 17 -18 25 -26 34 -42 44 -52 60 -70 82 -94 104 -121 138 -155
35a55L28l71M17m66N20n77O41p12P89q74R67j064J174j294J426j573J733j911
$$ -155 173 -198 219 -247 273 -304 337 -375 414 -460 507 -557 617 -677 749 -824 909 -1002
53a002K109k330K576k856L178l550L988m511N146n940O966q350J0335j3440J9039
$$ -1002 1107 -1223 1353 -1503 1675 -1875 2113 -2398 2748 -3192 3774 -4576 5759 -7681 11358
68A1358l2380J25083J69820l0936O896l7716k6185n2717m0879n4490m2561m8648
$$ 11358 -21022 104061 273881 242945 249841 212125 185940 133223 92344 37854 -4707 -53355
80e3355l3592l2693j7269j4289K50M008J6042J8909K8524K9619L5129L3546L6090
$$ -53355 -86947 -119640 -136909 -151198 -150948 -146940 -130898 -111989 -83465 -53846 -18717 14829 50919
93E0919L2311L0859K4078J9673J0953L849o372j4113k3493l0408l7642m1438m4080
$$ 50919 83230 114089 138167 157840 168793 172642 166270 152157 128664 98256 60614 19176 -24904
106b4904m3017m0173l3980k6657j6941o395N187J5590K4827L1872L6982L9018
$$ -24904 -67921 -108094 -142074 -168731 -185672 -192067 -186880 -171290 -146463 -114591 -77609 -38591
118c8591L8226L4646K8925K0975J1965K672n871j3443j9391k3101k4181k3066
$$ -38591 -365 34281 63206 84181 96146 98818 92947 79504 60113 37012 12831 -10235
130a0235k0240j5697r796l497K323P374J1340J3766J4405J3381J1289Q200M332
$$ -10235 -30475 -46172 -55968 -59465 -57142 -49768 -38428 -24662 -10257 3124 14413 22613 26945
143B6945L47l084n642p314p857p208n480k968K4L178N912P892Q996R235Q362O486
$$ 26945 27292 24208 18566 11252 3395 -3813 -9293 -12261 -12237 -9059 -3147 4745 13741 22976 31338 37824
159C7824L818O57k816o209q943j0697j1520j1513j0520q331n395k184J115M337
$$ 37824 41642 42299 39483 33274 24331 13634 2114 -9399 -19919 -28250 -33645 -35829 -34714 -30377
173c0377P152R122J0190J0450R975Q564O516M168J639j037l520n437o765p679
$$ -30377 -23225 -14103 -3913 6537 16512 25076 31592 35760 37399 36362 32842 27405 20640 12961
187A2961q255q302p785o907n908m791l495k099p77N61J959L386M750N994P171
$$ 12961 4706 -3596 -11381 -18288 -24196 -28987 -32482 -34581 -35358 -34797 -32838 -29452 -24702 -18708 -11537
202a1537Q172Q881R262R128Q438P159N324L023L49k540n537q432j0847j2610j3537
$$ -11537 -3365 5516 14778 23906 32344 39503 44827 47850 48199 45659 40122 31690 20843 8233 -5304
217e304j3753j3043j1291q703n524j920J863N598Q935J1505J3199J3944J3720
$$ -5304 -19057 -32100 -43391 -52094 -57618 -59538 -57675 -52077 -43142 -31637 -18438 -4494 9226
230I226J2528J0380P542M239P21k621n527p926r655j0616j0591r695q222o219
$$ 9226 21754 32134 39676 43915 44636 42015 36488 28562 18907 8291 -2300 -11995 -20217 -26436
244b6436l842j211J264L490N346O788P644P743P285O403N119L443J559l18k081
$$ -26436 -30278 -31489 -30225 -26735 -21389 -14601 -6957 786 8071 14474 19593 23036 24595 24277 22196
259B2196l748n130o075o528o628o373n686m530l057j472K74K112L842N318O412
$$ 22196 18448 13318 7243 715 -5913 -12286 -17972 -22502 -25559 -27031 -26757 -24645 -20803 -15485 -9073
274i073P212P598P554O945N806M331K602O74j283l211m918o284p199p605p547
$$ -9073 -1861 5737 13291 20236 26042 30373 32975 33649 32366 29155 24237 17953 10754 3149 -4398
289d398p036o108m805l251j584R7J642K968M024M689N065N069M897M470L891L230
$$ -4398 -11434 -17542 -22347 -25598 -27182 -27085 -25443 -22475 -18451 -13762 -8697 -3628 1269 5739 9630 12860
305A2860K528J993J502J005N72K11j03m85q81j346j844k405k995l548l892m191
$$ 12860 15388 17381 18883 19888 20460 20671 20568 20083 19202 17856 16012 13607 10612 7064 3172 -1019
321a019m270m134l785l235k525j649o27L86J194J845K343K650K660K442K059J617
$$ -1019 -5289 -9423 -13208 -16443 -18968 -20617 -21244 -20858 -19664 -17819 -15476 -12826 -10166 -7724 -5665 -4048
337d048J121P01M16L38M16O46J031J453J851K116K257K071J512P01m19j647k969
$$ -4048 -2927 -2226 -1810 -1472 -1056 -410 621 2074 3925 6041 8298 10369 11881 12582 12163 10516 7547
354G547m217n340o141o463o197n437m178k474m31J808M030O010P672Q776R270
$$ 7547 3330 -2010 -8151 -14614 -20811 -26248 -30426 -32900 -33331 -31523 -27493 -21483 -13811 -5035 4235
369D235R099Q259O869N075K973P14j444l328m752n750o107o015n406m484l322
$$ 4235 13334 21593 28462 33537 36510 37224 35780 32452 27700 21950 15843 9828 4422 -62 -3384
384c384j990q07J78Q89J256J318J073O19P5m47q87j145j079p53j48O60J451K235
$$ -3384 -5374 -6181 -6003 -5114 -3858 -2540 -1467 -848 -773 -1220 -2107 -3252 -4331 -5084 -5232 -4572 -3121 -886
402h86K889L186L236K839J989Q25n68k020l420m561n310n608n369m600l357j699
$$ -886 2003 5189 8425 11264 13253 14078 13510 11490 8070 3509 -1801 -7409 -12778 -17378 -20735 -22434
418b2434J86K074L805N184O057O361O079N162L738J888j84k197l984n392o274
$$ -22434 -22248 -20174 -16369 -11185 -5128 1233 7312 12474 16212 18100 17916 15719 11735 6343 69
433F9o548o151n151l607j777K58K222L943N181N910O067N619M677L253J567r3
$$ 69 -6479 -12630 -17781 -21388 -23165 -22907 -20685 -16742 -11561 -5651 416 6035 10712 13965 15532 15439
449A5439j644k903l817m182m115l505k544j371j15J069K015K618K851K645J980
$$ 15439 13795 10892 7075 2893 -1222 -4727 -7271 -8642 -8757 -7688 -5673 -3055 -204 2441 4421
464D421J130P0j059k039k885l249l217k856k112j069J63J436K631L580M145M353
$$ 4421 5551 5621 4562 2523 -362 -3611 -6828 -9684 -11796 -12865 -12702 -11266 -8635 -5055 -910 3443
480C443M120L602K736J642M86o12j520k147k439k342j896j179l97M81J256J893
$$ 3443 7563 11165 13901 15543 16029 15417 13897 11750 9311 6969 5073 3894 3497 3978 5234 7127
496G127K122J963J424N72n72j816l054m078m848n163m988m236l079j546K54K107
$$ 7127 9249 11212 12636 13208 12636 10820 7766 3688 -1160 -6323 -11311 -15547 -18626 -20172 -19918 -17811
512a7811L819N142O060O445O229N335L908K081O1k033l968n576o652p192p084
$$ -17811 -13992 -8850 -2790 3655 9884 15219 19127 21208 21269 19236 15268 9692 3040 -4152 -11236
527a1236o384n100l457j611L17K123L607M668N232N294M718L811K562J162k01
$$ -11236 -17620 -22720 -26177 -27788 -27471 -25348 -21741 -17073 -11841 -6547 -1829 1982 4544 5706 5505
542E505j464k465l186l384l186k605j682o01N88J770K852L610M139M323M162L745
$$ 5505 4041 1576 -1610 -4994 -8180 -10785 -12467 -13068 -12480 -10710 -7858 -4248 -109 4214 8376 12121
558A2121L066K267J434O14j82q05j313j697j937k060k157k262k345k409k548k627
$$ 12121 15187 17454 18888 19502 19320 18515 17202 15505 13568 11508 9351 7089 4744 2335 -213 -2840
574b840k612k554k345j949j354n58M10J488K610L700M561N251N616N623N158M224
$$ -2840 -5452 -8006 -10351 -12300 -13654 -14212 -13802 -12314 -9704 -6004 -1443 3808 9424 15047 20205 24429
590B4429K896J364m09k293m099n651o929p700p959p707o914n709m131k278k91
$$ 24429 27325 28689 28280 25987 21888 16237 9308 1608 -6351 -14058 -20972 -26681 -30812 -33090 -33381
605c3381J577L210M634N699O289O335N982N325M379L189J888O44m33j410k111
$$ -33381 -31804 -28594 -23960 -18261 -11972 -5637 345 5670 10049 13238 15126 15770 15337 13927 11816
620A1816k569k734k703k515k216j737j289q47n14k29K7J61K45K96L47L92M10M79
$$ 11816 9247 6513 3810 1295 -921 -2658 -3947 -4794 -5308 -5537 -5510 -5349 -5104 -4808 -4461 -4069 -3659 -3180
638c180O15P82Q50Q75R78J071J019Q95P00N41L57N1k36m31o15q33r54r86r24r18
$$ -3180 -2565 -1783 -933 -58 920 1991 3010 3905 4605 5146 5503 5554 5318 4887 4272 3439 2485 1499 575 -343
658c43q47o78m83l18k38m3J78L36M35N12P15Q34R00Q91R22Q48O91M16J73m6m35
$$ -343 -1190 -1868 -2351 -2669 -2907 -2950 -2772 -2436 -2001 -1489 -774 60 960 1851 2773 3621 4312 4728 4901 4855 4420
679D420q24j186j500j732j843j799j649j399j023n23Q6P34J299J860K238K555
$$ 4420 3596 2410 910 -822 -2665 -4464 -6113 -7512 -8535 -9058 -8972 -8238 -6939 -5079 -2841 -286
695b86K742K659K431K070J541R32K51m55j100j667k146k491k688k803k672k439
$$ -286 2456 5115 7546 9616 11157 12089 12340 11885 10785 9118 6972 4481 1793 -1010 -3682 -6121
711f121k154j759j241p03j47M56J029J555K024K433K731K973L019K907K715K290
$$ -6121 -8275 -10034 -11275 -11978 -12125 -11669 -10640 -9085 -7061 -4628 -1897 1076 4095 7002 9717 12007
727A2007J705J033K30n80j474k310l026l523l785l876l628l218k479j561n27M86
$$ 12007 13712 14745 14975 14395 12921 10611 7585 4062 277 -3599 -7227 -10445 -12924 -14485 -15012 -14526
743a4526J530K400L084L452L531L420K890K152J238K30p75j735k491k981l289
$$ -14526 -12996 -10596 -7512 -4060 -529 2891 5781 7933 9171 9401 8626 6891 4400 1419 -1870
758a870l254k956k379j558o61K50J140J928K528K824K921K853K458J924J307O77
$$ -1870 -5124 -8080 -10459 -12017 -12678 -12428 -11288 -9360 -6832 -4008 -1087 1766 4224 6148 7455 8132
774H132N8m87r19j201j311j316j216j023q05n86m35l32k66k42k72l09l06k24p9
$$ 8132 8190 7703 6784 5583 4272 2956 1740 717 -88 -674 -1109 -1441 -1707 -1949 -2221 -2530 -2836 -3060 -3139
793c139J67N36R85J491J959K318K625K813K699K371J842J105J71q05j801k704
$$ -3139 -2972 -2436 -1451 40 1999 4317 6942 9755 12454 14825 16667 17772 17943 17138 15337 12633
809A2633l505m074m330m309l962l425k613j624n96L79J285K001K511K711K620
$$ 12633 9128 5054 724 -3585 -7547 -10972 -13585 -15209 -15805 -15426 -14141 -12140 -9629 -6918 -4298
824d298K350J914J335O41N7m33q07j018r92p62m44j02K55O18Q18Q88P50M59M5
$$ -4298 -1948 -34 1301 1942 1999 1566 759 -259 -1251 -2013 -2457 -2559 -2304 -1686 -868 20 770 1229 1274
843A274m96j077j583j917k154k187j998j502q26m6Q59J718K517L118L487L671
$$ 1274 778 -299 -1882 -3799 -5953 -8140 -10138 -11640 -12466 -12512 -11653 -9935 -7418 -4300 -813 2858
859B858L476L101K436J597P15j45r78j654k103k315k290k022j637j089n01O8N26
$$ 2858 6334 9435 11871 13468 14183 14038 13060 11406 9303 6988 4698 2676 1039 -50 -551 -483 43
876D3Q93J024J007Q04M24j3m70q71j197j420j488j296r88n40l5N11R67J341J540
$$ 43 936 1960 2967 3771 4195 4182 3712 2841 1644 224 -1264 -2560 -3548 -4088 -4123 -3612 -2645 -1304 236
895B36J566J419J007N48K0n55j105j521j803j867j716j418j006m19J49P05J180
$$ 236 1802 3221 4228 4776 4796 4241 3136 1615 -188 -2055 -3771 -5189 -6195 -6614 -6465 -5760 -4580
912d580J514J657J612J400J006N07p5o47j135j510j718j677j452j089o18k3N95
$$ -4580 -3066 -1409 203 1603 2609 3116 3041 2394 1259 -251 -1969 -3646 -5098 -6187 -6805 -6828 -6233
929f233J195J618J923K049J964J649J213P17J03m99j004j374j606j708j565j265
$$ -6233 -5038 -3420 -1497 552 2516 4165 5378 6095 6198 5699 4695 3321 1715 7 -1558 -2823
945b823q63m49P4N23Q77J095J186J161R28O20K62j11m67p72r70j016r10p34m66
$$ -2823 -3686 -4135 -4061 -3538 -2661 -1566 -380 781 1709 2329 2591 2480 2013 1241 271 -745 -1655 -2389 -2855
964b855j23K24N17P48R46J031R52P75N57L06rk49m30n68n75n29l56r5J82M16O57
$$ -2855 -2978 -2754 -2237 -1489 -543 488 1440 2215 2772 3078 3069 2820 2390 1822 1247 718 362 267 449 865 1522
985A522P93Q42P81N91L38k5m39q02j157j475j640j634j534j262r31m47N0N51R97
$$ 1522 2315 3157 3938 4529 4867 4842 4403 3601 2444 969 -671 -2305 -3839 -5101 -6032 -6479 -6429 -5878 -4881
1004d881J348J604J741J731J576J270Q77M90L0l63p44j020j207j331j374j278
$$ -4881 -3533 -1929 -188 1543 3119 4389 5266 5756 5786 5423 4679 3659 2452 1121 -253 -1531
1020a531j105q78o67m35k33o4O6J83K70L25L29L41L89M26M49N02N62O02O70O62
$$ -1531 -2636 -3514 -4181 -4616 -4849 -4913 -4847 -4664 -4394 -4069 -3740 -3399 -3010 -2584 -2135 -1633 -1071 -469 201 863
1040H63O49O00N19L88K58J22n8k21l43m55n11n44n29m50l74k97j82r0pK7N5M0
$$ 863 1512 2112 2631 3019 3277 3399 3341 3120 2777 2322 1811 1267 738 288 -86 -383 -565 -655 -662 -635 -580 -540
1062e40J2n8j21j39j78j99j75j35m9L4J74L03M38N18N92O46O77O32N65M52L37
$$ -540 -528 -586 -707 -846 -1024 -1223 -1398 -1533 -1582 -1548 -1374 -1071 -633 -115 477 1123 1800 2432 2997 3449 3786
1083C786J68rj62l21m78o12p26q09q47q63q19q05o80n75m28k16l3K14M03N98Q06
$$ 3786 3954 3945 3783 3462 2984 2372 1646 837 -10 -873 -1692 -2497 -3177 -3752 -4180 -4396 -4429 -4215 -3812 -3214 -2408
1104b408R90J069J166J134J074R18O66M83K29p2l61o33p91r62j094j109j060r54
$$ -2408 -1418 -349 817 1951 3025 3943 4609 5092 5321 5249 4888 4255 3464 2502 1408 299 -761 -1715
1122a715p98n87m00j78j0J40K51L32L63L35L11K73K32J86J89J89K25K65L09L65
$$ -1715 -2513 -3100 -3500 -3678 -3688 -3548 -3297 -2965 -2602 -2267 -1956 -1683 -1451 -1265 -1076 -887 -662 -397 -88 277
1142B77L90L99L62L08K07L6r4k66m17n65o58p01o60n79m37k18kK37M50O43P38
$$ 277 667 1066 1428 1736 1943 1979 1885 1619 1202 637 -21 -722 -1382 -1961 -2398 -2616 -2618 -2381 -1931 -1288 -550
1163e50Q22P91O60M81K74Pk03m40n93p02p48o70n20l07j10J26L68N48O79P42P18
$$ -550 272 1063 1723 2204 2478 2485 2282 1842 1249 547 -201 -871 -1391 -1698 -1808 -1682 -1314 -766 -87 655 1373
1184A373O28M44K30J7k09m03n49o30o32n91m87k97q3J18K70L74M74M70L74K38
$$ 1373 2001 2445 2675 2692 2483 2080 1531 901 269 -322 -809 -1106 -1189 -1071 -801 -427 47 517 891 1129
1204A129O8r4k92m73n60n60n13m12k62J5K75M93P13Q71R41Q96P90N96L35J3l12
$$ 1129 1197 1103 811 338 -222 -782 -1295 -1707 -1969 -1954 -1679 -1186 -473 398 1339 2235 3025 3621 3956 3969 3657
1225C657o16q36j005j082j083r46p36n08k26N9L23M92O16O18N93M71K96O1j46
$$ 3657 3041 2205 1200 118 -965 -1911 -2647 -3155 -3381 -3322 -2999 -2507 -1891 -1273 -680 -209 87 148 2
1244Bl45n10n75n87n11l74j93K1K53M56O23P13P53P03N43L83J43m9k69m55n62
$$ 2 -343 -853 -1428 -2015 -2526 -2900 -3093 -3072 -2819 -2363 -1740 -1027 -274 429 972 1355 1498 1449 1180 725 163
1265A63n80n05l75k04K0K47M51O20P26P20O50N14L11P1j72l96n75o88p16o37m77
$$ 163 -417 -922 -1297 -1501 -1481 -1234 -783 -163 563 1283 1933 2447 2758 2829 2657 2261 1686 998 282 -355 -832
1286h32k04M9L84O69R15J082J163J122R70P56M11N3l33p05j064j286j457j550
$$ -832 -1036 -987 -603 66 981 2063 3226 4348 5318 6074 6485 6538 6205 5500 4436 3150 1693 143
1304A43j521j332j111q17m80j95J19L79N46O31P23O93O07M91M17K98J62J23M4
$$ 143 -1378 -2710 -3821 -4638 -5118 -5313 -5194 -4815 -4269 -3638 -2915 -2222 -1615 -1124 -707 -409 -247 -124 -80
1323h0P0Q5J00J17J55J17N8l7j55k87m49n95p02p51p57o89n20l43j09J67M71P05
$$ -80 -10 75 175 292 447 564 622 585 430 143 -306 -901 -1603 -2354 -3111 -3800 -4320 -4663 -4772 -4605 -4134 -3429
1345c429R73J119J249J232J144R86P42M78J75q8l32n16o61p01p04o37m98l39j37
$$ -3429 -2456 -1337 -88 1144 2288 3274 4016 4494 4669 4581 4249 3733 3072 2371 1667 1030 532 193 56
1364E6L1J65K67L03L07K17J15J2j43k83l85m55m70m53l48k10n8O3K27L66M73M88
$$ 56 87 252 519 822 1129 1346 1461 1473 1330 1047 662 207 -263 -716 -1064 -1274 -1332 -1269 -1042 -676 -203 285
1386B85M51M06K87J23m2j79l19m39n35n25n01m10l26j89l8J08K13K81L66L88L48
$$ 285 736 1142 1429 1552 1510 1331 1012 573 38 -487 -988 -1398 -1724 -1913 -1951 -1843 -1630 -1349 -983 -595 -247
1407b47K89K27J30L3o8j44j88k28k25k03j35j01m3L0J11J11J79J72J66J40J22
$$ -247 42 269 399 432 364 220 32 -196 -421 -624 -759 -860 -903 -873 -762 -651 -472 -300 -134 6 128
1428A28J16Q4Q2O8O8Q2N5Q6P4O2J3%m2j33j66k39k89l38l52l41k82k25j46o7Q2
$$ 128 244 328 410 478 546 628 683 769 843 905 918 918 876 743 577 338 49 -289 -641 -982 -1264 -1489 -1635 -1702 -1620
1453a620J84K76L56M45M59M55M13L33K74J41L2p2j70k73l22l63l82l47l22k69
$$ -1620 -1436 -1160 -804 -359 100 555 968 1301 1575 1716 1748 1676 1506 1233 911 548 166 -181 -503 -772
1473g72j71q5NP3J38J86K31K36K57K13J86J34P5K5o2r7j38j79k33k06k17j97j63
$$ -772 -943 -1028 -1023 -950 -812 -626 -395 -159 98 311 497 631 706 731 669 572 434 255 22 -184 -401 -598 -761
1496g61q5l6J4R0J78K53K97L20L44L45K96K39J59R5j7j24k18k91l39m05m36m01
$$ -761 -846 -882 -868 -778 -600 -347 -50 270 614 959 1255 1494 1653 1748 1731 1607 1389 1098 759 354 -82 -483
1518d83l43k93k08r5j8Q4J58K29K67K88K96K47K21J69J08O5Jm5o4o0j12r2p4p7
$$ -483 -826 -1119 -1327 -1422 -1440 -1356 -1198 -969 -702 -414 -118 129 350 519 627 692 693 648 584 524 412 320 246 169
1542A69p6q4q9j10j18j65j80k03k04k20j87j50r4n3K9R3J62K27K71K95K93K79
$$ 169 93 9 -80 -190 -308 -473 -653 -856 -1060 -1280 -1467 -1617 -1711 -1764 -1735 -1642 -1480 -1253 -982 -687 -394 -115
1564a15K34K07J26Q6L0kj6j1j4J9P4J06J44J74J76J78J41Q7Qq0j88k34l39l84
$$ -115 119 326 452 538 568 566 550 539 525 544 618 724 868 1042 1218 1396 1537 1624 1632 1552 1364 1130 791 407
1588D07m16m02l32k76j54k2J01K36L42M36M81N13M58L94L18J82N5p0k08l06l83
$$ 407 -9 -411 -743 -1019 -1173 -1195 -1094 -858 -516 -80 401 914 1372 1766 2084 2266 2321 2251 2043 1737 1354
1609A354m42m65m56m26l99l23k76j89j56r4p5n2k3j9L4M4Q5J53K03K62L31L80
$$ 1354 912 447 -9 -435 -834 -1157 -1433 -1622 -1778 -1872 -1947 -1999 -2022 -2041 -2007 -1963 -1878 -1725 -1522 -1260 -929 -549
1631e49M33M40M16L67K82J95N3q9k17l59m60n51n67n55m92l65k54p6J18L02M48
$$ -549 -116 324 740 1107 1389 1584 1637 1548 1331 972 512 -39 -606 -1161 -1653 -2018 -2272 -2348 -2230 -1928 -1480
1652a480N60O66O98O67N94M71L15J21l6j77l48m59n29n58n30m74l96k72j46k4
$$ -1480 -920 -254 444 1111 1705 2176 2491 2612 2576 2399 2051 1592 1063 505 -25 -499 -895 -1167 -1313 -1337
1672a337Q5J69K57K99L35K92L10K48J83J49J05M8J3k2m7p5q7j20j53j70k12k34
$$ -1337 -1252 -1083 -826 -527 -192 100 410 658 841 990 1095 1143 1156 1134 1087 1012 925 805 652 482 270 36
1694C6k71k85k89k65k21j65r8NJ01K03L07L92M49M85M89M30L61K65J36j3j50k69
$$ 36 -235 -520 -809 -1074 -1295 -1460 -1558 -1553 -1452 -1249 -942 -550 -101 384 873 1303 1664 1929 2065 2052 1902 1633
1716A633l84m69n20n24n11m16l28k29r1J9J20K11K57L01K93K71K38J69J17N5R
$$ 1633 1249 780 260 -264 -775 -1191 -1519 -1748 -1839 -1820 -1700 -1489 -1232 -931 -638 -367 -129 40 157 212 221
1737B21n9q1p5q2o5m7k5RJ3L5L0J7j7m9o2j00j04j18r4p5j6M9R6J87K34K80L15
$$ 221 162 81 6 -76 -141 -188 -213 -204 -191 -156 -126 -109 -126 -175 -237 -337 -441 -559 -653 -728 -744 -695 -599 -412 -178 102 417
1764D17L30L03K62J82J28K8p9j52k26k84l40l39l19k66k37j26m3L9J16K05K52
$$ 417 747 1050 1312 1494 1622 1650 1571 1419 1193 909 569 230 -89 -355 -592 -718 -761 -722 -606 -401 -149
1785a49K92K99K99K63K22J43R8J6m7j28j99k58l02l24l47l51l65l10k87k48j64
$$ -149 143 442 741 1004 1226 1369 1467 1483 1436 1308 1109 851 549 225 -122 -473 -838 -1148 -1435 -1683 -1847
1806a847j07k5L3J30K14K82L37L91M14M08M04L65K97K02R5rj19k07l35l70m55
$$ -1847 -1954 -1979 -1946 -1816 -1602 -1320 -983 -592 -178 230 634 999 1296 1498 1593 1584 1465 1258 923 553 98
1827I8m68m49m26l50k49j49l6R3J90L10L87M31M89M82M49L98K98K27J29Pp1j61
$$ 98 -370 -819 -1245 -1595 -1844 -1993 -2029 -1936 -1746 -1436 -1049 -618 -129 353 802 1200 1498 1725 1854 1861 1790 1629
1849A629k47k92l42l31l50l15k69k26j41o8qN2J03J47J79K07K14J93J77J57J11
$$ 1629 1382 1090 748 417 67 -248 -517 -743 -884 -952 -960 -908 -805 -658 -479 -272 -58 135 312 469 580
1870E80Q2K2j4m3o5j14j17j43j31j24j11r7p3l9j8kM7N3P2O8Q0O4P0M6M2L0jN
$$ 580 662 684 670 627 562 448 331 188 57 -67 -178 -275 -348 -387 -405 -407 -360 -307 -235 -167 -87 -23 47 93 135 165 164 169
1898A69pj3j6rk9j7ok9j2j5rj7l8k3m8l3m5l7j9k4MNK9N2N3P6Q3Q6R0O2P1M7K1
$$ 169 162 149 133 124 95 78 72 43 31 16 7 -10 -48 -71 -119 -152 -197 -234 -253 -277 -273 -268 -239 -187 -134 -58 25 111 201 263 334 381 402
1931D02mk6n2q0q0r5j06j00j07r5q5o5l6m4RK1P3O9J10R5J27J38J24J26J14R1
$$ 402 398 372 320 240 160 65 -41 -141 -248 -343 -428 -493 -529 -573 -564 -543 -470 -401 -291 -196 -69 69 193 319 433 524
1957E24O6K7Om6q1j21j40j81j71j81j79j33j25p9k9J5O3J24J31J93K06K07J84
$$ 524 590 617 623 577 496 375 235 54 -117 -298 -477 -610 -735 -814 -843 -828 -765 -641 -510 -317 -111 96 280
1980B80J76J63R2N7K2l7o7j03j35j42j57j31j26r9o1n0k0K9O4N7Q9J01J04J05
$$ 280 456 619 711 768 790 753 686 583 448 306 149 18 -108 -207 -268 -318 -338 -309 -245 -188 -99 2 106 211
2004B11J07J09Q8P6M1L0Orl6o0p8j02j29j32j43j52j39j24j36r7p2l9J0K1P3J06
$$ 211 318 427 515 591 632 662 668 659 623 563 485 383 254 122 -21 -173 -312 -436 -572 -669 -741 -780 -770 -749 -676 -570
2030e70J36J18J40J47J26R5O8L8rm9q5j09j31j61j69j43j24j32p8l6NN0P9J25
$$ -570 -434 -316 -176 -29 97 192 260 298 289 240 155 46 -85 -246 -415 -558 -682 -814 -892 -928 -923 -873 -794 -669
2054f69J48J58J82J90J90J55J44J23R9O1M6j6j8n6q2o6j09r9j03r0q2o3l1j8j7
$$ -669 -521 -363 -181 9 199 354 498 621 720 781 827 811 793 737 655 589 480 381 278 188 106 43 12 -6 -23
2079b3J7M1N8N4P3P2Q1Q0M4L0J6j8k8o0p0q1r8j06j05r2r1q7n3l8l9j1LmK6NL2
$$ -23 -6 35 93 147 220 292 373 453 497 527 543 525 497 437 367 286 188 82 -23 -115 -206 -293 -346 -384 -423 -434 -431 -435 -409 -404 -372
2110c72NNJ6j9J7rQJJ0J6L2M1N8O2M6O4M1O2K2K1Pj2m1l2n9q3o3m4n1k2k1L0K8
$$ -372 -367 -362 -346 -365 -348 -357 -349 -348 -338 -322 -290 -249 -191 -129 -83 -19 22 84 106 127 134 122 81 49 -10 -93 -156 -200 -251 -273 -294 -264 -236
2143b36O9Q3J08J08J28J19J28R0Q4L0pj6p3q6j35j52j76j43j63j31j23o5m4kN2
$$ -236 -167 -84 24 132 260 379 507 597 681 711 704 688 615 529 394 242 66 -77 -240 -371 -494 -559 -603 -605 -553
2168e53J07J26J46J66J72J67J56J24Q7M2k1n5r1j25j84j69k07j71j83j38j03m9
$$ -553 -446 -320 -174 -8 164 331 487 611 698 740 719 664 573 448 264 95 -112 -283 -466 -604 -707 -756
2190g56j0M4Q3J25J49J77J93J90J47J62J22M5M1l0o9j06j30j71j77j57j75j49
$$ -756 -766 -722 -639 -514 -365 -188 5 195 342 504 626 671 712 682 613 507 377 206 29 -128 -303 -452
2212d52j21q8k1j0L5P5J12J44J50J46J29J52J15Q3N0K6l3m4j00j09j22j23j26
$$ -452 -573 -661 -682 -692 -657 -582 -470 -326 -176 -30 99 251 366 449 499 525 492 448 348 239 117 -6 -132
2235a32j23j01n6m7rK9L4P4R5R2R2R5R1P3M6L0Nmk9n8m4m5n3k9l2Kj4J5K6J5K2
$$ -132 -255 -356 -412 -459 -468 -439 -405 -331 -236 -144 -52 43 134 207 253 283 288 284 255 197 153 108 55 26 -6 -4 -18 -3 23 38 60
2266F0L8J0J1kk0k3m5n0m8m8n9k3j2mJ7L5L6P6Q1P6Q8O8P1M7J6j5k7o6o3j02j17
$$ 60 98 108 119 117 97 74 29 -21 -69 -117 -176 -199 -211 -215 -198 -163 -127 -51 30 106 194 262 333 380 396 381 354 288 225 123 6
2297Fj16j08q5r3n3m1JL9O8J02J19J24J35J36J16R6P5N5mn9p5j19j27j62j77j45
$$ 6 -110 -218 -303 -396 -449 -490 -489 -450 -382 -280 -161 -37 98 234 350 446 521 576 572 513 438 319 192 30 -147 -292
2323b92j53j17r2l6mN1R8J23J79J46J78J83J47J25R8L0nn3r6j31j72j80k07j57
$$ -292 -445 -562 -654 -690 -694 -643 -545 -422 -243 -97 81 264 411 536 634 664 659 606 510 379 207 27 -180 -337
2347c37j87j08j20n1j1K6R6J17J61J78K02J89J80J73J56Q9O2J6k2o8j05j36j65
$$ -337 -524 -632 -752 -803 -814 -788 -692 -575 -414 -236 -34 155 335 508 664 753 815 831 809 741 636 500 335
2370C35j90j76j74j55j42q8o5qL6O5J12J35J73J65J67J43J53J04P3J8j7m2q4j02
$$ 335 145 -31 -205 -360 -502 -590 -655 -663 -627 -562 -450 -315 -142 23 190 333 486 590 663 681 664 622 538 436
2394D36j59j49j38j40j40p8p7m5NK4M4O4P8P9Q6O2O7N2K0K7Oj4j2j7j4qj0lj0
$$ 436 277 128 -10 -150 -290 -368 -445 -490 -485 -461 -417 -353 -275 -196 -110 -48 19 71 91 118 124 110 98 81 67 59 49 46 36
2423C6J0ppj9j5j5l7l0m6k4m0j7j1lJ4L3M8N9Q3P2N6O6O3L2Qj0j5m4o7p2o8p8
$$ 36 46 39 32 13 -2 -17 -54 -84 -130 -154 -194 -211 -222 -225 -211 -178 -130 -71 12 84 140 206 269 301 309 299 284 240 173 101 33 -45
2455d5p3n9p6l3k7RrJ3K0M7N5O2P1N0R3O2O8O3P2M7L7J7mk4m7n7r4r7j12j17j31
$$ -45 -118 -177 -253 -286 -313 -304 -313 -300 -280 -233 -178 -116 -45 5 98 160 228 291 363 410 447 464 460 436 389 332 238 141 29 -88 -219
2486b19r8r1p3k6PN2O9J14J32J44J53J50J28J11O8K8pp1p5j41j56j67j61j44j41
$$ -219 -317 -408 -481 -507 -500 -448 -379 -265 -133 11 164 314 442 553 621 649 642 571 496 355 199 32 -129 -273 -414
2511d14r6o5j4j2N6O5R1J17J13P9J10Q3N4K5J2j6k7l4p2m8n0l7p4j0k4k4Mj0J8
$$ -414 -510 -575 -589 -601 -545 -480 -389 -272 -159 -80 30 113 167 192 204 188 161 127 55 7 -43 -80 -154 -164 -188 -212 -208 -218 -200
2540b00J5K4L7L8O3N0N2P6O8M4P1M1K7Pj1l7p0q5q0r9j03r8q2o9m6qK0N7O8J05
$$ -200 -185 -161 -124 -86 -23 27 79 155 223 267 338 379 406 413 402 365 295 210 130 31 -72 -170 -252 -321 -367 -375 -355 -298 -230 -125
2570a25J17J16J22J12R8O2L2J0m4o1q2j21j25j13j14j03r2o4n0j8oM3K4N4O4M9
$$ -125 -8 108 230 342 440 502 534 544 500 439 357 236 111 -2 -116 -219 -311 -375 -425 -443 -449 -406 -382 -328 -264 -215
2596b15M7M7N8L2M4J8L1K5K1K3K5J1PJ7j4j9qm5k9n7n7n8n6k4m3j4j5J3K3M3M9
$$ -215 -168 -121 -63 -31 13 31 62 87 108 131 156 167 174 191 177 158 150 105 76 19 -38 -96 -152 -176 -219 -233 -248 -235 -212 -169 -120
2627a20N1O3M6N1M8M0J1PJ7j4j3j0k6k5k4pk1k5nk7pl0ql3k5j5l6PrjK5J8K3L5
$$ -120 -69 -6 40 91 139 179 190 197 214 200 187 177 151 126 102 95 74 49 44 17 10 -20 -28 -61 -86 -101 -137 -130 -139 -140 -115 -97 -74 -39
2661c9N3L7M8M2J6K7qj0k8n3m8m9p1n4l0l2m1j7K8K2L1O0P5N8O0P0N4M3K5K4j
$$ -39 14 51 99 141 157 184 176 166 138 85 37 -12 -83 -137 -167 -199 -240 -257 -229 -207 -176 -116 -41 17 77 147 201 244 269 293 292
2692B92l4k9m6q4n9p0p8n8o5m4l0j7qL4L2N6P4O8Q4O7Q3N5N1M3mjj2m3m8p8p9
$$ 292 258 229 183 99 40 -30 -108 -166 -231 -275 -305 -322 -330 -296 -264 -208 -134 -66 18 85 168 223 274 317 313 312 300 257 209 131 52
2723E2o8o3p1n2l3k5MJ9J3L9O0N0L8N4M2L2K1Qpj0ql3j8j4l6k1j9Pj4K%LNRJ9
$$ 52 -16 -79 -150 -202 -235 -260 -256 -237 -224 -185 -125 -75 -37 17 59 91 112 120 113 103 95 62 44 30 -6 -27 -46 -39 -53 -51 -51 -48 -43 -34 -15
2758a5OK4JJ1K0J0J9KJ0qmj5j3j7l5l5l8k3k3l2jQJ0L7M5L1O7M7O3N3L8K7nJ0
$$ -15 -9 15 16 27 47 57 76 78 88 80 76 61 48 31 -4 -39 -77 -100 -123 -155 -156 -148 -138 -101 -56 -25 42 89 152 205 243 270 265 275
2792B75k8l7n4n5l8o1n2k8k8mk1J1KJ1J5pQk2k0k8l3k9j3JK2J4L9O9P5P7Q2P8
$$ 275 247 210 156 101 63 2 -50 -78 -106 -110 -131 -120 -118 -107 -92 -99 -91 -113 -133 -161 -194 -223 -236 -235 -213 -199 -160 -91 -16 61 143 221
2824B21P8M7K0Pm6m7p8j07j05j16j00q7q1m1j5J4M6P5P9J19Q7J05P5P0P5K6K0
$$ 221 299 346 366 373 327 280 202 95 -10 -126 -226 -313 -394 -435 -450 -436 -390 -315 -236 -117 -30 75 150 220 295 321 341
2851C41rj6l2l0m9l3l8j6k1k0j7k8j7k1l3j2k7l1l0k6MlJ5L4L9M5L8M7L0K3K1
$$ 341 332 316 284 254 205 172 134 118 97 77 60 32 15 -6 -39 -51 -78 -109 -139 -165 -161 -164 -149 -115 -76 -31 7 54 84 107 128
2882A28%k6m9l3n5n8m5m1%pQM5O6N8P9Q1O5M2J3Ll7n9r6r8r9r6q5o5l2j3L2N4
$$ 128 128 102 53 20 -35 -93 -138 -179 -179 -186 -178 -133 -67 -9 70 151 216 258 271 274 237 178 82 -16 -115 -211 -296 -361 -393 -406 -374 -320
2914c20Q7J05J08J07R9Q9O8L3kk6p5o1q7r4p4p4l6m3KQK7L6M7N4L6M2K4J4J9j7
$$ -320 -233 -128 -20 87 186 275 343 376 374 348 273 212 125 31 -43 -117 -153 -196 -194 -186 -159 -123 -76 -22 14 56 80 94 113 96
2944I6k8j6k2j8nj9nJ3QJ2JQjqk6k0k2j7j7j0LJ3M1K2N7P0O5M3O4K8pk1m2o3r0
$$ 96 68 52 30 12 7 -12 -17 -4 4 16 17 25 24 16 -10 -30 -52 -69 -86 -96 -93 -80 -39 -17 40 110 175 218 282 310 303 282 240 177 87
2979H7q3j04r7p9n9l3j5L2L7P3Q3Q0R8Q5N6N5L8kj4k7o9n6m6o1l6m3qj3J6K3M3
$$ 87 4 -100 -197 -276 -335 -368 -383 -351 -314 -241 -158 -78 20 105 161 216 254 252 238 211 142 86 40 -21 -57 -100 -108 -121 -105 -82 -39
3010c9L2J8K6J4Rk0j1l0l8m1l0l5j6PJ3MJ7L7L6L8L2L1K6J8K0NjNK3OpJ4J0j1
$$ -39 -7 11 37 51 60 40 29 -1 -39 -80 -110 -145 -161 -154 -141 -137 -120 -83 -47 -9 23 54 80 98 118 123 122 127 150 156 149 163 173 162
3044A62J2j0mk2m9l9n5p0n7q1o1k0n5qjK8O1O0Q1Q9R6Q6Q7Q3M5L8J5j4m1k5p2
$$ 162 174 164 160 138 89 50 -5 -75 -132 -213 -274 -294 -349 -357 -358 -330 -269 -209 -128 -39 57 143 230 313 358 396 411 397 356 331 259
3075B59p8q1q0q0p3m8n2n6j9rj3J0K1K8L8L4N4M1N3O1N3N0L7M8L3J8Qmrll2j6
$$ 259 181 100 20 -60 -133 -181 -233 -289 -308 -317 -330 -320 -299 -271 -233 -199 -145 -104 -51 10 63 113 150 198 231 249 257 253 244 241 209 193
3107A93m9m1n0m3n0l1n1k6l4k1j6j5J4KJ4K1K5K3N6M1N6M7L5L7M9K2J6rj7j8m3
$$ 193 144 103 53 10 -40 -71 -122 -148 -182 -203 -219 -234 -220 -218 -204 -183 -158 -135 -79 -38 18 65 100 137 186 208 224 215 198 180 137
3138A37m7l5n8n1k9k6j6j7K3K3K0L5K8M3K5J7K2pj2pl2l5l2j5j8k2nqK3J6J9K6
$$ 137 90 55 -3 -54 -83 -109 -125 -142 -119 -96 -76 -41 -13 30 55 72 94 87 75 68 36 1 -31 -46 -64 -86 -91 -99 -76 -60 -41 -15
3170a5K5J4J7RJ9mJ5j8J3JQJ2OQ%Nj3k9j7m4n1n6n8o9m6k8j7NJ9N7P5Q3R1J02
$$ -15 10 24 41 50 69 65 80 62 75 76 84 96 102 110 110 115 102 73 56 12 -39 -95 -153 -222 -268 -296 -313 -308 -289 -232 -157 -74 17 119
3204A19J02P8M7L7Rn2n7q3j03r6r9q0p2n7pK0L9O8O4J08P8P4M4M6%k6n0n8q2p3
$$ 119 221 299 346 383 392 340 283 200 97 1 -98 -178 -250 -307 -314 -294 -255 -187 -123 -15 63 137 181 227 227 201 151 93 11 -62
3234f2o8n9n0j7J0RM7N7O5O4N5N3L2L0Qmj7k5j1k4%lRJ2J6K0Qmj6m4m5o2p7p1
$$ -62 -130 -189 -239 -256 -246 -237 -190 -133 -68 -4 51 104 136 166 174 170 153 128 117 93 93 90 99 111 127 147 155 151 135 91 46 -16 -93 -164
3268a64o9p7n9j4J5K9P8P4J09J21J18J09Q9O8L1Km7o0q8j03r4r0q7n7m4k4K0K5
$$ -164 -233 -310 -369 -383 -368 -339 -261 -187 -78 43 161 270 359 427 458 460 413 353 265 162 68 -22 -109 -166 -210 -234 -214 -189
3296a89L4L7K7J4kk1n3l5o7n2o7k4KL2P1J01J11J42J59J60J36R5O1K1k3o5j23
$$ -189 -155 -118 -91 -77 -79 -100 -153 -188 -255 -307 -374 -398 -396 -364 -293 -192 -81 61 220 380 516 611 672 693 670 605 482
3323D82j53j63j74j70j59j36q5m7mL2P2R9J21J08J17J04Q5P0M7K8LJ6kj4Mk0j
$$ 482 329 166 -8 -178 -337 -473 -558 -605 -609 -577 -505 -406 -285 -177 -60 44 129 199 246 274 277 293 291 277 281 261 260
3350B60Pjj5k7l2l5q3o3r4r4q4q2o2m0J0J4P0P5J07R9J13J05O9O3L1nl3p2q3r3
$$ 260 267 266 251 224 192 157 74 11 -83 -177 -261 -343 -405 -445 -435 -421 -351 -276 -169 -70 43 148 217 280 311 306 273 201 118 25
3380B5p1r7p4l5KJ8N8Q0P5Q9R0N7O2OPn0o1r0r9j04q6p4m0k0nK8O7P6P3R2P8P0
$$ 25 -46 -143 -217 -252 -250 -232 -174 -94 -19 70 160 217 279 285 292 242 181 91 -8 -112 -198 -272 -312 -332 -337 -309 -242 -166 -93 -1 77 147
3412A47L7L8j1Jl4m2l5m0l8k8pKoL1K0L0J4K0ll1k0k3o0l4l7l4k2Jk1K4L0L1M1
$$ 147 184 222 211 212 178 136 101 61 23 -5 -12 -10 -16 15 35 65 79 99 96 65 45 22 -38 -72 -109 -143 -165 -164 -185 -161 -131 -100 -59
3445e9M3L5K9K3%Oj0k1k1j2j4Lj2J4K1K8K6K8L5OK0j6k6l7l1n8n6n7l7m9l7KO
$$ -59 -16 19 48 71 71 77 67 46 25 13 -1 2 -10 4 25 53 79 107 142 148 168 152 126 89 58 0 -56 -113 -150 -199 -236 -234 -228
3478b28J5L6L6M5N0N2M3K9K2J7J1Kj3j2j7qj6k6jJj3Pm%rOqj6qj1rrj2k4mj6j0
$$ -228 -213 -177 -141 -96 -46 6 49 78 100 117 128 130 117 105 88 80 64 38 37 38 25 32 28 28 19 25 17 1 -7 -18 -27 -36 -48 -72 -76 -92 -102
3515a02k6KpjpOJ7K9K7L1L8M9L2N8M4L9L3K4j5Jk1l6n8m7o0o0p4m5n7l9l9k6m
$$ -102 -128 -126 -133 -134 -141 -135 -118 -89 -62 -31 7 56 88 146 190 229 262 286 271 272 251 215 157 110 50 -10 -84 -129 -186 -225 -264 -290 -294
3548b94nJ5J4K4K9L9K7N4L8M9N3O7N2P7O6O7M3M9J6lk2n7p2j12j15j12j23j13
$$ -294 -299 -284 -270 -246 -217 -178 -151 -97 -59 -10 43 110 162 239 305 372 415 464 480 477 455 398 326 214 99 -13 -136 -249
3576b49j23j02n7m9J1L0N9P1J15J01J07J16Q5R3N3M5K7Pj6Lj8m2j8j6k5k2l3m4
$$ -249 -372 -474 -531 -580 -569 -539 -480 -409 -294 -193 -86 30 115 208 261 306 333 340 324 327 309 267 249 233 208 186 153 109
3604A09m3n7o8q8p4q7r0o8n6nrM4P9R1J36J40J38J52J25J01O2M0j5n3p8j02j24
$$ 109 66 9 -59 -147 -221 -308 -398 -466 -522 -527 -536 -492 -413 -322 -186 -46 92 244 369 470 532 572 557 504 426 324 200
3631B00j23j20r8p2n6j3%L5L6O8N7N8M9J6Llk8k9l1k4l0RMK1N4N0M8M8M2J7Rk0
$$ 200 77 -43 -141 -213 -269 -282 -282 -247 -211 -143 -86 -28 21 37 40 37 9 -20 -51 -75 -105 -96 -92 -71 -17 33 81 129 171 188 197 177
3663A77m8n6o3p5o2o0l1j9K4M3P7Q3J07Q7R0O2J9j1l7q7j21j08j29j19j16q7l6
$$ 177 129 73 10 -65 -127 -187 -218 -237 -213 -170 -93 -10 97 184 274 336 355 344 307 220 99 -9 -138 -257 -373 -460 -496
3690d96oM0R4J13J32J31J20J21R2N3K2l2k9q6r6r1r8o4n7k6jK6J5N7N1L2L4K3
$$ -496 -502 -462 -368 -255 -123 8 128 249 341 394 416 384 355 269 173 82 -16 -80 -137 -163 -164 -138 -123 -66 -15 17 51 74
3718G4k5k3m6n9n1o4k6m2rM1L8P7R5Q1Q6Q0N6L2Ml9o4o5q6r0p8n5m0OJ5M8P4Q5
$$ 74 49 26 -20 -79 -130 -194 -220 -262 -271 -230 -192 -115 -20 61 147 227 283 315 319 280 216 151 65 -25 -103 -158 -198 -192 -177 -129 -55 30
3750C0P2Q1M5K5Jl9p0r4r3j07j11r7n8l1QM0Q1J16J03J28J34R9P8O3J6rl9m9r0
$$ 30 102 183 228 253 254 215 145 51 -42 -149 -260 -357 -415 -446 -438 -398 -317 -201 -98 30 164 263 341 404 420 411 372 323 233
3779B33p5p9o3m8m4j2j2J6KJ9Lk4k2l6n5o0o4m2l5k3K5M5P0J21J27J41J41J37
$$ 233 158 79 16 -32 -76 -88 -100 -84 -82 -63 -60 -84 -106 -142 -197 -257 -321 -363 -398 -421 -396 -351 -281 -160 -33 108 249 386
3807C86J06P6O4Ll5m6r9j32j28j44j41j22j14o3o0pjK7M8N0N2O9O0M2O1K4M1N4
$$ 386 492 568 632 635 600 554 455 323 195 51 -90 -212 -326 -389 -449 -456 -457 -430 -382 -332 -280 -211 -151 -109 -48 -24 17 71
3835G1L9M0N5M9M0N8M8J7Nj0m8o1r8q5j10j11j10j12p6o0l1J4J7N6P9R1R5R8Q3
$$ 71 110 150 205 254 294 352 400 417 422 412 364 303 205 120 10 -101 -211 -323 -399 -459 -490 -476 -459 -403 -324 -233 -138 -40 43
3864D3Q7O3L9K2rjl7l6m8m5l5k8Kk4J2j2J9K0LJ4opj0rk9j5j8l3rk3j6ko%ROJ6
$$ 43 130 193 232 254 245 244 207 171 123 78 43 15 17 -7 5 -7 12 32 35 49 43 36 26 17 -12 -27 -45 -78 -87 -110 -126 -128 -134 -134 -125 -119 -103
3901a03J8K2QL3J9M3J6M3K5L0K1J6J4kj4j3m0l5l8n7m6m6m4m6k5rnlJ7K9K6K9
$$ -103 -85 -63 -55 -22 -3 40 56 99 124 154 175 191 205 203 189 176 136 101 63 6 -40 -86 -130 -176 -201 -210 -215 -218 -201 -172 -146 -117
3933a17L2M2L3M5K8L3J6K7J7OkjNl2k1j9m2l2m0m4k9l0k1k6RJ4J8O0L1M7M5K9
$$ -117 -85 -43 -10 35 63 96 112 139 156 162 160 159 164 132 111 92 50 18 -22 -66 -95 -125 -146 -172 -163 -149 -131 -71 -40 7 52 81
3965H1L5K9lj6l6m1m2o2m7n5l4qj2L3K3N8N5O0O2N6M6L3J6J0l2l4k7m5l1m7j9
$$ 81 116 145 142 126 90 49 7 -55 -102 -157 -191 -199 -211 -178 -155 -97 -42 18 80 136 182 215 231 241 209 175 148 103 72 25 6
3996Fk7Lj7Rkj3lj6j9m0m3l7n9m3j2j2K9M2O2Q5J01J10J22J10Q9O2L4Nl2p7r2
$$ 6 -21 -18 -35 -26 -28 -41 -44 -60 -79 -119 -162 -199 -258 -301 -313 -325 -296 -254 -192 -107 -6 104 226 336 425 487 521 526 494 417 325
4027C25j01j26j21j26r2q7o1k9J1J9M3M7N5O1M4N0L6J2K8NJ3K9M2M4N1P1O1N6
$$ 325 224 98 -23 -149 -241 -328 -389 -418 -407 -388 -345 -298 -243 -182 -138 -88 -52 -40 -12 -7 6 35 77 121 172 243 304 360
4055C60N9L5Krl9r3j00j18j33j53j42r9r3n7j4K7O8R3J13J20J31J07R3P5O2J0
$$ 360 419 454 456 447 408 315 215 97 -36 -189 -331 -430 -523 -580 -594 -567 -499 -406 -293 -173 -42 65 158 233 295 305
4081C05j5k2n0l5n0m1j1j5JJ3L9K0J9J0%j9n6p3q9q8j07q8p0m3j7J7N7Q3J04J23
$$ 305 290 268 218 183 133 92 81 66 67 80 119 139 158 168 168 149 93 20 -69 -157 -264 -352 -422 -465 -482 -465 -408 -325 -221 -98
4111i8J46J10J04P9N2J3nm1o6q0r9p3o0o4j8rJ0K3L5L4L1K7lql5l8o3n8m9l9p
$$ -98 48 158 262 341 393 406 401 360 294 214 115 42 -18 -82 -100 -109 -99 -76 -41 -7 24 51 48 40 5 -33 -96 -154 -203 -242 -249
4142b49rK0M1O9P9Q5R2P1N2L2J7j8m9p5o3p9p2o2m5l2OK9N5N1P8M8M9L1J8j3l9
$$ -249 -258 -238 -197 -128 -49 36 128 199 251 283 300 282 233 158 95 16 -56 -118 -163 -195 -189 -160 -105 -54 24 72 121 152 170 157 118
4173A18o4p3p7p7o4n3k4J5K8M9Q7Q4R6P7Q3N7L5Oj3m1o4p3o4o2n9k4k7oJ2L0L3
$$ 118 54 -19 -96 -173 -237 -290 -314 -299 -271 -222 -135 -51 45 122 205 262 297 303 290 249 185 112 48 -14 -73 -97 -124 -130 -118 -88 -55
4204e5L8L7K1NLk5k4l2m4k7m1k3kJ1L2M2L5N7O0L7M0K9Oj2k6l8n2m2m4l1j2Qm
$$ -55 -17 20 41 46 49 24 0 -32 -76 -103 -144 -167 -169 -158 -126 -84 -49 8 68 105 145 174 180 168 142 104 52 10 -34 -65 -77 -69 -73
4237g3K0L3M5L9L3L3kJ2l7k1m4n7o9n6m2m5k8j3J5L2L6O5O0O1N0P0M7L4K6KMj5
$$ -73 -53 -20 25 64 97 130 128 140 103 82 38 -19 -88 -144 -186 -231 -259 -272 -257 -225 -189 -124 -64 -3 47 117 164 198 224 226 230 215
4269B15j5rk9j9k7l4j7l7k1m0l2n5m8k5n1l6k0k3JOM2M5N9O8R4O5R9Q6O6N1O1
$$ 215 200 191 162 143 116 82 65 28 7 -33 -65 -120 -168 -193 -244 -280 -300 -323 -322 -316 -274 -229 -170 -102 -8 57 156 242 308 359 420
4300D20K1rpn8n6o2q5q7q5r0q6p5o6m3l1k2J0LM2L2P1O3Q5R1O7Q6O1O5N0L4L1
$$ 420 441 432 425 367 311 249 164 77 -8 -98 -184 -259 -325 -368 -399 -421 -411 -408 -366 -334 -263 -200 -115 -24 43 129 190 255 305 339 370
4331C70pj1l7l9n8o1n8o7n5p0l4m1k4j9qoJ1J0KL9J8K2L0J9L3L1L3M3L7K8K2L3
$$ 370 363 352 315 276 218 157 99 32 -23 -93 -127 -168 -192 -211 -219 -225 -214 -204 -202 -163 -145 -123 -93 -74 -41 -10 23 66 103 131 153 186
4363A86nPj4j3k9l9k4l6l3l2j0l4nj1J6J6K1J1PJ2mj4j3l8j0l6k7j4MlK1M4M6
$$ 186 181 188 174 161 132 93 69 33 0 -32 -42 -76 -81 -92 -76 -60 -39 -28 -21 -9 -13 -27 -40 -78 -88 -124 -151 -165 -161 -164 -143 -99 -53
4396e3M9O1O9M9M8K9J4Mk5l2o0o0o3n8m1m6l1k2nJ7J1RK9K5RJ2QKj1KLmQK1K6
$$ -53 -4 57 126 175 223 252 266 270 245 213 153 93 30 -28 -69 -115 -146 -168 -173 -156 -145 -136 -107 -82 -73 -61 -53 -51 -62 -60 -57 -61 -53 -32 -6
4431fM9L8M0N0M0J0J0rk0m6n9q1o3p7o6m2l3J2J5K9O8O9Q0P9O1N2K4J7k0l5o5
$$ -6 43 81 121 171 211 221 231 222 202 156 97 16 -47 -124 -190 -232 -265 -253 -238 -209 -141 -72 8 87 148 200 224 241 221 186 121
4462A21o8o5o8o5k9l9oJ3L1M8N2N8N6M4K4L4Ooml5j2l7l3JONOPJ2knql7n3o4n7
$$ 121 53 -12 -80 -145 -174 -213 -219 -206 -175 -127 -75 -17 39 83 107 141 147 141 137 102 90 53 20 21 27 32 38 45 57 55 50 42 5 -48 -112 -169
4498a69n6n6l2k1J3K3M2R8Q4J12J12J19R1O2N7Jk6m9q9r5j10j22j00j03o5n2k6
$$ -169 -225 -281 -313 -334 -321 -298 -256 -158 -74 38 150 269 360 422 479 480 454 405 316 221 111 -11 -111 -214 -279 -331 -357
4525c57jNM7N1N6M5P1K7L5K1J5J2MJ4K3J6K5L8L9M7L2K9J2J0m2m2n5q0r6q5j01
$$ -357 -358 -353 -306 -255 -199 -154 -83 -56 -21 0 15 27 31 45 68 84 109 147 186 233 265 294 306 316 274 232 177 97 1 -84 -185
4556a85o7o2m2j7LN3N5O4Q3P6P2P5L5K2J2j6j4l5l6m2k8k0j5K0K2J5K7K9L5J0
$$ -185 -252 -314 -356 -373 -370 -317 -262 -198 -115 -39 33 108 143 165 177 161 147 112 76 34 6 -14 -29 -9 13 28 55 84 119 129
4586A29Pj0k8m4m1o3o0m2o3j8k8J0K5K7M3N4O1N9O3L5K2MQj9Lk1k3j3rlJJJ6J0
$$ 129 136 126 98 54 13 -50 -110 -152 -215 -233 -261 -251 -226 -199 -156 -102 -41 18 81 116 138 142 150 131 134 113 90 77 68 65 66 67 83 93
4620I3KKJk3m3k5n7n5n0m5l0k9j9K5K5M1N0P5O0O3N9N3L3L0%kk6l3l3n2l1m3k7
$$ 93 95 97 98 75 32 7 -50 -105 -155 -200 -230 -259 -278 -253 -228 -187 -137 -62 -2 61 120 173 206 236 236 234 208 175 142 90 59 16 -11
4653a1k2j8r%Nj5MRkk4KorLj6RNK3K1L4L4L4L6J2K7J8j9Pj7k4k5k5l3k6l1k4l
$$ -11 -33 -51 -60 -60 -55 -70 -66 -57 -59 -83 -81 -87 -96 -93 -109 -100 -95 -72 -51 -17 17 51 87 99 126 144 125 132 115 91 66 41 8 -18 -49 -73 -76
4690g6Lj2QJ5J5QK1QJ8j1K4pKPOj6Npknj5J5j3Nqqkk3J1J0klJ4J4J9J3MK1J5q
$$ -76 -73 -85 -77 -62 -47 -39 -18 -10 8 -3 21 14 16 23 29 13 18 11 9 4 -11 4 -9 -4 -12 -20 -22 -45 -34 -24 -26 -29 -15 -1 18 31 35 56 71 63
4730F3K4jj1kj9k2j6j3k1k6k0k1j7j4onqjRK2K6J2L9K4M4L5M3L3K4L2J0J9k0j5
$$ 63 87 86 75 73 54 32 16 3 -18 -44 -64 -85 -102 -116 -122 -127 -135 -136 -127 -105 -79 -67 -28 -4 40 75 118 151 175 207 217 236 216 201
4764B01j8m0l2o8o0n8n6m6l9k9j6j2K9J4J9N4M7L6M0N4K2M2K9L0K3J3JJ6Mqqj4
$$ 201 183 143 111 43 -17 -75 -131 -177 -216 -245 -261 -273 -244 -230 -211 -157 -110 -74 -34 20 42 84 113 143 166 179 180 196 200 192 184 170
4796A70j8k5m4l4n3n3n2n7m3n3l5k1LJ9L8N7N5P3N9N3Q7N4M1K6J9k0ql9m2n3m5
$$ 170 152 127 83 49 -4 -57 -109 -166 -209 -262 -297 -318 -315 -296 -258 -201 -146 -73 -14 39 126 180 221 247 266 246 238 199 157 104 59
4827E9m0l4l5j9qlj4QPj0J8nJrq%qJ4KJ1L1L0K4M1L3K6K2QJ2j8om0l8k1l4m1n
$$ 59 19 -15 -50 -69 -77 -80 -94 -86 -79 -89 -71 -76 -75 -84 -92 -92 -100 -86 -84 -73 -42 -12 12 53 86 112 134 142 154 136 130 90 52 31 -3 -44 -49
4864d9k8LOJ9K9K2L2J2J5J7k3j9l0m4l1m0l9l0qOJ0K7L3N0N4P0M4M1L4K8j9Rl0
$$ -49 -77 -74 -68 -49 -20 2 34 46 61 78 55 36 6 -38 -69 -109 -148 -178 -186 -180 -170 -143 -110 -60 -6 64 108 149 183 211 192 201 171
4897A71k5m7m7m4m0j2l7pj0OkK5J2Qmqj4J1j9NnJ7L1RL6L2M3L1M5K5J2Mml0m9
$$ 171 146 99 52 8 -32 -44 -81 -88 -98 -92 -94 -69 -57 -49 -53 -61 -75 -64 -83 -78 -83 -66 -35 -26 10 42 85 116 161 186 198 202 198 168 119
4932A19n1o0o0o0l2n0k0j1QL7M0N0O1L3O1L8L5J5j8%k2m3l6m1j8k6j3j4JJ0J1
$$ 119 68 8 -52 -112 -144 -194 -214 -225 -217 -180 -140 -90 -29 4 65 103 138 153 135 135 113 70 34 -7 -25 -51 -64 -78 -77 -67 -56
4963e6J8K1J5J0J1oNrkKrMQNJ6J5K2OQQj7rk4m6k6n6m2l9l1j0j0MM3L1N1N9O2
$$ -56 -38 -17 -2 8 19 13 18 9 7 9 0 4 12 17 33 48 70 76 84 92 75 66 42 -4 -30 -86 -128 -167 -198 -208 -218 -214 -171 -140 -89 -30 32
5000C2P7M2L7M6K6j2j3k3l7n6m8n9n1l8m3k4kk3jJ1J1J1K3%QM0J3J7K7J0K9K2
$$ 32 109 151 188 234 260 248 235 212 175 119 71 12 -39 -77 -120 -144 -146 -169 -170 -159 -148 -137 -114 -114 -106 -66 -53 -36 -9 1 30 52
5032E2K6L3K0L4J9Qpj7k9j3m7m7m2n0m9k7k7k0Lj2J2J6M4L9L4M8J3K0J7L4oLo
$$ 52 78 111 131 165 184 192 185 168 139 126 79 32 -10 -60 -109 -136 -163 -183 -180 -192 -180 -164 -120 -81 -47 1 14 34 51 85 79 82 76
5065G6nkkj4rRjPrmjRj5j0k0ql1j1rl4lkrKPLJ3J4J0J4K2MOJ7PJ4QRKJ6J0LMl
$$ 76 71 69 67 53 44 53 52 59 50 46 45 54 39 29 9 1 -30 -41 -50 -84 -87 -89 -98 -96 -89 -86 -73 -59 -49 -35 -13 -9 -3 14 21 35 43 52 54 70 80 83 87 84
5109H4m%lj3j4k0k5j7l0k7j7j1j1j1lJRJ2K5K0J9L0K0K5L4J1J7J3LPj5kpk4j2
$$ 84 80 80 77 64 50 30 5 -12 -42 -69 -86 -97 -108 -119 -122 -121 -112 -100 -75 -55 -36 -6 14 39 73 84 101 114 117 124 109 107 100 76 64
$$ [...]
8191g
##END NTUPLES=NMR FID
##END=
