##TITLE=1H ikalashn
AM_NV Me Acryl(nlock)
20.9.2024
##JCAMPDX= 6.0         $$ Bruker NMR JCAMP-DX V2.0
##DATA TYPE= NMR FID
##DATA CLASS= NTUPLES
##ORIGIN= UXNMR, Bruker Analytische Messtechnik GmbH
##OWNER= root
$$ TOPSPIN		Version 1.3
$$ 2024-09-20 14:13:20.875 +0400  Irina@DPX200
$$ Compression mode = diff/dup
##.OBSERVE FREQUENCY= 200.131392401
##.OBSERVE NUCLEUS= ^1H
##.DELAY= (6, 6)
##.ACQUISITION MODE= SIMULTANEOUS
##.ACQUISITION SCHEME= undefined
##.AVERAGES= 16
##.DIGITISER RES= 18
##SPECTROMETER/DATA SYSTEM= spect
##.PULSE SEQUENCE= zg
##.SOLVENT NAME= CDCl3
##.SHIFT REFERENCE= INTERNAL, CDCl3, 1, 17.95386
##AUDIT TRAIL= $$ (NUMBER, WHEN, WHO, WHERE, WHAT)
$$ ##TITLE= Audit trail, TOPSPIN		Version 1.3
$$ ##JCAMPDX= 5.01
$$ ##ORIGIN= Bruker BioSpin GmbH
$$ ##OWNER= Irina
$$ $$ F:/spectra/data/iren/nmr/1H/4/audita.txt
$$ ##AUDIT TRAIL=  $$ (NUMBER, WHEN, WHO, WHERE, VERSION, WHAT)
(   1,<2024-09-20 14:12:59.984 +0400>,<Irina>,<DPX200>,<TOPSPIN 1.3>,
      <created by zg
	started at 2024-09-20 14:11:52.093 +0400,
	POWCHK disabled, PULCHK disabled
       configuration hash MD5:
       BE 6D 3F 07 2A EA 11 49 91 17 2B D3 AF B3 58 0D
       data hash MD5: 16K
       18 7A 13 23 86 DF 7A BE 1D F9 D6 89 00 E1 51 DC>)
$$ ##END=
$$ 
$$ $$ hash MD5
$$ $$ 54 B8 4C 04 83 A4 CF 70 CC BA 3F 9E 1D AE 99 66
##$RELAX= 
##$RELAX= 
##$RELAX= 
##$RELAX= 
##$RELAX= 
##$RELAX= 
##$RELAX= 
##$RELAX= 
##$RELAX= 
$$ Bruker specific parameters
$$ --------------------------
##$DU= <F:/spectra>
##$EXPNO= 4
##$NAME= <1H>
##$PROCNO= 1
##$TYPE= <nmr>
##$USER= <iren>
##$AMP= (0..31)
100 100 100 100 100 100 100 100 100 100 100 100 100 100 100 100 100 100 
100 100 100 100 100 100 100 100 100 100 100 100 100 100 
##$ANAVPT= -1
##$AQSEQ= 0
##$AQ_mod= 1
##$AUNM= <au_zg>
##$AUTOPOS= <>
##$BF1= 200.13
##$BF2= 200.13
##$BF3= 200.13
##$BF4= 200.13
##$BF5= 200.13
##$BF6= 200.13
##$BF7= 200.13
##$BF8= 200.13
##$BYTORDA= 1
##$CFDGTYP= 0
##$CFRGTYP= 5
##$CHEMSTR= <none>
##$CNST= (0..63)
1 1 145 1 1 1 1 1 1 1 1 1 1 1 1 1 1 1 1 1 1 1 1 1 1 1 1 1 1 1 1 1 1 1 
1 1 1 1 1 1 1 1 1 1 1 1 1 1 1 1 1 1 1 1 1 1 1 1 1 1 1 1 1 1 
##$CPDPRG= <>
##$CPDPRG1= <>
##$CPDPRG2= <>
##$CPDPRG3= <>
##$CPDPRG4= <mlev>
##$CPDPRG5= <mlev>
##$CPDPRG6= <mlev>
##$CPDPRG7= <mlev>
##$CPDPRG8= <mlev>
##$CPDPRGB= <>
##$CPDPRGT= <>
##$D= (0..63)
0 2 0 0 0 0 0 0 0 0.06 0 0.03 0 0 0 0 0.0002 0 0 0 0 0 0 0 0 0 0 0 0 0 
0 0 0 0 0 0 0 0 0 0 0 0 0 0 0 0 0 0 0 0 0 0 0 0 0 0 0 0 0 0 0 0 0 0 
##$DATE= 1726827176
##$DBL= (0..7)
120 120 120 120 120 120 120 120 
##$DBP= (0..7)
150 150 150 150 150 150 150 150 
##$DBP07= 0
##$DBPNAM0= <>
##$DBPNAM1= <>
##$DBPNAM2= <>
##$DBPNAM3= <>
##$DBPNAM4= <>
##$DBPNAM5= <>
##$DBPNAM6= <>
##$DBPNAM7= <>
##$DBPOAL= (0..7)
0.5 0.5 0.5 0.5 0.5 0.5 0.5 0.5 
##$DBPOFFS= (0..7)
0 0 0 0 0 0 0 0 
##$DE= 6
##$DECBNUC= <off>
##$DECIM= 32
##$DECNUC= <off>
##$DECSTAT= 4
##$DIGMOD= 1
##$DIGTYP= 9
##$DL= (0..7)
0 120 120 120 120 120 120 120 
##$DP= (0..7)
150 150 150 150 150 150 150 150 
##$DP07= 0
$$ [...]
##$SW= 21.9925939549014
##$SWIBOX= (0..15)
0 0 2 0 0 0 0 0 0 0 0 0 0 0 0 0 
##$SW_h= 4401.40845070422
##$TD= 16384
##$TD0= 1
##$TE= 300
##$TE2= 300
##$TE3= 300
##$TEG= 300
##$TL= (0..7)
0 120 120 120 120 120 120 120 
##$TP= (0..7)
150 150 150 150 150 150 150 150 
##$TP07= 0
##$TPNAME0= <>
##$TPNAME1= <>
##$TPNAME2= <>
##$TPNAME3= <>
##$TPNAME4= <>
##$TPNAME5= <>
##$TPNAME6= <>
##$TPNAME7= <>
##$TPOAL= (0..7)
0.5 0.5 0.5 0.5 0.5 0.5 0.5 0.5 
##$TPOFFS= (0..7)
0 0 0 0 0 0 0 0 
##$TUNHIN= 0
##$TUNHOUT= 0
##$TUNXOUT= 0
##$USERA1= <user>
##$USERA2= <user>
##$USERA3= <user>
##$USERA4= <user>
##$USERA5= <user>
##$V9= 5
##$VALIST= <valist>
##$VCLIST= <CCCCCCCCCCCCCCC>
##$VD= 0
##$VDLIST= <DDDDDDDDDDDDDDD>
##$VPLIST= <PPPPPPPPPPPPPPP>
##$VTLIST= <TTTTTTTTTTTTTTT>
##$WBST= 1024
##$WBSW= 25
##$XGAIN= (0..3)
0 0 0 0 
##$XL= 0
##$YL= 0
##$YMAX_a= 1259936
##$YMIN_a= -1514633
##$ZGOPTNS= <>
##$ZL1= 120
##$ZL2= 120
##$ZL3= 120
##$ZL4= 120
##$ABSF1= 10
##$ABSF2= 0
##$ABSG= 5
##$ABSL= 3
##$ALPHA= 0
##$AQORDER= 0
##$ASSFAC= 0
##$ASSFACI= 0
##$ASSFACX= 0
##$ASSWID= 0
##$AUNMP= <proc_1d>
##$AXLEFT= 0
##$AXRIGHT= 0
##$AXTYPE= 0
##$AXUNIT= <>
##$AZFE= 0.1
##$AZFW= 0.1
##$BCFW= 1
##$BC_mod= 2
##$BYTORDP= 1
##$COROFFS= 0
##$CY= 7568.61572265625
##$DATMOD= 1
##$DC= 2
##$DFILT= <>
##$DTYPP= 0
##$F1P= 17.9538593292236
##$F2P= -4.03888763876832
##$FCOR= 0.5
##$FTSIZE= 32768
##$FT_mod= 4
##$GAMMA= 1
##$GB= 1
##$INTBC= 1
##$INTSCL= 1
##$ISEN= 128
##$LB= 0.02
##$LEV0= 0
##$LPBIN= 0
##$MAXI= 945.577
##$MC2= 0
##$MEAN= 0
##$ME_mod= 0
##$MI= -402.1523
##$NCOEF= 0
##$NC_proc= 0
##$NLEV= 6
##$NOISF1= 8.587773
##$NOISF2= 6.764455
##$NSP= 1
##$NTH_PI= 0
##$NZP= 0
##$OFFSET= 17.95386
##$PC= 1
##$PHC0= 215.1048
##$PHC1= -34.81631
##$PH_mod= 0
##$PKNL= yes
##$PPARMOD= 0
##$PPDIAG= 0
##$PPIPTYP= 0
##$PPMPNUM= 100
##$PPRESOL= 1
##$PSCAL= 0
##$PSIGN= 0
##$REVERSE= no
##$SF= 200.13
##$SI= 32768
##$SIGF1= 18.5376
##$SIGF2= -6.396296
##$SINO= 400
##$SIOLD= 32768
##$SREGLST= <1H.CDCl3>
##$SSB= 3
##$STSI= 0
##$STSR= 0
##$SW_p= 4401.40845070423
##$SYMM= 0
##$S_DEV= 0
##$TDeff= 0
##$TDoff= 0
##$TI= <>
##$TILT= no
##$TM1= 0
##$TM2= 0
##$TOPLEV= 0
##$USERP1= <user>
##$USERP2= <user>
##$USERP3= <user>
##$USERP4= <user>
##$USERP5= <user>
##$WDW= 1
##$XDIM= 8192
##$YMAX_p= 0
##$YMIN_p= 0
$$ End of Bruker specific parameters
$$ ---------------------------------
##NTUPLES= NMR FID
##VAR_NAME=  TIME,          FID/REAL,        FID/IMAG
##SYMBOL=    X,             R,               I
##VAR_TYPE=  INDEPENDENT,   DEPENDENT,       DEPENDENT
##VAR_FORM=  AFFN,          ASDF,            ASDF
##VAR_DIM=   8192,          8192,            8192
##UNITS=     SECONDS,       ARBITRARY UNITS, ARBITRARY UNITS
##FACTOR=    0.0002272,     1,               1
##FIRST=     0,             0,               0
##LAST=      1.8609952,     -700,            -187
##MIN=       0,             -1514633,        -1514633
##MAX=       1.8609952,     1259936,         1259936
$$ Real data points
##PAGE= N=1
##DATA TABLE= (X++(R..R)), XYDATA
0@%%%%%%JjKj8L2l2M8o4O5q2J00j20J51j82K31k80L30l96M61n41O26p22Q36r56
30e11J100j263J432j616J829k060K321k611K912l247L622m029M474m955N482o062
46c182O689p377Q134q962R877j0881J1991j3233J4615j6167J7933j9949K2288
59A1776k5036K8309l2303L7293m3740N2450o4922Q4418j19529K02809p72726q73432
71a514633P29777N39051M17426k46610m75735m96260K9669M73073P59337M94539
81G09634L8078m58505n24511k50917K74544N74564N23252O8639m02647o37517
91h5386m19509L7600M66902N28286K30835k47477n35871m65991n9280L81199N78714
102D10022L81098n5137m46154n10652k23016K22418M99380M18846K5795m01763
$$ plain form
0 0 0 0 0 0 0 0 1 0 2 -16 16 -16 32 -32 33 -49 51 -69 82 -100 131 -149 181 -215 246 -295 331 -391 445 -511
30 -511 589 -674 758 -858 971 -1089 1232 -1379 1533 -1714 1908 -2121 2353 -2602 2880 -3182
46 -3182 3507 -3870 4264 -4698 5179 -5702 6289 -6944 7671 -8496 9437 -10512 11776
59 11776 -13260 15049 -17254 20039 -23701 28749 -36173 48245 -71284 131525 -641201 -1514633
71 -1514633 -784856 -245805 171621 -74989 -550724 -1046984 -1017315 -544242 215095 709634
81 709634 747712 289207 -235304 -486221 -211677 362887 886139 954778 552131 -85386
91 -85386 -504895 -467295 -393 527893 758728 511251 -24620 -490611 -549891 -168692 410022
102 410022 791120 735983 289829 -220823 -443839 -221421 277959 696805 722600 320837
112C20837n76197l77869M6004M04666M50568J62749k53809n02583m09278l2492
122g67404L73042N34251L45479n7162l91831m25356j37884K66610N00862L97576
132F38183K5339l60617m98990l04913P6650L76116L86883J04798k72801m83128
142c12480l79871l0904L27950M54678K69635r0029l66542l63034q1031K83084
152b88544M76896L68328L5156k92640l93713k07592J28353L76026L60349Q8733
162F51352k54589m35355l31975j8871K86669L73809J84831j45286l81554l55730
172d26699q4679K43851M04465K90964j4025k97717l64815j72492J42375L59032
182H0260L25905O3758k48983l97477k80438J8458K88907L42665J45616j60794
$$ plain form
112 320837 -255360 -633229 -587225 -182559 268009 430758 176949 -325634 -734912 -767404
122 -767404 -394362 139889 485368 428206 36375 -388981 -526865 -260255 240607 638183
132 638183 663522 302905 -196085 -500998 -424348 -48232 338651 443449 170648 -312480
142 -312480 -692351 -723255 -395305 59373 329008 238979 -127563 -490597 -571628 -288544
152 -288544 188352 556680 591836 299196 -94517 -302109 -173756 202270 562619 651352
162 651352 396763 -38592 -370567 -389438 -102769 271040 455871 310585 -70969 -426699
172 -426699 -511378 -267527 136938 427902 413877 116160 -248655 -421147 -278772 80260
182 80260 406165 469923 220940 -176537 -456975 -438517 -149610 193055 338671 177877
192A77877l59917l11285m7553K49321L76811K52833l0374k73804l09125j13323
202c88539J77117L59634L06703N3656k25849l40582k14801N9050K85691L04400
212C76480J02266j79008l44263k81562l7233K19041L11824J80170q1819k90844
222b4948l00728j03489J65187L19157K51848J0795k35600l15673j75063Q6520
232c21994K84684K80859P8553j80360l15968k35420M392K37514L04043J59999
242B96302r2807k77191k63310n8952J95108L22360K34570n570k29305k80466j25823
253b85084J23945K93003K63330N6169j85546k95915k02035K8477K34070K71294
263C01708J14151j28466k87841k53523m9967J80708K78041J75188n4144k48290
$$ plain form
192 177877 -182040 -493325 -540878 -291557 85254 338087 307713 33909 -275216 -388539
202 -388539 -211422 148212 454915 508571 282722 -57860 -272661 -213611 72080 376480
212 376480 478746 299738 -44525 -326087 -363320 -144279 167545 347715 265896 -24948
222 -24948 -325676 -429165 -263978 55179 307027 317822 82222 -233451 -408514 -321994
232 -321994 -37310 243549 322102 141742 -174226 -409646 -405254 -167740 136303 296302
242 296302 203495 -73696 -337006 -395958 -200850 121510 356080 350510 121205 -159261 -285084
253 -285084 -161139 131864 395194 451363 265817 -30098 -232133 -203656 30414 301708
263 301708 415859 287393 -448 -253971 -303938 -123230 154811 329999 275855 27565
273B7565k71751j09616J24257K67694K22775K2599j93620k76411j69320N3090
283c02738K36646K53547R1299j37454k72954k20486j7028J94621K66753J50256
293B42462p2481k45314k47803p8698J44822K68491K08591Q092j92730k53135j30246
304c47949R1958K59709K56582Q5282j34364k48743j78339K5978K19751K66580
314B96445J34103q5791k41755k28730n9286J47000K45692J67788l3690k19698
324A22078k61520j30568Q1899K27783K06169L4059j66819k55206j69681K9996
334b81810K05074K35106J01184j02574k34710k04712l4357J57658K38013J50579
344B29451m4344k11589k34383r6432J06648K33437J96250K2786j63900k32233
$$ plain form
273 27565 -244186 -353802 -229545 38149 260924 283523 89903 -186508 -355828 -302738
283 -302738 -66092 187455 278754 141300 -131654 -352140 -369168 -174547 92206 242462
293 242462 169981 -75333 -323136 -401834 -257012 11479 220070 228162 35432 -217703 -347949
304 -347949 -255991 3718 260300 345582 211218 -37525 -215864 -189886 29865 296445
314 296445 430548 344757 103002 -125728 -185014 -38014 207678 375466 341776 122078
324 122078 -139442 -270010 -188111 39672 245841 279900 113081 -142125 -311806 -281810
334 -281810 -76736 158370 259554 156980 -77730 -282442 -316799 -159141 78872 229451
344 229451 185107 -26482 -260865 -357297 -250649 -17212 179038 201824 37924 -194309
354a94309j34397O1668K20428K32827R1534j05309k21612j77552m585J75898K36741
365A81332J33732o2847k17178k22614p6795J17480K24025J69512o313j79000k27304
376a65970j17531P4804K17923K15145P0888j13497k09596j51005K1283J86408
386B8852K27784J14838p5555k12619k03894n9434J16367J99104J30483m1873j98561
397B5492k31584j18350O3604J89959J75750L3490j35090k10085j36351L7142J91578
408a14445K20557J05105p3666j90700j65358j6993J48842K15029J34773l7346
418B25798j83109k03231q4923Q9341J98517J67244J7680j45020k05610j20340
428b43653N2778J93616K05064Q0804r1393j91568j51577j586J52018K00892J09824
$$ plain form
354 -194309 -328706 -267038 -46610 186217 277751 172442 -49170 -226722 -231307 -55409 181332
365 181332 315064 252217 35039 -187575 -264370 -146890 77135 246647 240334 61334 -165970
376 -165970 -283501 -208697 9226 224371 295259 181762 -27834 -178839 -157556 28852
386 28852 256636 371474 295919 83300 -120594 -180028 -63661 135443 265926 224053 25492
397 25492 -206092 -324442 -260838 -70879 104871 138361 3271 -206814 -343165 -306023 -114445
408 -114445 106112 211217 137551 -53149 -218507 -235500 -86658 128371 263144 225798
418 225798 42689 -160542 -245465 -156124 42393 209637 227317 82297 -123313 -243653
428 -243653 -190875 2741 207805 288609 197216 5648 -145929 -147515 4503 205395 315219
439C15219n9815j92816j99539p7926Q6064J77325J32285j7536j66409k09129j14401
450c26678N3637J79934J79792N7259r8769j77751j24089K5344J67523K04366J10281
461B50849n0925j68660j63077m0045J12816J86447J27896k3728j63219j93737
471a25383r4667O5104J74594J59449L2284j16693j82023j17563L3144J66043J89579
482A83868Q7524p0166j74726j54769k5899J19793J77964J05926m7743j76997j93284
493a68509q7129O6704J61282J32959M115j33536j82482j06356M4662J68649J82045
504H2404P8103o8898j55372j20813J0269J45187J88528J08925l9769j56039j62203
515h9678n7631Q2419J58773J17843j2597j42554j81697j02628M1378J51626J53121
$$ plain form
439 315219 255404 62588 -136951 -214877 -128813 48512 180797 163261 -3148 -212277 -326678
450 -326678 -273041 -93107 86685 143944 45175 -132576 -256665 -231321 -63798 140568 250849
461 250849 199924 31264 -131813 -171858 -59042 127405 255301 231573 68354 -125383
471 -125383 -220050 -154946 19648 179097 211381 94688 -87335 -204898 -171754 -5711 183868
482 183868 271392 201226 26500 -128269 -154168 -34375 143589 249515 201772 24775 -168509
493 -168509 -255638 -188934 -27652 105307 109422 -24114 -206596 -312952 -268290 -99641 82404
504 82404 160507 91609 -63763 -184576 -174307 -29120 159408 268333 228564 72525 -89678
515 -89678 -147309 -64890 93883 211726 199129 56575 -125122 -227750 -186372 -34746 118375
526A18375M6546r1960j63333j16402J7219J44674J77600R4051m8096j50440j43478
537a15244l3820J00908J65556J14245j8975j42424j70884q4809N5950J53295J40090
548A63888K6610j06801j65789j08718K5068J42480J62386P2075o5469j55147j36741
559a46158k4922J01574J53396R3492l7950j50412j66681p6001N8484J43231J20381
570F8434Q176j12625j55969r0090M0837J48313J60454P1513n5094j30141j01443
581a47635J1014J28791J69173J02623k6605j30474j38452m7499P6237J44318J07479
592B48970r751j26691j62355r3246L2214J27100J26690L2400q9583j53277j13245
603a80774L968J17439J48454P6103m8900j39005j31769l2837Q7815J45273R9993
$$ plain form
526 118375 164921 72961 -90372 -206774 -189555 -44881 132719 226770 178674 28234 -115244
537 -115244 -149064 -48156 117400 231645 212670 70246 -100638 -185447 -129497 23798 163888
548 163888 190498 83697 -82092 -190810 -165742 -23262 139124 211199 145730 -9417 -146158
559 -146158 -171080 -69506 83890 177382 139432 -10980 -177661 -253662 -195178 -51947 68434
570 68434 76610 -36015 -191984 -282074 -241237 -92924 67530 139043 83949 -46192 -147635
581 -147635 -136621 -7830 161343 263966 237361 106887 -31565 -79064 -2827 141491 248970
592 248970 239219 112528 -49827 -143073 -110859 16241 142931 175331 85748 -67529 -180774
603 -180774 -176806 -59367 89087 165190 116290 -22715 -154484 -187321 -99506 45767 145760
614A45760j6453j22942j46167p0511N1470J35201J23748K6225q8678j40418r2464
625a95229K2778J25573J44623O7448n1798j29589j12607j4048R6387J41107Q9129
636A83774k4096j20511j34426n7378N6968J28787J08380R807r8049j39130q4352
647a70226K8868J22013J30897N0318o2798j28888j01917r42J03316J38021P9247
658A87909l2719j20843j24784m2664O7945J28977R7502n339j08004j38769p6390
669a67179L5729J19037J16234L0468p7429j31730r5013P591J05208J30485O6848
680A40249m1322j18452j11467k5447P9861J30553R1480j0410j03809j24041n7829
691a50634M8365J20170J08084K0907q0203j24894q2850J6557J04542J20522N3408
$$ plain form
614 145760 129307 6365 -139802 -210313 -158843 -23642 100106 126331 37653 -102765 -195229
625 -195229 -172451 -46878 97745 165193 113395 -16194 -128801 -142849 -46462 94645 183774
636 183774 159678 39167 -95259 -152637 -95669 33118 141498 151305 53256 -85874 -170226
647 -170226 -141358 -19345 111552 161870 99072 -29816 -131733 -132675 -29359 108662 187909
658 187909 155190 34347 -90437 -133101 -65156 63821 161323 155984 47980 -90789 -167179
669 -167179 -131450 -12413 103821 134289 56860 -74870 -169883 -162292 -57084 73401 140249
680 140249 98927 -19525 -130992 -156439 -76578 53975 145455 135045 31236 -92805 -150634
691 -150634 -102269 17901 125985 146892 66689 -58205 -141055 -124498 -19956 100566 153974
702A53974n0450j18504j03275j5422Q3721J24623P8804k2039j07397j17833m6750
713a40548N5882J18184R7255P616q8571j24414p5209K5059J06366J12369L9106
724A33095o2634j21438r6076l906R0912J22069O8723l1458j07929j07636l1093
735a47371O8340J21640R2473J416q8496j15017o0404L7488J10095J06596K9222
746A55982o8504j18346q6501M395R0539J11917N4326m2029j09833j02277k4824
757a35155O8968J14183Q0234r252r1789j09990n1114M4274J09370R8808J9576
768A38113p3317j14909p6875J3860R3373J06172M3600n0818j11544r6602j6284
779a45231P3935J11404P0627k0042r6984j06184m0826N3883J11728R2749J0436
$$ plain form
702 153974 103524 -14980 -118255 -133677 -49956 74667 153471 131432 24035 -93798 -140548
713 -140548 -84666 33518 130773 138389 49818 -74596 -149805 -124746 -18380 93989 133095
724 133095 70461 -50977 -147053 -150959 -60047 62022 130745 99287 -8642 -116278 -147371
735 -147371 -79031 42609 135082 136498 48002 -67015 -127419 -89931 20164 126760 155982
746 155982 87478 -30868 -117369 -112974 -22435 89482 143808 101779 -8054 -110331 -135155
757 -135155 -66187 47996 128230 118978 27189 -82801 -133915 -89641 19729 118537 138113
768 138113 64796 -50113 -126988 -113128 -19755 86417 130017 79199 -32345 -128947 -145231
779 -145231 -71296 40108 110735 90693 -6291 -112475 -153301 -99418 12310 105059 115495
790A15495p7528j09914o4879K6060R9079J03481L6811n4665j07317q5259l666
801a22302Q1122J10475O4586k4531r4100r5537k7800O2071J11215Q5969L891p7725
813G7334j02854n5435L0526R4674R1893K3185o4728j11459q5703n797P2287R3777
825E7700M3996m2528j04615r8399k7517N9498J02874P3770o048p9935r5568m1575
837a58347M5111J04534R6027K5565n8316r7300o4799J6260Q8508J00812M4222
848A42277m2548r8951q6506j4660O6186R9483O2912j8008q6724r5593l8772M4511
860f6393R6353Q1262R717o8606r9183o1391J8395Q4005Q9687L1637m9793r7545
872c1855p9087p411O7564R4145N5142k2012q3129q5469k6942N2568R7837P7928
$$ plain form
790 115495 37967 -71947 -136826 -110766 -11687 91794 128605 73940 -33377 -118636 -122302
801 -122302 -41180 69295 133881 109350 15250 -80287 -108087 -46016 65199 151168 155059 77334
813 77334 -25520 -80955 -50429 44245 136138 159323 94595 -16864 -102567 -108364 -36077 57700
825 57700 101696 59168 -45447 -143846 -171363 -111865 -8991 64779 58731 -21204 -116772 -158347
837 -158347 -113236 -8702 87325 112890 54574 -42726 -107525 -91265 -2757 98055 142277
848 142277 99729 778 -85728 -100388 -34202 65281 128193 110185 23461 -72132 -110904 -66393
860 -66393 29960 111222 120939 52333 -46850 -108241 -89846 -5841 83846 115483 65690 -31855
872 -31855 -110942 -118353 -50789 43356 98498 76486 -6643 -92112 -119054 -66486 31351 109279
884A09279O639o6319q9949m8400K8855Q6969Q4860K3445n5339r7073p4101k980
896i4114O6172Q4806M0180l6738r2035q7000k4373N3098R1980O6228n360p1725
908h881q5808l7215M0493R3134Q4617K1372n2661q6155n7048J3992P6856Q7504
920I0200L8196l7560q7272p7014j4283N7078Q7085N5296j5962p6495q4130l3812
932i8673L9637Q5051P1500Q648n9826q6316n3372J6277P3614P8745K7646m4634
944E8297q7680p1862p980N9165Q2776M6851k3074p7534p8197k4330M7171Q6884
956A0487O8130M249o0012p9568m0942K9298Q1721P9698K4188m6667q3547o1480
968g4445L606O5639Q1000L8943l1473q0951p5605j9416M8469Q1107N6423q226
$$ plain form
884 109279 115918 49599 -40350 -88750 -59895 27074 111934 135379 80040 -17033 -91134 -94114
896 -94114 -27942 56864 97044 60306 -31729 -118729 -143102 -90004 1976 68204 62844 -8881
908 -8881 -94689 -131904 -91411 1723 86340 107712 55051 -31104 -88152 -74160 2696 90200
920 90200 128396 90836 3564 -73450 -87733 -30655 56430 111726 95764 19269 -64861 -98673
932 -98673 -59036 26015 97515 106163 46337 -39979 -93351 -77074 -3460 75285 102931 58297
944 58297 -29383 -101245 -109225 -50060 32716 79567 56493 -21041 -99238 -123568 -76397 10487
956 10487 78617 82866 22854 -56714 -97656 -68358 13363 93061 117249 70582 -12965 -74445
968 -74445 -70839 -5200 75800 114743 83270 2319 -73286 -92702 -44233 36874 93297 85071
980H5071o7752q0610l7909L1054P7966P0457J3730n2719q2400n5411R289O6237
992b2997P5782L1815l5128p8401o8222j1461N2842Q0186N2233j1326o5750p2805
1004g3232k7169L9863Q1467O8902J0920n2062p6046m4984J9063P0818P3823K5854
1016A17217m0589p9494o4621o609N3918P4520M0730k4271p4717p5342k5556M0345
1028f4469P6398N8130r84n9349p5939l9302K5439P3197P1367K1535m1700p4268
1040b9945n4072M907O1470P6170L8834k4932p0656o6696j6299M5232P4906N2257
1052I1176o739o1100p3180l5246K6440O8821O2900J2428m7593p5345n1745O983
1064h2200N9914O9970L0507l1005p1210o2165r964M9209P4111M8222j0424o0461
$$ plain form
980 85071 17319 -63291 -101200 -70146 7820 78277 92007 39288 -43112 -98523 -89234 -22997
992 -22997 52785 84600 49472 -28929 -97151 -108612 -55770 24416 76649 65323 -427 -73232
1004 -73232 -100401 -60538 20929 89831 100751 48689 -27357 -72341 -53278 17540 91363 117217
1016 117217 76628 -2866 -67487 -74096 -20178 54342 95072 70801 -3916 -79258 -104814 -64469
1028 -64469 11929 70059 69075 9726 -66213 -105515 -80076 -6879 64488 86023 44323 -29945
1040 -29945 -84017 -79110 -17640 58530 97364 72432 1776 -64920 -81219 -35987 38919 91176
1052 91176 84437 23337 -49843 -85089 -58649 10172 73072 85500 37907 -37438 -89183 -82200
1064 -82200 -22286 47684 78191 47186 -24024 -86189 -96153 -46944 27167 75389 64965 4504
1076D504o7064k5601L5372P3242O2082R329m8405p0949m2851J6232O4501O8001
1088G8393K4187l6760p2254n8335n199M9932O8574L8138k0377o6067o7522k3683
1100i0973L5259O8340N3041J60n3120o9442l7594K0593O4531O3990J9733l7240
1112C7278o7091m9454L197N4263O8250L5856k0820o2325o0008j5686L9917O7783
1124C1160M8560m691n4720o6473l2209K4296O3239N7790J1964m2505o7404m5708
1136g6701P643N5436O4537K8729k7112o3864n6051q960M4677O7183M3212j0747
1148F7982n6743o2823k5068L0198O4056N3371N692m5890o5492m0159J2697N6220
1160e959O0257K2117l1928o3879n1842m130M5995O3615L6847j5597n6804n8354
$$ plain form
1076 4504 -62560 -88161 -52789 20453 82535 91864 43459 -27490 -70341 -54109 10392 78393
1088 78393 102580 65820 -6434 -64769 -69968 -20036 48538 86676 66299 232 -67290 -90973
1100 -90973 -55714 12626 65667 65827 12707 -56735 -94329 -73736 -9205 54785 74518 37278
1112 37278 -29813 -79267 -76070 -21807 46443 82299 61479 -846 -60854 -76540 -36623 31160
1124 31160 79720 75029 20309 -46164 -78373 -54077 9162 66952 78916 36411 -30993 -76701
1136 -76701 -69058 -13622 50915 79644 52532 -11332 -67383 -76343 -31666 35517 78729 67982
1148 67982 11239 -51584 -76652 -46454 17602 70973 76665 30775 -34717 -74876 -62179 -5959
1160 -5959 54298 76415 44487 -19392 -71234 -75364 -29369 34246 71093 55496 -1308 -59662
1172e9662j9453L3024O2518M9024J945m6023o1400l3832J7816N7326N7421J7962
1184G6666l3809o1593m6178J679M8342O1118L1367k0349n7750n5144j4486L5930
1196c4207O0835M3204m957m9989o0641k9409K2154N7810N2796J0812l8911o1429
1208c1932m1301P557N0978N8715K5800k4797n7625n0271p886M0153O0336L9116
1220F8843q973n0341n6336k2973K6826N8014M9142O331m0449n8449l5790J1752
1232e2403N0860N4594K0561k7930n6878m6758m577M0429N6734L3164j4238n2176
1244A382n4299j9144K8811N5918M3663N70m3206n6848l1178J6268N2159N1899
1256D5995J5939l0873n5601m1269K493M5196N6966K9858j7468n1655m9029j1467
$$ plain form
1172 -59662 -79115 -46091 16427 65451 67396 21373 -40027 -73859 -56043 1283 58704 76666
1184 76666 42857 -18736 -64914 -63235 -14893 46225 77592 57243 -507 -55651 -70137 -34207
1196 -34207 26628 69832 64875 14886 -45755 -75164 -53010 4800 57596 68408 29497 -31932
1208 -31932 -73233 -65676 -14698 44017 69817 45020 -12605 -62876 -70762 -30609 29727 68843
1220 68843 59870 9529 -46807 -69780 -42954 15060 64202 70533 30084 -28365 -64155 -52403
1232 -52403 -1543 53051 73612 45682 -11196 -57954 -62531 -22102 34632 67796 53558 1382
1244 1382 -52917 -72061 -43250 12668 56331 56901 13695 -43153 -74331 -58063 -5904 45995
1256 45995 61934 31061 -24540 -65809 -63316 -18120 38846 68704 51236 -419 -49448 -60915
1268f0915L4779N7222M0549l671m4563n3894k5680K0496N2202M7527R558l5552
1280C8058n6480l9212M165M3253N0829K1629k4190n4438m8308j0113L3690N2644
1292A1527L4277q328m5235n0591k0565K4401N3265M6571R099l3123n0243l0490
1304e9435J2661M8681N2453K1377k3332n0462m1641l444L7116N1475K9591j3875
1316F1165m8565n0736j9104K4528M9276L8261r02m0813n3428k9918J3702M6852
1328i682M6734J3814k8723n0913l7543K243M0835N1501K7323j4971m5712m3711
1340d8805j0353L1421N2248L8040j554l8776m7736k2733J8839M7650M3753R633
1352G1627l1210n0452l5490L098L7999M4926J8983k2335m9952m5085j0941K8937
$$ plain form
1268 -60915 -26136 31086 71635 67964 23401 -30493 -56173 -35677 16525 64052 73610 38058
1280 38058 -18422 -57634 -53469 -10216 40613 62242 38052 -16386 -64694 -74807 -41117 11527
1292 11527 45804 37476 -7759 -58350 -78915 -54514 -1249 45322 54421 21298 -28945 -59435
1304 -59435 -46774 1907 54360 75737 52405 1943 -39698 -43142 -6026 45449 75040 61165
1316 61165 12600 -38136 -57240 -32712 16564 54825 53923 13110 -40318 -70236 -56534 -9682
1328 -9682 37052 50866 22143 -28770 -66313 -64070 -23235 28266 55589 40618 -5094 -48805
1340 -48805 -59158 -27737 24511 62551 60997 22221 -25515 -48248 -29409 18241 61994 71627
1352 71627 40417 -10035 -45525 -42427 -4428 40498 59481 37146 -12806 -57891 -68832 -39895
1364c9895M6577L0247q496m2099m6692j8652K2817M9064M2547Q226k9705m4520
1376c0581k6000J3319M5816M8779J9996k0955m5551l7144k092L4802M7271K6427
1388G4087j3644m4990m6150j6757K2715M4590L4021j645l7401m8227k6826J2320
1400d7907M2036M1904J2218k6453m6727l4882J115L5998M5488K3375j4972m2672
1412a1479m0691j0422K7285M6225L3656j648l5004m2975k0108J8017M4745M1474
1424D9075J0623k6625m4162l0096N596L7625M3372J8798j9390m4599l9724q355
1436d7862K7597M2971K7212q819l9824m4040j8260J9867M3700L7071M791l0302
1448A4102m3489k5812J0693M0344M2648J6156k0995m2919l4809k487L1500M3221
$$ plain form
1364 -39895 6682 36929 28433 -13666 -60358 -79010 -56193 -7129 35418 43644 13939 -30581
1376 -30581 -56581 -43262 2554 51333 71329 50374 4823 -32321 -34413 389 47660 74087
1388 74087 60443 15453 -30697 -47454 -24739 19851 53872 52227 14826 -33401 -60227 -47907
1400 -47907 -5871 36033 48251 21798 -24929 -59811 -58696 -22698 22790 46165 31193 -11479
1412 -11479 -52170 -62592 -35307 10918 44574 42926 7922 -35053 -55161 -37144 7601 49075
1424 49075 59698 33073 -11089 -41185 -35589 2036 45408 64206 44816 217 -39507 -47862
1436 -47862 -20265 22706 49918 41099 1275 -42765 -61025 -41158 2542 39613 44404 14102
1448 14102 -29387 -55199 -44506 -4162 38486 54642 33647 -9272 -44081 -46568 -15068 28153
1460B8153K4737j1442l9992m1189j4339K2253M2827L3577R79l1990m2163k2779
1472e1368J3002M0098M0027J2968k2653m1835l1772O09L2615M1634K1431j4466
1484D0290m0746l9369j1500K3672M1337K9491l500l4398m1557j9912J5742M0654
1496B04L7711R188k5117m1044k7707N762L5942M1586J8733j7018m0546l5883o465
1509d4654K7034M0986K6012p747l6633m0696j7340J7516L9460L3701M221k8416
1521A3444m1196k5529Q086L6171L9216J5531j8653l9293l2302k515K9246M0855
1533B3061K4547q391l5072l7060j3050K0438M0015L2307K524k8626l9247k2127
1545d0681J0926L6568L7070J1925k1383l9599l0403l41K9440L8208J9793j3309
$$ plain form
1460 28153 52890 41448 1456 -39733 -54072 -31819 11008 44585 45564 13574 -28589 -51368
1472 -51368 -38366 1732 41759 54727 32074 -9761 -41533 -40924 -8309 33325 54756 40290
1484 40290 -456 -39825 -51325 -27653 13684 43175 39675 5277 -36280 -56192 -40450 204
1496 204 37915 47103 21986 -19058 -46765 -41003 -5061 36525 55258 38240 -2306 -38189 -44654
1509 -44654 -17620 23366 49378 41631 4998 -35698 -53038 -35522 3938 37639 41860 13444
1521 13444 -27752 -53281 -45195 -9024 30192 45723 27070 -12223 -44525 -47040 -17794 23061
1533 23061 47608 39217 4145 -32915 -45965 -25527 14488 46795 49319 20693 -18554 -40681
1545 -40681 -29755 6813 43883 55808 34425 -5174 -35577 -35918 -6478 31730 51523 38214
1557C8214l7833l6999j1382K1332L8043K7395l222l2317l9416j9706J3469L6757
1569e665L4302Q079k3541l8372k6298M506L2482L8401J8357j3904l5777l2332
1581c9762n938K5090L8896K6090m611l1665l6449j5935J5776L6289L1687N231
1593D4699k4836l7384k4044O196L2199L6069J5264j5908l5380k9864k967K6488
1605i468L7902K3475p011l2179l4483j2770J7721L5517K8318P28k8048l8096k2828
1618d1222P335L1086L1815R130k1280l7840k9173r91K7104L5579J9110j0719l2832
1631a2898l1756q175K1797L7113K7634j35k6884l3893j6734J2923L4096L2222
1643C5310Q465k0803l5087k4727L051K8774L4659J6779j2514l2587k9767o082
$$ plain form
1557 38214 381 -36618 -48000 -26668 11375 38770 35548 3231 -36185 -55891 -42422 -5665
1569 -5665 28637 36716 13175 -25197 -51495 -46989 -14507 23894 42251 28347 -7430 -39762
1581 -39762 -45700 -20610 18286 44376 39765 8100 -28349 -44284 -28508 7781 39468 44699
1593 44699 19863 -17521 -41565 -35369 -3170 32899 48163 32255 -3125 -32989 -35956 -9468
1605 -9468 28434 51909 44898 12719 -21764 -34534 -16813 18704 47022 47750 19702 -18394 -41222
1618 -41222 -33887 -2801 29014 38144 16864 -20976 -50149 -51140 -24036 11543 30653 19934 -12898
1631 -12898 -44654 -52829 -31032 6081 33715 33580 6696 -27197 -43931 -31008 3088 35310
1643 35310 43775 22972 -12115 -36842 -33791 -5017 29642 46421 33907 1320 -28447 -34529
1655c4529K2170L5201K4094l640k8811l3949j5681J3166L2205K8163L666k4342
1667A7713l6213k3934M094K8267L1771J2640j5789l3351k7756k511K4988L5641
1679A5560K2476n489k8559l0610j0328J8143L4482K7369J347k5504l4721k0527
1691c6361P233K8873K9240Q303j9681l4891k6972j056K5088L3406J8676q741k9363
1704f246k8714p197K0604L4989K6435N63k4744l1867j6586J0447L0017K8529O679
1717D2909k0630l4318k5176N33K5128L1365J5349j1799l0670k7954n302K1680
1729a8885L4165K3944k048k5692l0550j3555J3329L0989K6992L637k2967l4540
1741a5181k3374K845K5617K8997J0936j5883l2402k6966k949K3233L3656K1659
$$ plain form
1655 -34529 -12359 22842 46936 43296 14485 -19464 -35145 -21979 10226 38389 42055 17713
1667 17713 -18500 -42434 -38340 -10073 21698 34338 18549 -14802 -42558 -45069 -20081 15560
1679 15560 38036 32547 3988 -26622 -36950 -18807 15675 43044 44391 18887 -15834 -36361
1691 -36361 -29128 -255 28985 37288 17607 -17284 -44256 -45312 -20224 13182 31858 23117 -6246
1704 -6246 -34960 -42157 -21553 13436 39871 40434 15690 -16177 -32763 -22316 7701 36230 42909
1717 42909 22279 -12039 -37215 -36682 -11554 19811 35160 23361 -7309 -35263 -40565 -18885
1729 -18885 15280 39224 37176 11484 -19066 -32621 -19292 11697 38689 42326 19359 -15181
1741 -15181 -38555 -35710 -10093 18904 29840 13957 -18445 -45411 -48360 -25127 8529 30188
1753C0188m104k5448k7440q851J7774L3592K7656L701k1843l1442j8987O550K7061
1766H407K8113Q862j7655l2772k6286k687K1835L0363J7392q016k7955k8334r027
1779c7760J6949L1224K4177L60k3851l1525j7896P600K6650K5871N780j9753l2895
1792b5069k4628m04K3131K9792J5547r248k6966k4744l561K2174L4691K5745J608
1805C8068k0808k5910j0543J4169L0765K7185N370j9980l1690k2350R97K1867
1817G140K5631R394j5581l1781k7914o488J8085K8774J8855m476k4630k7287j0595
1830d0873J4160K9632K5453M328j9214k8864j8361M922K4532K6627R754j4691
1842A7405k9422k4453k973K0072K8686J7351n994k4699k5563p955J6110K9713
$$ plain form
1753 30188 26084 636 -26804 -35655 -17881 15711 43367 47068 25225 -6217 -25204 -18654 8407
1766 8407 36520 45382 27727 -5045 -31331 -34018 -12183 18180 35572 27556 -399 -28733 -37760
1779 -37760 -20811 10413 34590 34950 11099 -20426 -38322 -30722 -4072 21799 27579 7826 -25069
1792 -25069 -49697 -50101 -26970 2822 18369 9121 -17845 -42589 -46150 -23976 10715 36460 38068
1805 38068 17260 -8650 -19193 -5024 25741 52926 58296 38316 6626 -15724 -14727 7140
1817 7140 32771 42165 26584 -5197 -33111 -39599 -21514 7260 26115 21639 -2991 -30278 -40873
1830 -40873 -26713 2919 28372 32700 13486 -15378 -33739 -28817 -4285 22342 32096 17405
1842 17405 -12017 -36470 -39443 -19371 9315 26666 20672 -4027 -29590 -37545 -21435 8278
1854H278K3602J988k0332k7802j5712P521K5250K4926O553j7283k9876k2777p27
1867c6391K0830K7062J4062q784k5177k3577m691J8723L0543K3007J332j9297
1879A7642k4511j1052J1476K7189K4856N517j7722k9053k1123J0J9353K3371R121
1892C5074j3590k8791k6127p093J5275K5767J7344l623k2403k5508j0578J2392
1904c1861K7236K3868M776j6788k5772j6303N272K3390K5445J0035j2379k6047
1916i128k1662k175J8926K6892J6420n136k2534k3449p315J4895K7502K1931J959
1929C7126j8506k5283j4107P131K3358K3250O597j5334k7265k1240j518J8133
1941g658K4055J2285r028k4718k3888p002J4504K5725J9198l65j9305k4296j1964
$$ plain form
1854 8278 31880 33868 13536 -14266 -29978 -22457 2793 27719 34272 16989 -12887 -35664 -36391
1867 -36391 -15561 11501 25563 16779 -8398 -31975 -36666 -17943 12600 35607 36939 17642
1879 17642 -6869 -17921 -6445 20744 45600 51117 33395 4342 -16781 -16771 2582 25953 35074
1892 35074 21484 -7307 -33434 -40527 -25252 515 17859 14236 -8167 -33675 -44253 -31861
1904 -31861 -4625 19243 24019 7231 -18541 -34844 -29572 -6182 19263 29298 16919 -9128
1916 -9128 -30790 -32965 -14039 12853 29273 24137 1603 -21846 -29161 -14266 13236 35167 37126
1929 37126 18620 -6663 -20770 -13639 9719 32969 39566 24232 -3033 -24273 -25791 -7658
1941 -7658 16397 28682 19654 -5064 -28952 -35954 -21450 4275 23473 23108 3803 -20493 -32457
1954c2457R182K4360K3030O210j4859k5299j8178J540K0035K4198J1325r879k4362
1967e154k2115m751J5883K5249J7172k622k0279k3393r805J1255K4853K1763L962
1980C2018j6178k4544j5608M418K1378K3280Q911j2028k4757k0736k769J6580
1992a0035K3797J4067n886k2104k3375q789J1751K3777J9250J268j7595k4118
2004a7992j3874O150K1856K2543P755j2251k3521j8392m04J7935K3871J3351o389
2017B0638k1579k1720o717J3083K3749J8123q4j7938k3021j1862Q020K2542K1739
2030B4973O375j3048k2638j6103K129J9319K3455J1573q311k2164k0609m921J3863
2043f107K2402J4751m006k0741k3879j1533P871K0674J8124K226j6028k3636j5382
$$ plain form
1954 -32457 -23275 1085 24115 30325 15466 -9833 -28011 -26471 -6436 17762 29087 19208 -5154
1967 -5154 -27269 -32020 -16137 9112 26284 23662 3383 -20010 -29815 -18560 6293 28056 32018
1980 32018 15840 -8704 -24312 -19894 1484 24764 33675 21647 -3110 -23846 -26615 -10035
1992 -10035 13762 27829 21943 -161 -23536 -32325 -20574 3203 22453 23721 6126 -17992
2004 -17992 -31866 -25716 -3860 18683 26438 14187 -9334 -27726 -28130 -10195 13676 27027 20638
2017 20638 -941 -22661 -29378 -16295 7454 25577 25493 7555 -15466 -27328 -19308 3234 24973
2030 24973 31348 18300 -4338 -20441 -18312 1007 24462 36035 27724 5560 -15049 -19970 -6107
2043 -6107 16295 31046 27040 6299 -17580 -29113 -21242 -568 17556 19782 3754 -19882 -35264
2056c5264L320J9585K2170R701r148k1149j7963j647J6366K3459J4878l633j9094
2069A581k1028q268J0349K1585J7908J658j5853k2375j3458M879J9995K1249Q248
2082B6470j0245k0752j6387K54J7247K2816J3291n193j9362j9878o404J1480K1100
2095A4437J5659j117j7659k2406j2301N989J9488J8963M904j2678k1337j5046
2107b3104J855J7911K1518J0736p196k0014j8755m714J2287K0064J3170l933j9492
2120C33k2687j1738O043J8049J6299K096j4241k1335j3803L631J8973K2042J1145
2133A4807n887j6883j4357L49J6590K3449J5667j490j6583j8853p615R004J9502
2146A7700J5624N37j5915k2018j3844L019J6812J8018O252j0469k0121j5839o18
$$ plain form
2056 -35264 -31944 -12359 9811 19512 10364 -10785 -28748 -30395 -14029 9430 24308 20675 1581
2069 1581 -19447 -27715 -17366 4219 22127 23785 7932 -14443 -27901 -23022 -3027 18222 26470
2082 26470 16225 -4527 -20914 -20660 -3413 19403 32694 27501 8139 -11739 -18143 -6663 14437
2095 14437 30096 28979 11320 -11086 -23387 -17398 2090 21053 25957 13279 -8058 -23104
2107 -23104 -21249 -3338 18180 28916 21720 1706 -17049 -21763 -9476 10588 23758 19825 333
2120 333 -22354 -34092 -28049 -10000 6299 8395 -5846 -27181 -40984 -37353 -18380 3662 14807
2133 14807 8920 -7963 -22320 -21971 -5381 18068 33735 32245 15662 -3191 -10806 -1802 17700
2146 17700 33324 33861 17946 -4072 -17916 -14897 1915 19933 26185 15716 -4405 -20244 -20862
2159b0862J5355K0527J1753n287j8562j8810o452J0070J8751J3730j795j7025
2171A393k1389j2034M829J7483J7446M731j0983j9145j3156K505J7589K1622J2135
2184B3026m430j6372j5484k867J2836K0018J3900j822j6856k0412j0888N209J6333
2197B191J4895J924j3552k0656j3957J933J6439J9535R497o222j6672j4342p60
2210a9747J4444K0784J3664k261j5996j8376p982P579J7178J3986p8j5237k0853
2223a2895j3175K697J5700J7129O277q952j7727j3743N15J5322K0320J2425l114
2236B0779j5511j6296n271R761J8045J3545q03j5362k0017j1914L404J5272J5460
2249A1092M220j0441j8202j3414J039J5304J9672J1502l486j4798j4475k911J1717
$$ plain form
2159 -20862 -5507 15020 26773 21486 2924 -15886 -22338 -12268 6483 20213 18418 1393
2171 1393 -19996 -32030 -27201 -9718 7728 12459 1476 -17669 -30825 -28320 -10731 10891 23026
2184 23026 18596 2224 -13260 -16127 -3291 16727 30627 28805 11949 -8463 -19351 -14142 2191
2197 2191 17086 19010 5458 -15198 -29155 -27222 -10783 8752 18249 12027 -4645 -18987 -19747
2210 -19747 -5303 15481 29145 26884 10888 -7488 -15470 -7891 9287 23273 23195 7958 -12895
2223 -12895 -26070 -23373 -7673 9456 15733 6781 -10946 -24689 -24174 -8852 11468 23893 20779
2236 20779 5268 -11028 -16299 -6538 11507 25052 24249 8887 -11130 -23044 -19640 -4368 11092
2249 11092 15312 4871 -13331 -26745 -25706 -10402 9270 20772 17286 2488 -11987 -14898 -3181
2262c181J9014J3697q61j4809j8690j0111M592J4951J3773J682j2843j9508j3813
2275b6107O50J3948J6946P954o511j6221j4221j740J2654J8706J2411j882j4364
2288B223j6489p019P331J6297J3766J305j2477j7921j1269L014J5104J6837P233
2301A7935o720j5190j2063O26J4105J9124J2240j919j3613j4886n333Q252J5947
2314A8505J2314o21j4171j9062j2214J495J2392J2986K838j0733j8069j3926q84
2327b9150J2243J6527R307m038j4067j3652l042J0575J7523J2929J18j2182j5601
2340a2510p810N616J5060J3929L016j0240j6342j1360J545J3292J5808P665n440
2353A2229j4293j2683j643J1161J6804J1434j384j2768j4833o458O402J4798J2680
$$ plain form
2262 -3181 15833 29530 28669 13860 -4830 -14941 -10349 4602 18375 20057 7214 -12294 -26107
2275 -26107 -25457 -11509 5437 13391 6880 -9341 -23562 -25302 -12648 6058 18469 16587 2223
2288 2223 -14266 -21285 -13954 2343 16109 17414 4937 -12984 -24253 -21239 -6135 10702 17935
2301 17935 11215 -3975 -16038 -15412 -1307 17817 30057 28138 14525 -361 -5694 2558 18505
2314 18505 30819 30198 16027 -3035 -15249 -13754 -1362 11624 14462 3729 -14340 -28266 -29150
2327 -29150 -16907 -380 8927 4889 -9178 -22830 -25872 -15297 2226 15155 15273 3091 -12510
2340 -12510 -20320 -14704 356 14285 17301 7061 -9281 -20641 -19096 -5804 10004 17669 12229
2353 12229 -2064 -14747 -16390 -5229 11575 23009 21625 8857 -5976 -12434 -6032 8766 21446
2366B1446J484j1141j6346j0747J898J2668J4335N773p045j5029j2549j286J0975
2379e564J5791R881k821j3274j4375n405P176J4521J1476l0j2004j6173r817K702
2393a7916J2523J2868L612q709j5471j1803j7J1704J5254Q455l761j2828j2332
2406a8421k523R751J5951J1834K13j0841j3676o542N555J4140J3238L193q920
2419A2952j4769j0379J101J1680J4044O494n717j4035j2732k749Q954J4333R683
2432A8860j830j2190j4150o455N624J3559J1955J829r727j4747r702J924J1882
2445c168J3326N218o700j4177j1965j648R653J3997Q503k916j2370j3180m720
2458b0147P149J4210J1490J055r777j3483p447M084J3097J3236M545p074j3551
$$ plain form
2366 21446 22930 11789 -4557 -15304 -13406 -738 13597 19370 12325 -2704 -15253 -16539 -5564
2379 -5564 10227 20108 17287 4013 -10362 -15767 -8591 5930 17406 17376 5372 -10801 -20618 -17916
2393 -17916 -5393 7475 11087 2378 -13093 -24896 -24913 -13209 2045 10500 6739 -6089 -18421
2406 -18421 -20944 -11193 4758 16592 16805 5964 -7712 -14254 -8699 5441 18679 21872 12952
2419 12952 -1817 -12196 -11095 585 14629 21123 15406 1371 -11361 -14110 -5156 9177 18860
2432 18860 17030 4840 -9310 -15765 -10141 3418 15373 17202 7475 -7272 -16974 -15050 -3168
2445 -3168 10158 15376 8676 -5501 -17466 -19114 -9461 4536 13039 10123 -2247 -15427 -20147
2458 -20147 -12998 1212 12702 13757 3980 -9503 -16950 -12866 231 13467 18012 10938 -2613
2471b613j0347L0J0416J3623P302m234j2889j2727l935P449J3507J0021m57j0642
2485D504j3461o869M507J2814J2332L447p778j3481r827N71J0476J2964O176n187
2499A1188j3316j2526l455P584J2911Q848j582j1147j2996n858N565J3291J2026
2512A0533K951p606j2315p741K818J1967J3365N921n305j2519j0812j569Q603
2525a709J2629P582l082j1858j2735n132N690J2330J0250R21q958j2626p337L101
2539a0934J1549J2114M322o423j2816j0438j156Q401J1657O089m264j2461j2760
2552a7120m911N735J1796R355K41r108j1788n969M751J2799J2923N057n157j0655
2566b051p633J672J0623J2883O708l855j1596j1329l531O298J1153P488k031j0797
$$ plain form
2471 -2613 -12960 -12930 -2514 11109 18411 14177 1288 -11439 -15374 -7925 5582 15603 15146 4504
2485 4504 -8957 -15826 -11319 1495 13827 17274 9496 -3985 -13812 -13241 -2765 10199 16375 11188
2499 11188 -2128 -14654 -18109 -10525 2386 11234 9652 -1495 -14491 -20349 -14784 -1493 10533
2512 10533 13484 5878 -6437 -14178 -11360 607 13972 19893 14588 2069 -8743 -10312 -1709
2525 -1709 10920 18502 15420 3562 -9173 -14305 -8615 3715 13965 14886 5928 -6698 -14035 -10934
2539 -10934 615 12729 17051 10628 -2188 -12626 -13782 -5381 6276 12365 8101 -4360 -17120
2552 -17120 -22031 -16296 -4500 4855 5096 -4012 -15800 -21769 -17018 -4219 8704 13761 8604 -2051
2566 -2051 -9684 -8012 2611 15494 22202 18347 6751 -4578 -8109 -1811 9342 16830 14799 4002
2580D002j2673o233L991J1169J0359K292p188j1431p430K098J0474J1910N419
2593A6759m616j1312j0160k026P173J1114O838k661j0807j1990n307M567J0985
2606a443R505J358p607j1179o693K751J0710J1586M905m848j1011r263j116P686
2620d659J0920O052l362j1153j1682m736M994J0625Q577M11q050j0511n312M355
2634a3531J1827J2033N115m183r241o744J673R812J1827O135l564j0754j0632
2647b27l747N065R374O144k458j0487j2373o670K704R309Q962J825o865j0768
2661a0212p269J491R445J1102N399l706r971r083j794O739J0591O953j634r348
2675a297j0702m823M310J0451R346J946o362r891n829K823J0281J1324N151l826
$$ plain form
2580 4002 -8671 -14904 -10913 256 10615 12907 5719 -5712 -13142 -11044 -570 11340 16759
2593 16759 12143 831 -9329 -11355 -4182 6932 13770 11109 302 -11688 -16995 -12428 -1443
2606 -1443 8062 9420 1813 -9366 -16059 -13308 -2598 8988 13893 9045 -1966 -11229 -12345 -4659
2620 -4659 6261 12313 8951 -2202 -13884 -18620 -13626 -3001 5576 5987 -2063 -12574 -17886 -13531
2634 -13531 -1704 10329 15444 11261 2020 -4724 -3051 6761 18588 24723 21159 10405 -227
2647 -227 -3974 1091 10465 16609 14151 3664 -8709 -15379 -12675 -3366 5596 7421 556 -10212
2661 -10212 -17481 -15990 -6545 4557 9956 6250 -3721 -12804 -14598 -7859 2732 9685 8051 -1297
2675 -1297 -11999 -16822 -12512 -2061 7285 9231 2869 -7022 -12851 -10028 253 11577 16728 12902
2689A2902r552q189p46P385J0204N846l024j0238j1011m776L925R153P180l94
2703H665q203j0772n979K777R699J0101L787m534r289o940P79Q415J0723N897
2717A5126k815r442r607l204M968R437O752j009q616j0717n749K797R203R201
2731F325K745n333r493o655J228Q714J0710N611k845r038q695k114N852R667O455
2746A3134j448q755j0477n177L107Q893Q125J465o296r771o260J723Q765J0052
2760G080M659l438q811p604q18O753R781N992j900q665r643m183L691Q649P164
2775H707K57p110r985o028J773Q397R138L647m144q831p020m9P251R972N981j692
2791A0264q093q662k967M695R195P237K43o956r491n372K344Q424Q667K807m749
$$ plain form
2689 12902 3350 -4839 -5585 1800 12004 17850 14826 4588 -6423 -11199 -7274 1879 9059 8665
2703 8665 462 -10310 -16289 -13512 -3813 6288 10075 5541 -3748 -10688 -9909 -1494 9229 15126
2717 15126 12311 2869 -6738 -9942 -4974 4463 11215 10206 1590 -9127 -14876 -12079 -2876 6325
2731 6325 9070 3737 -5756 -12411 -11183 -2469 8241 13852 11007 1969 -6726 -8840 -2988 6679 13134
2746 13134 11686 2931 -7546 -12723 -9616 -723 7402 8867 2571 -7200 -13460 -11737 -2972 7080
2760 7080 11739 8301 -510 -8114 -8932 -2179 7602 13594 11694 3029 -6614 -10797 -7106 1543 8707
2775 8707 8964 1854 -8131 -14159 -12386 -3989 5149 8796 4652 -4179 -11199 -11248 -3997 5975 11956 10264
2791 10264 2171 -6491 -9458 -4763 4432 11669 11912 4956 -4535 -9907 -7563 861 9528 12335 7586
2806G586r019o780K30P198R234M902k737q541q492k619M728Q563O017j116p825
2821A329r609n011K467P870P494J566n700r028o144R64P528R062M556k800p853
2836c309p011r52O151R431O385o00o934q305l544L668Q487P458J281n658q849
2851b301n847J194P279Q375L461l678q441p290j004N848Q726N432j539p465q274
2866e524l213L882Q303O757M56o178q785n240J599P220P628K415m538q661o846
2881a0725n16N925Q117M494k463p735p619k328M502Q302O434J00o109p901l974
2896a1496K781P926P779K366m271p955n706O00O637Q303M225k531p446p200j802
2911g790M869Q228N857m90o428q027l916K898P641O997J397n112q314n771N74
$$ plain form
2806 7586 -1433 -8213 -7983 -785 8449 13351 10614 2073 -6419 -9038 -4310 4253 10270 9154 1329
2821 1329 -8280 -13291 -10824 -2954 4540 6106 406 -8622 -14766 -13802 -6274 2788 7344 4544 -3309
2836 -3309 -10320 -11272 -5121 4310 10695 10095 3161 -5144 -8688 -5020 3467 10925 12206 6548 -2301
2851 -2301 -8148 -6954 325 8700 12161 8483 42 -7248 -8252 -2404 6322 11754 10215 2750 -5524
2866 -5524 -8737 -4855 3448 10205 10661 4483 -4302 -9542 -7943 -723 6905 9320 4782 -3879 -10725
2881 -10725 -11241 -5316 2801 7295 4832 -2903 -10522 -12850 -8348 -46 6388 6488 379 -7522 -11496
2896 -11496 -8715 -789 6990 9356 5085 -2870 -8576 -7976 -1339 6964 11189 8658 1212 -5988 -7790
2911 -7790 -2921 5307 11164 10674 4246 -3781 -7697 -4799 2842 9839 11236 6124 -2190 -7961 -7387
2926g387O266P498L088l472q007p125j457M909P818N119j204o719p411k876L658
2941g302P935O826J117m985p603m504J686O831P375K652l724p818o441q42N063
2956c734P403M265j962p041p357k534L800P680O291O69n165p299l869K275P221
2971F43P442K642l656p420n908k18N527P358L833k378p229p288k331L782P303
2986B102N484k29n721p342l657K514P110O915J922m071p270n238M85N777P061
3001E842L175k884p234o737j724M114O973M746q93n992o898k944L031P231O596
3016F402J673m062o660m318J373O431P155L098k850o896o159j241M347O785M142
3031I220j555o397p205l069K793O651N779P24m816p034m225J460O155O707K564
$$ plain form
2926 -7387 -1121 6377 9465 5993 -2014 -9139 -10596 -5687 2131 7250 6046 -673 -8084 -10960 -7302
2941 -7302 633 7459 8576 3591 -4012 -8516 -6830 1 7376 10028 6304 -1514 -7955 -8797 -3734
2956 -3734 3669 7934 5972 -1069 -8426 -10960 -7160 520 6811 7480 2315 -4984 -8853 -6578 643
2971 643 8085 10727 7071 -349 -6257 -6475 -948 6410 10243 7865 636 -6652 -8983 -5201 2102
2986 2102 7586 7357 1636 -5706 -9363 -6849 261 7176 9098 5027 -2243 -7481 -6996 -1219 5842
3001 5842 9017 6133 -1101 -7838 -9562 -5448 1525 6271 5378 -614 -7512 -10456 -7425 -194 6402
3016 6402 8075 4013 -2647 -6965 -5592 839 7994 11092 8242 1346 -4813 -6054 -1707 5078 9220
3031 9220 7665 1268 -5937 -9006 -6213 438 6217 6941 2125 -4909 -9134 -7674 -1519 5188 7752
3046G752l312o905n641n92M659O667L816j844o412o520k207L463O849N520M74
3061E767m628o204l029K592O830O814K437l008o076m636L82N230O452L146k415
3076I654o612o589k346L064N880M038j020n857p003l607J937N949N791J552l738
3091A093o301m255Q72N599O775L450k104n958n507j039M119O541M363p92n379
3106A477o326k813K587O164N472R66m100o329m003J113N513O133K410k821o225
3121g82n298p76M117O007L461j567n741o019k254K853O038N028N03m152n855l076
3137g513J956O032O257K399k619n655m478N8M677O058L179j887n873o163k293
3152e865K623N483M021o34n240o582l588J517N342N402J591l393n883m087N84
$$ plain form
3046 7752 4440 -2465 -8106 -8698 -4039 2628 6444 4600 -1812 -8332 -10539 -7076 -227 5293 5767
3061 5767 1139 -5065 -8094 -5502 1328 8142 10579 7571 1495 -3141 -2759 2471 8923 12069 9654
3076 9654 3042 -3547 -5893 -2829 3051 7089 6069 212 -6791 -10398 -8461 -2512 3279 4831 1093
3091 1093 -5208 -9463 -8591 -2992 3783 7233 5129 -829 -6336 -7375 -3256 3285 7648 6856 1477
3106 1477 -4849 -7662 -5075 1089 6561 7527 3427 -2902 -6905 -5792 -279 5854 8264 5443 -782
3121 -782 -6080 -6856 -2739 3268 6729 5162 -579 -6598 -8852 -5999 39 5067 5570 1418 -4437 -7513
3137 -7513 -5557 475 6732 9131 6512 857 -3621 -3563 1114 7172 10351 8464 2591 -3572 -5865
3152 -5865 -3242 2241 6262 5628 388 -6194 -9782 -8265 -2923 2479 4070 677 -5206 -9293 -8709
3167h709N016O292L325j668n316n022r87L818O167M289m11m747n731k605K346
3182c943N720N105J010l616n797l829Q52M965N650K349k416n662n049r35L665
3197a931N601L493j250n239n848k502K320N430M640N21l955n830l499J186N137
3212a726N700K352k468n423m499k93M259N917L530j199n071n438j971K749N497
3227A916M373J47m279n764l282J372N076N207J695k928n511m183P4M296N597L010
3243F816j587n108m939j484L079N424L959k65m341n504k831J708N063M862J232
3258F084l188n475l835L98M420N427K698j817n033m716j082L291N472L817m69
3273E992m403n338k549J924N086M599R20l441n451l666N95M444N158K287k131
$$ plain form
3167 -8709 -3693 2599 5924 4256 -1060 -6082 -7069 -3251 2916 7205 6794 2047 -3684 -6289 -3943
3182 -3943 1777 6882 7892 4276 -1521 -5350 -4498 467 6117 8466 6050 388 -4661 -5596 -1931
3197 -1931 3670 7163 5913 674 -5174 -7676 -5356 74 4714 5235 1280 -4550 -8049 -6863 -1726
3212 -1726 3974 6326 3858 -1565 -6064 -6357 -2098 3819 7349 6150 1079 -4359 -6330 -3581 1916
3227 1916 6289 6436 2157 -3607 -6889 -5517 -441 4766 6461 3533 -1978 -6161 -6087 -1791 3806 6816
3243 6816 5229 121 -4818 -6302 -3223 2201 6160 5895 1554 -3950 -6781 -5073 -10 4852 6084
3258 6084 2896 -2579 -6414 -6016 -1596 3831 6529 4712 -321 -5037 -6119 -2828 2644 6461 5992
3273 5992 1589 -3749 -6298 -4374 712 5311 6231 2790 -2661 -6327 -5732 -1288 3870 6157 4026
3288D026n033m421p05L511N312L463p50m396m919k036K346N067M228N17l553n141
3304b484l170R21M400M722J747k465n017m118m20L476M988K926j172m513m672
3319d851j642K482M959L941K53l572m932k761J321M524M684J600k501m885l751
3334e131m5L749M936K740j368m515m517j368K665M827L585j66l798m862k527J453
3350d342M427M249J114k823m794l435L26L822M680K258j658m382l998q17K981
3365b392M761L241m12l737m441j976J825M438L928O70l048m706l138N12L735M280
3381C540J712k113m608l967o90K917M515K842p77l929m328j625K125M623L923
3396D160N99k943m360k566J144M200M452J694k040m361l495k15L249M440K473
$$ plain form
3288 4026 -1007 -5428 -6133 -2622 2690 6153 5403 1007 -3912 -5948 -3602 1465 5693 6210 2657 -2484
3304 -2484 -5654 -4733 -333 4389 6136 3671 -1346 -5464 -5884 -2408 2580 5506 4334 -179 -4851
3319 -4851 -6493 -4011 948 4889 5142 1570 -3362 -6123 -4802 -278 4406 6006 3505 -1380 -5131
3334 -5131 -5176 -1427 3509 6249 4881 366 -4151 -5519 -2854 1973 5558 5392 1594 -3268 -5795 -4342
3350 -4342 85 4334 5448 2625 -2169 -5604 -5278 -1456 3224 5482 3824 -558 -4556 -5373 -2392
3365 -2392 2369 5610 5198 1461 -2980 -4956 -3131 1307 5235 5905 2857 -1849 -4987 -4475 -740 3540
3381 3540 5252 3139 -1469 -5436 -6126 -3209 1306 4148 3371 -558 -4886 -6511 -4386 237 4160
3396 4160 4759 1816 -2544 -5110 -3966 234 4686 6380 4340 -21 -3516 -3731 -482 3958 6431
3411F431j189m129m250j543K120M220L177j71l501m526k484J115L855L848J078
3426D051k447m342l131J41L462M331K288j230l841l664q17K713M462L244j07l260
3442A853m131j949J578M093L744Q64k614m387l101K31L366M058J833j800m243
3457f05l855r15K556M200K786o00l605m168j788J751M094L651O25k683m113k606
3473e275Q02L695M103J735j771l924l289k55K952M185K558p71l591l813j448J945
3489b162L939L197J66k981m203k466Q16L553L646J184k153m125l251j92K938M035
3505A941K267j076l622l770j160K163M104L150J08l032m008k149J232L767L745
3520C660J121k193l979k951J74L225M031K119j188l658l507q40K355M012K883
$$ plain form
3411 6431 5242 1113 -3137 -4680 -2560 1660 4837 4666 1165 -3361 -5845 -4730 -875 2973 4051
3426 4051 1604 -2738 -5869 -5728 -2266 2065 4353 3123 -718 -4382 -5199 -2486 1976 5220 5113 1853
3442 1853 -2278 -4227 -2649 1444 5188 6052 3438 -949 -4050 -3819 -453 3605 5438 3638 -605
3457 -605 -4460 -5375 -2819 1381 4167 3567 -38 -4206 -5994 -4243 -149 3502 4127 1444 -2669 -5275
3473 -5275 -4473 -778 3325 5060 3289 -635 -3924 -4179 -1227 2958 5516 4745 1154 -2659 -4107 -2162
3489 -2162 1777 4974 5140 2159 -2044 -4510 -3694 -141 3505 4689 2536 -1589 -4840 -5032 -2094 1941
3505 1941 4208 3132 -490 -4260 -5420 -3257 847 3997 4105 1073 -2935 -5084 -3852 -85 3660
3520 3660 4781 2588 -1391 -4342 -4168 -943 3088 5207 4019 361 -3146 -3986 -1631 2381 5264
3535E264k75l183l926j924J313L586L274N87k565m085k829K32K993L635J614j578
3551B133l732l329o07K499L977K692l50l073l548j435J769L901L380O86k407l788
3567a232k431O05L291L716J480j720l835l314n39K533L771K295q26l413l763j502
3583d884J694L663L009K53k722l839k308P86L309L547J329j831l633k868l6K865
3599a666L867K262p61l142l244q97K108L802K917Q5k698l623k031R69L202L165
3615D315P87k310l902l027j88K564L338J667j340l562l389r45K087L679K755k0
3631B509k737l434j571J449L690L456J038k024l500k428M46L066L634J716j326
3646C984l436l162p14K238L582K328m63l054l550j592J374L358K927M57k394l635
$$ plain form
3535 5264 4989 1806 -2120 -4044 -2731 855 4129 4716 2151 -1934 -4763 -4531 -1538 2097 3711 2133
3551 2133 -1599 -4928 -5535 -3036 941 3633 3283 210 -3338 -4773 -3004 897 4277 4963 2556 -1232
3567 -1232 -3663 -3058 233 3949 5429 3709 -126 -3440 -3979 -1446 2325 4620 3794 381 -3382 -4884
3583 -4884 -3190 473 3482 3735 1013 -2826 -5134 -4348 -1039 2508 3837 2006 -1627 -4495 -4531 -1666
3599 -1666 2201 4463 3702 560 -2684 -3581 -1473 2329 5246 5331 2633 -990 -3021 -2052 1150 4315
3615 4315 5102 2792 -1110 -4137 -4325 -1761 1577 3244 1904 -1658 -5047 -5992 -3905 -226 2529 2509
3631 2509 -228 -3662 -5233 -3784 -94 3362 4400 2376 -1124 -3552 -3106 -40 3594 5310 3984
3646 3984 548 -2614 -3328 -1090 2492 4820 4357 1303 -2247 -3839 -2465 893 3820 4277 1883 -1752
3662a752k335M58K902L288J317j581l450k924m31K367L514K213n80k985l261j241
3678d481J685L502K948L81k407l445k105P47L056L296J195j710l540k876l04K440
3694a618L468K030q85l162l321j101J787L514K794J55k488l414j855R77L259L270
3710C410J106j806l378k613J8K622L406J786j069l206l159r20J840L318K434j97
3726C592k688l381j711J024L154K994P94k004l390k412K49K705L353J649j168
3741B760l196k942o63K071L441K357k74k780l316j570J272L248K952O15k150l421
3757a596k321M01K869L338J481j311l227k836n03K216L432K211n08k869l262j387
3773c872J386L202K696L20k326l397k161N62K793L096J233j522l177k644k00K338
$$ plain form
3662 -1752 -4087 -3629 -727 2561 3878 2297 -1153 -4077 -4508 -2141 1373 3586 3006 21 -3240 -4481
3678 -4481 -2796 706 3654 4035 1628 -1817 -3922 -3175 -119 3177 4372 2662 -878 -3754 -4058 -1618
3694 -1618 1850 3880 2995 -167 -3488 -4589 -2802 712 3506 3661 1173 -2241 -4096 -3119 140 3410
3710 3410 4516 2710 -668 -3281 -3263 -641 2765 4551 3482 276 -2883 -3803 -1963 1355 3789 3592
3726 3592 904 -2477 -4188 -3164 -10 2984 3778 1774 -1616 -4028 -3779 -1074 2279 3928 2760
3741 2760 -436 -3378 -4041 -1970 1471 3828 3554 774 -2542 -4112 -2840 408 3360 3975 1825 -1596
3757 -1596 -3917 -3516 -647 2691 4172 2861 -366 -3202 -3705 -1489 1943 4154 3646 777 -2485 -3872
3773 -3872 -2486 716 3412 3732 1406 -1991 -4152 -3590 -797 2299 3532 2010 -1167 -3811 -4011 -1673
3789a673L370K094o23k787l021j081J617L266K609K15k398l347j941O60K890K986
3805B836J017j718l314k610p3K436L361J908p82k896k973r18J882L378K582J7
3821D133k442l264j776R25K979K887P84j912l372k468J2K483L194J600j071l045
3837c53k867p30J914L206K292k40k591l193j616J021K892K653N05k078l346k303
3853d834K38K560L104J495j098k933k535k69K330L529K478m3k324k814j107J561
3869f62L254K804N17k157l335k285K65K490K803R35j734l454k954o23J960L041
3885H65J896o72k828l004j138J523L211K695L37k142l129j837P23K790K971J038
3901C299j587l132k447j52K289L199J862o75k646k775q06J788L275K539J46k239
$$ plain form
3789 -1673 1697 3791 3168 381 -2640 -3721 -2104 1162 3771 3986 1588 -1759 -3700 -3040 -150 2836
3805 2836 3853 2135 -1179 -3789 -3862 -1426 1935 3843 3061 165 -2808 -3726 -1844 1534 4116 4133
3821 4133 1691 -1573 -3349 -2424 555 3442 4226 2314 -1058 -3526 -3514 -1031 2163 3763 2692 -353
3837 -353 -3220 -3950 -2036 1170 3462 3222 631 -2562 -4178 -3157 -265 2388 2893 815 -2531 -4834
3853 -4834 -4596 -2036 1068 2563 1465 -1468 -4003 -4272 -1942 1587 4065 4022 1698 -1116 -2223 -662
3869 -662 2592 5396 5913 3756 421 -1864 -1599 891 3694 4629 2895 -559 -3513 -4136 -2176 865
3885 865 2761 2089 -739 -3743 -4881 -3358 -147 2548 2885 743 -2386 -4223 -3500 -710 2261 3299
3901 3299 1712 -1420 -3867 -4019 -1730 1469 3331 2656 10 -2765 -3571 -1783 1492 4031 4177 1938
3917A938l089j727Q31K776K715O92j904l356k619j60K202L001J531j005k933k769
3933c876o79K001L456K610J35k136k842j280J320L155K942P24j904l253k431n
3949b063K263K740J141j509l331l019q32J683K977K046l67k560k957j226J424
3964c590L123K826O53j819k950j959N07K674K965J242j315l081k636m39K033L106
3980A340K033m65k584k809j055J595L237K790N22j994l037j822O43K740K884R80
3996D998j703l337k822n18J946K845J592r70l013l047j090J526L177K546K77k104
4012C03k906j528J043L010L036J057j527k976k354m9K265L003J525j004k891k877
4028b870q67J618L056K306L7k263k916j419J144L013K913Q46j701l036k260R7
$$ plain form
3917 1938 -1151 -2878 -2047 729 3444 4136 2232 -1124 -3743 -3903 -1701 1300 2831 1826 -1107 -3876
3933 -3876 -4555 -2554 902 3512 3647 1511 -1331 -2611 -1291 1864 4806 5530 3626 373 -2058 -2063
3949 -2063 200 2940 4081 2572 -759 -3778 -4610 -2927 50 2096 1729 -831 -3788 -5014 -3590
3964 -3590 -467 2359 3012 1193 -1757 -3716 -3209 -535 2430 3672 2357 -724 -3360 -3799 -1766 1340
3980 1340 3373 2908 324 -2485 -3540 -1945 1292 4082 4604 2610 -427 -2249 -1606 1134 4018 4998
3996 4998 3295 -42 -2864 -3382 -1436 1409 3001 2031 -982 -4029 -5119 -3593 -416 2130 2407 303
4012 303 -2603 -4131 -3088 -78 2958 4015 2488 -488 -2842 -2891 -626 2377 3902 2898 7 -2870
4028 -2870 -3737 -2119 937 3243 3280 1017 -1899 -3318 -2174 839 3752 4598 2897 -139 -2399 -2302
4044b302K336K875J268j318l171l018r24J626K849K027l96k599l049j378J299
4059c875L064K879P69j707k866j883N71K765L139J435j209k916k658m74J914K957
4075A905J855n82k653l019j268J288K906K552L81j967k919j795O81K717K941J187
4091D210j300k906k428k65K105K939J705p34k797k908j101J376K908K336R3k206
4107A027l060j681P47K770K822R71j604l040k378r5K221K947J513r98k910k874
4123c622r41J544K973K169j03k344k954j440J094K941K854R04j537k768j924M01
4139b753K604L099J585r32k664k527n56J797K959K013l65k505l000j407J033K723
4155A104K428L51j997l077k065L38K414K867J151j331k911k547m25K001K984J883
$$ plain form
4044 -2302 34 2909 4177 2859 -312 -3330 -4254 -2628 221 2248 1852 -747 -3796 -5174 -3875
4059 -3875 -811 2068 2837 1130 -1736 -3619 -3048 -283 2856 4291 3082 166 -2492 -2966 -1052 1905
4075 1905 3760 3178 525 -2494 -3762 -2474 432 2984 3365 1398 -1521 -3316 -2635 82 3023 4210
4091 4210 2910 4 -2424 -2689 -584 2355 4060 3326 529 -2379 -3480 -2104 804 3140 3233 1027
4107 1027 -2033 -3714 -2967 -197 2625 3596 1992 -1048 -3426 -3521 -1300 1647 3160 2162 -748 -3622
4123 -3622 -4563 -3019 -46 2123 2020 -324 -3278 -4718 -3624 -683 2171 3075 1538 -1230 -3154 -2753
4139 -2753 -149 2950 4535 3603 939 -1588 -2144 -347 2612 4625 4260 1755 -1245 -2652 -1619 1104
4155 1104 3532 3883 1886 -1191 -3256 -2918 -504 2363 3514 2183 -728 -3275 -3700 -1699 1285 3168
4171C168n71k670k872j211J349K910K403K38k177l068j873N92K644K845J039j448
4187A298k958k333o4K263L132J854o32k548k634p77J735L118K407R9k113k877
4203a030j592Q74K734K688P54j663l018k325rK260K883J469j015k817k719p45
4219c271J692K985K152k28k405l058j534R56K781K544N18k004l179k230J91K380
4235a710K939J392j170k900k521l97K113L256K248j88k334k769j108J433L093
4250A377K663M39k021l141k068M13K457K721R97j520l111k615l97K001L015J897
4266C107n52k554k765r49J548L101K569K61k090l044j830O16K598K735P92j714
4282A829l211k587k61K140L017J738p75k732k667p45J867L365K625K76k108k875
$$ plain form
4171 3168 2597 -73 -2945 -4156 -2807 103 2506 2744 567 -2501 -4374 -3782 -1138 1707 2746 1298
4187 1298 -1660 -3993 -4057 -1794 1338 3192 2560 12 -2622 -3399 -1664 1454 3861 3960 1847 -1030
4203 -1030 -2622 -1748 986 3674 4428 2765 -253 -2578 -2587 -327 2556 4025 3010 193 -2526 -3271
4219 -3271 -1579 1406 3558 3330 925 -2133 -3667 -2711 70 2614 3132 1128 -2051 -4281 -4090 -1710
4235 -1710 1229 2621 1451 -1449 -3970 -4367 -2254 1002 3250 3062 728 -2041 -3149 -1716 1377
4250 1377 4040 4479 2458 -683 -2751 -2338 119 2840 3837 2317 -794 -3409 -3806 -1805 1210 3107
4266 3107 2555 1 -2764 -3713 -2165 936 3505 3766 1676 -1368 -3198 -2582 16 2751 3543 1829
4282 1829 -1382 -3969 -4230 -2090 927 2665 1890 -842 -3509 -4254 -2387 978 3603 3879 1771 -1104
4298a104j501J042K947K819P44j861l307k519j51K160K829J323j210l056k884
4313c729p47J796L191K327k5k230k792j240J313L068K844O91j835l066k251J71
4329b514K299K743J154j435l198k862p06J785K996K023l78k489k859j154J445
4344c150L168K848O12j925l016j984M73K659K937J095j536l202k738m41K098L139
4360A037J954m94k580k736q61J887L458K900O18j862k790j603Q74K828K876Q80
4376F386j830l372k858o19J758K527J182j341l270l225j238J406K917K323Q6k209
4392a377k878j336J204L123L111J107j504k859k137J97K469L086J548j042l015
4407c03k826p51J832L177K282j27k335k917j252J364L226K969P85j782l085k128
$$ plain form
4298 -1104 -2605 -1563 1384 4203 4947 3086 -221 -2740 -2891 -731 2098 3421 2211 -845 -3729
4313 -3729 -4476 -2680 511 2838 2813 583 -2209 -3449 -2136 932 3776 4467 2632 -434 -2685 -2514
4329 -2514 -215 2528 3682 2247 -951 -3813 -4519 -2734 262 2285 1907 -582 -3441 -4595 -3150
4344 -3150 18 2866 3478 1553 -1463 -3447 -2974 -315 2622 3717 2181 -1021 -3759 -4200 -2102 1037
4360 1037 2991 2497 -83 -2819 -3680 -1793 1665 4565 5183 3321 531 -1072 -198 2630 5506 6386
4376 6386 4556 1184 -1674 -2293 -535 1992 3174 1833 -1437 -4662 -5900 -4494 -1577 746 832 -1377
4392 -1377 -4255 -5591 -4387 -1264 1847 2954 1450 -1409 -3546 -3349 -880 2206 3754 2712 -303
4407 -303 -3129 -3880 -2048 1129 3411 3284 949 -1968 -3220 -1856 1370 4339 5124 3342 257 -1871
4423a871L02K535K859J159j520l302l039p92J720K878J840n74k738k981j210J471
4439c263L228K825O72j789k874j718P66K825L029J123j471l194k770n40J861K763
4455A473J510r98l080l162j253J385L024K538K91k115k890j515J106L165L254
4470B733J283j386k937k237O7K434L165J682j061l028l037r87J643L074K298j64
4486C542k479l119j525J138L078K958Q42j752l080k233K29K443K994J356j345
4501C047l190k995q86J661K943J958n00k719l124j388J262L110K867O98j806k952
4517b014j831O87K885L245J483j218l008k627m23K092L139J947o79k900l209j300
4533c731J395L109K588K79k273l186j905P48K914L122J118j557l192k577k30K228
$$ plain form
4423 -1871 -1569 966 3825 4984 3464 162 -2877 -3669 -1949 929 2769 2195 -543 -3524 -4734 -3263
4439 -3263 -35 2790 3462 1673 -1201 -2919 -2153 672 3701 4824 3353 159 -2611 -3151 -1290 1473
4455 1473 2983 1985 -1095 -4257 -5510 -4125 -1101 1437 1728 -387 -3277 -4792 -3686 -521 2733
4470 2733 4016 2630 -307 -2544 -2477 -43 3122 4804 3743 715 -2322 -3309 -1666 1408 3706 3542
4486 3542 1063 -2056 -3581 -2443 635 3593 4435 2683 -397 -2630 -2401 42 3036 4392 3047
4501 3047 -143 -3138 -4024 -2363 580 2538 2038 -681 -3805 -5193 -3931 -821 2046 2744 938 -2014
4517 -2014 -3845 -3158 -273 2972 4455 3237 229 -2398 -2821 -729 2410 4357 3678 778 -2431 -3731
4533 -3731 -2336 773 3361 3640 1367 -1819 -3724 -2976 -62 3060 4178 2621 -571 -3148 -3378 -1150
4549a150L133J698r39l058l138j136J547L097K395j8k398l145j696J016L042L073
4565B323J040j596k991k213K50K602L308J785r43k907k865p53J870L230K262k43
4581D159k628l242j628J090L018K826O12j998l293k278L05K683L195J448j281
4596B988l176k846n52K042L261K115n44k848l289j458J267L038K654K86k312l394
4612b768k131M53K727L084J247j487l131k596k05K390L386K138m65k645k886r00
4628c789J746L366K753L37k220l154j827Q23K956L055R64j712l268k598r8K391
4644b75L258J750r29l065l048r41J814L268K434j69k681l383j797R19K966K823
4660B944N97k148l497k528P4K548L211J542j186l106k840n38K161L499K448j70
$$ plain form
4549 -1150 1983 3681 2742 -316 -3454 -4590 -3043 54 2449 2431 33 -3112 -4808 -3792 -750 2323
4565 2323 3363 1767 -1224 -3437 -3187 -585 2723 4508 3565 658 -2207 -2960 -1090 2140 4402 4159
4581 4159 1531 -1711 -3339 -2249 769 3595 4207 2209 -1084 -3362 -3057 -374 2821 4269 2988
4596 2988 -188 -3034 -3586 -1544 1717 3832 3288 440 -2849 -4307 -3040 -2 2652 2938 626 -2768
4612 -2768 -4899 -4446 -1719 1365 2612 1125 -2006 -4602 -4807 -2417 969 3107 2642 -3 -2889 -3789
4628 -3789 -2043 1323 4076 4413 2193 -961 -2788 -1965 991 4046 5010 3298 30 -2568 -2666 -275
4644 -275 2983 4733 3804 739 -2309 -3250 -1436 1832 4266 4097 1416 -1967 -3764 -2845 121 2944
4660 2944 3541 1393 -2104 -4632 -4558 -2010 1201 2743 1557 -1549 -4389 -4927 -2766 733 3181 3011
4676C011k587l116j312J359L208K815M87k243l376k285L25K639L070J267j480
4691A782l220k683l11K377L539K329l02k582k844r16J851L517K894L98k297l353
4707A79k083O21K768K905P99k040l677l004m49K218L161J696j046l144l138r52
4723e186J911L453K687R5k480l269j715J069L088L056P66k030l480k551K9K576
4739a981L262J667j050l065k803n03K248L715K680L6k369k989j351J466L344K928
4755E235N88k273l575k549P5K474K928J081j781l604l129o35K139L446K253m74
4771B199k744l085j073J833L609L071N13k275l396k089O73K932L109R96j880l590
4787a197k976l44K369L362K003p30k989k942q36K065L732K919L80k298l187j733
$$ plain form
4676 3011 424 -2692 -4004 -2645 563 3378 3865 1622 -1754 -4039 -3714 -1075 1995 3262 1782
4691 1782 -1438 -4121 -4432 -2055 1484 3813 3511 929 -1915 -2831 -980 2537 5431 5829 3532 179
4707 179 -1904 -1283 1485 4390 5189 3149 -528 -3532 -3981 -1763 1398 3094 2048 -1096 -4234 -5186
4723 -5186 -3275 178 2865 2960 480 -2789 -4504 -3435 -347 2709 3475 1445 -2035 -4586 -4557 -1981
4739 -1981 1281 2948 1898 -1167 -3970 -4473 -2225 1490 4170 4206 1837 -1152 -2503 -1037 2307 5235
4755 5235 5823 3550 -25 -2574 -2499 -25 2903 3984 2203 -1401 -4530 -5165 -3026 420 2673 2199
4771 2199 -545 -3630 -4703 -2870 739 3810 4323 2048 -1348 -3437 -2764 168 3277 4273 2393 -1197
4787 -1197 -4173 -4517 -2148 1214 3217 2487 -502 -3444 -4280 -2215 1517 4436 4816 2518 -669 -2402
4803b402J006L082K994P60k138l734k940l08K229L004J445j353l392l160q22K026
4819c703L560K692J07k473l065j318J504L525L217Q33k080l514k484K16K691L154
4835B862J275j637l573l198o85K139L509K289m10k804l171j141J757L600L151
4850C963O39k175l349k137O73K941L172J135j740l560k943m31K311L377K024p23
4866C177k945l058r57J909L653K910L56k339l293j897Q70L028K961P17k195l864
4882i67l066m66K148K981J471j436l526l290r33K034L585K749J33k429l014j234
4898e260J639L744L467J064j796l260k226M53K925L398J496j427l422l086p17
4913c008K151L389K253m92k914l282j393J494L390K950M25k314l515k278M70K810
$$ plain form
4803 -2402 -1396 1686 4680 5440 3302 -432 -3372 -3680 -1451 1553 2998 1645 -1747 -4907 -5729 -3703
4819 -3703 -143 2549 2656 183 -2882 -4200 -2696 829 4046 4879 2799 -715 -3199 -2983 -292 2862
4835 2862 4137 2500 -1073 -4271 -4956 -2817 692 2981 2571 -233 -3404 -4545 -2788 812 3963
4850 3963 4602 2427 -922 -3059 -2386 555 3727 4862 3122 -438 -3381 -3812 -1501 1876 3900 3177
4866 3177 232 -2826 -3783 -1874 1779 4689 5045 2706 -587 -2484 -1614 1414 4375 5092 2897 -967
4882 -967 -4033 -4499 -2351 630 2101 665 -2861 -6151 -7084 -5050 -1465 1284 1417 -1012 -4026 -5260
4898 -5260 -3621 123 3590 4654 2858 -402 -2628 -2175 750 4148 5644 4217 795 -2291 -3008
4913 -3008 -857 2532 4785 4293 1379 -1903 -3296 -1802 1588 4538 4963 2649 -866 -3144 -2674 136
4929A36L082J061j860l608l067m77K219L258J928p62l110l160j094J884L599K941
4945B970L01k346l330j788J067L265L296J042j952l619k753q0K588L337J732j210
4961B520l367l218q47K055L630K686m1k631l278j463J434L521L253R09k024l437
4977b98k377K90K800L324J469j466l472l171p83K068L361K210n26l051l427j501
4993d550J435L359K961M75k320l561k199O09L022L402J289j636l507k912l27K466
5009a994L575K137p85l153l326j101J815L611K892J96k515l515j914J029L284
5024B36L367J108j852l529k696QK690L528J866j118l303l294r73J917L403K543
5040C901k02k830l562j808J108L217L098P58k079l526k462K93K876L520J667j208
$$ plain form
4929 136 3218 4279 2419 -1189 -4256 -4733 -2514 744 2672 1910 -1200 -4360 -5454 -3570 29 2970
4945 2970 3271 925 -2405 -4193 -3126 139 3435 4477 2525 -1094 -3847 -3927 -1339 1998 3730 2520
4961 2520 -847 -4065 -4912 -2857 773 3459 3418 787 -2491 -3954 -2520 1001 4254 5163 3139 -298
4977 -298 -2675 -2385 415 3739 5208 3742 270 -2901 -3684 -1616 1745 3955 3429 378 -3049 -4550
4993 -4550 -3115 244 3205 3680 1360 -2201 -4400 -3791 -769 2633 3922 2286 -1221 -4133 -4460 -1994
5009 -1994 1581 3718 2933 -220 -3546 -4647 -2832 779 3671 3867 1352 -2163 -4077 -3048 236
5024 236 3603 4711 2859 -670 -3366 -3358 -668 2860 4726 3608 305 -2989 -3962 -2045 1358 3901
5040 3901 3699 869 -2693 -4501 -3393 -176 2922 3680 1601 -1925 -4387 -4094 -1218 2302 3969 2761
5056B761l308k998o00K262L608K426m39k916l454j552J483L400K982M68k359l555
5072a791k282O03L146L471J439j549l403k851k79K542L657K182p45l133l412j318
5088c723J643L378K712N1k723l684k148P47L064L197J058j857l476k672m4K684
5104a793L526J967r04l184l169r80J884L431K543j29k809l519j859J054L222L170
5120B451Q78j971l347k313M54L105L742J938r78l048k800m49K418L687K432m30
5136E769l035l570j695J181L100K640J40k648l884k567L38K758L206J251j625
5151A359l422k827k60K493L600K250n37k937l203j147J700L402K743K06k526l438
5167b544k050P85L124L241J158j666l304k492P4K772L622K002q22l043l095r21
$$ plain form
5056 2761 -547 -3545 -4145 -1883 1725 4151 3712 796 -2658 -4210 -2727 673 3655 4123 1764 -1791
5072 -1791 -4073 -3470 -324 3147 4586 3037 -366 -3217 -3496 -954 2703 4885 4140 1007 -2405 -3723
5088 -3723 -2080 1298 4010 4061 1338 -2346 -4494 -3747 -683 2514 3572 1715 -1761 -4433 -4477 -1793
5104 -1793 1733 3700 2796 -388 -3557 -4537 -2653 778 3321 3192 383 -3136 -4995 -3941 -719 2451
5120 2451 3329 1358 -1989 -4302 -3848 -743 2999 4937 3959 911 -1889 -2338 80 3767 6199 5769
5136 5769 2734 -836 -2531 -1350 1750 4390 4530 1882 -2002 -4569 -4231 -1473 1733 2984 1359
5151 1359 -2063 -4890 -5150 -2657 943 3193 2656 -281 -3484 -4631 -2931 471 3214 3420 894 -2544
5167 -2544 -4594 -3809 -685 2556 3714 2048 -1256 -3748 -3674 -902 2720 4722 3900 857 -2238 -3159
5183c159J898L375K446k46k905l663j950R32L072K958O63k125l513k367M05L001
5199a178L635J859j006l030k755l72K356L650K378m02k947l513j693J145L036
5214A163K526J34k653l777k479K71K702L148J311j497l270k690j56K561L665K326
5230C285m46k819l045j056J782L411K777K01k468l467k019P94L093L186J105j773
5246B541l364k550J25K751L609J975q86l114l068q81J920L394K387l35k957l678
5262b131k025Q89K976K804N38k269l615k505K73K867L495J748j095l051k725l59
5278d185K393L621K521k71k771l271j441J335L215K779L79k341l557k363M72K858
5294f27L273J337j467l254k719k39K486L603K166o10l018l219j257J592L275K581
$$ plain form
5183 -3159 -1261 2114 4560 4314 1409 -2254 -4204 -3272 -200 2758 3421 1296 -2217 -4584 -4179 -1178
5199 -1178 2457 4316 3310 280 -2475 -2847 -491 3159 5537 5135 2188 -1325 -3018 -1873 1163
5214 1163 3689 3823 1170 -2607 -5086 -4815 -2113 1035 2346 849 -2421 -5111 -5267 -2706 959 3285
5230 3285 2839 20 -3025 -4081 -2299 1112 3889 4090 1622 -1845 -3864 -3070 23 3209 4314 2541
5246 2541 -823 -3373 -3248 -497 3112 5087 4201 1087 -1981 -2862 -942 2452 4839 4504 1547 -2131
5262 -2131 -4156 -3267 -291 2513 3051 782 -2833 -5338 -5065 -2198 1297 3045 1950 -1101 -3826 -4185
5278 -4185 -1792 1829 4350 4079 1308 -1963 -3404 -2069 1146 3925 4304 1963 -1594 -3957 -3485 -627
5294 -627 2646 3983 2516 -738 -3457 -3696 -1210 2393 4559 3949 931 -2288 -3545 -1953 1322 3903
5310C903j9k704l692k164O58K919L094R68j866l410k575R2K743L650K068p68k944
5327d7k897o95K108L534K665q0k638l418j815J012L042K924O35k127l516k540
5343c853J32K638L286J609j173l154k889n92K153L455K377k91k761l302j483J305
5359b543L210K880M45k292l457k239M81K866L268J355j467l279k751k92K403L456
5375B044K121o49l008l247j238J544L254K621M9k577l507k096P05K941L066J044
5391C067j728l318k474J5K643L515K024p08k835k880p16J973L443K627L4k453
5407B229l293j759R99L006K874O90k015l453k549O5K483L180J495j271l205l014
5423c538o75J965L349K264l85k755l280j434J306L251K852M73k139l390k150N21
$$ plain form
5310 3903 3884 1180 -2512 -4676 -4018 -1099 1995 2963 1097 -2313 -4888 -4796 -2053 1597 3665 2897 -47
5327 -47 -2944 -3639 -1531 2003 4668 4588 1950 -1468 -3283 -2271 771 3695 4330 2203 -1313 -3853
5343 -3853 -3721 -1083 2203 3812 2639 -515 -3404 -3996 -1843 1612 3989 3698 937 -2365 -3848 -2543
5359 -2543 667 3547 3992 1700 -1757 -3996 -3515 -649 2619 3974 2507 -772 -3523 -3815 -1412 2044
5375 2044 4165 3516 508 -2739 -3977 -2433 821 3442 3491 914 -2593 -4689 -3984 -1043 2023 3067
5391 3067 1339 -1979 -4453 -4438 -1795 1720 3744 3036 201 -2679 -3395 -1422 2021 4648 4682 2229
5407 2229 -1064 -2823 -1824 1182 4056 4746 2731 -722 -3271 -3206 -723 2457 3952 2681 -524 -3538
5423 -3538 -4213 -2248 1101 3365 2980 225 -3055 -4489 -3183 68 2920 3393 1254 -2136 -4286 -3765
5439c765K858L263J350j414l223k718l25K312L382K098n61k874l116j182J555
5454b360L289K686K36k291l295j949P59K939L074J120j632l235k528j13K387L308
5470B395J834q52k977l027r79J742L215K460n6k567l302j750R51L002K917P57
5486C763j961l336k437J72K568L243J552j193l131k879o21K037L337K314l10k635
5502D83l147j387J345L216K893N86k074l233k138M94K787L136J314j404l148k783
5518c060m72K094L207J991o11k818l104j284J422L128K661K94k214l252j915P25
5534c208K865L078J145j565l131k560j33K348L204J836q35k936l026r71J709L217
5550A037K474L8k486l173j671R94L002K992Q27j813l225k348J47K535L123J571
$$ plain form
5439 -3765 -907 2356 3706 2292 -931 -3649 -3974 -1662 1720 3818 3257 383 -2733 -3915 -2360
5454 -2360 929 3615 3851 1560 -1735 -3684 -2925 14 3088 4208 2576 -659 -3187 -3300 -913 2395
5470 2395 4229 3377 400 -2627 -3606 -1864 1351 3811 3755 1188 -2114 -3864 -2913 89 3006 3763
5486 3763 1802 -1534 -3971 -3799 -1231 2012 3564 2371 -760 -3639 -4260 -2223 1114 3428 3118 483
5502 483 -2664 -4051 -2706 510 3403 3989 1915 -1318 -3456 -2962 -175 2961 4275 2871 -277 -3060
5518 -3060 -3532 -1438 1769 3760 3149 331 -2773 -4057 -2635 493 3154 3448 1234 -2018 -3933 -3208
5534 -3208 -343 2735 3880 2315 -816 -3376 -3509 -1161 2043 3879 3044 108 -2918 -3889 -2180 1037
5550 1037 3511 3549 1063 -2110 -3781 -2787 215 3207 4034 2221 -1004 -3352 -3205 -670 2453 4024
5566D024j147l087k898p63J846L137K176k78k605l163j465J170L039K802O41j893
5582A536l103k062M19K672L139J421j187k976k653m50K068L132K021n32k679l068
5598b302j280J324L038K538K66k257l203j971O05K731K945J048j578l160k526
5613c782j71K255L169J796p66k841k858q86J705L187K531J50k248k998j572J022
5629b307K999K933R19j697l053k284N0K387K977J483j133l007k925r05J601K904
5645I42K049l54k606l151j538J024K872K682O33j844l005k003M45K689L142J526
5661C503j055k837k455k88K186L220K075m22k592k953j175J380K985K485J77k231
5677B003l233k007M81K577K784Q76j623l188k564k54K165K995J764p85k760k813
$$ plain form
5566 4024 2877 -210 -3108 -3871 -2025 1112 3288 3010 405 -2758 -4223 -3053 -14 2788 3429 1536
5582 1536 -1567 -3629 -3210 -538 2601 4022 2835 -141 -2794 -3244 -1176 1956 3977 3445 766 -2302
5598 -2302 -3582 -2258 780 3318 3584 1327 -1876 -3847 -3242 -511 2434 3482 1904 -1256 -3782
5613 -3782 -3953 -1698 1471 3267 2501 -340 -3198 -4084 -2379 808 3339 3489 1241 -1757 -3329 -2307
5629 -2307 692 3625 4544 2847 -206 -2490 -2440 -53 2924 4407 3274 267 -2658 -3563 -1962 942
5645 942 2991 2637 31 -3120 -4658 -3634 -762 1920 2553 709 -2296 -4299 -3854 -1165 1977 3503
5661 3503 2448 -389 -2844 -3132 -946 2274 4349 3927 1335 -1618 -2793 -1413 1572 4057 4234 2003
5677 2003 -1230 -3237 -2756 -179 2605 3481 1858 -1330 -3894 -4148 -1983 1012 2776 1991 -769 -3582
5693c582q84J656L138K492K13k135k898j539J000K951K866R89j541k974k255Q9
5709b414K344K976J534j029k897k821q72J657K933K049l11k561l130j541R71K826
5725b86K617N34j910l107k063L78K569L068J387j145k855k496l25K106L208K079
5741C759l77k500k879j145J359L023K526L23k109l108j969N01K580K797J000j456
5757B325l059k535l16K064K991J779o83k671k815j014J476L000K397J98k132l035
5773b030j648P88K727K832R35j598k955k297J2K294K997J634q81k790k725p58
5789c463J760L040K234j42k383k964j516J022K845K636N91j860l076k156K25K419
5805g88K878J329j164k855k616n45J915L019K025k79k478k857j273J306K889K556
$$ plain form
5693 -3582 -4466 -2810 328 2820 3033 898 -2000 -3539 -2539 412 3278 4267 2726 -248 -2503 -2414
5709 -2414 -70 2906 4440 3411 514 -2307 -3179 -1522 1411 3460 3149 588 -2542 -4083 -3112 -286
5725 -286 2331 2865 955 -2152 -4215 -3837 -1268 1800 3187 2042 -813 -3309 -3634 -1528 1680 3759
5741 3759 3382 882 -1997 -3142 -1783 1240 3766 4089 1980 -1128 -3097 -2596 -16 2781 3781 2325
5757 2325 -734 -3269 -3585 -1521 1470 3249 2566 -105 -2920 -3934 -2458 542 2939 3137 1005 -2030
5773 -2030 -3678 -2890 -163 2669 3604 2006 -949 -3246 -3234 -940 2057 3691 2810 20 -2705 -3463
5789 -3463 -1703 1337 3571 3429 1046 -1918 -3434 -2412 433 3069 3660 1800 -1276 -3432 -3207 -788
5805 -788 2090 3419 2255 -600 -3216 -3761 -1846 1173 3198 2919 441 -2416 -3689 -2383 506 3062
5821C062M48j907k931j919M67K527K843J155j295k892k466l48K023K946J818o12
5837B919k594k815j065J410K873K338J64k170l001j733O99K613K731Q85j540k964
5853a250k281K0K204L009J599q05k634k622p01J713L000K237j8k247k822j497
5869c095J007K716K622O66j727k976k129J26K279K775J313j079k790k608o43J706
5885a837K851J977k83k384k811j289J110K768K488N09j818k883j896M37K472K792
5901B203J179j204k851k379l23J982K932J738n63k548k749j015J379K844K316
5916B941J87k070k852j635P36K658K732R66j424k786k164K2K193K909J598p90
5932C221k590k666q17J521K765K076j23k279k899j601P74K539K509O29j672k915
$$ plain form
5821 3062 3510 1603 -1328 -3247 -2780 -253 2590 3745 2450 -442 -2908 -3256 -1233 1713 3531 2919
5837 2919 325 -2490 -3555 -2145 728 3066 3230 1060 -1941 -3674 -2975 -362 2369 3254 1714 -1250
5853 -1250 -3531 -3511 -1307 1702 3301 2496 -138 -2760 -3461 -1748 1252 3489 3471 1224 -1598 -3095
5869 -3095 -2088 628 3250 3916 2189 -787 -2916 -2790 -511 2264 3577 2498 -292 -2900 -3543 -1837
5885 -1837 1014 2991 2708 324 -2487 -3776 -2666 102 2590 3099 1281 -1602 -3498 -3061 -589 2203
5901 2203 3382 2178 -673 -3052 -3375 -1393 1539 3277 2714 166 -2583 -3598 -2219 625 2941
5916 2941 3128 1058 -1794 -3429 -2693 -35 2697 3663 2239 -547 -2711 -2689 -496 2413 4011 3221
5932 3221 631 -2035 -2852 -1331 1434 3510 3387 1108 -1791 -3392 -2618 -79 2430 3059 1387 -1528
5948a528k134J11K243K810J388r55k692k464n77J750K883K030k34k290k746j240
5964c645J170K802K508M95j756k838j780M88K483K782J197j206k752k366l74J948
5980h44K801J730o26k576k794j147J221K707K231J35k065k857j659O45K549K719
5996B170J050j270k662k114n4K170K877J682o86k494k658r06J382K701K058j05
6012C141k241k910j632P24K493K520P25j574k805k033J79K248K906J461q72k570
6028b40k462n50J719K846J971k76k327k801j368J063K661K432M48j756k788j845
6044c273M46K414K821J315j068k602k296l49J853K792J761m99k446k801j249J021
6060b160K551K162J56k021k883j808M47K392K670J110j196k611k100m1K093K890
$$ plain form
5948 -1528 -3662 -3551 -1308 1502 2890 1935 -757 -3221 -3798 -2048 835 2865 2631 341 -2405 -3645
5964 -3645 -2475 327 2835 3330 1574 -1264 -3044 -2556 -73 2709 3906 2700 -52 -2418 -2792 -844
5980 -844 1957 3687 3061 485 -2309 -3456 -2235 472 2703 2838 773 -2084 -3743 -3098 -549 2170
5996 2170 3220 1950 -712 -2826 -2880 -710 2167 3849 3163 669 -1989 -2895 -1513 1188 3246 3141
6012 3141 900 -2010 -3642 -2918 -425 2095 2820 1246 -1559 -3592 -3413 -1165 1741 3202 2330 -240
6028 -240 -2702 -3252 -1533 1313 3284 3008 681 -2120 -3488 -2425 236 2668 3116 1360 -1428 -3273
6044 -3273 -2827 -413 2408 3723 2655 53 -2243 -2592 -739 2053 3814 3315 869 -1932 -3181 -2160
6060 -2160 391 2553 2709 688 -2195 -4003 -3556 -1164 1506 2616 1420 -1191 -3291 -3332 -1239 1651
6076A651J775n28k351k572q77J413K717K094L0k101k830j575P59K506K538Q25
6092C474j498k677j970J42K213K812J486q29k559k494p58J498K608J785l85k426
6108D22k910j537P11K353K239M53j758k710j848L38K336K843J477p28k307k056
6124b682k13J958K920J977j81k180k548j194J065K491K157K39j929k807j852L41
6140b438K203K522R85j241k629k184j77J939K701J623n74k370k547r44J289K552
6156G10K029lk074k758j564O29K416K473Q16j347k564j882J11K176K771J541o55
6173B825k403k368o90J432K573J829k63k250k830j506O11K268K211N01j617k641
6189b318j860K74K270K776J488o67k240k011k17J923K850J985j81k113k489j143
$$ plain form
6076 1651 3426 2898 547 -2025 -2902 -1489 1228 3322 3352 1251 -1579 -3154 -2395 111 2649 3474
6092 3474 1976 -701 -2671 -2529 -316 2496 3982 3153 594 -1900 -2658 -1160 1448 3233 2848 422
6108 422 -2488 -4025 -3314 -961 1278 1731 -27 -2737 -4585 -4247 -1911 932 2409 1681 -626 -2682
6124 -2682 -2895 -937 1983 3960 3779 1599 -949 -2143 -1078 1413 3570 3809 1880 -927 -2779 -2438
6140 -2438 -235 2287 3272 2031 -598 -2782 -2959 -1020 1681 3304 2730 360 -2187 -3131 -1842 710
6156 710 2739 2736 662 -2096 -3660 -3031 -615 1858 2674 1327 -1237 -3119 -3008 -832 1939 3480 2825
6173 2825 422 -1946 -2636 -1204 1369 3198 2935 685 -2145 -3651 -3040 -772 1439 1940 323 -2318
6189 -2318 -4178 -3904 -1634 1142 2630 1963 -277 -2288 -2505 -582 2268 4253 4072 1959 -530 -1673
6205a673J021K438K090J90j914k837j868K58K130K358Q72j308k614k209k38J786
6221a518K635J594n74k309k516r05J222K493K027Q1j947k675j546N71K321K434
6237A388Q77j226k474j892Q0K102K765J632n33k213k232o37J446K627J954l9k035
6254A590k667j453O94K278K206N31j608k664j945J24K068K549J272q92k378k225
6270b520m34J675K634J838k76k142k537j146R83K427K110K83j755k692j749L15
6286b986K142K433J036j073k479k086k43J810K621J709l63k100k407r09J195K526
6302H26K112K09j743k591j572N08K217K336Q55j270k547k035j49J847K526J454
6318B983o23k276k356p66J341K541J942qj953k510j389P46K289K269O13j491k573
$$ plain form
6205 -1673 -652 1786 3876 4066 2152 -685 -2553 -2295 -165 2193 3065 1757 -857 -3066 -3304 -1518
6221 -1518 1117 2711 2137 -172 -2688 -3593 -2371 122 2149 2230 283 -2392 -3938 -3367 -1046 1388
6237 1388 2265 1039 -1435 -3327 -3247 -1145 1620 3252 2719 506 -1726 -2363 -917 1710 3664 3625 1590
6254 1590 -1077 -2530 -1836 442 2648 3179 1571 -1093 -3038 -2914 -846 1703 2975 2083 -295 -2520
6270 -2520 -2954 -1279 1355 3193 2917 775 -1762 -2908 -1925 502 2612 2895 1140 -1552 -3301 -2986
6286 -2986 -844 1589 2625 1552 -927 -3013 -3256 -1446 1175 2884 2521 421 -1986 -2895 -1700 826
6302 826 2938 3147 1404 -1187 -2759 -2251 -34 2302 3157 1887 -660 -2695 -2844 -997 1529 2983
6318 2983 2360 84 -2272 -3038 -1697 844 2786 2778 825 -1685 -3074 -2328 -39 2230 2843 1352 -1221
6335a221j851P7J969K473J217q62k388k211n07J547K590J809j34j960k387j052
6351b891J003K494K248N10j461k449j656L12K103K376J059j022k453k197m36J527
6367i33K400J541m66k182k464j063J034K392K031K88j716k482j496M67K179K343
6383A873Q91j223k456k009j98J741K429J394o60k281k300p61J304K448J952Q8
6399B232j764k388j190Q17K375K364P28j269k380j797N7J910K415J179q00k342
6415A47k278o20J356K433J778j01j893k328j058R59K433K282O41j334k353j650
6431a586K45J974K326R59j099k561k333o74J244K179J322o07k337k534j108R36
6447c654K335K035L88j566k250j338O42K402K486J091r04k158j827p7J806K493
$$ plain form
6335 -1221 -3072 -2995 -1026 1447 2664 1802 -586 -2797 -3304 -1757 833 2642 2508 548 -1839 -2891
6351 -2891 -1888 606 2854 3364 1903 -546 -2202 -1890 213 2589 3648 2626 173 -2024 -2460 -933
6367 -933 1467 3008 2542 360 -2104 -3167 -2133 259 2290 2578 862 -1620 -3116 -2649 -470 1873
6383 1873 2764 1541 -915 -2924 -3122 -1381 1048 2442 1782 -499 -2799 -3560 -2256 192 2144 2232
6399 2232 468 -1920 -3110 -2293 82 2446 3174 1905 -475 -2272 -2215 -305 2110 3289 2489 147
6415 147 -2131 -2751 -1395 1038 2816 2715 822 -1506 -2564 -1605 828 3110 3751 2417 64 -1586
6431 -1586 -1341 633 2959 3918 2819 258 -2075 -2749 -1505 674 1996 1389 -948 -3482 -4590 -3654
6447 -3654 -1319 716 1104 -462 -2712 -4050 -3408 -1006 1480 2571 1667 -491 -2318 -2395 -589 1904
6463A904J333m04k291k258p15J211K331J963J39j786k310j282Q19K195K350P83
6479C982j267k343j918j09J703K231J085q84k477k428q84J098K192J657j99j915
6495d76k368j128Q98K386K360P58j178k194j494L90K080K441J152r08k366k203
6511a850n70J300K204J383n35k201k463j104R32K303K056M43j435k189j322O31
6527b417K283K482J134r14k173j901k62J581K307J330o24k250k415j053R50K181
6543B39J839J21j636k339j320O39K243K359R44j042k206j774mJ722K331J192p83
6560B525k308k368q70J049K102J604j77j930k326j177Q43K259K267P74j122k102
6576i57j406M06K093K430J210p82k135k075n53J312K160J416m36k090k427j164
$$ plain form
6463 1904 3237 2833 542 -1716 -2431 -1220 1111 3074 3213 1427 -883 -2165 -1346 849 3199 3982
6479 3982 2715 372 -1546 -1655 48 2279 3364 2480 3 -2425 -3309 -2211 -19 1638 1439 -476
6495 -476 -2844 -3972 -3074 -688 1672 2430 1252 -942 -2436 -2046 34 2475 3627 2719 353 -1850
6511 -1850 -2420 -1120 1084 2467 1932 -269 -2732 -3836 -2904 -601 1455 1898 463 -1726 -3048 -2417
6527 -2417 -134 2348 3482 2568 395 -1506 -1768 -187 2120 3450 2826 576 -1839 -2892 -1942 239
6543 239 2078 2199 563 -1776 -3096 -2457 -214 2145 3089 2047 -159 -1933 -1937 -215 2116 3308 2525
6560 2525 217 -2151 -3021 -1972 130 1734 1557 -373 -2699 -3876 -3033 -774 1493 2267 1145 -957
6576 -957 -2363 -1957 136 2566 3776 2994 859 -1216 -1769 -457 1703 3119 2683 593 -1834 -2998
6592b998P96K110J962L76j440k256j414M24K018K325J026r35k199j937l83J424
6608a101K155J287n85k167k377j036Q94K156J816K42j514k159j162P55K303K429
6624A936J073p95j984j509J37J874K350J304n98k149k201q28J062K048J437k76
6640B881j962k443j315N50K010J956N51j302k222j607J93J819K251J168p69k136
6656c77k006n40J263K147J480k97j900k303j085Q07K144J973M86j333k151j362
6672c054M51K049K306J081p64k058j820k27J506K235J410m95j976k240q90R51
6688a535K157J738J80j588k214j206N84K119K191Q25r93k096j656J4J696K232
6704B448J193o45k129k183q04J012K028J490k35j870k389j367N48J910J952N52
$$ plain form
6592 -2998 -2202 -92 1870 2246 806 -1450 -2864 -2440 -422 1903 2929 1994 -205 -2142 -2525 -1101
6608 -1101 1054 2341 1756 -411 -2788 -3824 -2930 -774 1042 1284 -230 -2389 -3551 -2796 -493 1936
6624 1936 3009 2214 230 -1279 -1142 732 3082 4386 3788 1639 -562 -1390 -328 1720 3157 2881
6640 2881 919 -1524 -2839 -2289 -279 1677 2228 926 -1296 -2903 -2710 -891 1360 2528 1759 -377
6656 -377 -2383 -2923 -1660 487 1967 1670 -230 -2533 -3618 -2811 -667 1306 1792 459 -1692 -3054
6672 -3054 -2603 -554 1752 2833 2069 11 -1809 -2036 -530 1705 3115 2620 644 -1596 -2486 -1535
6688 -1535 622 2360 2540 952 -1262 -2468 -1884 235 2426 3251 2258 162 -1494 -1480 216 2448
6704 2448 3641 2996 867 -1316 -2120 -1108 920 2410 2175 305 -2084 -3451 -2903 -993 959 1511
6720A511j267k197j588J34J797K273J243o46j974j871l82J357K287J656j21j742
6736D70k121r78Q49K141J969M51j347k147j456L35J879K194R55q95k072j831k67
6753a871J499K196J386m21j903k131q76R40K067J701J35j616k277j398L61J850
6769c58K009P10j111k242j746j64J528K196J279m87j955j984o74J139K165J775
6785B080Q7j557k185j182O32J991K031N78j164k153j642O0J693K162J141o42j941
6802a1j893m40J349K238J628q5j693k057j004P83K032J804L01j418k279j595J47
6819b193J611J966P74r76k140j879l44J400K182J416k15j735j946p32J030K195
6835D14J865L29j380k122j311L68J835J976P32j030k137j783j91J485K155J311
$$ plain form
6720 1511 244 -1953 -3541 -3407 -1610 663 1906 1260 -714 -2585 -2967 -1610 677 2333 2212 470
6736 470 -1651 -2629 -1780 361 2330 2781 1434 -713 -2169 -1834 45 2239 3194 2299 227 -1604 -1871
6753 -1871 -372 1824 3210 2789 886 -1245 -2121 -1181 886 2587 2722 1106 -1171 -2569 -2208 -358
6769 -358 1651 2361 1250 -992 -2738 -2902 -1374 822 2101 1614 -341 -2325 -2999 -1860 305 2080
6785 2080 2167 610 -1575 -2757 -2125 -134 1897 2475 1311 -842 -2484 -2424 -731 1431 2572 1930 -11
6802 -11 -1904 -2344 -995 1243 2871 2786 1093 -964 -1968 -1185 847 2651 2952 1534 -745 -2340 -2193
6819 -2193 -582 1384 2158 1182 -958 -2837 -3181 -1781 401 1817 1602 -133 -2079 -2811 -1781 414
6835 414 2279 2608 1228 -894 -2205 -1837 -2 1974 2706 1676 -461 -2244 -2435 -950 1205 2516
6851B516l77j817j878n73J165K214J784J34j463k071j224M81J843J797M20j362
6867A589k341j833j86J415J841R30q08k034j916m57J285K210J656M9j466j852
6883a918p85R35K139J965M85j191k077j463J58J616J938Q40q84k074j844l70J289
6900a241K103J469j89j618j887p57J047K144J843L21j335k049j397L03J676J810
6916B243O21j140k197j811l21J361J957J214m78j763j843n47J177K184J756J53
6932B566j428j951j100N13J825J716L80j344k281j793k39J324J765Q71p48j992
6948a916j826l75J296K240J748J96j277j647o59J054K239K058O47j089j919j390
6964f20R4J613J841P78r08k161j905n72J167J919J311l19j741j965q14Q69J999
$$ plain form
6851 2516 2139 322 -1556 -2129 -964 1250 3034 3168 1705 -366 -1590 -1109 734 2531 2951 1589
6867 1589 -752 -2585 -2771 -1356 485 1415 607 -1427 -3343 -3800 -2515 -305 1351 1400 -66 -1918
6883 -1918 -2703 -1768 371 2336 2821 1630 -447 -1910 -1752 -136 1802 2642 1758 -316 -2160 -2530 -1241
6900 -1241 862 2331 2142 524 -1363 -2120 -1073 1071 2914 3235 1900 -149 -1546 -1243 433 2243
6916 2243 2864 1724 -473 -2284 -2605 -1244 713 1927 1449 -314 -2157 -2704 -1527 657 2413 2566
6932 2566 1138 -813 -1913 -1400 425 2141 2521 1177 -1104 -2897 -3136 -1812 -47 824 76 -1916
6948 -1916 -3742 -4117 -2821 -581 1167 1363 86 -1561 -2220 -1166 1073 3131 3778 2689 770 -620
6964 -620 -526 1087 2928 3706 2798 637 -1268 -1840 -673 1246 2557 2238 497 -1468 -2282 -1413 586
6981E86J734K41j386k109j338K21J618J773N40j159k174j778k92J315J959J176
6997I27m21j695j703m17J210K257J844L37j213j779r40O71J905J864N55j148k099
7014A55j707k34J345J759R23p63j971j905n79J152K046J569Q5j375j826q18Q09
7031a335K022J905N59j128k037j425J9J489J803P29r25k055j875n01J136J879
7047B60J321k51j606j791o92R38K037J767L99j185j879j198L35J659J821O54r78
7064A611k015j728k83J221J850J138m60j685j787o11J038K027J680K77j221j789
7080g37j062N55J784J849O23j033j962j639j89J310J779R24o58j878j882o17J002
7097a831J899J462Mj426j845q66O85J869J793M99j068j874j327J16J515J823Q33
$$ plain form
6981 586 2320 2561 1175 -934 -2272 -2051 -433 1340 1880 721 -1453 -3231 -3523 -2208 -249 927
6997 927 506 -1189 -2892 -3309 -2099 158 2002 2339 1126 -653 -1593 -922 983 2847 3402 2254 155
7014 155 -1552 -1786 -441 1318 2241 1478 -493 -2398 -2977 -1825 221 1790 1875 500 -1326 -2144 -1335
7031 -1335 687 2592 3151 2023 -14 -1439 -1420 69 1872 2601 1676 -379 -2254 -2755 -1619 260
7047 260 1581 1330 -276 -2067 -2759 -1821 216 1983 2382 1197 -682 -1880 -1545 114 1935 2589 1611
7064 1611 -404 -2132 -2415 -1194 656 1794 1334 -351 -2138 -2749 -1711 316 1996 2273 1052 -737
7080 -737 -1799 -1244 540 2389 3012 1979 17 -1622 -1811 -501 1278 2202 1544 -334 -2216 -2833 -1831
7097 -1831 68 1530 1534 108 -1737 -2603 -1918 -49 1744 2243 1175 -699 -2026 -1910 -395 1428 2261
7114B261p41j848j658l56J181J921J306j53j496j726o89Q82J936J703L62j157
7130A728j845j180K86J575J743O52r17j944j737l52J092J760J041m82j745j895
7146b220p37Q09J775J547J46j291j836j053N03J685J822O99r16j791j389l2J420
7163h59J888J046m85j675j649m87J043J870J409j3j383j760q68O47J754J651N07
7180B636j015j836j256J36J486J774Q78o72j712j631l98J085J782J196k21j580
7196F52j821r09O30J660J493K54j242j895j270J58J477J713P68p94j766j558k32
7213b682J197J856J139k42j562j720o29Q25J836J484K00j227j741j018M67J656
7229a61J756O64q09j695j275oJ432J819J033m26j602j594n63R42J699J251r5j435
$$ plain form
7114 2261 1520 -328 -1986 -2342 -1161 760 2066 1913 417 -1309 -1998 -1116 820 2523 2885 1728
7130 1728 -117 -1297 -1011 564 2307 2959 2042 98 -1639 -1991 -899 861 1902 1420 -325 -2220
7146 -2220 -2957 -2148 -373 1174 1320 29 -1807 -2860 -2357 -672 1150 1849 933 -858 -2247 -2279 -859
7163 -859 1029 2075 1590 -85 -1734 -2221 -1178 692 2101 2088 705 -1055 -1923 -1276 478 2129 2636
7180 2636 1621 -215 -1471 -1335 151 1925 2803 2131 419 -1212 -1610 -525 1257 2453 2232 652
7196 652 -1169 -2078 -1448 212 1705 1959 717 -1178 -2448 -2290 -813 900 1668 874 -892 -2450 -2682
7213 -2682 -1485 371 1510 1268 -294 -2014 -2643 -1818 18 1502 1702 475 -1266 -2284 -1817 -161
7229 -161 1595 2259 1450 -245 -1520 -1526 -94 1725 2758 2332 730 -864 -1427 -485 1214 2465 2370 935
7247I35j850j029M15J553J518L82j039j771j299Q1J388J790R56n20j561j509l73
7264a933J066J767J255j43j462j748r43N36J541J462K21j158j830j243J70J416
7280a026J724Q13o10j606j330j44J255J838J212j76j382j587o77Q13J650J377
7296B144Q4j226j754j099L00J420J586N64q01j664j280m9J270J751J034l40j439
7313E01j577n30Q18J622J294m2j361j824j071L02J405J430M24r54j750j207MJ349
7331a167J779R80l60j425j356k63J109J772J273k9j274j660q08N23J505J336K33
7348B168j107j723j210J09J328J556P32o40j501j329j81J146J691J113k14j383
7364E55j601p27O62J463J197O3j251j760j163J86J283J476O00p09j536j223qJ303
$$ plain form
7247 935 -915 -1944 -1529 24 1542 1924 885 -886 -2185 -2104 -716 1074 2030 1510 -51 -1560 -1933
7264 -1933 -867 900 2155 2012 550 -1198 -2141 -1605 -64 1398 1619 461 -1369 -2612 -2442 -1026
7280 -1026 698 1511 901 -705 -2035 -2179 -924 914 2126 1950 568 -1019 -1696 -883 767 2144
7296 2144 2228 1002 -752 -1851 -1551 -131 1455 2019 1218 -446 -1726 -1775 -505 1246 2280 1940 501
7313 501 -1076 -1606 -788 834 2128 2086 725 -1099 -2170 -1868 -463 967 1391 437 -1313 -2520 -2516 -1167
7331 -1167 612 1592 1232 -193 -1549 -1812 -703 1069 2342 2313 1039 -621 -1429 -906 599 1935 2168
7348 2168 1061 -662 -1872 -1763 -435 1121 1853 1213 -288 -1617 -1798 -652 1039 2152 1938 555
7364 555 -1046 -1773 -1111 352 1549 1612 361 -1399 -2562 -2376 -1093 383 983 274 -1262 -2485 -2493 -1190
7382a190J827J200j57j241j304m50R75J663J342Q5j168j682j022L10J315J368
7398A871L06r68j697j308o9J149J551Q57m63j422j365l57R45J646J136l7j278
7415D97j554p77M48J404J325K45j022j640j142J13J289J504P87n21j417j253j89
7432a903J084J671J138j31j243j505o80N72J428J236J08j146j681j127R7J245
7448h37J443O06o49j488j216n2J203J737J152j04j199j272l91Q82J586J296Q7
7465B784j115j576r63K61J240J256K95r64j661j304j52J011J445P83m97j423j373
7482a953l58Q33J518J157Mj129j477p92M75J380J347L75q90j492j089J05J239
7499g47J527P97l86j335j252k00J020J608J135j6j162j395p14N52J386J247J82
$$ plain form
7382 -1190 637 1837 1680 439 -865 -1315 -340 1323 2665 2750 1582 -100 -1122 -812 503 1871
7398 1871 2177 1209 -488 -1796 -1865 -716 835 1692 1229 -193 -1558 -1915 -970 676 1812 1775 497
7415 497 -1057 -1834 -1386 18 1343 1588 566 -1074 -2216 -2103 -814 690 1477 956 -461 -1714 -1903
7432 -1903 -819 852 1990 1859 616 -889 -1569 -997 431 1667 1775 629 -1052 -2179 -2082 -837
7448 -837 606 1212 563 -925 -2141 -2193 -990 747 1899 1795 596 -676 -1067 -185 1401 2697 2784
7465 2784 1669 93 -870 -609 631 1887 2182 1218 -443 -1747 -1899 -888 557 1340 843 -580 -1953
7482 -1953 -2311 -1478 40 1197 1201 72 -1405 -2197 -1722 -342 1005 1380 490 -1002 -2091 -1986 -747
7499 -747 780 1577 1191 -144 -1396 -1596 -576 1032 2167 2151 989 -406 -1120 -568 818 2065 2247
7516B247j030j581j098N7J150J344N33o50j481j283j91J005J490R86k13j199j315
7533a229m88O96J485J193J55j043j490q81K66J256J283M83p88j474j162j21J002
7550h57J478Q57l38j231j334m05P97J454J164J10j065j412p86L87J326J294M18
7567A857q35j461j095NJ066J413P37m63j338j276l39Q74J418J041p2j108j357
7584i33o66N02J349J230K46q76j428r77J29J115J307O01n85j359j152k50R19J377
7602E49R24j74j186j303n07N98J366J179J60q95j345q75K36J200J336N40o14j357
7620a68j133j08R56J361Q41k87j244j303m87O53J325J063O2j028j369q31L54J190
7638a53J264L79p10j356j022k1J030J320P19m16j238j185l33P60J338R79m4j036
$$ plain form
7516 2247 1217 -364 -1462 -1405 -255 1089 1622 972 -509 -1792 -1983 -978 512 1498 1285 86 -1229
7533 -1229 -1717 -1021 464 1657 1812 769 -721 -1602 -1336 -80 1203 1686 898 -576 -1738 -1859 -857
7550 -857 621 1478 1140 -91 -1425 -1830 -1033 421 1585 1695 630 -782 -1568 -1181 145 1439 1857
7567 1857 1022 -439 -1534 -1529 -463 950 1687 1224 -114 -1390 -1729 -855 563 1604 1532 424 -933
7584 -933 -1599 -1097 252 1482 1728 852 -576 -1553 -1424 -309 998 1599 1014 -345 -1497 -1747 -828 549
7602 549 1473 1299 113 -1190 -1697 -1099 267 1446 1606 711 -634 -1509 -1273 -73 1263 1803 1189 -168
7620 -168 -1301 -1409 -453 908 1749 1462 218 -1085 -1572 -919 406 1469 1531 503 -866 -1697 -1343 -153
7638 -153 1111 1490 780 -576 -1598 -1619 -589 731 1450 1034 -204 -1389 -1722 -962 376 1355 1311 275
7656B75j280o33M61J253J164L33p70j301q98J20J080J298O30m69j274j128k81
7673a420Q34J327Q70j70j124j283n87N22J257J172J92q59j307q25K07J160J281
7690A247N32n54j274j110j45Q55J316P11k78j227j275n19N47J190R66K9r78j316
7708a283p56L33J130J238M55o12j185r33L1J049J344P84k89j100j102l43P29J316
7726H06R59k1r91j240o84L73J176J111K88p65j297r26nJ003J227N90m72j243j166
7745a277l24P35J232Q57j39j071j275n85M71J200J084K57p54j228p91K59J106
7762b43J268N72m33j167r94j53Q70J228P80k44j106j234n13N04J142R49K2q92
7780C56j289p52K30J081J154M19n39j167r30l3R48J270P57k45j069j112l81O46
$$ plain form
7656 275 -1005 -1638 -1177 76 1240 1573 803 -498 -1396 -1276 -196 1102 1732 1263 -11 -1139 -1420
7673 -1420 -586 741 1611 1441 317 -966 -1553 -1031 226 1398 1590 731 -576 -1401 -1194 -34 1247
7690 1247 1779 1225 -49 -1159 -1304 -449 867 1578 1300 73 -1202 -1721 -1174 16 982 1011 33 -1283
7708 -1283 -2039 -1706 -576 662 1117 505 -680 -1613 -1582 -533 811 1595 1306 206 -896 -1239 -510 806
7726 806 1765 1744 753 -487 -1171 -798 378 1489 1777 1012 -285 -1211 -1216 -213 1014 1604 1132 -111 -1277
7745 -1277 -1601 -866 366 1223 1084 13 -1262 -1847 -1376 -176 908 1165 411 -817 -1608 -1349 -243
7762 -243 1025 1597 1164 -3 -997 -1150 -280 948 1728 1484 378 -856 -1369 -865 277 1226 1248 356
7780 356 -933 -1685 -1455 -374 780 1199 660 -507 -1437 -1470 -522 748 1505 1260 191 -921 -1302 -656
7798f56J225R06M1r25j231o97L16J093J111L42o73j217r22J7R38J238N92l76j129
7817gj097l19O91J201Q34j23r92j221n84M15J100J033K31p33j186p80J56J010
7835c71J200N47m44j072r53j42P93J202Q02j82r89j115n01N11J089R69J33q37
7853F40j195p61J79J017J121M00n16j182r59j25Q33J172O96k83j072j090m51O01
7871i75J111R22N1q84j175o66L16J085J068M04n85j114p94M3R22J189O67l12j031
7890B42j007k45O39J129Q16r3r01j180n93L35J002R41J98p37j179q27O1Q74J094
7909E69M81m39j064r72j76P18J178P95r5q90j061m46M74J162J004K20p24j124
7927c90o97K07R72J078M67n13j122r20j65P63J062O72k70j034j108m11M90J020
$$ plain form
7798 -656 569 1475 1516 591 -640 -1337 -1021 72 1183 1525 852 -365 -1287 -1270 -332 906 1498 1122 -7
7817 -7 -1104 -1423 -732 469 1303 1180 188 -1033 -1617 -1202 -102 931 1162 429 -757 -1537 -1381 -371
7835 -371 829 1376 932 -140 -1093 -1235 -442 760 1562 1380 391 -724 -1225 -714 375 1344 1477 640
7853 640 -555 -1316 -1137 -120 1001 1401 885 -297 -1256 -1381 -548 624 1320 1037 -35 -1125 -1576 -975
7871 -975 136 1058 1109 225 -950 -1616 -1300 -215 853 1257 672 -442 -1236 -1193 -271 918 1585 1273 242
7890 242 -765 -1010 -371 758 1574 1481 580 -600 -1193 -858 144 1085 1283 546 -633 -1460 -1399 -525 569
7909 569 1050 611 -453 -1425 -1601 -883 295 1090 995 105 -956 -1402 -928 234 1238 1458 734 -390
7927 -390 -1087 -880 92 1170 1637 1124 2 -918 -1083 -320 742 1414 1144 110 -998 -1409 -919 101
7945A01Q63N5q36j125o40K86J006J026L68n48j029q06L9Q64J118O41k73r76r59
7964h25k73O15J100Q40o1q68j084n78L27R87R52K65o96j130q48L8Q35J050N56
7983A202m08j032r94k35O45J122P84p0q81j052m52M33J076R49K03o46j083p03
8001a142J48Q99J065M25m39j045r11j50O97J051O37k03r25j010m31M70J021Q79
8019A036M7p42j061o50K93R36J001L48m88j041p94l8P71J058O16k29r45r94l16
8038a192N24J051Q11Jp62j064n70K56R57R53K98n85j061p98L2Q00J034N23l06
8057I02r68r27k39O08J024P38o5q29j002m98L77R79Q77K08o23j029p03J16Q31
8076b23R74M55l77r76q66j45O48J024O57j55q19r72m20M29R60Q49J26o84j027
$$ plain form
7945 101 964 1019 183 -942 -1582 -1296 -290 736 1104 556 -473 -1279 -1240 -376 742 1383 1110 134 -825
7964 -825 -1098 -483 617 1457 1396 528 -556 -1134 -807 180 1132 1397 701 -429 -1277 -1239 -404 646 1202
7983 1202 794 -238 -1232 -1467 -822 300 1084 1014 133 -919 -1371 -938 138 1087 1290 644 -439 -1142
8001 -1142 -994 -95 970 1395 956 -89 -1000 -1150 -453 598 1235 1032 107 -903 -1334 -864 157 1036
8019 1036 1083 341 -720 -1370 -1077 -141 860 1208 720 -321 -1115 -1153 -382 676 1292 1063 118 -876 -1192
8038 -1192 -668 383 1194 1195 433 -631 -1201 -945 12 965 1263 678 -383 -1181 -1149 -349 685 1208 902
8057 902 -66 -993 -1232 -624 400 1138 1073 244 -758 -1256 -879 100 977 1185 562 -467 -1170 -1054 -223
8076 -223 751 1206 829 -147 -1013 -1158 -510 514 1171 1016 197 -775 -1195 -766 194 1043 1169 485 -542
8095e42o30J79Q61R54L95m83r84q03p5O72J019O32k04q68r79l10M75R70Q00P1
8115A150p52r89n56J88R18Q60L05n14r69p52l1P27R96N39k77q98q58k41N48R95
8135C89O93j1p59r31m90L09R33Q36K16n67r53o84O4P77R34M70l44r00q46j74O05
8156d33R61O63j14p93r55m31L01R28P38J33o76j009o90J05P77R25L62m10r17p94
8176a329n6O93R81O63q8p51q14k61M81R65P96J05o37q97n51
$$ plain form
8095 -542 -1172 -993 -132 822 1217 734 -250 -1053 -1128 -456 563 1195 991 123 -856 -1166 -691 279 1079 1150
8115 1150 398 -591 -1147 -959 -41 819 1124 610 -359 -1111 -1142 -415 581 1120 843 -55 -913 -1154 -606 389
8135 389 1082 1071 312 -619 -1109 -800 133 969 1185 618 -335 -1019 -955 -178 756 1226 882 -18 -864 -1038 -433
8156 -433 528 1191 1077 284 -671 -1102 -801 127 865 998 322 -687 -1377 -1272 -495 430 792 382 -535 -1329
8176 -1329 -1385 -692 289 952 864 113 -701 -962 -481 484 1280 1385 748 -149 -700
8191g00
$$ Imaginary data points
##PAGE= N=2
##DATA TABLE= (X++(I..I)), XYDATA
0@%%%%%%%%%%%%Jj7J7j8L3l3M9o5O6q2R8j15J44j60J81k14K47k92L40l86M38m95
34b63N61o35P11p97Q93j000J119j240J378j535J699j878K074k284K522k780L059
51A604l372L714m092M518m995N534o152O857p683Q662r839J1300j3154J5607j9025
66a0516K4142l2762N0838j52237L69885N72014q4739m39360n18736j00017L76603
77E5115O80108M98362K6351m90275o49834m10705R8165M78439N01410J17113l73189
88E31060o51949m98714m2061M27022N73218L23785j52920n05688n02936j40800
98f39983L16544N62651M20943m036m30218n63161l23712J21598M56374M50466
108C67466J05336l33311n59165m11076P068M10547N25825K85238j35204m36881
$$ plain form
0 0 0 0 0 0 0 0 0 0 0 0 0 0 1 -16 1 -17 16 -17 32 -33 33 -49 49 -66 78 -82 99 -115 132 -160 180 -206 232 -263
34 -263 298 -337 374 -423 470 -530 589 -651 727 -808 891 -987 1087 -1197 1325 -1455 1604
51 1604 -1768 1946 -2146 2372 -2623 2911 -3241 3616 -4067 4595 -5244 6056 -7098 8509 -10516
66 -10516 13626 -19136 31702 -120535 249350 821364 736625 297265 -221471 -321488 55115
77 55115 735223 1233585 1259936 769661 119827 -290878 -192713 285726 787136 904249 531060
88 531060 -120889 -619603 -661664 -234642 338576 662361 509441 3753 -499183 -639983
98 -639983 -323439 239212 660155 656119 225901 -337260 -660972 -539374 -83000 367466
108 367466 472802 139491 -419674 -830750 -823682 -413135 112690 397928 262724 -174157
118a74157m09486p1722L42464N47901M02639N348l73943m78103k42944J59853
128b92150M42640M03013O5223l37430n26247l73204J1167L60285M38223K01889
138C93409j75356m26191l73567n0300L25051M98404L54443l741l26801l91726
148a76375j58338K03658M35946L72546N4925l00364m53219l06996K7900L15472
158A5155L56923J26162k15236m29245l65916o6725K64884M04164K60452o1237
168B89381l33132l62578j27818K06687M06373L33306M0013k70837l87550k34931
178d41086P6383L27081L42450J12448k03878l87621l11127k5373K72906L78091
188A40274K21156q2929l17806l17970q3137K23021L87755K98503J9772k54824
$$ plain form
118 -174157 -583643 -655365 -312901 235000 637639 642987 269044 -209059 -452003 -292150
128 -292150 150490 553503 618726 281296 -244951 -618155 -606988 -246703 191520 393409
138 393409 218053 -208138 -581705 -632005 -306954 191450 545893 542152 215351 -176375
148 -176375 -334713 -131055 304891 677437 732362 431998 -21221 -328217 -300317 15155
158 15155 372078 498240 283004 -146241 -512157 -578882 -313998 90166 350618 289381
168 289381 -43751 -406329 -534147 -327460 78913 412219 452232 181395 -206155 -441086
178 -441086 -364703 -37622 304828 417276 213398 -174223 -485350 -510723 -237817 140274
188 140274 361430 278501 -39305 -357275 -440412 -217391 170364 468867 488639 233815
198B33815l38578j79844J06211L17839L05894P6269k14475l66706k77722j1858
$$ plain form
198 233815 -104763 -284607 -178396 139443 445337 521606 307131 -59575 -337297 -349155
$$ [...]
8191a87
##END NTUPLES=NMR FID
##END=
