##TITLE=1H ikalashn
AM_NV Et Acryl(nlock)
20.9.2024
##JCAMPDX= 6.0         $$ Bruker NMR JCAMP-DX V2.0
##DATA TYPE= NMR FID
##DATA CLASS= NTUPLES
##ORIGIN= UXNMR, Bruker Analytische Messtechnik GmbH
##OWNER= root
$$ TOPSPIN		Version 1.3
$$ 2024-09-20 14:15:51.781 +0400  Irina@DPX200
$$ Compression mode = diff/dup
##.OBSERVE FREQUENCY= 200.131392401
##.OBSERVE NUCLEUS= ^1H
##.DELAY= (6, 6)
##.ACQUISITION MODE= SIMULTANEOUS
##.ACQUISITION SCHEME= undefined
##.AVERAGES= 8
##.DIGITISER RES= 18
##SPECTROMETER/DATA SYSTEM= spect
##.PULSE SEQUENCE= zg
##.SOLVENT NAME= CDCl3
##.SHIFT REFERENCE= INTERNAL, CDCl3, 1, 17.95386
##AUDIT TRAIL= $$ (NUMBER, WHEN, WHO, WHERE, WHAT)
$$ ##TITLE= Audit trail, TOPSPIN		Version 1.3
$$ ##JCAMPDX= 5.01
$$ ##ORIGIN= Bruker BioSpin GmbH
$$ ##OWNER= Irina
$$ $$ F:/spectra/data/iren/nmr/1H/4/audita.txt
$$ ##AUDIT TRAIL=  $$ (NUMBER, WHEN, WHO, WHERE, VERSION, WHAT)
(   1,<2024-09-20 14:15:38.750 +0400>,<Irina>,<DPX200>,<TOPSPIN 1.3>,
      <created by zg
	started at 2024-09-20 14:15:01.062 +0400,
	POWCHK disabled, PULCHK disabled
       terminated by command 'halt'
       configuration hash MD5:
       BE 6D 3F 07 2A EA 11 49 91 17 2B D3 AF B3 58 0D
       data hash MD5: 16K
       BF 03 AF 50 F4 53 1A 24 C0 D4 8C 35 92 81 16 AF>)
$$ ##END=
$$ 
$$ $$ hash MD5
$$ $$ 4B 21 39 E2 F9 D8 29 BE A1 1E 09 5B F1 35 BD 4E
##$RELAX= 
##$RELAX= 
##$RELAX= 
##$RELAX= 
##$RELAX= 
##$RELAX= 
##$RELAX= 
##$RELAX= 
##$RELAX= 
$$ Bruker specific parameters
$$ --------------------------
##$DU= <F:/spectra>
##$EXPNO= 4
##$NAME= <1H>
##$PROCNO= 1
##$TYPE= <nmr>
##$USER= <iren>
##$AMP= (0..31)
100 100 100 100 100 100 100 100 100 100 100 100 100 100 100 100 100 100 
100 100 100 100 100 100 100 100 100 100 100 100 100 100 
##$ANAVPT= -1
##$AQSEQ= 0
##$AQ_mod= 1
##$AUNM= <au_zg>
##$AUTOPOS= <>
##$BF1= 200.13
##$BF2= 200.13
##$BF3= 200.13
##$BF4= 200.13
##$BF5= 200.13
##$BF6= 200.13
##$BF7= 200.13
##$BF8= 200.13
##$BYTORDA= 1
##$CFDGTYP= 0
##$CFRGTYP= 5
##$CHEMSTR= <none>
##$CNST= (0..63)
1 1 145 1 1 1 1 1 1 1 1 1 1 1 1 1 1 1 1 1 1 1 1 1 1 1 1 1 1 1 1 1 1 1 
1 1 1 1 1 1 1 1 1 1 1 1 1 1 1 1 1 1 1 1 1 1 1 1 1 1 1 1 1 1 
##$CPDPRG= <>
##$CPDPRG1= <>
##$CPDPRG2= <>
##$CPDPRG3= <>
##$CPDPRG4= <mlev>
##$CPDPRG5= <mlev>
##$CPDPRG6= <mlev>
##$CPDPRG7= <mlev>
##$CPDPRG8= <mlev>
##$CPDPRGB= <>
##$CPDPRGT= <>
##$D= (0..63)
0 2 0 0 0 0 0 0 0 0.06 0 0.03 0 0 0 0 0.0002 0 0 0 0 0 0 0 0 0 0 0 0 0 
0 0 0 0 0 0 0 0 0 0 0 0 0 0 0 0 0 0 0 0 0 0 0 0 0 0 0 0 0 0 0 0 0 0 
##$DATE= 1726827334
##$DBL= (0..7)
120 120 120 120 120 120 120 120 
##$DBP= (0..7)
150 150 150 150 150 150 150 150 
##$DBP07= 0
##$DBPNAM0= <>
##$DBPNAM1= <>
##$DBPNAM2= <>
##$DBPNAM3= <>
##$DBPNAM4= <>
##$DBPNAM5= <>
##$DBPNAM6= <>
##$DBPNAM7= <>
##$DBPOAL= (0..7)
0.5 0.5 0.5 0.5 0.5 0.5 0.5 0.5 
##$DBPOFFS= (0..7)
0 0 0 0 0 0 0 0 
##$DE= 6
##$DECBNUC= <off>
##$DECIM= 32
##$DECNUC= <off>
##$DECSTAT= 4
##$DIGMOD= 1
##$DIGTYP= 9
##$DL= (0..7)
0 120 120 120 120 120 120 120 
##$DP= (0..7)
$$ [...]
##$SW= 21.9925939549014
##$SWIBOX= (0..15)
0 0 2 0 0 0 0 0 0 0 0 0 0 0 0 0 
##$SW_h= 4401.40845070422
##$TD= 16384
##$TD0= 1
##$TE= 300
##$TE2= 300
##$TE3= 300
##$TEG= 300
##$TL= (0..7)
0 120 120 120 120 120 120 120 
##$TP= (0..7)
150 150 150 150 150 150 150 150 
##$TP07= 0
##$TPNAME0= <>
##$TPNAME1= <>
##$TPNAME2= <>
##$TPNAME3= <>
##$TPNAME4= <>
##$TPNAME5= <>
##$TPNAME6= <>
##$TPNAME7= <>
##$TPOAL= (0..7)
0.5 0.5 0.5 0.5 0.5 0.5 0.5 0.5 
##$TPOFFS= (0..7)
0 0 0 0 0 0 0 0 
##$TUNHIN= 0
##$TUNHOUT= 0
##$TUNXOUT= 0
##$USERA1= <user>
##$USERA2= <user>
##$USERA3= <user>
##$USERA4= <user>
##$USERA5= <user>
##$V9= 5
##$VALIST= <valist>
##$VCLIST= <CCCCCCCCCCCCCCC>
##$VD= 0
##$VDLIST= <DDDDDDDDDDDDDDD>
##$VPLIST= <PPPPPPPPPPPPPPP>
##$VTLIST= <TTTTTTTTTTTTTTT>
##$WBST= 1024
##$WBSW= 25
##$XGAIN= (0..3)
0 0 0 0 
##$XL= 0
##$YL= 0
##$YMAX_a= 619561
##$YMIN_a= -699049
##$ZGOPTNS= <>
##$ZL1= 120
##$ZL2= 120
##$ZL3= 120
##$ZL4= 120
##$ABSF1= 10
##$ABSF2= 0
##$ABSG= 5
##$ABSL= 3
##$ALPHA= 0
##$AQORDER= 0
##$ASSFAC= 0
##$ASSFACI= 0
##$ASSFACX= 0
##$ASSWID= 0
##$AUNMP= <proc_1d>
##$AXLEFT= 0
##$AXRIGHT= 0
##$AXTYPE= 0
##$AXUNIT= <>
##$AZFE= 0.1
##$AZFW= 0.1
##$BCFW= 1
##$BC_mod= 2
##$BYTORDP= 1
##$COROFFS= 0
##$CY= 7568.61572265625
##$DATMOD= 1
##$DC= 2
##$DFILT= <>
##$DTYPP= 0
##$F1P= 17.9538593292236
##$F2P= -4.03888763876832
##$FCOR= 0.5
##$FTSIZE= 32768
##$FT_mod= 4
##$GAMMA= 1
##$GB= 1
##$INTBC= 1
##$INTSCL= 1
##$ISEN= 128
##$LB= 0.02
##$LEV0= 0
##$LPBIN= 0
##$MAXI= 945.577
##$MC2= 0
##$MEAN= 0
##$ME_mod= 0
##$MI= -402.1523
##$NCOEF= 0
##$NC_proc= 0
##$NLEV= 6
##$NOISF1= 8.587773
##$NOISF2= 6.764455
##$NSP= 1
##$NTH_PI= 0
##$NZP= 0
##$OFFSET= 17.95386
##$PC= 1
##$PHC0= 193.3168
##$PHC1= 3.718903
##$PH_mod= 0
##$PKNL= yes
##$PPARMOD= 0
##$PPDIAG= 0
##$PPIPTYP= 0
##$PPMPNUM= 100
##$PPRESOL= 1
##$PSCAL= 0
##$PSIGN= 0
##$REVERSE= no
##$SF= 200.13
##$SI= 32768
##$SIGF1= 18.5376
##$SIGF2= -6.396296
##$SINO= 400
##$SIOLD= 32768
##$SREGLST= <1H.CDCl3>
##$SSB= 3
##$STSI= 0
##$STSR= 0
##$SW_p= 4401.40845070423
##$SYMM= 0
##$S_DEV= 0
##$TDeff= 0
##$TDoff= 0
##$TI= <>
##$TILT= no
##$TM1= 0
##$TM2= 0
##$TOPLEV= 0
##$USERP1= <user>
##$USERP2= <user>
##$USERP3= <user>
##$USERP4= <user>
##$USERP5= <user>
##$WDW= 1
##$XDIM= 8192
##$YMAX_p= 0
##$YMIN_p= 0
$$ End of Bruker specific parameters
$$ ---------------------------------
##NTUPLES= NMR FID
##VAR_NAME=  TIME,          FID/REAL,        FID/IMAG
##SYMBOL=    X,             R,               I
##VAR_TYPE=  INDEPENDENT,   DEPENDENT,       DEPENDENT
##VAR_FORM=  AFFN,          ASDF,            ASDF
##VAR_DIM=   8192,          8192,            8192
##UNITS=     SECONDS,       ARBITRARY UNITS, ARBITRARY UNITS
##FACTOR=    0.0002272,     1,               1
##FIRST=     0,             0,               0
##LAST=      1.8609952,     753,             78
##MIN=       0,             -699049,         -699049
##MAX=       1.8609952,     619561,          619561
$$ Real data points
##PAGE= N=1
##DATA TABLE= (X++(R..R)), XYDATA
0@%%%%%%QqQj6J6j7K5l3M2n8O7p7J01j25J49j80K14k50K91l40L98m63N31o07O98
31C74p98R05j028J162j311J476j652J849k066K300k555K836l146L481l844M244
47B227m683N162n684O263o903P606q391R269j0255J1374j2652J4134j5879J7957
61I545k0489K3657k7750L3268m1156N3450p5427J26698m62210l18635O64868j12670
73a46851k34558K35950M07107l56222m64871K32322N42795p2795k07086L22899
83B58690L60871l91805n09231J68363L87816j72827k27181L34105L24768l89196
93A44373m74763J64625L12095j94662j67124M00230L42284l43750m06913J69697
103e3908K28888k54930j69616L92147L02648l42461l72378J50032J43002l02644
$$ y = [0, 0, 0, 0, 0, 0, 0, 8, 0, 8, -8, 8, -9, 16, -17, 25, -33, 34, -43, 58, -67, 82, -98, 116, -134, 157, -183, 215, -248, 283, -324, 374, -424, 481, -547, 615, -696, 780, -872, 977, -1089, 1211, -1344, 1492, -1654, 1827, -2017, 2227, -2456, 2706, -2978, 3285, -3618, 3988, -4403, 4866, -5389, 5985, -6667, 7467, -8412, 9545, -10944, 12713, -15037, 18231, -22925, 30525, -44902, 81796, -380414, -699049, -34181, -146851, -381409, -145459, 261648, -94574, -559445, -327123, 215672, 142877, -64209, 258690, 619561, 227756, -281475, -113112, 274704, 101877, -125304, 208801, 533569, 144373, -330390, -165765, 146330, -48332, -215456, 184774, 527058, 183308, -223605, -53908, 174980, -79950, -249566, 142581, 445229, 102768, -269610, -119578, 23424, -279220]
113b79220j49388M12710L07454k81788k65666K06640J27990l03303j11078M29278
123I3629K97540k50850k07105K02456N3203l64708j43419L68002K22667k59733
133A1682j62072K10219J6309l72821j19169L67318K17766j98196n9576K66976
143A78436K9785l41377q9605L36682J65248j94030k6376K49679k4068l70638j17699
154b03963K58651Q2686k09352l695K45841l1116l36455q4622K39709O1363j68880
165a49833O0540K72757j4869k90759n3858K08344J4630j73301O8577K51123l2880
176A60471k72904m6925J65285k8864j67216R0308K50515k0562k19049r76J61426
187G1509m3026j50987J06280K38719k3783j92092Q236J21326q8994j68970Q3208
$$ y = [-279220, -428608, -15898, 291556, 9768, -255898, -49258, 78732, -224571, -335649, 93629, 391169, 140319, -66786, 135670, 188873, -175835, -319254, 48748, 271415, 11682, -150390, 59829, 76138, -296683, -415852, -48534, 169232, -28964, -88540, 178436, 208221, -133156, -222761, 113921, 279169, 85139, 58763, 308442, 284374, -86264, -203963, 54688, 137374, -71978, -75673, 170168, 139052, -197403, -282025, -42316, 19047, -149833, -89293, 183464, 168595, -122164, -176022, 32322, 46952, -126349, -57772, 193351, 160471, -112433, -159358, 5927, -22937, -190153, -99845, 150670, 130108, -88941, -89917, 71509, 28483, -122504, -16224, 222495, 198712, 6620, 14856, 136182, 47188, -121782, -38574]
198c8574J91603m9750j74140K1815J00109j06170j56600R1402J81898l5575j23508
209i7490O0371J05105r6598j29948R5564J57720l9909r6404P1833Q5242j09314
220F172j26085Q0111J22596n0666p7451P9646P6187j01130j03905P7718J00555
231H3748m9068n2153Q8231O5254r8885r2527O3664O7047o4781n0778P6709M5638
243H2099r8827q3093N1687M4105o4671l3061Q2655M5896p8247n3118O1352M0468
255b755n4702j5269Q6308M4795o3824l6899N5256K4486n6310j2565P3156K9375
267G1052n9870k6989M8201J0866n6507r108O4872K2681m9722j5601M3987M846
279D8708m9782m651N3434J2659m3230q598L5665n468m9424o729L9294J733m1003
$$ y = [-38574, 153029, 103279, -70861, -49046, 51063, -55107, -211707, -120305, 61593, 26018, -97490, -37119, 67986, -28612, -158560, -62996, 94724, 54815, -41589, 30244, 115486, 6172, -119913, -39802, 82794, 32128, -45323, 34323, 110510, 9380, -94525, -16807, 83748, 34680, -17473, 70758, 136012, 37127, -55400, 8264, 75311, 10530, -40248, 36461, 82099, -16728, -99821, -48134, -4029, -68700, -101761, -19106, 26790, -51457, -104575, -43223, -2755, -57457, -72726, 13582, 58377, -5447, -42346, 12910, 37396, -18914, -31479, 41677, 71052, 11182, -15807, 32394, 43260, -13247, -22355, 42517, 65198, 15476, -125, 43862, 48708, -1074, -5725, 47709, 60368, 17138, 8540, 44205, 38737, -10687, -17416, 21878, 23611, -17392]
292a7392q163K5840j0834m3579n623K9388j871k9976J903K6705n759k8291O275
305f1377L2507N148j4950J2668L0092J895j5658J0064K6109K451j1380R976J9147
318D6692n410j7135M035J3981n811j4395M194J1492o557j3866K130Q514n387r829
332A2648L243N940p843j1535j42J863r382j1702j411R15p787r214n86K289k590
347c5294k038M711O170K088K663P326O929K414J781M438L299r37k602j657j779
362b488l406l776k848k096j131P33K469L662N133P031Q445Q929Q729Q123P192
377D4701O196M591J703j562l873n437p560j0105j1841j2124j1404j0731j0224
390b7670r032o456l300j241J82K605N114N690N557O989P671N037K541L846M806
$$ y = [-17392, -25555, 285, -10549, -54128, -59751, -30363, -32234, -62210, -60307, -33602, -39361, -67652, -61377, -28870, -23722, -38672, -26004, 4088, 5983, -9675, 389, 26498, 28949, 17569, 27545, 46692, 41282, 24147, 28182, 42163, 36352, 21957, 26151, 37643, 31086, 17220, 19350, 27864, 22477, 12648, 15891, 21831, 13988, 2453, 2311, 4174, -5208, -16910, -18321, -17406, -25193, -34407, -34993, -32704, -35294, -37332, -32621, -26451, -24363, -21700, -14374, -7445, -5031, -3250, 1188, 4487, 3550, 948, -709, -2488, -5894, -9670, -12518, -14614, -15745, -15012, -12543, -8881, -3748, 3283, 11728, 20657, 29386, 37509, 44701, 50897, 55488, 57191, 55629, 51756, 46319, 38759, 28654, 16813, 4689, -6715, -17446, -27670, -36702, -43158, -46458, -47699, -47517, -44912, -39798, -34108, -28551, -21562, -13891, -8854, -6313, -2467, 2339]
405B339N24l526j019K056j387m722o1N001J961j072M839R792M368J76P278J1713
421C8260K251n402J237N232o539j5009n903K15j1415j8867p017M28j1337j5732
435d9598J998J2184j220o602J1930K0221K014n473J4601K2664J355q443J0158
448B5789J4090j1817k0382L944J1064j4322j9983P753J3205j6332k1079J2514
460a5556K1502p544j0889K2062K3935j4064j9599J6024J8534j9119k0337J7956
472A2905J4658l1276l3235J0684J2481k7606k0482K8536K5010k3885j9723K9811
484b2122K5884j9653o638M6560L3615k5640k0368K9692J4926l9302k1338L7227
496C2843J9237m3050l0056K4601M589m9377j8633M8795K7001l5596j3234M4053
$$ y = [2339, 2863, -663, -1682, 374, -1013, -5735, -5796, -795, 1166, 94, 4933, 14725, 19093, 19269, 26547, 38260, 40511, 35109, 36346, 41578, 35039, 20030, 14127, 14342, 2927, -15940, -22957, -22529, -33866, -49598, -47600, -35416, -36636, -43238, -31308, -11087, -9073, -14546, 55, 22719, 24074, 15631, 25789, 39879, 28062, 7680, 11624, 22688, 8366, -11617, -3864, 9341, -6991, -28070, -15556, 5946, -1598, -12487, 9575, 33510, 19446, -153, 15871, 34405, 15286, -5051, 12905, 27563, -3713, -36948, -26264, -13783, -41389, -61871, -33335, -8325, -32210, -51933, -22122, 3762, -15891, -22529, 24031, 57646, 32006, 11638, 41330, 56256, 16954, -4384, 32843, 52080, 9030, -21026, 3575, 8164, -41213, -59846, -11051, 15950, -19646, -32880, 11173]
508A1173J3230m6953j0124N9118K8419l8585j1430M3177o13o5013j9566N2303
520A5136J5220m8869q345M9104m587p0216j3676O1918J8271m3578P550O3063m733
533C6258p4327j1351O0588N876n2766J1559O5664j5179q5035j1285O0426j270
545a0842n1747K9054Q3544p337p5203N665O9335m660m9453M2918R0629j5373q3915
558B2615P43N2818l4282p2019L3614P9230l2214r1971P90M4374m8975p2744M8601
571f9420R2005k2952p2312K5971N5708m9755o6449O2516R8700k1594o2855L6397
583E960M9214o7186p5071O1181R0476l0271n6471M8560M6921p9015p7460O5426
595a7736Q7453l3058m4788O3525M4991r1093q2242O1949P2551m6932m0467P3369
$$ y = [11173, 24403, -22550, -32674, 26444, 54863, 16278, 4848, 48025, 47412, -17601, -37167, 15136, 30356, -18513, -26858, 22246, 17659, -52557, -66233, -4315, 13956, -29622, -22072, 40991, 36258, -38069, -49420, 11168, 17044, -35722, -24163, 41501, 26322, -58713, -69998, -9572, -10842, -62589, -33535, 50009, 42672, -32531, -26866, 42469, 37809, -11644, 31274, 121903, 106530, 22615, 23358, 76176, 41894, -30125, 3489, 82719, 50505, -41466, -40676, 3698, -45277, -118021, -69420, 22585, -367, -72679, -46708, 9000, -40755, -107204, -44688, 54012, 32418, -30437, 5960, 55174, -12012, -87083, -25902, 64574, 34303, -22168, 26392, 73313, -5702, -83162, -17736, 69717, 36659, -8129, 55396, 100387, 9294, -72948, -10999, 61552, 14620, -25847, 47522]
607D7522L9674j03756q4995O1403O1978n3203k6271R3768M7055j00582p3611O8031
619b2987N2788n9786j4216J08102M6242j05229p1203O2409L0622p7854j3470J12241
631D7659M1782j05201o1629O2817J6032q4801j405J25484M6858r3741m1749O9630
643B1736M652r2392L849J28066M2554q9699l0880O5630j6172j07218J556J22342
655E4024L2878q5577j5658O8161k9178j14800M426J20628K8216p5664M174P4182
667F5812l8552j19526N990J12989J6846p0042K1936P9446m7266j23007P607J04456
679A6689N589o3009M1165Q7393m9770j19203J2258R4204q147n7945N7145R1717
691A08086n3868j16131J3793P9197k5773n7472O6749R1897n5977j08766J6933
$$ y = [47522, 87196, -16560, -101555, -40152, 21826, -31377, -57648, 36120, 83175, -17407, -91018, -22987, 29801, -29985, -44201, 63901, 110143, 4914, -66289, -3880, 26742, -51112, -64582, 47659, 89441, -15760, -77389, -14572, 1460, -83341, -84746, 40738, 87596, -6145, -47894, 21736, 26388, -66004, -62155, 65911, 108465, 18766, -12114, 53516, 37344, -69874, -68318, 54024, 86902, 1325, -14333, 53828, 24650, -90150, -85724, 34904, 63120, -12544, -8370, 65812, 27260, -92266, -86276, 26713, 43559, -26483, -4547, 74899, 27633, -95374, -87767, 16689, 22278, -40731, 434, 87827, 38057, -81146, -68888, 25316, 17169, -40776, 16369, 108086, 54218, -61913, -48120, 31077, 5304, -52168, 14581, 106478, 50501, -58265, -41332]
702d1332O4462m1363n4572P6595R2627n4407r6292K3807N2956n4090n2032Q2852
714g89R1426n0866q1725L0543M1111o6059n0326Q5409Q6409m8776o6723L8544
726H178L1254p6879n0379Q4535P9366m6569n1394M6919K3430q4631m9097Q1685
738c582O9249m6168l6256N6171J7280r0982m8479P6385N6757m7691k3661O3399
750D2422J2264r3454m5377P0707M3564m8436r881P1998J0549r1167l8830O6479
762i162L1706m8795J257P7051Q538q7034l2847N9020J7142n0990R270P8900O216
775F0272q0817k4778N3956O224n0848J6653Q0196O480p1329j6062M7695n963n3319
788c1640J8236P4152L51o7030j1766L8689j9560n8094J6996O7769k429n7438j431
$$ y = [-41332, 23130, -18233, -72805, 3790, 96417, 42010, -54282, -30475, 22481, -31609, -83641, -789, 90637, 39771, -41954, -11411, 29700, -36359, -86685, -1276, 85133, 36357, -30366, 8178, 39432, -37447, -87826, -3291, 76075, 29506, -21888, 25031, 48461, -36170, -85267, -3582, 65667, 19499, -16757, 39414, 56694, -34288, -82767, -6382, 50375, 2684, -20977, 42422, 54686, -38768, -84145, -13438, 30126, -18310, -28191, 43807, 54356, -36811, -75641, -9162, 22544, -26251, -24994, 52057, 60595, -26439, -59286, -266, 16876, -34114, -24844, 54056, 60272, -20545, -45323, 8633, 14857, -35991, -19338, 60858, 67338, -3991, -20053, 27642, 21679, -31640, -13404, 60748, 61099, -5931, -17697, 20992, 1432, -56662, -39666, 28103, 25674, -31764, -33195]
801c3195L7860k2857n2798K3424O7153m7m3522J2317L9621k5183m9851K4283N9988
814C7193m653l8069J6750L4102l1769n0352K0862M8900j1000l2760K2177L1562
826D2943l3648m6536K0881M1473j4181k6781K6305K8857l3922m2214J8939L1949
838A4065j8324k1952K9141K6655l1680l4936K0452K7264j7872j4968L2772K6545
850C7162k6918k7471J9606J9453k1358j4067K8814J8997k8844k5912J4865J0192
862D519k5513j3689K6560J6676k3462j6919J8572J0914j9618n145L0152J8444
874B1491j6353q042K0576Q244j9970n574K4201J1016j8858r462J3973K18k3335
887a875p817J7687N146j7825n816J3821m27j9732m070J7287M849j3586j653J3778
$$ y = [-33195, 4665, -18192, -70990, -47566, 19587, 19540, -23982, -11665, 27956, 2773, -47078, -22795, 37193, 32540, -5529, 11221, 45323, 13554, -36798, -15936, 32964, 21964, -10796, 11381, 42943, 9295, -37241, -16360, 25113, 10932, -15849, 10456, 39313, 5391, -36823, -17884, 14065, -4259, -26211, 2930, 29585, -2095, -37031, -16579, 10685, -7187, -22155, 10617, 37162, 10244, -17227, 2379, 21832, 474, -13593, 15221, 34218, 5374, -20538, -5673, 4519, -20994, -34683, -8123, 8553, -14909, -31828, -13256, -2342, -21960, -27105, 3047, 21491, 5138, -2904, 17672, 25916, 5946, 372, 24573, 35589, 16731, 7269, 21242, 21460, -1875, -9692, 7995, 13141, -4684, -10500, 3321, 2894, -16838, -20908, -3621, 1228, -12358, -14011, -233]
901b33n08j6381k198J4182K478j1102J084J3045k27j2339R33J3726L028p089L907
916B306J2746O34r118J246R553n11q064J108O718m060j1025j984M078m091q671
931i135oM968k703o798R77N449n25l012L830O551J52k697K834M760q00k932J861
948B774L249j645l602L01J612j834k529J079K090q66j314J655K195l28p57J418
964C498J661o21j382j81q5j601j988j153j080j776j607p12m31n34j20P08J233
981f171J258J316J566J937K078J669J156J028J058N99j70n11m73q10j248j221
997C061j099j309j460j005n42o01p08l01K08K42Q1J21K96M94N21L43O3K37O28
1016g30M19M1L41R68O31P7O86J338M14m20O00J509J3j600l34Q16j126l004j255
$$ y = [-233, -741, -17122, -19320, -5138, -2660, -13762, -12678, 367, 140, -12199, -11266, 2460, 5488, -1601, 2306, 15052, 15686, 6568, 7814, 17367, 16856, 8792, 9900, 16618, 12558, 1533, -451, 3627, -464, -9135, -9141, -4173, -6876, -13674, -12697, -7248, -7773, -10785, -6955, -404, -252, -2949, -115, 4645, 3845, 913, 2774, 6023, 4378, 776, 1077, 2689, 855, -1674, -595, 1495, 629, -685, 970, 3165, 2837, 2080, 3498, 5159, 4538, 3156, 2975, 2890, 1289, -699, -1852, -2932, -4708, -6315, -7027, -7458, -7992, -8112, -7404, -6171, -4913, -3597, -2031, -94, 1984, 3653, 4809, 5837, 6895, 7494, 7324, 6813, 6340, 5530, 4282, 3061, 1962, 653, -807, -1812, -2354, -2955, -3663, -3964, -3756, -3514, -3433, -3312, -3016, -2522, -2001, -1658, -1595, -1358, -730, -311, -270, 71, 1039, 1670, 1747, 2433, 3771, 4185, 3765, 4365, 5874, 5887, 4287, 3953, 4769, 3643, 639, -616]
1035f16M73j690l471j059Q48j781l433K92K984k10k151K175M777M62j990K924
1051a466N896R22j866L173N291j288m450J852M463k603n398J807L999m635p763
1066b066Q13M082m266o387L153N386m909p486L252N943m313n446O725Q229m932
1081b222p224N548P389n338n613Q912R375o251p819O667O629q582o946J0367R299
1096A4191r003r098P627N513j2155q364J1948R514j0550q390J0065N198j4626
1109h130p889J5131J0499j1375o456J3676N239j7201p951J7090J0128j2915n088
1122e242J5880L508k0848q553J7913Q168j5257l374J8796K376k3826q447J9209
1135C03O830j6299k54K2529K010k5433p047K0439M412j7991L011K6244J053k7610
$$ y = [-616, -143, -1833, -5304, -6363, -5515, -7296, -10729, -10437, -7453, -7663, -9814, -7639, -2862, -2400, -4390, -1466, 4430, 5352, 3486, 6659, 11950, 10662, 6212, 8064, 12527, 9924, 4526, 6333, 10332, 5697, -2066, -1253, 2829, -1437, -7824, -4671, 715, -4194, -11680, -8428, -2485, -6798, -12244, -5519, 2710, -2222, -9446, -3898, 3491, -1847, -7460, 1452, 10827, 4576, -3243, 3424, 10053, 1471, -5475, 4892, 14191, 5188, -3910, 3717, 9230, -2925, -11289, 659, 10173, -377, -8767, 1298, 6496, -8130, -16019, -888, 9611, -1764, -8220, 5456, 10695, -6506, -14457, 2633, 12761, -154, -5242, 10638, 14146, -6702, -15255, 2658, 10826, -4431, -7805, 10991, 13367, -10459, -18906, 303, 7133, -9166, -9420, 13109, 15119, -10314, -17361, 3078, 7490, -10501, -7490, 18754, 19807, -7803]
1149g803o204K0613O56k0843N373K8942m14k9093m530K0469m144k3683Q479L2149
1163A9967j451k9324j230K1307q450k6191J1669L4919k179k8251K987K1624j3579
1176A818k8937J4232L6205m176k7274P300K1577j9056l2052J5546L5970o319k5327
1189a0493J2127K1488k3955l4022J7095L5058q590k2425J8197K2523k7587l5167
1201c5751J8328L3296j0948j9065K4241K3387l0656l5486J8986K9622j5051j6444
1213a5541L0095K4143l3457l5562J9302K5011j9951j4229L5513K4853l4968l3647
1225b8438K0333J9570k5594j1996M0901K5377l5961l0595K1984J3968l1476j0299
1237c2226M5183K5444l5574k5548K4384Q489l6687p996M9013K5039l4370j9330
$$ y = [-7803, -14007, 6606, 7262, -13581, -8208, 20734, 20320, -8773, -13303, 7166, 3022, -20661, -12182, 19967, 18516, -10808, -12038, 9269, 819, -25372, -13703, 21216, 19037, -9214, -6227, 15397, 1818, -27119, -12887, 23318, 19142, -8132, -832, 20745, 1689, -30363, -14817, 21153, 14834, -10493, 1634, 23122, -833, -34855, -17760, 17298, 8708, -13717, 4480, 27003, -584, -35751, -17423, 15873, 4925, -14140, 10101, 33488, 2832, -32654, -13668, 15954, 903, -15541, 14554, 38697, 5240, -30322, -11020, 13991, -5960, -20189, 15324, 40177, 5209, -28438, -8105, 11465, -14129, -26125, 14776, 40153, 4192, -26403, -4419, 9549, -21927, -32226, 12957, 38401, 2827, -22721, 1663, 10152, -26535, -34531, 14482, 39521, 5151, -14179]
1249a4179K7294L117m2006p081N0016K2610l3668j3589K8737l328m7620p331M8815
1262A1787J8603l2726o880L1540p591n0899o487M7712J5536k9814J532L5681r923
1275A8071n1934m931M5400J0777k8146R178L9318j2227n2980m291M1332M277k7880
1288a4036J5311M1839j4342n2809l104L6289l679k8687K0668M3758j6190n1524
1300b6506r29L1836j1072k9052K6066M6142j5651m6471M258K9264j6541k7557
1312c6213L1911M8313j4640m0695R189K5446k3784k9327L2552M5227j7057l7606
1324f684J0831J8730l2509l2372L1239M0964j8290l1663J6068J6769l5649l0822
1336e3388L3022L9795j5669k2297K3638J6950l6634k8600L2902L5563j6243j6083
$$ y = [-14179, 13115, 16232, -25774, -32855, 17161, 39771, 6103, -7486, 21251, 17923, -29697, -37028, 11787, 30390, -2336, -9216, 22324, 14733, -36166, -42653, 5059, 20595, -9219, -7687, 27994, 18071, -33863, -38794, 6606, 17383, -10763, -1585, 37733, 25506, -27474, -31765, 9567, 13844, -14036, 1275, 43114, 28772, -24037, -27141, 9148, 5469, -23218, -2550, 41208, 25018, -26506, -27435, 4401, -6671, -35723, -9657, 36485, 20834, -25637, -21379, 7885, -8656, -36213, -4302, 44011, 29371, -11324, -2135, 23311, -473, -29800, 2752, 47979, 30922, -6684, 4147, 22877, -9632, -42004, -10765, 30199, 11909, -19754, -3686, 13083, -22566, -53388, -20366, 19429, 3760, -18537, 5101, 22051, -14583, -43183, -10281, 25282, 9039, -7044]
1348g044K8117J4900l9453k8763K9822K8561j8928j1892L1068J2542m1107k7773
1360b9950K6871K1042k2078q081L3771J0712m1518k5599K4837J4571k4207l646
1372b3275L7210J1082l8137j9752K5473J0452k4038J986M0819J1750l4425j4476
1384a5331K4376M156k7119K506L8688Q132l3731j2355K0391l481l0537K437L6426
1397A4558O163k9776o464K1002n679k9226N325L6257O547k3952j82K1389q101
1410G861k8871N465L2239L195k1764K905J9540j1519k9380M610K7900L84j8841
1423f276O619J9217j2361k7413N376K4257k224j6288R700J8356j3595k5947N207
1436a5372K0060n229j4352J2128J7911j2931k2171O988J7654o271j0946J5233
$$ y = [-7044, 21073, 35973, -3480, -32243, -2421, 26140, 7212, -4680, 26388, 38930, -2177, -29950, -3079, 17963, -4115, -12196, 21575, 32287, -9231, -34830, -9993, 4578, -19629, -23275, 13935, 25017, -13120, -32872, -7399, 3053, -20985, -18999, 21820, 33570, -855, -15331, 9045, 13201, -13918, -11412, 27276, 35408, 1677, -10678, 9713, 6232, -24305, -21868, 14558, 20721, -9055, -15519, 5483, -196, -29422, -24097, 12160, 18707, -5245, -5427, 15962, 7861, -21010, -15545, 16694, 19889, -1875, 1030, 20570, 9051, -20329, -15719, 12181, 12565, -6276, 343, 19560, 7199, -20214, -14838, 9419, 7195, -9093, 607, 18963, 5368, -20579, -15372, 4688, -541, -14893, -2765, 15146, 2215, -19956, -12968, 4686, -1585, -12531, 2702]
1448B702J8097j1800j8589P804J3998r010j0562J4450J5011j2759j7052O592R262
1461H144j1819j0096J3924J3005j1704j3190Q023P854j1487p743J4408J2136r726
1474A729r463Q575N743j1861o862J2826R364r436p276Q461L953j1620n554J1969
1488E48Q100p684m166R173L380j0383m052J0575N679p576l147P779R99j1085m568
1503f428P785K692p922k475O926K89r531k781P426K341n776K37P896J123p050
1518e248p92P112J735m886Q98O744K98o207p01N069M7m753Q06N307m34n234j76
1535d15M118m80l921R68M374n55m051kK943j063l416P08L030j008l359J69K148
1552A88j134k603P52K400n88k149N10J708p39j664P93J694n74j428N52J211o77
$$ y = [2702, 20799, 8999, -9590, -1786, 12212, 3202, -7360, 7090, 22101, 9342, -7710, -1118, 8144, -3675, -13771, 153, 13158, 1454, -11736, -3713, 4141, -7346, -15089, -681, 11455, 1729, -7734, 841, 6584, -5277, -12139, 687, 10051, 615, -6661, 1800, 5753, -5867, -11421, 548, 8648, 964, -3202, 5971, 9351, -1032, -5084, 5491, 11170, 3594, 447, 8226, 9225, -1860, -6428, 1357, 4049, -3873, -6348, 578, 867, -8664, -11445, -4019, -1678, -7454, -7217, 679, 1802, -5248, -6040, 1072, 2807, -2079, -1181, 5563, 5861, -346, -1047, 4022, 4069, -684, 122, 5429, 4995, -239, -415, 3703, 3223, -698, 270, 4644, 4089, 38, 36, 2979, 1916, -1500, -792, 2238, 1230, -2129, -1960, 188, -946, -3549, -2797, -397, -985, -3134, -2624, -916, -1655, -3319, -2526, -832, -1406, -2834, -2282, -1071, -1748]
1569a748j177O57J287k01o77O62J124Nk19R06J138K63P0Q05Q91J42n3M38N13n6
1589D770l92j62j50m20o86o59o55p12q48r36q04o80o97o57m35j40j95k82J23N09
1609d108M05K62N40Q57P15L65M93P00M30R2J47J74j40l71k48j10l13m35j78LJ9
1630g01J01K98L81N57P27P32M77N82P88M73j8K3K99j88q26o13k66q49j554q65
1650d42q5p74j477l86O10l90j260Q5J260N9r69N25J514l06j572L54J615m62j650
1669c751Q14K127m95j837J085K762M2j136K217L512j71j718J678K926j152k544
1685D359J589K552k508m301R9J285l586m398J265K569k936l981J887K958k673
1700e820k757M339N287j676k646L953L899l537l531M416M466l696m038L445K418
$$ y = [-1748, -2925, -2268, -981, -1182, -1859, -1197, -73, -68, -287, 619, 1757, 2020, 2090, 2895, 3786, 3928, 3875, 4313, 4826, 4770, 4378, 4216, 4066, 3646, 2960, 2301, 1646, 934, 86, -850, -1654, -2334, -3031, -3688, -4123, -4263, -4458, -4740, -4617, -4108, -3703, -3441, -2901, -2044, -1329, -964, -471, 229, 659, 751, 898, 1072, 932, 561, 313, 203, -110, -545, -723, -720, -701, -600, -302, 79, 636, 1363, 2095, 2572, 3154, 3942, 4415, 4397, 4420, 4719, 4531, 3705, 3092, 2826, 1977, 423, -442, -527, -1301, -2778, -3164, -2554, -2944, -4204, -4119, -2859, -2800, -3769, -3244, -1730, -2036, -3608, -3254, -1639, -2101, -3751, -2937, -810, -1305, -3142, -2057, 705, 747, -389, 1828, 5340, 5169, 3451, 5129, 8055, 6903, 4359, 5948, 8500, 5992, 1691, 1790, 3075, -511, -4909, -3644, -1075, -4011, -7992, -6105, -3147, -5820, -8577, -4238, 1049, -627, -3273, 680, 4579, 1042, -2489, 1927, 6393, 2697, -1341, 2104, 4522]
1715D522o014m694M944M645m207l083N832L674o126l874O821N219m718k659O616
1730F898K474q905n606N837K960p515l367P231J848j0216n059P681L855o533k48
1745h665J1233L938r113k981R494L439p716K03J1845K244j1943m623P778l3j0875
1760e775l60J2308J554j2293l045R326m18j0864K284J5242K538j1652j168R970
1774G647k661j3284J962J4849L89j3095n71R483n470j5061L278J6405N78j1384
1788f935L436J2094n916j5065N195J7214n87j1370N067J1383r887j8254L915J4856
1802E146m054j2009P225J2167j1060j7808O480J6356l243q331J2953J5597j0276
1815I143j6373Q029J4906o332r227J3594J3711j4390j9430N376R953j1595j0777
$$ y = [4522, -1492, -6186, -1242, 3403, -804, -3887, 1945, 5619, -507, -4381, 2440, 7659, 2941, 282, 6898, 9372, 467, -5139, 698, 3658, -3857, -7224, 7, 1855, -8361, -13420, -5739, -1884, -8417, -8665, 2568, 6506, -2607, -5588, 3906, 7345, -371, -168, 11677, 13921, 1978, -2645, 5133, 5100, -5775, -6135, 6173, 7727, -4566, -7611, 1715, 1297, -9567, -7283, 7959, 10497, -1155, -2323, 7647, 4986, -8298, -6336, 8513, 8902, -4193, -4764, 4719, -751, -15812, -12534, 3871, 4449, -6935, -3499, 8595, 2679, -12386, -7191, 10023, 9436, -1934, 3133, 14516, 4629, -13625, -9710, 5146, 1092, -10917, -3692, 8475, -2585, -20393, -13913, 2443, -800, -9131, 3822, 19419, 9143, -7230, 799, 15705, 9373, 146, 13740, 27451, 13061, -6369, -993, 8960, -2635, -13412]
1828a3412J4544J3484j4949j7757P544R533j2444q191J9007J5941j3461j4681
1840a4842R848Q052j5118p957K0435J5432j4053j2801J1241N769j7819p159K2643
1853C671J5827j3096q970J4240M408k0247p046K2689J3507j4673p718J4009k14
1866A6387k5357r317K0395R689j6043m880J6365j080k5838p214K2111R799j3338
1879h321J249K0978k86k5304n769K1061O300j4564L096K1293k987k7530o846J7860
1893B30J729j5762N619K3165k698k5693m031J7880j08j4738R623K5687k153k4001
1907e251k188J5892m515j6591J0196K4916l889k3392r20J3576q764j7734J1884
1920f780K5316l829k0374K690J3093j1622j8185J2946K4414m834j8195N058J1129
$$ y = [-13412, 1132, 14616, -333, -18090, -10546, -1013, -13457, -21648, -2641, 13300, -161, -14842, -4994, 3058, -12060, -20017, 418, 15850, 1797, -11004, 237, 6006, -11813, -18972, 3671, 19498, 6402, -2568, 11672, 16080, -4167, -11213, 11476, 24983, 10310, 2592, 16601, 16387, -8970, -18287, 2108, 11797, -4246, -9126, 7239, 6159, -19679, -26893, -4782, 5017, -8321, -7072, 13906, 13620, -11684, -17453, 3608, 9908, -4656, -1560, 19733, 16746, -10784, -17630, 230, 1959, -13803, -8184, 14981, 12283, -13410, -17441, 439, 331, -14407, -4784, 20903, 18750, -5251, -7439, 8453, 3938, -12653, -2457, 22459, 18570, -4822, -5742, 7834, -930, -18664, -6780, 18536, 14707, -5667, -2977, 10116, -1506, -19691, -6745, 17669, 12835, -5360, -302, 10827]
1933A0827j5619j9638J2784K2357n973j5169Q835J1248j6906j8563J4159K1629
1945I971n574j0871J2978J1546j7937j8027J3526J8259p736r313J4524R910j9995
1958A261j8498J1890J4298r720p353J6542R775j9622j6536J1890J1693j0592m848
1971i820J8799R843j8979j4717J1339Q280j2518l687J9595R124j8210j2493J1088
1984b356N309j3880k022K0758R059j6461r218J1566K781j5016j056K0693P922
1997A8079j5372o690J1174m47j6850j027J9408N932j4479m174J1124k729j7680
2010a3731n81J8281M623j2715r86J1707l792j7218L73J7107L306j0953J824J2167
2024I412m595j6676P33J5193J506r894L689J1934n380j5850J058J3122k63q777
$$ y = [10827, -4792, -24430, -11646, 10711, 4738, -10431, -1596, 9652, -7254, -25817, -11658, 9971, 4397, -6474, 6504, 18050, 113, -17914, -4388, 13871, 6135, -3178, 11346, 21256, 1261, -17237, -5347, 8951, -769, -8122, 8420, 18195, -1427, -17963, -6073, 5620, -4972, -9820, 8979, 18822, -157, -14874, -3535, 4745, -7773, -11460, 8135, 17259, -951, -13444, -2356, 2953, -10927, -12949, 7809, 16868, 407, -8811, 2755, 5536, -9480, -10536, 10157, 18079, 2707, -3983, 7191, 6744, -10106, -11133, 8275, 14207, -272, -4446, 6678, 3949, -13731, -14312, 3969, 8592, -4123, -5109, 6598, 2806, -14412, -14039, 3068, 6374, -4579, -2755, 9412, 4817, -11859, -11126, 4067, 5573, -4321, -632, 11302, 5922, -9928, -8870, 4252, 3989, -4788]
2038d788N497J2063n366j4301J801J1448j725p891O661J1511n682j3242J707Q722
2052F415m256q143O513R997o463j2217J919O763n653p391P415R826n395r303L745
2067f228O323n662n820Q367R432m767p190M548N069o554n473P797P949m711n590
2082b510N031M083o635m510P658O885m316l945N298L010p147m669N975M445n342
2097C311m092M079J024p815m745M768L095m744k289N139J957n715k378N789L629
2112A013l119l76N673J816n165k235M158J417m297j271L918J10n565k263L233
2127b953P30l384J54M749J375l086M7M309J476k006J154M394P94l139n27K373
2143F460n85l363m01K254p71l402q34J650p65k509L98K529k9k041K13J780o23
$$ y = [-4788, 709, 12772, 7406, -6895, -5094, 6354, 4629, -3262, 3399, 14910, 9228, -4014, -2307, 6415, 2159, -5984, 529, 10526, 4063, -8154, -6235, 528, -5125, -12516, -5101, 4725, -670, -9973, -6228, 95, -5567, -11387, -3020, 6412, 1645, -5545, -997, 4072, -2482, -7955, -158, 7791, 3080, -2510, 2521, 6604, -31, -4541, 3117, 10002, 5686, 1741, 7039, 10049, 2902, -1767, 4208, 8653, 3311, -781, 3298, 4322, -3493, -8238, -3470, -375, -5119, -7408, -2269, -312, -6027, -8405, -2616, 1013, -2106, -2482, 3191, 5007, -158, -2393, 1765, 3182, -1115, -2386, 1532, 1642, -3923, -6186, -2953, -2223, -5607, -5453, -704, 671, -2415, -2368, 1941, 3417, 1411, 2565, 6959, 7753, 4614, 4087, 6460, 5875, 2512, 2111, 4365, 3594, 192, -642, 1008, 243, -2266, -1868, 661, 632, -1409, -1196, 584, -39]
2160c9k142O3J385q42k303n13N71j151j879J47J404O5n39J214K138R33M70J943
2178I25K598J217M87J252J330m8p98j93j78j280j744j203r72j627j717q41l16
2195c108n33m62K39O79N06M89Q61R67P04L84L49K26j01m73n12m97n77p51o63l62
2215b635j42l4J04N16Q50Q39Q12J024J095Q29N57M35L11j24n52o43p27j068j351
2234I6j135r20r45q77m60o4M6K63O76Q84Q65Q99J030R24O10M79L44J2k96m11n66
2255A454p69q14n84n05n81l30J67K61J31M95J008Q72M80O73J014L91k89l5K45
2274C284m95j213o99j68r95j579o51J93m24q18M26J304L35k99J005J736L48m28
2292H62R79J497m38j549j43M39j562k290j96O11j409k070L33J199r00j104J880
$$ y = [-39, -2181, -2118, -733, -1575, -3878, -4391, -3820, -4971, -6850, -6703, -5299, -5234, -5773, -4559, -2421, -1488, -1018, 925, 3523, 4740, 5227, 6479, 7809, 7761, 6963, 6770, 6592, 5312, 3568, 2365, 1393, -234, -1951, -2792, -3108, -3641, -4103, -3864, -3185, -2679, -2190, -1329, -362, 342, 726, 1075, 1301, 1200, 727, 215, -282, -859, -1610, -2273, -2635, -2777, -2811, -2707, -2191, -1341, -502, 310, 1334, 2429, 3258, 3815, 4250, 4561, 4437, 3885, 3242, 2515, 1447, 96, -1039, -1959, -2904, -3781, -4241, -4305, -4259, -3996, -3320, -2436, -1571, -672, 358, 1282, 1892, 2371, 2715, 2727, 2431, 2020, 1454, 685, -129, -713, -1218, -1799, -2129, -1962, -1701, -1570, -1075, -67, 805, 1285, 1958, 2972, 3363, 3074, 3039, 3284, 2789, 1576, 877, 709, -286, -1865, -2516, -2323, -2747, -3565, -3139, -1835, -1500, -1799, -794, 942, 1290, 862, 1841, 3338, 2900, 1351, 1208, 1647, 85, -2205, -2401, -1790, -3199, -5269, -4936, -3737, -4637, -5741, -3861]
2309c861K803K31l95K345K701m38r45K165K526r72j739J290J143k689k864J081
2325B382J452k345k367J569J315l015k655K022K156k140j669K685J695l567k846
2340e328K291J747l015j796L303J678l974k552L290K268k602l71N363K983l377
2355i2j414M496K296l261k75N697K124m984k521L368K39n522j335N317J195n787
2371d59k339L940j62n829k69O888K011n190r55N050m56o507n9P157J381n784p03
2388b285M934j847p855j68P308Q83n698O68N989k001p949Q39Q157R65n120K442
2404g38P018k580q487J094P846k80n474L375P338l707r326J118P225j690n599
2419b867M674P906m388r514J567O591l248n819N864Q315n046r583K003N727m868
$$ y = [-3861, -1058, -827, -1222, 1123, 3824, 3386, 2441, 4606, 7132, 6160, 4421, 5711, 6854, 4165, 1301, 2382, 3834, 1489, -878, 691, 2006, -1009, -3664, -1642, 514, -1626, -3295, -610, 1085, -2482, -5328, -3037, -1290, -4305, -6101, -2798, -1120, -5094, -7646, -4356, -2088, -4690, -5061, 302, 3285, -92, -1506, 2990, 5286, 2025, 1750, 7447, 9571, 4587, 2066, 5434, 5673, 151, -1184, 4133, 5328, -459, -2798, 1142, 980, -4849, -5118, 1770, 3781, -1409, -2364, 2686, 2230, -4277, -4336, 2821, 4202, -1582, -2285, 2649, 802, -7053, -7221, 87, 970, -4728, -4060, 1929, -72, -8021, -7182, 975, 1940, -3180, -738, 6280, 3700, -4787, -3693, 4153, 3873, -1601, 1774, 9112, 5405, -3921, -2803, 4422, 2732, -2867, 1807, 9713, 5325, -4189, -2622, 3969, 721, -5098, 766, 9081, 4035, -5548, -3545, 2182, -2686]
2434b686n934P021Q757n187q821L036N247o033n718Q372R405n018p702M243M816
2449C798p330n763R146R388n164o699N198L849r044o218R282Q727n673n749O144
2464C892K971j0608o594R366P967n886m182P691K542j1532o391R563P054o175
2478c22k483R244K084j2505o384R127N382o977j120J0479J620j3045n873Q978
2492a795L875p321P34J2225J889j2638m701Q843K281p947J912J2985J370j2763
2506a051m263P810l25r381K306J3210Q74j2283l033P569j804r774L494J4014J252
2521H615j0849j152P543l451j0566L739J3592M69j0268o5O898n450j1579L829
2535h695J3152J86q586K426P665n959j1062M838J3110m3o954M551P720p383j1847
$$ y = [-2686, -8620, -1599, 7158, 1971, -6850, -3814, 1433, -4600, -10318, -1946, 7459, 2441, -5261, -1018, 3798, -3532, -9295, -149, 9239, 4075, -2624, 2574, 6423, -2621, -8839, 443, 9170, 3497, -2252, 3892, 6863, -3745, -10339, -973, 6994, 1108, -3074, 4617, 7159, -4373, -10764, -1201, 5853, -322, -2805, 6439, 8523, -3982, -10366, -1239, 4143, -2834, -3954, 6525, 8145, -4900, -10773, -1795, 2080, -5241, -4507, 7718, 9607, -3031, -7732, 1111, 3392, -4555, -2643, 10342, 11712, -1051, -5314, 2496, 2171, -7210, -4904, 8306, 9180, -3103, -6136, 1433, -371, -10145, -6651, 7363, 8615, -2234, -3386, 4157, 706, -9860, -6121, 7471, 7940, -2328, -2393, 4505, -945, -12524, -8695, 4457, 4643, -3943, -1517, 6148, 189, -10873, -6035, 7075, 7032, 78, 4629, 12349, 4966, -6881]
2550f881M102J0865k190o997N265O775r027j2355L764R206l388n732P391P507
2564H305q683j0976M565Q291m104m470Q931P582q788j0260M448O339n614l981
2578h415R844P665q238q675N202N487o062k755J1110Q047p435p149N279L484p880
2593d91l445J0143O339q293p001M450J179r634l694R926N988p061m408O066J383
2608A447q968k124J0802O112n883k304O729K36r960k734R121L830o657j872O241
2623D016j260j0549k588Q486L030n693M60P692o03r229j166Q439K394n050J755
2638A34P792j231r287j342O789L95n481K152P553j571q532o61O199l56m896L095
2654G52P719j459p683l56M819k083n612K557O403k442p581m06L646k998n297L259
$$ y = [-6881, -2779, 8086, 5896, -1101, 4164, 10939, 1912, -10443, -6679, 2527, -861, -6593, 798, 8305, -378, -11354, -6789, 1502, -2602, -7072, 1859, 9441, 653, -9607, -5159, 1180, -4434, -8415, 1429, 9094, 856, -7819, -2617, 2870, -3192, -5947, 5163, 13210, 5775, -1374, 3905, 7389, -491, -3936, 6207, 12546, 4253, -2748, 1702, 2881, -6753, -10447, -521, 5467, -1594, -6002, 64, 1447, -7521, -9645, 1157, 7269, 1386, -918, 5811, 6047, -3913, -6647, 2474, 6304, -353, -2225, 4016, 2756, -7793, -10381, -1895, 1135, -4558, -4098, 3594, 2991, -6238, -7404, 1035, 3429, -1621, 134, 7926, 6695, -2592, -3934, 2855, 3250, -2231, -79, 7474, 5903, -2629, -3290, 2909, 2553, -2343, 752, 8471, 7012, -671, -1027, 3792, 1709, -3903, -1346, 5057, 2615, -4966, -5372, -1726, -4724, -10021, -6762]
2670f762O756j304n179J764M556k093l697M514O981q23l988K181L559l398m534
2685a467L130M899k329m319J661K266m317m425L015M314j987k875K880K688l640
2700e06l389L242L759k028k285K816J856m089l489K410K462k514j829K940J844
2715A200l425k404K862K514j726o47L593K000k759j850K423J505k304j048K623
2730B557Q93l253k111J573N63k422p71K594J053k277r48K108R23j665J4K718J055
2747B604j888p38J585J29k073n03J777K32j990p13J211q8j657K0J878N80j109
2764g43J59J555K10j151K14J566J90j144j30Q13m63j428k58Q11k20j063k2P75
2782c29j54q04K80J095K62l56L93Q66K2n57J05N28k07o98j91J12n03q58l16J30
$$ y = [-6762, -6, -1310, -6489, -4725, -169, -2262, -5959, -1445, 5536, 4713, 725, 2906, 6465, 3067, -1467, 1663, 6562, 4233, -86, 1575, 3841, -476, -4901, -1886, 2428, 441, -2434, 446, 3134, -506, -3895, -653, 3106, 1078, -1207, 1609, 3465, -624, -4113, -1703, 759, -1755, -3584, -644, 1200, -2225, -4629, -1767, 747, -979, -1626, 1967, 3967, 1208, -642, 1781, 3286, 982, -66, 2557, 3450, 197, -1914, -341, 222, -2200, -2971, -377, 676, -1601, -2549, -441, 482, -1183, -1169, 1549, 2604, 716, -22, 1563, 1692, -381, -884, 893, 1125, -865, -1578, -367, -455, -2112, -2092, -214, 366, -743, -584, 971, 1181, 30, 244, 1810, 2000, 856, 726, 1539, 1076, -352, -610, 201, -19, -1082, -1104, -329, -483, -1287, -1007, 88, 350, -6, 387, 1253, 1275, 718, 823, 1351, 1144, 446, 255, 367, -136, -994, -1310, -1180]
2802a180k99n20J8K95J6j48K53N49L27J09L89N58K66M5K08L39J75n8K2J24J9j55
2824A352j13O2J1j39j25Mk8j62j93o8p6k22l03j94j31l07l65j90q6k32k73l8L7
2847a779m0n0J53L11J35J07L02L85J81J68L08K96J31N3J71J34k5j2P7Rj18m0O3
2870I20n7j32k3J03m9j01P0Q0j30r5Q3M6k05j41J16n6l64k55N3j11m74k20J62
2893g80j48n12k07K48q4m63O5N93R8l40K11P48J51k86M59J001J75l89L82P94j57
2914A559p32L11Q26k79r00J75N94o84j170K52Q56m71r71M61Q87p55j180O11J190
2933E80n22r60Q39J049r86j420O93J169q48j033J088J190j242j463R87J325r77
2950e31r06J675J487j379j522J252J244j449j035J892J378j887j719J319R18j983
$$ y = [-1180, -1479, -1999, -1981, -1686, -1670, -1818, -1565, -1016, -689, -580, -191, 367, 633, 678, 886, 1225, 1400, 1342, 1364, 1488, 1507, 1352, 1239, 1301, 1312, 1173, 1048, 1052, 1024, 862, 669, 601, 525, 303, 0, -194, -325, -632, -997, -1187, -1273, -1505, -1778, -1816, -1779, -1819, -1869, -1716, -1405, -1270, -1163, -861, -476, -295, -127, 181, 477, 608, 661, 832, 966, 941, 929, 1006, 1015, 897, 857, 920, 863, 731, 708, 811, 762, 661, 731, 811, 681, 586, 669, 715, 510, 369, 485, 429, 65, -190, -137, -248, -722, -942, -780, -928, -1440, -1647, -1399, -1483, -1946, -1881, -1288, -1190, -1530, -1319, -571, -420, -706, -247, 754, 929, 540, 922, 1716, 1559, 827, 1138, 1964, 1685, 785, 960, 1554, 870, -300, -48, 808, 337, -634, -173, 714, -41, -1221, -610, 580, 58, -902, -63, 986, 0, -1420, -727, 442, -406, -1439, -351, 839, -403, -1866, -879, 446, -531, -1437, 238, 1725, 346, -1176, 76, 1320, -129, -1164, 728, 2106, 219, -1500, -181, 737, -1246]
2966a246j032K378J616j942j396J901J020k182p49K998J783k126j186K071M86
2981B394k997j097L008J282k699j247K211K0l571r81L364J402k563m23L031J49
2997A283l714n61L823J323k652J3L383l46m406q18L633O66l033M23L779o30m715
3014b549n09L863M36k980J346M485o86m867l25L700m30l451J619M551j356n355
3030b508l39L252j408l749K264N151j272m939O26L565j733l477L347N761j194
3045C347m491J298L309k846l998L486N501j849m491J606K784m014m419L700N399
3060D322k047l915K463K687m755m602L938N207k418l389L194K450n543m863M005
3075c266M831k577k517M418K788n661m474M554M714k609j517N580K847o046m551
$$ y = [-1246, -2278, 100, 1716, -226, -1622, 279, 1299, -883, -1632, 1366, 3149, 1023, -163, 1908, 2394, -603, -1700, 1308, 2590, -109, -1356, 855, 875, -2696, -3677, -313, 1089, -1474, -1897, 1134, 1283, -2431, -2992, 831, 2154, -498, -485, 2898, 2552, -1854, -2672, 961, 1627, -1406, -983, 2796, 2166, -2549, -3058, 805, 1241, -1739, -393, 4092, 3406, -1461, -1786, 1914, 1484, -1967, -348, 4203, 2847, -2508, -2847, 405, -1003, -4752, -2488, 2663, 1391, -3548, -2922, 643, -1090, -4567, -1220, 4541, 3347, -1144, 154, 3463, 617, -3381, 105, 5606, 3757, -734, 872, 3656, -358, -4777, -1077, 4322, 2275, -1640, 823, 3510, -1245, -5847, -1909, 3298, 880, -2509, 685, 3135, -2408, -7271, -3266, 1565, -1012, -3529, 889, 3677, -1984, -6458, -1904, 2810, 201, -1316, 4264, 7111, 1065, -3486]
3090c486M195L479l684j523N771K186o919m796L731K233m545r39O664K400o582
3105a815l792M293J734m636J34P664K637o229k900M385N34n546K71P789K092o293
3121C22k355M170p62o431M70P857J843n883j284M374j630o931P34P853J539n348
3137a462j75M619k367p312R30P699J243m664J221N122k733p337J170P362O93m178
3153a69K231N255l427p756Q23O241n85m324K781N086m083p891Q08N386j432l837
3169d893M000N658l807p026J556N033j951l164N089N996l700o323J868M059l099
3184g04l205N433N664l905n802K033L007m155l178N645N454l772m874K492K260
3199B393m902l109N782N076l579l926K955J658n495l057N702M696l357k882L608
$$ y = [-3486, 709, 4188, 504, -1019, 4752, 6938, 19, -4777, -1046, 1187, -3358, -4297, 2367, 4767, -1815, -5607, -1314, 420, -4216, -4082, 3582, 6219, -10, -2910, 1475, 2009, -3537, -3266, 4523, 6615, 322, -2033, 2137, 1375, -5056, -4586, 3271, 5114, -769, -2053, 2321, 691, -6240, -5506, 2347, 3886, -1462, -1637, 2982, 615, -6697, -5767, 1932, 3175, -1489, -268, 4854, 2121, -5216, -4046, 3316, 4009, -169, 2062, 7317, 3890, -3866, -3043, 3198, 2613, -1711, 1070, 6156, 2073, -5818, -5010, 376, -1056, -4893, -893, 4765, 958, -6068, -4512, 521, -1430, -4594, 495, 6491, 2791, -3532, -1664, 2395, -704, -3909, 1524, 7188, 3283, -2519, -486, 2521, -1634, -4812, 833, 6287, 2515, -2359, 133, 2393, -2509, -5618, 164, 5240, 1661, -2265, 690, 2348, -3147, -6204, -502, 4194, 837, -2045, 1563]
3214A563J303n781k852N566M166l250j881M070Q89o031k792N089L266l360j155
3229a190M388N06o145k579M670K423l355l10M831L85n889k117M331J600l358M39
3245a370N062K08n611j689L865O40l478R28N110J5n182j198L446j45l481J307
3261a573N065n6m640o59L116q66l528J529M806k18m107j59K755j433l514J595
3277a887M481l18l500L99K553j752l402J679M105m24k921Q99K350j994l286J603
3293a415L591o68k463J251K115k192l125J508L013r03k016J569J954k235k784
3308b800J467K539j055j567J903J816k153k397J493J993j216j193K030J601k094
3323C67k059J362J468j396r92J983J344j971j710J281J027j488p60J958J201j723
$$ y = [1563, 2866, -2915, -5767, -201, 3965, 715, -1166, 2904, 3793, -2238, -5030, 59, 3325, -35, -1190, 3198, 3704, -2441, -5020, -350, 2073, -1282, -1592, 3239, 3624, -2265, -4382, -51, 1549, -1809, -1370, 3692, 3900, -1711, -3400, 465, 1105, -2373, -1445, 3665, 3680, -1502, -2700, 746, 601, -2880, -1573, 3492, 3436, -1204, -1863, 1253, 387, -3141, -1612, 3194, 2976, -1131, -1290, 1465, 32, -3482, -1887, 2594, 2276, -1224, -825, 1728, -24, -3426, -1747, 2358, 1934, -987, -88, 2262, 268, -3018, -1415, 2176, 1508, -955, 296, 2411, 219, -2906, -1398, 1615, 712, -1304, 265, 2219, -16, -2800, -1333, 1206, 151, -1416, 487, 2303, 150, -2247, -754, 1239, 23, -1170, 860, 2461, 367, -1692, -330, 1138, -258, -1250, 733, 2077, 106, -1604, -323, 704, -784, -1544, 414, 1615, -108]
3339a08j270J279P80j439n31J918J001j463r06J214M99j428m44J675P49j365p14
3356e53J062K03j430m06J394N22j199m86R62R3j248k57J283M49r13j70J015J10
3374D31j028o0J145L74p22rQ50or15p7Q24Q9p30n5N77j69q94j46N49o2o40j1N00
3397a85j52o27RN51L8l52J85N58K9l38J52N14Q4j77J63M00Qk98kK77q0k88l3J60
3421E96j90m01j39M4j48l03j16O1q3k24n4J28O3m1J03K40J64M7J15K74K23P9P7
3444E15K14J30n1k0M1K3j09j67m9p7j97j86q9o7j44j60l6M3j09r3K7R8k7m2R1
3469d41J04nj7J33J14kJ6J51J10j9M6J28J07l2M9J05J1q6j0L7q0j46o1j7j49j87
3495a41q2mj54j50P4K8j13o6J57J38o9K5K71J63j01qK61O8k20j1K75M0k73n6K76
$$ y = [-108, -1378, -99, 681, -758, -1289, 629, 1630, 167, -739, 475, 974, -454, -898, 777, 1526, 161, -553, 509, 712, -718, -1124, 270, 792, -407, -893, 69, 162, -1086, -1343, -60, 389, -524, -694, 321, 431, -597, -657, 488, 862, 140, 131, 981, 975, 60, -17, 807, 896, 166, 111, 688, 519, -375, -521, 28, -34, -674, -685, -185, -337, -964, -955, -404, -366, -718, -533, 25, 54, -284, -132, 382, 466, 289, 452, 852, 860, 562, 560, 837, 757, 469, 436, 596, 406, 5, -134, -90, -238, -541, -657, -596, -679, -903, -957, -829, -766, -807, -704, -464, -300, -253, -138, 136, 359, 438, 515, 729, 859, 808, 788, 829, 852, 743, 576, 527, 450, 253, 67, -22, -89, -233, -393, -429, -386, -495, -588, -561, -463, -490, -532, -441, -337, -342, -359, -226, -112, -114, -98, 53, 163, 144, 190, 318, 425, 393, 442, 547, 558, 472, 462, 499, 419, 273, 212, 195, 46, -141, -223, -227, -381, -531, -457, -429, -542, -608, -451, -313, -382, -357, -86, 77, -24, -32, 229, 297, 77, 66, 341, 381, 108, 52, 328]
3520C28o3l65K5M20J7l60Q1M05j03m39O7M37q3m59P8L71l16o61N6M57k41n44K45
3543f47N67l13o09L14P15j52l70N90Q11l15o47M47O69m12n84N62O92o74r66L08
3563a4M74p81p58P18P37p80q87O09O55q05o18J124J054p47p35Q80O61j022o16
3582h51J286J015r15p21J013N23j374p18J441R38j104o53J187L36j753q27J464
3599B87P08j375n78J351R9k127q25J596O49j412j53J839K67k023m83K021P68j297
3617f88L61K325K71k209m50J930K93j713K77K295j47k707o36J683k77k091M63
3634a020K549j92k674l34J869m57k108R07K982j36k533L7J953q68k344J138L114
3651A883l28k486L67J888j333k594J358L180m46k317Q06J905j802k770J482L099
$$ y = [328, 265, -100, -75, 345, 362, 2, 83, 488, 385, -54, 13, 450, 367, -92, -14, 357, 41, -620, -564, -107, -348, -892, -647, -80, -393, -1002, -688, 27, -125, -495, 95, 906, 591, -56, 391, 1060, 648, 64, 626, 1318, 644, -322, -14, 460, -321, -1079, -361, 376, -404, -1291, -682, -27, -832, -1450, -326, 728, -19, -754, 126, 787, -235, -851, 435, 1450, 535, -186, 827, 1350, -24, -742, 699, 1637, 533, -120, 1067, 1403, -350, -1177, 287, 995, -380, -958, 393, 492, -1635, -2460, -864, -215, -1627, -1780, 59, 326, -1697, -2180, -159, 609, -688, -327, 1998, 2269, 60, -390, 1540, 1833, 120, 397, 2692, 2545, -162, -798, 885, 608, -1483, -1020, 1529, 1337, -1337, -1671, 198, -259, -2367, -1460, 1522, 1386, -1147, -1110, 843, -25, -2369, -1231, 1883, 1555, -931, -564, 1324, -9, -2603, -1245, 1935, 1489, -828, -22, 1883, 81, -2689, -1207, 1892]
3667A892o87k132J252J869k283k975J616K965q94j857J876J988k554k934J768
3682a090K843j144j532K417K029k871l081J737K345j639j468K757J958l155l084
3697b978J729J936k039j186L305K158l111k765J972J650k335r03L801K267l065
3712D36k446K114J138k878q29M028K169l110k095K210N65l387p26M175K053l028
3728C89j538K415Q4l815o36M270J817k906r30K654l74m203n69M186J491k766k81
3745g12K907p46m427m78M012J124k635M33L246r76m524l54L806O67k484J012L510
3762C381j124m536k79L447N0k498J465L696j308m478j53L070n31k525J930L896
3778C503j301m217J26K755j077k512K313L973j329l903M35K316j738k595K506
$$ y = [1892, 1205, -927, 325, 2194, -89, -3064, -1448, 1517, 623, -1234, 642, 2630, 76, -2858, -1090, 1753, 609, -923, 1494, 3523, 652, -2429, -692, 1653, 14, -1454, 1303, 3261, 106, -2978, -1249, 687, -1352, -2538, 767, 2925, -186, -2951, -979, 671, -1664, -2567, 1234, 3501, 436, -2010, 104, 1242, -1636, -2465, 1563, 3732, 622, -1473, 737, 1302, -2085, -2811, 1364, 3417, 389, -1149, 1266, 1350, -2465, -3101, 1169, 2986, 80, -850, 1804, 1430, -2773, -3342, 844, 2335, -431, -712, 2195, 1449, -2978, -3456, 556, 1680, -955, -522, 2724, 1748, -2776, -3130, 676, 1343, -1141, -129, 3381, 2257, -2279, -2558, 889, 939, -1559, -94, 3602, 2294, -2184, -2337, 733, 202, -2323, -393, 3503, 2202, -2015, -1889, 866, -211, -2723, -410, 3563, 2234, -1669, -1234, 1082, -656, -3251, -745]
3793g45L910j387l449P79K022k230k553K778L846j297k822J343J791k624k517
3808c155K840L550j403k324J636J433l140k611K663L033j580j895K061J216l342
3823a018k510K619K652j643j341K464J123l424k402K429K099j813r81K725J040
3838B019l437k168K371J730j840l79L200J230l112j723K413J382j920p6L302R81
3854C973l127j677J975N14k460j98L057O11l130j423J786K7k450J82L215P38k584
3871i71o68J982j20k354M29L178N70k330l50J775o33k550L61K796K61k100K4J732
3889A032q01k442N35K678K02j729M69J738r29k391M83K253j37j623O08J611j121
3906D36k278N03K026k02j251J036J754r51j893O68J803l84j145J049J422j222
$$ y = [-745, 3165, 1778, -1671, -892, 1130, -1100, -3653, -875, 2971, 1674, -1148, 195, 1986, -638, -3155, -315, 3235, 1832, -492, 1144, 2577, -563, -3174, -511, 2522, 942, -953, 1108, 2324, -1018, -3528, -909, 1743, 100, -1241, 1223, 2346, -1078, -3480, -1051, 1048, -765, -1746, 979, 2019, -1418, -3586, -1215, 515, -1325, -1704, 1496, 2726, -386, -2109, 304, 1686, -234, -310, 2992, 3973, 846, -831, 1144, 1658, -802, -1000, 2057, 2668, -462, -1885, -99, -72, -2522, -2340, 875, 1613, -971, -1639, 343, 223, -2131, -1702, 1476, 2046, -284, -634, 1141, 508, -2042, -1681, 1115, 1376, -724, -700, 1032, 231, -2211, -1676, 1002, 1204, -525, -56, 1682, 753, -1638, -1155, 1098, 961, -662, -54, 1557, 436, -1842, -1339, 687, 485, -766, 270, 2024, 1073, -820, -152, 1651, 1267, 122, 1171, 2593, 1371]
3922A371k040K94J136r64j350Q62J163j275j749M97J060p67p55J354J519p46j017
3939a407R44J127o18n73J371J218q26j034O65N76j035p82J027Q30r15q66O49M53
3957H04r63n64J076Q06p36n90O62L21j025n94P98M73q29n69N42J28r64m46Q10
3976h60N44n24j47Q41L96o01j04R01N44m30o7O23J17p54l90M63O4o65k74L83m5
3997A5o99k53M99J71l23M0O24K07l42J0M93J44l08k1L54p4n16j99J76j03l98q4
4019e87K39K1k84K2L31J49p5J64M27J38j01J4K42Mk29r8Q7j32l09j97j0j24k02
4042e10o0J11N6m4M2K41J50L4J14K21J46o0m6P3k3j84j41o0r7j95j84m7k4r5o6
4067f48Q5J15QL8J84J57M7N6J28J26l7l7N0N3p9q4O0L4o2n5J28Q0j1M2J06J13
$$ y = [1371, -669, -375, 761, -203, -1553, -691, 472, -803, -2552, -2055, -995, -1762, -2517, -1163, 356, -390, -1407, -463, 664, 46, -527, 844, 2062, 1236, 202, 867, 1443, 408, -374, 653, 1483, 568, -298, 351, 804, -159, -723, 353, 1159, 423, -167, 495, 816, -209, -803, -5, 468, -361, -930, -388, -260, -1224, -1670, -860, -316, -840, -987, -146, 250, -351, -455, 446, 990, 560, 493, 1116, 1233, 479, 89, 552, 616, -49, -323, 60, 15, -684, -937, -438, -267, -590, -550, 74, 281, -61, -51, 442, 586, 278, 257, 611, 537, 21, -178, -2, -105, -503, -587, -348, -327, -611, -589, -258, -109, -184, -20, 407, 545, 444, 458, 700, 704, 475, 377, 464, 332, 23, -174, -184, -308, -510, -570, -459, -403, -447, -405, -164, -14, 20, 134, 355, 501, 441, 395, 468, 445, 261, 120, 60, -37, -232, -416, -463, -487, -582, -648, -563, -448, -440, -402, -218, -61, -14, 42, 170, 296, 259, 222, 272, 325, 246, 162, 222, 256, 194, 139, 267, 347, 336, 378, 484, 597]
4093E97j9k1O1J2j21j18n2j27k35k13j29j77k46j43k0j05j11K3J27O7K9J98K63
4116d60J37Q1K34K26P3K3J90J42m3o6R5M2j71j04J32J7j53r5J42Rk09o1K03M7
4140D31k15m0K06l1l38q9K11m8l50l5K51j22m27n0K62p5l17Q1L84q9l99R0M08
4163c01p9l30K63N44j01m09J99M62j79l52L55O09j76m36K63M31k96m55M06O05
4183A023k88n12K71M25n31n72M47N79m34n53L57L50p03o95N26N72n47n57N58L88
4203A04q31o61O98O37n36l58Q57N15q78n81Q69P02o19k69J043M71j089o65Q38
4222B47M52q89k87J150L62j252o53R09L51r95p2J441M45j221m65J053K10j146
4240c60nJ521L33j418n08R77j34j512m1J620K34j475k78J142j91j515K25J915
$$ y = [597, 578, 557, 618, 630, 509, 391, 339, 212, -23, -236, -365, -542, -788, -931, -951, -1056, -1167, -1144, -1017, -950, -921, -723, -460, -323, -242, -8, 218, 291, 314, 504, 646, 603, 537, 632, 674, 503, 399, 531, 548, 395, 300, 442, 451, 242, 181, 384, 431, 216, 176, 382, 351, 13, -76, 135, 87, -263, -298, -47, -169, -596, -646, -384, -459, -776, -695, -311, -400, -799, -709, -301, -380, -710, -447, 97, -4, -413, -214, 248, 69, -283, 72, 681, 505, 69, 332, 763, 467, 12, 418, 1023, 735, 223, 494, 919, 388, -184, 263, 842, 408, -145, 212, 562, -141, -836, -310, 262, -285, -842, -284, 104, -727, -1388, -690, -53, -589, -947, -90, 425, -453, -1034, -165, 537, -82, -351, 692, 1163, 74, -591, 247, 699, -190, -477, 673, 1035, -217, -870, 39, 390, -605, -677, 764, 1209, -12, -477, 576, 786, -360, -365, 1156, 1489, 71, -437, 540, 406, -1106, -1147, 473, 707, -768, -1046, 96, -95, -1610, -1385, 530]
4258E30L53j288O0J362l98j705K31J875J43j420J49J285p34j995K33J884j1j316
4276g62N82J542p90j975M83J944j37j194Q79J578j075k201L29J586n90j384J025
4293a60J541j288k225N04J528p05j107J596J935j134j903Q48J508r35j032J806
4309G77J890j356j973P59J093j527j234J910J821j404j770J025R80j696j080K204
4325D19J960j356j479J202O80k162j326K067J641j624j428J234M09k508j270K219
4341a322J701j347p00J930O60k329q99K549J717j277l15K129L45k770j164K104
4357A012R61j709l58K088ml016j153J998O80j656K20K581J62k761p97K019L98
4374F65j748M88K619k9k838q10J706j49k005O25K761J3k595l93J814l42j884J019
$$ y = [530, 883, -405, -345, 1017, 619, -1086, -855, 1020, 1163, -257, -108, 1177, 443, -1552, -1319, 565, 554, -762, -180, 1362, 572, -1403, -920, 1024, 887, -307, 572, 2150, 1075, -1126, -797, 789, 199, -1185, -160, 1381, 93, -2132, -1628, -100, -805, -1912, -316, 1619, 485, -1418, -570, 938, 3, -1029, 777, 2667, 1311, -662, 97, 1190, -337, -1571, 339, 2160, 756, -1014, 11, 991, -705, -1785, 419, 2379, 1023, -456, 746, 1426, -736, -2062, 5, 1646, 22, -1406, -172, 237, -2271, -3541, -1322, 379, -968, -1668, 262, 922, -1407, -2306, 243, 1960, 683, 368, 2497, 2842, 72, -1092, 1012, 1973, 264, -94, 1994, 1990, -1026, -2179, -181, 499, -1157, -937, 1644, 1806, -955, -1752, 267, 665, -1083, -595, 2024, 1995, -843, -1653, 53, -96, -2101, -1476, 1285, 1298, -1297, -1690, 124, -218, -2102, -1083]
4392a083L036Q0k376j12J645q48k250R09K762k12k370M2J485j230k295J106K877
4409A166m8j787P50J776j218k146J321K776k48j635Q83J404j817k580Q65K057
4425A519q37j720R78J236k026k437J008J995p25j084J697J611j728k022J260J875
4441F00q49q60J901J468j900k011J102J329j216p64K045J456j809j692J241J124
4457A165j300n79K237J441j780j564J083O58j770p72K002J112j866j440J038L17
4473a8j855n81K182J236j496p89J414M03j769l21K244J103j402n63J338Qk051
4490i17n17J860P00j438l75J356j55j966l09J835O88j153J30J551j20j833k04
4507h67J655L27j173J73J401m12j921l07J316J8j170L48J451l28j656n0J316p
$$ y = [-1083, 1953, 2033, -343, -455, 1190, 342, -1908, -999, 1763, 1551, -819, -777, 708, -522, -2817, -1711, 1166, 1118, -669, 81, 1857, 639, -1507, -186, 2590, 2342, 707, 1590, 2994, 1177, -1403, -538, 1519, 682, -1038, -60, 1176, -850, -3287, -2279, -284, -1009, -2093, -396, 1215, -513, -2535, -1275, 600, -249, -1109, 792, 2260, 360, -1651, -549, 780, -436, -1200, 845, 2301, 492, -1200, 41, 1165, -135, -714, 1523, 2964, 1184, -380, 703, 1361, -409, -1181, 821, 1933, 67, -1373, -335, -18, -1873, -2454, -272, 964, -532, -1321, 93, 496, -1273, -1594, 650, 1753, 351, -212, 1126, 1134, -917, -1434, 426, 1126, -312, -687, 669, 514, -1452, -1761, 74, 762, -391, -261, 1290, 1170, -663, -867, 788, 1115, -58, 115, 1516, 1104, -817, -1124, 192, 210, -960, -612, 839, 511, -1145, -1195, 121, 114]
4525A14r70O21J497k61j469lJ110k90j044N49J307m31j379M0Q83m45r58O61J301
4544H33k99j085K77R14m79q54O96J196l50r58K92O49o84r00N44R20m50q63L28
4563b73N21o78p87O03Q57l61n99N01N34o07o27N71P52l50m66N38M24o10n58N45
4583g0N98l56l41N52M11n45m66M95M77l57k68M99L19n50m58L78K79m33l06M09
4603B67J91n69m27K77J81m09k08L50K04m40k62L02K07l03r2M30K31k87j59L78
4623a38J83k18n9L88J77k18j20K72O3k34o7K97J20k13r6J95J03j84k6K53J29j34
4645D73n1J73N4j84j02J41Kk46j87Rj25k70j89Kn1k19j44N5K7j11NJ72J54J6M4
4670e52K21J83K4L9K12J42k0l1J26Q8o7o8Q1P8o8n5J19J00q0k6Q2P7p7j05L2Q
$$ y = [114, -856, -235, 1262, 1001, -468, -471, 639, 349, -695, -146, 1161, 730, -649, -609, 274, -171, -1129, -468, 833, 534, -551, -274, 640, 161, -693, 3, 1199, 849, -109, 183, 832, 148, -752, -208, 712, 262, -601, -273, 248, -430, -1217, -614, 243, -118, -717, -216, 318, -289, -916, -345, 407, 57, -409, 129, 553, -57, -615, -70, 528, 172, -169, 383, 794, 249, -217, 278, 755, 398, 130, 629, 948, 398, -60, 318, 597, 164, -142, 267, 458, -111, -538, -261, -80, -489, -697, -347, -143, -583, -845, -543, -336, -639, -731, -301, -70, -357, -516, -138, 45, -173, -232, 156, 333, 115, -5, 267, 330, 96, 29, 326, 446, 233, 137, 332, 435, 251, 225, 478, 607, 473, 422, 595, 649, 465, 363, 504, 506, 260, 73, 82, -43, -313, -502, -500, -551, -770, -914, -859, -832, -943, -938, -766, -612, -596, -552, -331, -148, -124, -85, 127, 269, 249, 218, 344, 432, 365, 297, 378, 456, 388, 333, 452, 552, 472, 446, 528, 605, 528, 423, 455, 463]
4696D63j82j62m0o0k31j87j9m9j46r5P8O3j4L5J80J65L8R3K07J25j0RO8Mj75r9
4722E9Qr9k00j00%p9j21L2J67M8J8J64K32R5K2K02K26Jp2Q3M8j57k43j5j3k49
4748E7k23L4oj98j53J24J59q3l1K80J60j36n6K84k0k44j78L78j20l25q1Q7J2l65
4772f44PL19J45k32P3M18J46j69J50N26J31k87QL08j44n10o5K99j74n57r6K40
4794a08k41n77Q2N09j3l62K46N50j30m56K63O34p5m32K66M88l95p13J63N09k62
4815e4n15L94O05l72o25M15P11k15l34O56P23m42p08L61M87n61o58N34M72q35
4835C9r49K50L25p89n68P53P17o28n77O92N65o03l04J149Q88n89m95P61L91r63
4855F5n17J038O41q75n57P47J99j206m85J177O98q27l02J020K10j324m50J238
$$ y = [463, 281, 119, 79, 19, -212, -399, -418, -467, -613, -708, -630, -567, -581, -546, -366, -201, -163, -70, 137, 262, 252, 261, 329, 333, 158, 59, 67, -32, -232, -332, -332, -411, -532, -500, -333, -285, -267, -103, 129, 224, 246, 448, 674, 675, 603, 686, 734, 577, 334, 319, 306, 57, -166, -132, -138, -336, -489, -365, -206, -289, -320, -40, 120, -16, -72, 212, 192, -52, -230, 148, 28, -297, -378, -291, -279, -644, -637, -318, -173, -405, -332, 86, 232, 63, 213, 739, 870, 583, 591, 899, 755, 245, 180, 479, 305, -252, -348, -108, -349, -926, -844, -335, -348, -710, -464, 86, -44, -500, -237, 397, 322, -110, 156, 644, 249, -464, -301, 208, -54, -569, -175, 430, 58, -567, -152, 559, 344, 10, 666, 1389, 947, 239, 600, 1087, 526, -132, 402, 874, 39, -910, -660, -335, -1124, -1692, -939, -222, -850, -1427, -735, -170, -773, -1077, 72, 960, 371, -124, 637, 1028, 65, -452, 586, 1227, 352, -205, 542, 741, -465, -950, 227, 925, 98, -204, 816, 1026, -298, -748, 490]
4873D90N46r58k73J047k0j626n50J187M00j071l8J355M4j571l42J383M16r92K78
4892b95J604l8j681l64J240jj275K51J566k54j866l13J165j99j271O21J888n5
4910G23j587R8J407k93j214Q94K055j61j558J51J132p99j600P87J820m65j663
4927b73K04R83j140j674Q95J885m35j427O35J088j270j673J043J893n22j248R17
4944a19J076j493j755J083J803n97r98J300J216j602j696J230J706p21q03J588
4960A218J200j773j775J116J324j118q30J732J072j950j791J102J024j303o45
4975a397K053J191j892j483J227Q22j470m25K249J150j862j309J224M56j781l88
4991a635K305J061j817j049J298J80j932k63K451J048j669o61J464k0k121j98
$$ y = [490, 1036, 78, -195, 852, 832, -794, -1344, -157, 243, -828, -866, 489, 533, -1038, -1380, 3, 419, -573, -295, 1309, 1271, -410, -774, 466, 465, -810, -559, 1007, 753, -1113, -1426, -261, -460, -1731, -1110, 778, 723, -864, -766, 641, 348, -866, 28, 2083, 1922, 364, 515, 1647, 848, -752, 35, 1855, 1390, -273, -69, 914, -226, -1900, -1005, 880, 445, -982, -347, 741, -529, -2202, -1159, 734, 212, -1036, -119, 957, -536, -2291, -1208, 595, -2, -1000, 300, 1516, -86, -1782, -552, 1154, 433, -370, 1218, 2418, 645, -1130, -14, 1310, 192, -638, 1094, 2166, 216, -1575, -473, 551, -752, -1397, 656, 1847, -45, -1528, -301, 521, -949, -1374, 875, 2025, 163, -1146, 78, 534, -1247, -1635, 670, 1731, -86, -1135, 163, 343, -1589, -1852, 599, 1647, -22, -683, 781, 761, -1360, -1558]
5007a558K409R15j599m02J515l06k325k65K300O92j571q0J651m82k437j88K172
5024D41N01j508L04J783n51k481j48K043K07j425O14J909o70k434m2J843j02j361
5042a077Q85K001p14k310O4J638l66j314J106K038p10k139J90J409o60j314J247
5059b6J991p80j968L20J153j008j340J292J901q12j691N09J001j232j292J405
5075e77J875p22j388P76R47j381j249J440J724p81j126R25P69j554j287J345J491
5092A227q30r08J093O99j610j235J323J310q43o81J262O41j666j176J253R65r47
5109a23n08J352N00j656j048J137P62r80k72J473N16j514q13J093N67j020j42
5126f76J506M16j478p24R29K57j125o4J412L35j323m92R71J33j029J51J500M48
$$ y = [-1558, 851, 1766, 167, -235, 1280, 974, -1351, -1616, 684, 1376, -195, -275, 1376, 894, -1543, -1731, 441, 942, -566, -262, 1521, 970, -1511, -1659, 384, 591, -834, -220, 1689, 1019, -1415, -1457, 386, 284, -1077, -192, 1809, 1095, -1215, -1151, 487, 121, -1193, -87, 1951, 1241, -898, -708, 701, 41, -1273, -26, 1965, 1185, -783, -463, 690, -318, -1658, -366, 1535, 723, -968, -459, 542, -690, -1982, -577, 1298, 576, -812, -36, 911, -470, -1719, -279, 1445, 664, -462, 463, 1232, -322, -1609, -264, 1227, 397, -511, 582, 1281, -329, -1564, -241, 1069, 226, -455, 807, 1448, -218, -1394, -141, 824, -123, -631, 721, 1221, -435, -1483, -346, 416, -564, -836, 637, 1153, -361, -1174, -81, 486, -534, -676, 830, 1246, -232, -956, -27, 230, -895, -959, 453, 788, -535, -1027, -56, 77, -952, -801, 699, 1147]
5144A147j060k01R95J2j037J27J360K10j102k19P38l08j221j1J094J6j051j11
5162f22P35l32j104J14J107Q9p87J62Q29k86r54J98J022J0o62K66P71l53q82K36
5182d43R03m9n45L68P35l05p80K36P20j51n51L15N65m57q23R0M64l46n61K91M59
5203A35l95o36K05N10k08l21N00N88k04m00K97M53k15k87L77L80l16m92J38J93
5223C02l83l73K36K97l40l59J89K75k66k22L89L75j55k16K86K55k09j91K69K84
5243D43k26k06J64J34k42k10K41K34j99j32J83J54j91j25J73J69j75j51J11M5
5263A94k31k14Q9N7j96j67J01P9j65j12J77J76l5j2K11J77l9j1J65J37m4q5J07
5286C59M8j30j59N5M0j32j43L4O5j12j16J05R5o2m4Q5Q8p0r7N7P6j06r8J3P1j27
$$ y = [1147, 87, -114, 881, 893, -144, -17, 1343, 1553, 451, 232, 970, 662, -559, -570, 524, 540, -511, -622, 113, -219, -1323, -1209, -102, -13, -800, -638, 191, -95, -1049, -851, 171, 181, -481, -215, 556, 203, -679, -443, 460, 411, -134, 234, 969, 664, -116, 120, 840, 689, 138, 453, 1018, 561, -262, -172, 292, -54, -615, -324, 135, -260, -896, -691, -181, -389, -710, -210, 378, 174, -226, 71, 524, 309, 22, 399, 779, 463, -29, 109, 302, -81, -454, -218, 79, -261, -620, -431, -156, -422, -644, -255, 120, -35, -251, 35, 290, 81, -110, 159, 443, 217, 11, 175, 309, 67, -143, 98, 332, 133, 1, 184, 338, 147, 22, 195, 364, 189, 38, 149, 194, -37, -251, -162, -105, -301, -468, -367, -288, -453, -565, -388, -212, -247, -259, -48, 129, 90, 79, 244, 381, 337, 252, 359, 407, 277, 118, 173, 213, 81, -62, -28, 37, -75, -191, -86, 9, -53, -97, -12, 76, 6, -91, -34, 42, -64, -162, -149, -78, -205]
5312b05j03O0P8o5o4J38J12j5J0J73J51qJJ48Q0r1n4P8Nj49j15K1l5k08j07PR
5339a48j70p3J09j1j16J2J57M0p1L7J63L9j21M6J74Mj00P6J34l3j33M5J73m9j13
5364G1R7J60j07j55O9J29j55j55J22J23j87k00Q9R4j94j49J91J72j65j49K34J36
5386G1j83q0L13K23k23r3K70R6l36j28L02R8l25j25K31J5m61j29L54O9l33l2L65
5409d1J8m23o6M68J33l22P9N00Qm89oM97K4m07J27N44j08o03MM59j10n06J77N92
5433E49j82o74M5M86k33n65K89O77k18o68J50N46l62n65M20P90k65o36K90N26
5453D00m43o75N33Q18l33o22L87N15o16p17N99P88m22n88N61M92p78p49O74P91
5473F15m85n23P38M72r14p52P25P23o01l96Q69M66j044p63P57O15p37l32J049
$$ y = [-205, -308, -248, -170, -235, -299, -161, -49, -64, -54, 119, 270, 262, 263, 411, 491, 400, 346, 424, 429, 280, 165, 186, 151, -57, -164, -157, -148, -318, -391, -282, -293, -409, -397, -240, -200, -271, -234, -71, -32, -153, -107, 67, 71, -29, 47, 181, 148, 15, 60, 233, 184, 71, 168, 328, 221, 66, 135, 264, 109, -46, 76, 199, 12, -188, -99, -5, -199, -348, -157, 15, -150, -299, -65, 71, -112, -192, 121, 344, 121, 28, 298, 394, 58, -70, 232, 330, 5, -120, 111, 126, -335, -464, -110, -41, -374, -406, -41, -23, -446, -512, -44, 89, -233, -154, 346, 354, -135, -141, 356, 380, -27, 100, 644, 536, -67, -63, 396, 286, -220, -43, 549, 367, -307, -262, 224, -9, -574, -285, 392, 174, -494, -344, 202, -160, -725, -305, 485, 220, -416, -126, 400, -43, -718, -185, 633, 300, -322, 65, 580, -36, -753, -154, 634, 212, -376, 185, 677, -101, -850, -176, 615, 130, -393, 345, 817, -97, -849, -124, 599, -2, -398, 471, 937, -107, -870, -113, 502, -235, -567, 482]
5492D82M72j167p36P96M90q71k39J247M76j192o75Q97L72j002j11J418N04j251
5510i0n77R90J59j185n0J533M41j290m33R84o2j361J7J607L54j265k66J050k43
5529C13j500R2J710K83j240kJ149m08j650J71J694J94j174K43J219o10j732K39
5547a009J623M9j130N06J316p73j812K80J530j68j079P64J375q52j876L16J413
5564D73l96j052J006J489r58j813M09J272o35j003J257J582r82j731N42J129r05
5581c16r56J475J623j028j587O65R50j191r64J574J591j084j427P66P34j477j026
5598a678J636J506j108j203R24N77j674j000J723J472j099q57J199M98j788r22
5614a794J753J319j023n90J412L65j969r27J665J064j131l81J522K10k101r46
$$ y = [482, 954, -213, -949, -153, 337, -534, -773, 474, 950, -242, -917, -20, 352, -650, -761, 657, 1161, -90, -667, 323, 482, -703, -753, 780, 1221, -69, -502, 482, 420, -941, -924, 683, 1037, -228, -494, 556, 313, -1187, -1095, 615, 898, -342, -344, 805, 397, -1253, -1082, 612, 806, -368, -125, 1094, 484, -1248, -1009, 614, 663, -467, 39, 1355, 582, -1230, -950, 580, 412, -667, 97, 1472, 620, -1256, -940, 473, 77, -975, 31, 1520, 562, -1251, -842, 430, -205, -1208, 49, 1631, 649, -1082, -540, 589, -316, -1272, 203, 1826, 798, -789, -124, 826, -365, -1329, 245, 1836, 752, -675, 91, 825, -652, -1678, -42, 1464, 356, -847, 77, 654, -1020, -2020, -297, 1175, 76, -781, 418, 916, -872, -1794, -41, 1278, 255, -335, 1077, 1442, -527, -1454, 211, 1275, 144, -237, 1285, 1495, -606, -1552]
5630a552J543P47j231j46J682J58k118q33J477N19j243J42J897J63k022o26J466
5647B3L12j284L58K061J93j952m77J385k0j424M53K039L2j911l81J190m14j574
5665a391M65J971l5j765j45J182o08j543O52K006L0j448K49J222p18j517P44J918
5683A269o8j266M48J063r46j645O65J657l15j157N57R54j121j626O35J441m12
5700A33r86Q11R95j171j498O98J299m79p64J027J051j133j340P49J176n77o29
5717f38J238J030j100j221P33R09p89n79J208Q95j186j167O31N90r73o02J221
5734B00P97j127r54O90M71r83l84J309Q34r17o70Q35L75j040l06J305P12r09n26
5753b88P85J29j117l24J162N12q45l85P99L8j086k73J098M50p67j79Q03j8j072
$$ y = [-1552, -9, 738, -493, -639, 1043, 1201, -917, -1750, -273, 246, -997, -855, 1042, 1205, -817, -1443, 23, 335, -949, -591, 1470, 1663, -289, -766, 619, 599, -825, -372, 1667, 1699, -212, -593, 597, 183, -1391, -926, 1045, 1010, -755, -900, 282, -326, -1869, -1217, 789, 819, -629, -380, 842, 124, -1393, -649, 1269, 1201, -65, 383, 1446, 500, -1145, -480, 1177, 862, -295, 262, 1216, 95, -1531, -896, 545, 133, -853, -42, 953, -218, -1716, -1018, 281, -198, -962, 65, 1116, -17, -1357, -608, 568, -9, -638, 600, 1630, 530, -691, 42, 951, 162, -417, 791, 1686, 500, -667, -36, 554, -419, -1021, 200, 997, -130, -1084, -394, 77, -906, -1290, 19, 853, -64, -734, 101, 476, -564, -870, 435, 1147, 238, -288, 497, 626, -491, -815, 347, 859, 14, -371, 428, 466, -620, -893, 205, 655, -112, -291, 512, 494, -578]
5772e78k10R56L04p35o2Q15q7j049j55Q95K11o61J09Q40r3r25o9Q15Q9o13J78
5793b5P72j46q97r1O61o8o22J84P16j66p77j8N87j09n22K74P11j37o54R3N07j56
5815A17m77K55O32j85n73Q8L68k10m68K89N23j63m61J31L67k23l80K65M86j59
5835B22l77J52K89k58l83K18L83j92l33J54K21k37l08K32L50j20k27K16K62j73
5855I1k52K46L32j25k00J68K03k23k63J48J76j62k15J04J18k21k37J09J51j52
5875b04j35J34J40j61j60J29J91q4j07J45J49r5j35J38J59q2q1J44J11r9j16J12
5897I3J01o0r7J13J01j00j05P7J10q8q2M4J05q5r3M0P3q1j05N4O8r6j25O4M9j04
5923a29q2N1O0r4r8Q0N3p2p2R6P0o7p8J23R4o2m8J20J08m2m7J25J10o4k2J43J00
$$ y = [-578, -788, 168, 472, -263, -325, 490, 403, -646, -801, 94, 305, -356, -247, 593, 500, -425, -494, 321, 410, -203, -25, 747, 601, -296, -387, 274, 206, -416, -232, 484, 318, -459, -477, 110, 1, -521, -247, 464, 327, -327, -234, 273, 117, -360, -105, 527, 342, -231, -143, 225, 15, -453, -164, 359, 196, -265, -134, 233, 10, -370, -105, 381, 222, -155, -3, 286, 28, -355, -137, 246, 54, -279, -125, 96, -141, -449, -217, 133, 13, -214, 2, 264, 91, -161, 85, 417, 292, 92, 260, 463, 240, -23, 125, 301, 139, -76, 28, 146, -75, -312, -203, -52, -204, -339, -205, -65, -226, -386, -257, -66, -150, -257, -112, 37, -58, -193, -55, 104, 22, -59, 85, 196, 97, -19, 93, 194, 134, 37, 150, 251, 151, 46, 123, 233, 145, 63, 107, 212, 127, 34, 74, 147, 66, -39, 15, 83, -13, -138, -74, -25, -129, -211, -160, -100, -194, -292, -212, -159, -231, -303, -207, -137, -204, -282, -159, -65, -127, -175, -55, 53, 11, -36, 89, 199, 135, 113, 256, 356]
5950C56q2k4J27M9j02m7P8rj55r4N3n0j95n6M4n6j66o4J03j1j21M0J86J8p8P2
5976a84J82M4r8R0J78l7j40L0J11p7j86O3J20j16j73R3J04r9j57J75J98q4j10
5999g3J75J73j64j56J99J70j62j61J77R3k83j94K15J47k31r2K60J23k94j35K80
6020F7J51k41o9L50O7m07j66K59L8l76q7L65M5m57j24L81O7l49R8N30J31l83L2
6043g8M68J0l92J29N58on08o9L71k21n90N2N49j00n77Q8M38k24n71K35P13o0m80
6066b65K11N31l31o49K42O62k11n48K49M75m88p47L29O74k14m18M93O43m44o52
6086d58M82P23k73m07O15N82o56p95L42M63n63n62O12N00p97q28M17M62o24l79
6106a144Q78P00o87o08O12M81o70l27J036O74p64o17O42L01r22l71J100O48q32
$$ y = [356, 274, 250, 377, 426, 324, 277, 355, 346, 191, 97, 150, 100, -95, -151, -107, -163, -329, -393, -290, -301, -422, -382, -196, -178, -256, -184, -2, 42, -56, 34, 212, 175, 35, 65, 176, 99, -87, -24, 96, -20, -193, -100, 4, -95, -252, -77, 121, 37, -73, 102, 275, 111, -45, 154, 324, 162, 1, 178, 271, -12, -206, 9, 156, -75, -167, 93, 216, -78, -213, 67, 218, -23, -92, 258, 325, -82, -248, 11, 49, -327, -414, -49, -4, -461, -585, -204, -137, -486, -388, 142, 273, -110, -78, 390, 400, 8, 137, 695, 689, 181, 112, 483, 262, -328, -276, 273, 173, -404, -316, 122, -102, -673, -438, 275, 215, -265, -54, 477, 146, -503, -261, 401, 190, -358, -109, 366, -122, -869, -540, 134, -80, -498, -5, 638, 194, -458, 24, 747, 474, 67, 682, 1264, 608, -187, 155, 618, 55, -507, 105, 605, -192, -1020, -603, -141, -765, -1144, -266, 434, -253, -861, -249, 232, -438, -765, 271, 945, 181, -436, 206, 507, -415, -786, 314, 962, 130]
6125A30m61P72K46j018k69J215O24q33l44Q21K7j274l86J124M06r87l39Q81j17
6144B18j416l21J237M22q71O4J180oj346j18J305L78q69K06J227j99j541k72J085
6163C63k7j036K58J261l33j555j58J081o6r30O19J487j77j383P1J123k60r43P45
6182A40J504l51j405O3Q96n97j128P60J459m31j326K23Q47p95j132R08J506m70
6200F71j219M08P55j049j264Q92J414n34j098O04P47j156j169J057J466m71p47
6217f93R99Q67j203j108J152J320n86o45J091O48j471j228Q99R57q56o11J169
6234G01N59j535j178R72Q17q55l51J452O75j436j006J011O29j007k30J526N89
6251A333j488r18R19L58j128j61J619N92j415o76J030J99j202K3J706N77j296
$$ y = [130, -331, 441, 687, -331, -600, 615, 1239, 406, 62, 883, 910, -364, -750, 374, 780, -207, -546, 335, 218, -1198, -1519, -282, 140, -731, -667, 513, 507, -839, -957, 348, 726, -143, 63, 1290, 1091, -450, -722, 363, 336, -700, -442, 819, 486, -1069, -1227, -146, -212, -1142, -523, 964, 787, -596, -525, 598, 338, -605, 140, 1644, 1293, -112, -49, 847, 250, -878, -118, 1341, 910, -416, -193, 654, -141, -1273, -365, 1141, 671, -548, -140, 615, -434, -1698, -806, 608, 74, -1024, -420, 327, -829, -1998, -941, 525, 54, -693, 306, 1173, -30, -1138, 14, 1334, 748, 103, 1194, 1842, 371, -857, 42, 999, 143, -468, 701, 1260, -275, -1453, -481, 336, -519, -870, 582, 1257, -179, -1185, -174, 455, -552, -782, 744, 1333, -155, -1073, -154, 204, -924, -1085, 534, 1126, -289, -965, 65, 264, -938, -915, 791, 1368, 72]
6268G2n01J011m6j410J9J670M21j290l21J020k66j497N3J635L88j170m3J057l50
6287D52j509J09J576K38j089J70J047n28j583J01J400N4r72L36J099n81j516J80
6305a016J299l4q58N72J179o13j409K34J153k27p88O84J137o61j350K23R53m17
6323F1p85P90J104o89j225K74Q27n75p27Q68J100o65j067L69O72o79o82R18J040
6342I29o23r25M85N44q02o39R50R81o21p46N95M43q54n98R59Q63n79n54O43L83
6362H34r13n79Q79P33o17m57O21K31r91n87P85N27o42l67P00J98r33m81P58M81
6382A80n47j51P94K19q45l69O85L75n86q3P34J21q47l48N98J82n84j8P92J33p26
6403b91k04O44J73m82J03Q22J20o19j41N63%n81M3O16J2p05j77L80j23n99K8O00
$$ y = [72, -429, 582, 536, -874, -855, 815, 1236, -54, -375, 645, 379, -1118, -1065, 570, 958, -212, -255, 802, 452, -1057, -948, 628, 866, -223, -53, 994, 466, -1117, -1016, 384, 438, -534, -198, 901, 320, -1196, -1016, 283, 249, -609, -37, 1142, 529, -880, -646, 507, 280, -508, 176, 1313, 652, -698, -475, 478, 61, -724, 66, 1170, 481, -744, -470, 357, -218, -945, -77, 1023, 358, -709, -340, 332, -347, -1029, -111, 929, 306, -619, -134, 410, -392, -1031, -81, 900, 279, -467, 128, 571, -283, -881, 78, 941, 362, -192, 451, 834, -79, -658, 221, 954, 337, -120, 501, 732, -259, -846, -61, 466, -176, -543, 157, 355, -578, -1059, -301, 180, -367, -518, 276, 495, -350, -719, -34, 341, -245, -328, 406, 527, -320, -668, -70, 112, -472, -490, 302, 435, -291, -495, 149, 322, -160, -57, 765, 885, 266, 125, 688, 688, 107, 150, 766, 778, 73, -104, 276, 153, -446, -418, 182]
6425A82k8n59o0M26j35m92J10N62Mm89oL79j70m96Q5N21k9l74J31L86q4l24K49
6448b11N22J22k19K45L79p5l03J28L73r7l73M3J34k61m79m3J71k03l24Q1K00j86
6470c76k75J49L22Pj29K11K96j01j71J07K08j20k09Q4J28j99k67J3J29r5j63J40
6492c11K05l6j29J61K39j4n7J54J94r3j46J6J07j35j58K3Q2j14j57M6J43l9o8
6515h7J43J97Lm2J09J44m8j11J7N2j54k40o1k7k04k00m9M0r4r6P3J50L8L1J77
6540b39K33Q8L2J86J57l7n1O2M5j12j76j7mj51j46L2N1q6p4J20R8k9oJ59J13n7
6566A91o4R9J3j34j40K4m0k24j32K6Kj43k9J51J06k4M2K44J74%J13K45R0q4j6
6591D90J20k8k26n3N2j17k48q8M2r9k18K6J68k6j20Q2J96l8j28Q3J86n9j68O6
$$ y = [182, 154, -405, -465, -39, -174, -666, -556, 6, 10, -479, -485, -106, -276, -772, -687, -166, -195, -569, -438, -52, -136, -460, -211, 311, 433, 214, 459, 838, 763, 460, 588, 961, 864, 491, 534, 668, 407, -72, -115, 56, -147, -471, -390, -190, -376, -651, -502, -180, -173, -302, -91, 205, 104, -67, 40, 248, 128, -81, 3, 131, -68, -335, -322, -193, -288, -451, -311, -106, -142, -271, -110, 129, 115, 58, 212, 406, 313, 167, 183, 290, 155, -3, 20, 102, -12, -169, -123, 20, -19, -87, 56, 253, 256, 214, 323, 467, 419, 308, 325, 377, 223, -17, -78, -105, -309, -509, -558, -518, -612, -708, -635, -485, -447, -416, -239, -6, 82, 114, 300, 457, 420, 369, 431, 476, 364, 188, 171, 167, 16, -130, -98, -47, -133, -207, -87, 11, -18, -24, 135, 248, 191, 127, 226, 239, 105, -35, -11, -51, -275, -407, -381, -379, -522, -551, -400, -294, -318, -276, -32, 142, 142, 255, 500, 590, 506, 490, 610, 582, 356, 303, 355, 238, -10, -98, -56, -155, -373, -347, -179, -205, -325, -243, -47, -85, -213, -130, 56, -3, -171, -105]
6615a05J18j77k48Q3J42j08j50J77K15j00j14K62K74m1l2L11K31j73j59J79Q9
6636F74k58k08J62M8l74k94J42L4l45j28L36J51k49q6L08J60k69%M43J79l27j08
6658iK76j5m67j24L73O0m73j05L34o6m69j9N13J32l23Q1M87mm65Q7N76Q3m00J30
6682A93M79j53n88L2N23o1m58K02N54k19o47J34N27j51m62L12N61l21p22Q5M37
6703B57l44n41L04N65l98p29J46M64l63m81N34P35l20n43L66N32m08m24O68P98
6723H18l70n43L85M48o25n45O74O85m97n37M80L16p55n70P16O74n12m42O31L03
6743G34q84n66P50N78n50l71P03K44r98o08P77M81o56k34Q76K27j079n22Q04M33
6763A39p12n4J062K32j094m43Q93K89p53O8J175K08j131l87Q68J05q95J17J233
$$ y = [-105, 13, -164, -412, -329, -187, -295, -445, -268, -53, -153, -267, -5, 269, 228, 196, 507, 738, 565, 406, 585, 674, 416, 208, 370, 418, 44, -250, -108, -74, -419, -547, -211, -60, -309, -395, -87, 73, -196, -196, 247, 426, 99, -9, 267, 252, -215, -339, 34, 94, -379, -484, -150, -216, -685, -704, -191, -59, -382, -301, 186, 182, -283, -196, 380, 463, 63, 193, 672, 519, -69, -37, 486, 425, -33, 169, 723, 504, -143, -9, 518, 367, -95, 217, 778, 457, -265, -180, 257, -87, -628, -324, 241, -157, -886, -740, -276, -639, -1120, -586, 149, -171, -714, -348, 184, -224, -648, 20, 818, 448, -95, 290, 738, 113, -432, 242, 927, 430, -107, 373, 689, -66, -636, 80, 754, 242, -200, 431, 734, -150, -716, 34, 612, 62, -309, 394, 638, -360, -968, -191, 290, -366, -600, 276, 503, -576, -1098, -294, 139, -573, -627, 435, 667, -427, -870, 23, 312, -441, -373, 802, 1010, -121, -508, 360, 465, -430, -313, 920]
6782I20J48j151l20Q04q9r90J98J283J11j132j68Q01k45j076K63J332N2j057j8
6801c34P83m37j143K90J339mr73J72Q56n76j160M12J349l0q52M48Q91o61j249
6820h79M45J244k15q07N22Q66q61j368M10J093l50p68P34R23q96j252N07J021
6838C69m60o13R66R61r43j206N52Q23o63o17J077R13r96j146N62O91p85n11J224
6857A98R95q88r00O90N70q95m67J287Q95r24q45O56K83j163n17J208P90r74o69
6876f70P64K06j191m23J334Q08p96l92R31J60j285l80J271O19q93l12Q96m3j466
6895h62m64J162M31q78r0J058j9j342k42J229M33p66K05J238n4j321k29J101J63
6914G53q44K27J119j77j378k21R36m5q53L54J209j76j228r7Q45j85q81L96J142
$$ y = [920, 1068, -83, -403, 401, 312, -678, -480, 803, 914, -218, -386, 415, 170, -906, -643, 689, 741, -316, -334, 449, 12, -1131, -841, 498, 494, -479, -307, 549, -27, -1187, -775, 574, 544, -308, 140, 1031, 370, -879, -434, 810, 595, -212, 310, 1176, 315, -1053, -643, 450, 100, -668, 66, 989, 93, -1159, -652, 369, -91, -704, 262, 1223, 280, -926, -374, 449, -214, -831, 246, 1159, 163, -983, -421, 270, -515, -1026, 198, 1193, 305, -595, 95, 665, -230, -697, 590, 1485, 561, -284, 372, 655, -508, -1025, 183, 973, -1, -670, 94, 300, -891, -1314, 20, 828, 32, -360, 571, 731, -554, -934, 337, 956, 63, -249, 647, 604, -862, -1326, -164, 267, -611, -701, 357, 338, -1004, -1246, -17, 416, -350, -145, 1093, 1039, -282, -511, 590, 753, -91, 136, 1255, 1078, -300, -521, 415, 370, -483, -129, 1080, 904, -324, -421, 424, 239, -642, -246, 896]
6933H96k82j183j09O50m37r32M31J098k29j000J47P50l85o98O84J258m4p35L82
6952B62P67m86p90O11J004l16p76K71M50p55r42M54Q27m02o73M15N21o96p37N83
6972d08Q54l17m61O17M95p27p41N30O39m46m47N49L97p75o86M96N44m48k77P09
6992I7M64o62n32N60M55m35k33O94L30o63n42L99K57n61k28O59L24n96l69M93
7012h9K66m18m9P61L75m82k17M68J19n38j24N74J31n99l36L18q0o31j56N15J34
7033e8m82j29M33M3m31K5O01K10l33J2M59l1m82k1M60P4l93l4L49j05m69rM33
7056A22P1k87P3L90l5l60L1L80K5k88L7K79j69m17n0K33q5l12J8K61j16l19K9
7079d89L03J9j73J68L34mk02O5K85j7j83Q6K03p3k75lJ58q7k13P0J98p2j95K5
$$ y = [896, 614, -569, -678, -28, -465, -1397, -966, 132, -97, -1097, -950, -200, -585, -1283, -599, 659, 615, -120, 262, 1029, 543, -247, 364, 1368, 1052, 276, 547, 997, 242, -700, -246, 581, 179, -494, -79, 442, -254, -991, -408, 446, 129, -332, 285, 780, 53, -688, -158, 481, 35, -412, 137, 534, -241, -927, -431, 113, -335, -612, 97, 561, -101, -633, -73, 382, -53, -286, 408, 738, 75, -467, -68, 189, -372, -600, 59, 383, -213, -582, -89, 177, -241, -290, 471, 846, 364, 147, 615, 734, 196, 72, 646, 777, 178, -158, 160, 80, -551, -707, -192, -58, -540, -669, -236, -193, -624, -599, 2, 212, -121, -109, 350, 319, -163, -184, 276, 350, -43, -77, 272, 167, -302, -311, 122, 193, -94, -21, 369, 334, -26, 5, 385, 410, 122, 159, 438, 269, -148, -198, 35, -50, -362, -344, -83, -199, -518, -489, -186, -167, -340, -172, 162, 158, -44, 21, 306, 289, 106, 192, 395, 322, 47, 44, 202, 115, -98, -28, 170, 98, -97, -72]
7103g2J81l7j45R4J92o6j90L4J05j06j94M8J09q3k04K7J01o2j26J04J96pq6J12
7127g5J72Lq9J16J70j3j13L6J08p8j45J9Q1n8j28J6Q1p3j22P0J23l5r5O0J15l9
7153A07r7N5Q6m4j35M3M8q5j19M0N0q9j13J8R3q2q7O4R7m9n9R2J02l0n4Q4J32
7180F8m9m8R6J05n5n8J10J04p4n4R2P3j04n6R8M6j06q3P8J4j22r2R2J5j29o9Q0
7207b8nj49m9J19J0j27l5J29Kj37k1J51K6r4K4J57%j29K4J77K0j22P2J64o1j78
7233f0O3J59n4j39J02J78r2j82Q5J51p1j11J48K04j04j88J11J55j89j69J59J58
7255C14k33k09R4N7k52k18K02J60k16j98K24J26k62r4L22K35j74p3L05J22k71
7276c9j12L30J65k53p5L01M6l91j44L46R2k97k7L71J0m11j04L70O4l25L2L90o
$$ y = [-72, 109, 72, -73, 21, 213, 147, -43, -9, 96, -10, -204, -156, -47, -130, -334, -307, -206, -268, -394, -290, -94, -101, -187, -75, 97, 100, 11, 127, 297, 284, 171, 207, 315, 237, 92, 111, 192, 134, 6, 22, 103, 30, -92, -22, 101, 66, -29, 31, 146, 107, 10, 65, 151, 107, -28, 15, 63, -22, -141, -101, -51, -140, -253, -235, -142, -224, -311, -247, -150, -199, -258, -166, -64, -94, -148, -64, 68, 19, -29, 67, 172, 117, 59, 169, 273, 199, 145, 237, 310, 206, 150, 248, 294, 188, 105, 183, 197, 75, -17, 75, 90, -39, -108, -28, -33, -182, -231, -112, -102, -229, -264, -135, -133, -270, -291, -140, -114, -208, -184, -27, -27, -156, -132, 45, 65, -57, 15, 179, 118, -60, 3, 162, 108, -31, 71, 249, 157, -25, 60, 211, 140, 29, 177, 381, 277, 89, 200, 355, 166, -3, 156, 314, 81, -128, -34, 23, -229, -447, -245, -85, -301, -499, -275, -149, -411, -505, -183, 52, -122, -195, 110, 232, -39, -151, 179, 344, 91, 16, 317, 363, -28, -172, 174, 266, -31, -58, 313, 323, -88, -192, 178, 242, -83, -51, 339, 333]
7299C33m77j25L34l3m03O6M68n8n16k7M13n3l76K09N89k5m61O8M22j35m42K21
7321hN81j47n32Q0L70l17n30K53N72j63n24K18L95l43n11L71O46j77m23L06M15
7342E32m72n56L36N74k88m52L74L85n60o06M17N66l16l13N46M56n83n53M72N40
7362D99l81k96O27L78o88o16M38L44n26k99O94L67p36n47N28L21n60j63Q92M65
7382G41p04m41O19K42o84j41R25L53p69m10N37L9q56j57R59L25p80k96O41pr25
7403g89m6J042L37p48j03O93j00r91l5J028K45p32K3P78j92j047K4J013K02o65
7423f3K08Q45k65j080J3R48J2p21K45Q17m15j230l1P99j81p27L88R01m42j097
7443a076J22Q44k01n98O42J063l52r93K65P80l41o51P24R99m66r93K38O04n96
$$ y = [333, -144, -269, 65, 32, -371, -305, 163, 105, -411, -438, -25, -78, -454, -245, 344, 319, -142, -74, 348, 213, -229, -8, 573, 426, -106, -26, 344, 27, -503, -250, 322, 159, -365, -147, 248, -95, -606, -235, 411, 234, -189, 117, 532, 60, -496, -160, 414, 126, -326, 48, 433, -127, -733, -316, 250, -66, -379, 167, 623, 40, -513, -41, 499, 118, -178, 449, 827, 139, -477, -39, 305, -221, -520, 174, 541, -195, -742, -214, 107, -453, -616, 276, 741, 37, -404, 215, 457, -227, -368, 557, 910, 141, -269, 268, 307, -549, -706, 253, 578, -202, -498, 143, 136, -789, -835, 207, 544, -204, -307, 386, 286, -705, -740, 288, 533, -199, -176, 602, 410, -637, -613, 400, 602, -63, 145, 990, 725, -355, -342, 606, 618, -103, 142, 959, 544, -686, -717, 82, -99, -826, -438, 463, 21, -1076, -954, -110, -311, -909, -267, 796, 444, -549, -284, 496, 155, -496, 228, 1227, 761, -232, 6, 610, 14]
7462A4p17P34R61n25r01L38N38p11o90Q06R76n25p36M58M62q43o75Q31R14n12
7482A97o44N95M07r24o42Q57Q56n17m79P31L42r66o68Q20P04o08l41P35K72j108
7502c81o27P74N43o44k19Q93K64j026n37Q01M74o20l3R91K96j019m51P69K82p29
7522a99OJ015J60j041m26O85P0p94L8J044J36r89k82O81l8q15J58J067J36q85
7542b73j46O62j59q34J97J033Q2p97k2O36k38q66K28R90O9o90O5O48l37q62K42
7563c72R04l5o24J76N70m11q69K21P96j01n58K85N65m55p96K44P27j59n01M08
7583A5N78m42p62K67O29k20m43M68N69m76p06L03N20l12l78N12N57m88o19L06
7603a22M30l74l42N48M81m70n14K96L31m31l10N51M62m46m35L14K56m75k42N30
$$ y = [14, -703, 31, 992, 467, -434, -96, 442, -269, -959, -153, 823, 298, -438, 20, 482, -361, -1036, -205, 709, 197, -447, 148, 555, -369, -1011, -154, 702, 185, -294, 437, 779, -187, -855, -35, 669, 61, -280, 455, 727, -381, -1008, -234, 309, -335, -554, 339, 603, -423, -960, -159, 315, -305, -338, 653, 949, -70, -521, 248, 530, -199, -193, 822, 982, -59, -485, 200, 270, -524, -486, 558, 694, -295, -577, 104, 66, -749, -591, 476, 612, -273, -419, 243, 84, -750, -553, 480, 562, -235, -257, 379, 141, -725, -497, 493, 562, -128, -63, 585, 248, -614, -372, 532, 497, -127, 49, 619, 208, -661, -440, 356, 255, -303, -18, 547, 92, -704, -460, 267, 108, -393, 15, 593, 151, -611, -344, 285, 65, -378, 90, 659, 183, -523, -220, 300, -12, -390, 122, 679, 191, -428, -122, 308, -66, -408, 140, 621, 151, -363, -67, 264, -167, -477, 74, 536, 90, -345, -31, 225, -250, -492, 38]
7623C8M22m07l47L33J79m43k36N15L59l75k61L45J49n00k03M99K83l57j81L63
7643A75Q3m67j71M56K35l26j14L47P7m38j66M17J80l06o1L40M5m48j27L48J13
7664A92l17l2L39Om06j39L25P6k79J1L42Ql35p0L19M2k30M5L42K3l14l8K54J9
7688A83k44N1K62Pk98n1K08l6k47L1K37l1k27k1J74l0j83N1K28Rk08M0J75l4j43
7713i7N4K23nj66L8J66o3j63L2J69Oj89PJ15q5j63OJ31k6j85J2J31o5j43L1J67
7739f2j1r8O3J52k4r8P4J61J8q6M3J29l0j28L8Q5l8j29J8O1p4j24k5Q4m9j16K1
7766a45P7m6j16N6R6k6n8K2J34Jp8N0J37Kp1M6J01k4q2L8Q8l0j14J7P3o0j20L1
7794aP2q8j05J3Q3p3r6N8P5l5o9Q0P7l9o7J18P5m7l7O7P6q9n9J09O2p7o0R2L0
$$ y = [38, 460, 53, -294, 39, 218, -225, -461, 54, 413, 38, -223, 122, 271, -229, -432, 67, 350, -7, -188, 175, 258, -209, -380, 76, 311, -15, -129, 218, 295, -143, -309, 108, 288, -18, -79, 261, 306, -142, -269, 79, 192, -125, -157, 182, 188, -218, -357, -32, 44, -235, -224, 118, 126, -209, -279, 40, 82, -148, -103, 239, 262, -52, -90, 164, 183, -61, -10, 252, 259, -39, -90, 118, 82, -165, -134, 103, 72, -155, -176, -2, -32, -215, -164, 64, 73, -135, -95, 80, 46, -97, -43, 180, 175, 9, 47, 213, 150, -13, 19, 188, 194, 5, 12, 127, 42, -121, -115, 16, -10, -195, -183, -52, -117, -260, -229, -62, -73, -171, -108, 44, 20, -78, -4, 157, 175, 89, 132, 261, 231, 103, 141, 226, 188, 59, 77, 138, 64, -60, -85, -1, -50, -166, -145, -68, -114, -230, -174, -78, -104, -162, -140, -6, -5, -83, -33, 104, 106, 35, 81, 182, 158, 76, 114, 202, 172, 58, 75, 148, 88, -32, -1, 71, -17, -122, -109, -26, -99, -195, -137, -62, -97, -166, -86, -9, -48, -115, 3, 78, 31, -6, 61, 137, 48, -11, 98, 160, 83, 23, 115, 145]
7823A45j03p4J12M6j09n3J07K1j53n0Q9K3j44OJ30rj42j7J24lq9J4J83Jj36K1
7849f0J74l6j12N1J93m3j42K3J29p3j82J21J74q1j78P4J02j05j81J13J83j24j59
7872a39J07J00j63j93J55J89j56j62J80J30k03j76K15K09j55p4K48J53k42j30
7892a07K44J77j88r0K65J18l11j85K09Q9k76j10L06N4l58j62K17J01l18j9L83
7913C9J08l27r9L14L8l05M9M31Q9l57p0L37l1m06L4M60L9l82k1L19j09m59P1M80
7937B42k8l98N5L48j84n01R6N03m8l93J78M16k46n20J82N43p0l39K93M60k95n56
7959b62K09M97j82l46K96M32l87o26J92M03l10l79L95M61m48n78K31L99l04l28
7979f35N59N26m07n05L52L53l85l00O20N38m56m83L78K69n41l29O63M82n05m20
$$ y = [145, 42, -32, 80, 126, 17, -36, 71, 92, -61, -111, -22, 1, -143, -137, -7, -16, -158, -175, -51, -54, -143, -129, 54, 55, -81, -60, 114, 78, -34, 17, 210, 167, 25, 48, 177, 104, -78, 43, 217, 136, -42, 32, 134, 29, -152, -39, 144, 20, -139, -32, 68, -95, -288, -133, 56, -100, -262, -82, 48, -155, -331, -116, 93, -62, -136, 112, 265, 23, -107, 137, 314, 126, 36, 301, 419, 108, -77, 132, 221, -55, -165, 141, 195, -163, -325, -108, -7, -325, -344, 39, 147, -180, -279, 35, 73, -232, -183, 248, 337, -20, -90, 247, 216, -190, -156, 304, 343, -39, -60, 259, 150, -309, -238, 242, 214, -184, -129, 219, 35, -466, -370, 133, 85, -308, -130, 286, 40, -480, -298, 245, 175, -164, 129, 589, 294, -262, -53, 444, 262, -84, 212, 644, 257, -369, -177, 226, -84, -463, -68, 393, -55, -633, -402, -3, -307, -635, -76, 450, 43, -462, -110, 243, -142, -442, 178, 716, 260, -223, 155, 424, -117, -446, 217, 699, 194, -226]
7999b26M35K02o74l13P29M42n30l45N16J39p74k96P40M01n40k20N98O3q09k82
8019g44P79L42n25q5O81K9q87k28P48K63n60j5P60k9r21k15P11J58o05J14Q38
8040F09n5r23j89P19L0o14K49Q69q8q91j13O69j14o65L00R23j24q90l9N98k48
8061A3o93L67R25j39q26O0N73l58p15M34R78j55p54J78N52m76p57M87R44k15o63
8082b40L25N04o01p85N00Q51k62n86M59M77p14p67N06Q01l36m85N60M78p47p31
8102g93N26O82m10l86O48M59p79p24N16N61m62l16P49M57p78o54N54M42n05k21
8122d34Q64M37p73n64N28L21o16j80Q78L77p77n31N21J72p05j43Q99L59p37l63
8142d67N67Q0p37q0R34L52o83k45N85k2q11m5Q67K64o70j44N72j28q33l4Q52K12
$$ y = [-226, 209, 411, -263, -576, 153, 595, 65, -280, 236, 375, -399, -695, 45, 446, -94, -314, 284, 347, -462, -744, 35, 377, -148, -233, 448, 477, -410, -638, 110, 373, -187, -202, 558, 529, -392, -607, 104, 262, -343, -229, 609, 554, -369, -558, 161, 191, -423, -174, 695, 607, -284, -397, 272, 158, -507, -207, 716, 592, -298, -337, 261, 13, -680, -313, 612, 473, -353, -293, 280, -78, -793, -359, 619, 464, -290, -112, 440, -36, -793, -306, 638, 423, -240, 85, 589, -12, -797, -297, 554, 292, -294, 165, 642, -72, -839, -333, 468, 132, -353, 207, 685, -62, -793, -267, 415, 5, -381, 267, 726, -53, -777, -261, 300, -162, -478, 271, 728, -50, -704, -150, 292, -213, -434, 430, 867, 94, -470, 58, 379, -237, -417, 461, 838, 61, -470, 51, 223, -482, -625, 274, 633, -104, -467, 100, 180, -557, -637, 297, 649, -34, -279, 306, 284, -527, -572, 295, 559, -111, -255, 317, 189, -644, -678, 174, 386]
8164C86n83J3O17j61q18LQ13J36n53J02O29k22q19j9P45L1n14J97O29k31p94P6
8186c37O68l3m56K80O31
$$ y = [386, -197, -184, 433, 272, -546, -543, 270, 406, -147, -45, 584, 362, -457, -476, 269, 300, -214, -17, 612, 381, -413, -337, 331, 298, -158, 122, 753]
8191G53
$$ Imaginary data points
##PAGE= N=2
##DATA TABLE= (X++(I..I)), XYDATA
0@%%%%%%%%%%%jRj6J6j7J8k5L2l3M2n0N8p5R1j06J20j38J62j86K11k41K78l16
34a67L55m01M54n11N73o40P15p98Q84r80J089j205J331j469J619j784J964k163
52a134K384k627K896l199L544l933M373m886N492o213P094q197R621j1540J4274
67G949j8510K6018n7796L77823J7323m00505J90250L01856l00355m30832L36755
78D9976N47635j12248l77601J61414K11728m27066m87516K68219M62056j43238
88A53359k97589K39340K34090m07414m31545K79390M25156j31656k03052L06649
98A66728K29168m17320m19586K33874L22938j86364j72926L32423K17690m05154
108i8529l76627K27485K70853j84272r2408M02092K47898l53418l06226K30065
$$ y = [0, 0, 0, 0, 0, 0, 0, 0, 0, 0, 0, 0, -1, 8, -8, 8, -9, 9, -16, 16, -17, 25, -25, 33, -42, 49, -57, 63, -75, 87, -99, 112, -129, 149, -167, 188, -213, 241, -270, 303, -337, 378, -420, 464, -516, 573, -632, 699, -770, 849, -935, 1029, -1134, 1250, -1377, 1519, -1680, 1864, -2069, 2304, -2582, 2910, -3303, 3791, -4406, 5215, -6325, 7949, -10561, 15457, -42339, 335484, 352807, -47698, 142552, 444408, 144053, -286779, 49976, 597611, 485363, 107762, 269176, 480904, 53838, -433678, -165459, 296597, 153359, -144230, 95110, 329200, -78214, -509759, -230369, 194787, 63131, -139921, 166728, 395896, -21424, -441010, -207136, 115802, -70562, -243488, 88935, 306625, -98529, -475156, -247671, 23182, -161090, -253498, 148594, 396492, 43074, -263152, -33087]
118c3087K02188k27773q1908L95530K08677l65268k97780J79686J00122k87741
128b07354q0952L90392J96974l19092k13499K11458P9676k76563k9588M18379
138A69831K08705k64020j44446K11088K2339l14386n3701L54377J38480k71211
148E7056j23204J78732m3657l41664n6628L24503J18695k20185m2535K15434k9897
159C6650k99199j7981L13876J07193j74630J3968K16569n4896l00437k8800K54120
170F6433M8969j75338L3406K04703o9172k82103j8030K23633K7952j40818Q0890
181E25K18211n9172k45910J33J89123j2308j42490Q4664J93486q0377k40601j0505
193a05221J37365n6208j42627R2440J83189p1178j93979K4056J31808n8385j12059
$$ y = [-33087, 169101, -58672, -140580, 254950, 463627, 98359, -199421, -19735, 80387, -207354, -288306, 102086, 299060, -20032, -233531, -22073, 57603, -218960, -248548, 169831, 378536, 114516, -29930, 181158, 203497, -110889, -164590, 189787, 328267, 57056, -66148, 112584, 68927, -272737, -329365, -4862, 113833, -106352, -148887, 66547, 36650, -262549, -280530, 33346, 140539, -34091, -20123, 196446, 141550, -158887, -187687, 66433, 115402, -59936, -26530, 178173, 109001, -173102, -191132, 32501, 60453, -80365, 525, 218736, 159564, -86346, -86213, 102910, 90602, -51888, 32776, 226262, 145885, -94716, -105221, 32144, -24064, -166691, -74251, 108938, 37760, -156219, -132163, -355, -58740, -170799]
204a70799J20552J88903n1844j50593M3996J10106p7721j10040J07557J53874
214A63991o4282j32189M4218P7849r9267j06778J00390J32690n9491r9871N9675
225A6935O8869r6438r0943R3888J09048n8539p7189O1065M6538j06200q8074P7401
237d3639P9956o3029n9787O6305M1150r4329o7132P8427P2124m6728k7724Q1320
249A6914M3575p8270m6676P5213N4920m8686j9910P4775K9881p8609m5372N6337
261C4092K9960n4530j6973O4687J8302p1335l3500M9938J7264n1700q159O1910
273C9956J5163o0264k3387M2593P268m8267n289N0701O304n2420j6011L3841l117
286a2929m5547k018M3841L551m1477o561L2293j193l2650O641M1876P876k3696
$$ y = [-170799, -50247, 138656, 86812, -63781, -19785, 90321, 12600, -97440, 10117, 163991, 99709, -32480, 11738, 89587, -9680, -116458, -16068, 116622, 57131, -42740, 16935, 85804, -10634, -101577, -7689, 101359, 42820, -34369, 26696, 73234, -32966, -121040, -43639, 36317, -26712, -86499, -20194, 20956, -73373, -140505, -62078, 10046, -36682, -64406, 16914, 60489, -17781, -64457, 10756, 65676, 16990, -2920, 71855, 101736, 23127, -22245, 34092, 64052, 9522, -7451, 57236, 75538, 4203, -29297, 20641, 37905, -13795, -21954, 39956, 55119, -5145, -28532, 14061, 21329, -26938, -32227, 18474, 24778, -27642, -43653, -9812, -12929, -58476, -60494, -16653, -13102, -54579, -61140, -28847, -30040, -62690, -56049, -14173, -6297, -29993]
299b9993P499L3688J817k1059J3008L7515N899j8535P323K4539m579k2996L475
312C7601J9760n701k1605j29J0535j2836k3078K49J1633q338j7264K046J0044
325B917q132j5214K075R254n511j0940K365N683p738j0793K119N521n181o648
339d0223M936P984p90j916P462J0244L965K892Q522Q577K557J385M825L325k179
354B1566l136l08j114m902n238k284r67j581p92J374K781L736M928N642N319M915
370B9939M641L635J579p24k870m861o530q231j0266j1717j1692j0579r768r120
384d6564p453m486j293J228L123N065P619R758J0218R540R503R417P647N227M257
399B2806L334P0k628j442l21l461n907k253J870m74l039J622O332K690j432K728
$$ y = [-29993, -22494, 11194, 13011, -8048, 4960, 42475, 48374, 29839, 37162, 61701, 57122, 34126, 37601, 57361, 51660, 30055, 29926, 40461, 27625, 4547, 4796, 16429, 8091, -9173, -7127, 2917, -5215, -20429, -18354, -9100, -14611, -25551, -23186, -17503, -25241, -36034, -33915, -28394, -33575, -40223, -35287, -27303, -28093, -30009, -22547, -12303, -8338, -5446, 3076, 11653, 14210, 15595, 20420, 23745, 21566, 18430, 18122, 17008, 12106, 6868, 4584, 3617, 2036, 1244, 2618, 5399, 9135, 14063, 19705, 25024, 29939, 34580, 38215, 39794, 39070, 36200, 31339, 24809, 16578, 6312, -5405, -17097, -27676, -37444, -46564, -54017, -58503, -59796, -58568, -55445, -50380, -42761, -33003, -22785, -13245, -3742, 5675, 13322, 18549, 22806, 26140, 26210, 23582, 22140, 21819, 18358, 12451, 10198, 12068, 11594, 8555, 10177, 16509, 19199, 17767, 20495]
415B0495O126k86n821o35K416p047j4143o776j305j0415j6089m734L812n216j0453
430e0071K991J2171K212k112J3875K1775O235k043J2931J8546j193j0425P256
443C2148J3490q846j9470p59N348j6855k2398L792J2881j0756j6207J1128J7432
456I28j0437j4606J7838K5098o568j3921J5430J6254k0695k5175J1375J5489k0913
469i903k2908J4821J3759k7784k5600K1737K6271j3592r638L5075K9141k0569
481A0810j7282L1717K7774k0107j2959L4041J7890m1378l4149J9973J0708l9960
493a2922k2381L4459J6301m4365k8543L1674J7981l3191n254N6323K9118l7944
505A256j8126M0480J3820m4210r689N4607J8946n2179k6070L3170j584n8637j0873
$$ y = [20495, 26621, 26335, 20514, 19879, 22295, 15248, 1105, -5671, -6976, -17391, -33480, -38214, -34402, -39618, -50071, -47080, -34909, -32697, -34809, -20934, 841, 7076, 5033, 17964, 36510, 35317, 24892, 32148, 45638, 36792, 17322, 16563, 21911, 5056, -17342, -13550, -669, -11425, -27632, -16504, 928, -9509, -24115, -6277, 18821, 12253, -1668, 13762, 30016, 9321, -15854, -4479, 11010, -9903, -32811, -17990, -4231, -32015, -57615, -35878, -9607, -23199, -32837, 2238, 31379, 10810, -6472, 25245, 53019, 32912, 19953, 53994, 71884, 30506, -3643, 16330, 27038, -12922, -35303, -844, 15457, -28908, -57451, -25777, -7796, -40987, -46241, 10082, 39200, 1256, -16870, 23610, 37430, -6780, -16469, 38138, 57084, 4905, -21165, 12005, 10421, -48216, -59089]
518e9089N9745J9348m9528j2347M7370P51n8577m31P2474K2589m8234m495N0745
531D0321j0496p2387m549O9086J1753n4129L015N6764j7042p7545L481P8820J4271
544D1363m6397K2292P0738j8852q1642N119P3262k387n7245K2511O3314m1057
556E1019j01842n468N8643k2391o4029L2985P2689l8549r2361J1851O8667j8149
568d6935m6933O1826R3028k9788q0558K4361O5460l2659n2369O5671Q9297m0982
580F9419q5492K1047M8909n4710n9708P0134Q8493m3817p6869L2208M4164o7751
592a3973o0662P8229Q9249m6029o9085L9606L3806q6316o7240P8759Q2639n0468
604H515n7194N4077L1125r5882o3965Q8160Q4077m6198l7138P4089L1999j03297
$$ y = [-59089, 656, 20004, -29524, -41871, 5499, 6250, -52327, -52758, 19716, 42305, -5929, -10424, 40321, 29825, -42562, -47111, 21975, 33728, -20401, -17386, 39378, 22336, -55209, -51728, 27092, 41363, -5034, 17258, 87996, 69144, -12498, -7379, 65883, 63496, 6251, 28762, 92076, 51019, -50823, -56291, 2352, -20039, -84068, -51083, 21606, -16943, -109304, -97453, -28786, -46935, -93868, -32042, 60986, 31198, -49360, -24999, 40461, 7802, -44567, 21104, 110401, 69419, -16073, 4974, 53883, -827, -60535, 9599, 98092, 54275, -22594, 9614, 53778, -13973, -74635, 3594, 92843, 46814, -22271, 17335, 51141, -35175, -102415, -23656, 58983, 8515, -48679, 5398, 36523, -59359, -123324, -35164, 48913, 2715, -34423, 39666, 71665, -31632]
616c1632o3295Q7040P0856n5115k8270Q2367K1964j18096o8192Q0377N4288o2574
628c0282j4983R7579K4146j16001n8124Q2887M4855o2255L645J13242K5109j15054
640e236n2146P6392K3671p4965P734J15429J7831j17486m9088O6718K386q4122
652g2882J6020J21876J7988j08309l3416O7592j1275q8720K5589J28108J8505
663H1076r8566j8950O5367k8203r7214K8723J26159J3508q9438k226O5902m2428
675C710j03448L2570J24005R459p7992J6416O8104n3996j08212L2666J14156r15
687E6523p0065L1972O7456o6162j12666L0981J01604j2023o1498M7931O9778p0660
699A3171j09335L2375Q9415k1002n0318O4385P2568p2165j02830L3916P5634l1970
$$ y = [-31632, -94927, -7887, 62969, 7854, -20416, 61951, 83915, -34181, -102373, -21996, 32292, -30282, -45265, 52314, 76460, -39541, -97665, -14778, 30077, -32178, -28533, 84709, 109818, -5236, -57382, 19010, 42681, -32284, -24550, 90879, 108710, -8776, -57864, 8854, 11240, -72882, -56862, 65014, 83002, -25307, -58723, 8869, -2406, -91126, -65537, 62571, 81076, -17490, -36440, 28927, 724, -96490, -67767, 58392, 71900, -17538, -19764, 46138, 3710, -99738, -67168, 56837, 66296, -11696, 4720, 72824, 18828, -89384, -56718, 57438, 56523, -13542, 18430, 85886, 19724, -92942, -61961, 39643, 27620, -33878, 14053, 83831, 13171, -96164, -63789, 25626, 4624, -45694, 18691, 91259, 19094, -83736, -49820, 25814, -6156]
711f156m2970P5788P3164p1798r4947L3617N9558m3819l7275Q3712P1642p0299
723C0217q4382L5420M4638n5911l3940Q8926O9886o6467p1718L8300L1239o6486
735d0278l1395R0778O5229o2921n7440M3005J9202p6850l0485R0137N9299n8973
747I308m2432M9134J0833q2441k7471Q8250N2378n3766k5599N6529M283q6109
759d7103k4927Q3395M2418n1402j2995O0210k425q8114k3453P5009L0571m8784
771g600l27O4132o134q5609j9055O8044K0008m6362R538O5740r350q2541j7476
784d6992N6333N677m7538J4634O3363j3281p7483j2858M9005l563m4419K3782
796c3340O7118q427o3987j684M7187p878l9185L0715O6500q380n5655L492L8686
$$ y = [-6156, -49126, 26662, 99826, 28028, -66919, -33302, 26256, -17563, -54838, 28874, 100516, 30217, -54165, -18745, 25893, -30018, -63958, 24968, 94854, 28387, -43331, -5031, 26208, -40278, -71673, 19105, 84334, 21413, -36027, 6978, 26180, -50670, -81155, 8982, 68281, 9308, -33124, 16010, 26843, -55598, -83069, 5181, 57559, 3793, -21806, 34723, 39006, -47103, -72030, 11365, 53783, 2381, -10614, 49596, 47171, -40943, -64396, 10613, 41184, -7600, -7927, 56205, 50071, -35538, -54593, 13451, 33459, -12903, -3365, 62375, 53025, -29516, -46992, 9341, 15018, -32520, -17886, 45477, 32196, -45287, -58145, -9140, -12703, -57122, -33340, 33778, 25351, -38636, -40320, 6867, -1011, -40196, -9481, 57019, 48639, -7016, -3524, 35162]
809C5162j9813m3253K7889N7803j3929n1592N746L0608k8067m3253K7887N2203
821C7391j4341m1453J3703K8249l1020l9919K8793M6852j5104l3640J8463K4536
833B2510l3235l7007K7358L9832j5377k4693K4166K3200l1858l1235K7491L4144
845B5296j5637j8546K5969J9257l2665k9858K1389K2929k0195j6706K4009J4061
857A9303l2073k5403K0407J8583j7996q860K9044J7393k3591j5576K2749J6623
869B0603j5462m321K7803J3149k3655j4974J6202O051k1965q291K0380N906k4783
882c357j3950J2760K042k0212m442K0840O905j7656n631J5703K951j5899k30K0456
896B80O212j4206k641J3867P48j4423K63J6792M000j1210L60J2823l8j1915J615
$$ y = [35162, 15349, -27904, -15, 57788, 43859, -7733, -1987, 28621, 554, -42699, -14812, 37391, 23050, -18403, -4700, 23549, -7471, -47390, -18597, 28255, 13151, -20489, -2026, 22510, -10725, -47732, -20374, 19458, 4081, -20612, 3554, 26754, -5104, -36339, -8848, 25296, 9659, -8887, 17082, 36339, 3674, -26184, -4795, 18134, -2061, -18767, 5242, 19303, -12770, -38173, -17766, 817, -17179, -26039, 3005, 20398, -3193, -18769, 3980, 20603, 5141, 820, 28623, 41772, 18117, 3143, 19345, 25396, 3431, -4860, 15520, 21426, -3357, -17307, -4547, -2505, -22717, -27159, -6319, 586, -17070, -22701, -6998, -4047, -19946, -20176, 280, 6492, -7714, -10355, 3512, 4260, -10163, -9900, 6892, 10892, -318, 42, 12865, 12827, 912, 2527]
911B527J4211K106r911K85R127l041j2624j478P483k694j0684j308N149m679j0631
926a6162k03O992r68n817K982Q038J0m303L524P928J124k499L555N735j325m489
942D122J133L308k350m522O15K303k553m191L94K315j163j965J707K601o96j437
958c79J412J783j083j714M59O50j814k353o13j36j332j414l6M56n2L14J372J629
976b851J334J477K023J974J420J033R02P73L59k98r39j112j037j369j812j824
992E3j395j226j307r65m58k90k36L17P93O38M82P72J117R30N15M78N83N95M82
1011A878K03k6J20M35K51j67M5N40J39m73j49L80m91j344m86K93j100k474j084
1030c510L17j185k612n74J429l00j844P00K832N12r67K376M716J291j074K515
$$ y = [2527, 16738, 18844, 8933, 9218, 18345, 15304, 2680, 1202, 8685, 5991, -4693, -6001, -852, -5531, -16162, -16365, -9373, -10341, -16158, -13176, -5138, -5128, -9431, -5907, 2021, 3145, 646, 4201, 9936, 8611, 4122, 5255, 8563, 6213, 1691, 2306, 4609, 2056, -2135, -1741, 574, -589, -2554, -847, 1754, 1058, -379, 1033, 2816, 1733, 19, 478, 1128, -686, -3039, -3652, -3788, -5120, -6534, -6570, -6114, -6166, -5852, -4480, -2851, -1517, -40, 1983, 3957, 5377, 6410, 7312, 8085, 8444, 8146, 7207, 6095, 5058, 3689, 1877, 53, -1342, -2568, -3875, -4840, -5298, -5588, -5824, -5507, -4714, -4076, -3594, -2822, -1705, -775, -260, 218, 801, 1396, 1878, 2081, 2055, 2175, 2610, 2861, 2694, 2739, 3279, 3418, 2945, 2796, 3176, 2685, 1341, 855, 1148, 48, -2426, -3510, -3193, -4378, -6990, -7564, -6135, -6435, -8279, -7579, -4747, -4235, -5202, -2826, 1890, 3181, 2107, 4622]
1046D622M602J24k686J735M228j071m333L08K444l630o272J37L050l544o192R70
1062e508L477m246o674K351N958k208m748M263O463l475n754M942P819k546m434
1077d320O588P520n397p532N499P742m942o011P367P316q189r446N581O562p933
1092D05o906R285P674j0564j0271P300O705j0010o547J2662R381j1173r270R947
1106a382O687j1898n517J6112J0212j2786q699J1871N252j5644o236J7908R713
1119A5593j4901q266J3113K958j9249o097K0053R277j5990n883J6171J778k2056
1132a3499n274K2637R234j6330k939J8983O5k5021m773K3633P150j7786o0K1592
1146A7612k528k8769m846K4049M440j9308L270K4681m275l0962l600K4416J263
$$ y = [4622, 9224, 9348, 6662, 8397, 12625, 11554, 7221, 7529, 9973, 6343, 71, 208, 3258, -286, -6478, -5508, -2031, -6277, -12951, -10600, -4642, -6850, -11598, -7335, -872, -4347, -10101, -5159, 2660, 114, -4320, 2268, 9788, 4391, -3141, 2358, 10100, 5158, -853, 6514, 13830, 5641, -3805, 1776, 8338, 405, -6501, 2784, 10458, -106, -10377, -3077, 3628, -6382, -12929, -267, 9114, -2059, -11329, -1382, 5305, -6593, -12110, 4002, 14214, 1428, -7271, 4600, 9852, -5792, -12028, 5880, 15593, 692, -7574, 5539, 8497, -10752, -16849, 3204, 12481, -3509, -9392, 6779, 8557, -13499, -18773, 3864, 13098, -3232, -6171, 12812, 12877, -12144, -16917, 6716, 13866, -3920, -3980, 17612, 15084, -13685, -18531, 5518, 9958, -9350, -6080, 18601, 14326, -16636, -20236, 4180, 5443]
1159E443k0145Q102K8685n618l2347j506K4712k735k1700J2301L1938p152l3235
1172a3257M63K3411q331k3833J6030L4150r144l3400L167K2112j4068k5912J9482
1185i130L6170j0070l1583O921K0910j9324k7103K2926L7455j0911k8652J1631
1197g60J9938k4713k8829K5001L7333j2092k5448J6119J8343l0203l0601K5878
1209a0034L5222j4289k1760K1564J7436l5176l2001K6558L2537j6542j7411K7711
1221A3815J7297l8599l2015K7030K8392j9692j2758L4357J7301m1535l1153K7560
1233a0000K3427k3513q432M0653J7684m2793k8730K7928J7402k7731m293M5933
1245B7535J7134m3788k5869K7496R962l3311k016M8961J5757m3816k2097K6866
$$ y = [5443, -14702, -6600, 22085, 16467, -15880, -17386, 7326, 4591, -17109, -4808, 27130, 19978, -13257, -12794, 10617, 2286, -21547, -5517, 28633, 19489, -13911, -10744, 11368, -2700, -28612, -9130, 27040, 16970, -14613, -7692, 13218, -6106, -33209, -10283, 27172, 16261, -12391, -760, 19178, -5535, -34364, -9363, 27970, 15878, -9570, 6549, 24892, -5311, -35912, -10034, 25188, 10899, -10861, 10703, 28139, -7037, -39038, -12480, 20057, 3515, -13896, 13815, 31112, -7487, -39502, -12472, 15920, -3772, -16530, 17827, 35128, -6407, -37560, -10000, 13427, -10086, -18518, 22135, 39819, -2974, -31704, -3776, 13626, -14105, -18398, 27535, 44669, 881, -24988, 2508, 12470, -20841, -22857, 26104, 41861, -1955, -24052, 2814]
1257B814K562l7883P68N1811J5271m1048j5480K8442k880m1075L556N3817J4890
1270C5565l7329q427K9463q832m4836M323N2525J1810l4813j828L0280j4840m8840
1283c5779M023M9828P870l2203N230L1787j9285n1082M394M6207L179k9294J3241
1296a884L4462k2124n1290O100M3214j126k5772K1692L7995k2921m9257Q249L8803
1309A6141o940k3817K7719L8678k5697m8792P838L1050j5896k5082L0263L7285
1321D2750k7654m6353Q838K5020k1865k3034L5529L9266k4510l8266J4460K2654
1333F835k4786j9996L9665L9988k1977l1474J7288J7234l0807k1066L8234L5531
$$ y = [2814, 5376, -32507, -31739, 20072, 35343, -5705, -21185, 7257, 4377, -36698, -33142, 20675, 35565, -1764, -10191, 19272, 10440, -34396, -30073, 22452, 34262, -551, -2379, 27901, 13061, -35779, -31756, 18072, 25942, -6261, -1031, 30756, 11471, -39611, -35217, 10990, 14169, -15125, -1884, 32578, 10454, -40836, -34736, 8478, 7352, -18420, 3272, 41267, 18346, -30911, -22662, 16141, 9201, -14616, 13103, 51781, 26084, -22708, -14870, 16180, 284, -24798, 5465, 42750, 15096, -31257, -22419, 2601, -19264, -42298, -6769, 32497, 7987, -30279, -15819, 6835, -17951, -37947, 1718, 41706, 19729, -11745, 5543, 22777, -8030, -29096, 9138, 44669]
$$ [...]
8191G8
##END NTUPLES=NMR FID
##END=
