##TITLE=1H ikalashn
AM_NV APTMS(nlock)
23.10.2024
##JCAMPDX= 6.0         $$ Bruker NMR JCAMP-DX V2.0
##DATA TYPE= NMR FID
##DATA CLASS= NTUPLES
##ORIGIN= UXNMR, Bruker Analytische Messtechnik GmbH
##OWNER= root
$$ TOPSPIN		Version 1.3
$$ 2024-10-23 13:39:47.937 +0400  Irina@DPX200
$$ Compression mode = diff/dup
##.OBSERVE FREQUENCY= 200.131300845
##.OBSERVE NUCLEUS= ^1H
##.DELAY= (6, 6)
##.ACQUISITION MODE= SIMULTANEOUS
##.ACQUISITION SCHEME= undefined
##.AVERAGES= 16
##.DIGITISER RES= 18
##SPECTROMETER/DATA SYSTEM= spect
##.PULSE SEQUENCE= zg
##.SOLVENT NAME= D2O
##.SHIFT REFERENCE= INTERNAL, D2O, 1, 17.49637
##AUDIT TRAIL= $$ (NUMBER, WHEN, WHO, WHERE, WHAT)
$$ ##TITLE= Audit trail, TOPSPIN		Version 1.3
$$ ##JCAMPDX= 5.01
$$ ##ORIGIN= Bruker BioSpin GmbH
$$ ##OWNER= Irina
$$ $$ F:/spectra/data/iren/nmr/1H/4/audita.txt
$$ ##AUDIT TRAIL=  $$ (NUMBER, WHEN, WHO, WHERE, VERSION, WHAT)
(   1,<2024-10-23 13:38:58.468 +0400>,<Irina>,<DPX200>,<TOPSPIN 1.3>,
      <created by zg
	started at 2024-10-23 13:37:50.125 +0400,
	POWCHK disabled, PULCHK disabled
       configuration hash MD5:
       BE 6D 3F 07 2A EA 11 49 91 17 2B D3 AF B3 58 0D
       data hash MD5: 16K
       E9 96 2B BF B9 EE CA 03 E4 D8 FB 33 50 AF 20 32>)
$$ ##END=
$$ 
$$ $$ hash MD5
$$ $$ DF 2E D9 13 E7 52 3B 83 54 55 6A 2B F2 1E E2 E5
##$RELAX= 
##$RELAX= 
##$RELAX= 
##$RELAX= 
##$RELAX= 
##$RELAX= 
##$RELAX= 
##$RELAX= 
##$RELAX= 
$$ Bruker specific parameters
$$ --------------------------
##$DU= <F:/spectra>
##$EXPNO= 4
##$NAME= <1H>
##$PROCNO= 1
##$TYPE= <nmr>
##$USER= <iren>
##$AMP= (0..31)
100 100 100 100 100 100 100 100 100 100 100 100 100 100 100 100 100 100 
100 100 100 100 100 100 100 100 100 100 100 100 100 100 
##$ANAVPT= -1
##$AQSEQ= 0
##$AQ_mod= 1
##$AUNM= <au_zg>
##$AUTOPOS= <>
##$BF1= 200.13
##$BF2= 200.13
##$BF3= 200.13
##$BF4= 200.13
##$BF5= 200.13
##$BF6= 200.13
##$BF7= 200.13
##$BF8= 200.13
##$BYTORDA= 1
##$CFDGTYP= 0
##$CFRGTYP= 5
##$CHEMSTR= <none>
##$CNST= (0..63)
1 1 145 1 1 1 1 1 1 1 1 1 1 1 1 1 1 1 1 1 1 1 1 1 1 1 1 1 1 1 1 1 1 1 
1 1 1 1 1 1 1 1 1 1 1 1 1 1 1 1 1 1 1 1 1 1 1 1 1 1 1 1 1 1 
##$CPDPRG= <>
##$CPDPRG1= <>
##$CPDPRG2= <>
##$CPDPRG3= <>
##$CPDPRG4= <mlev>
##$CPDPRG5= <mlev>
##$CPDPRG6= <mlev>
##$CPDPRG7= <mlev>
##$CPDPRG8= <mlev>
##$CPDPRGB= <>
##$CPDPRGT= <>
##$D= (0..63)
0 2 0 0 0 0 0 0 0 0.06 0 0.03 0 0 0 0 0.0002 0 0 0 0 0 0 0 0 0 0 0 0 0 
0 0 0 0 0 0 0 0 0 0 0 0 0 0 0 0 0 0 0 0 0 0 0 0 0 0 0 0 0 0 0 0 0 0 
##$DATE= 1729676335
##$DBL= (0..7)
120 120 120 120 120 120 120 120 
##$DBP= (0..7)
150 150 150 150 150 150 150 150 
##$DBP07= 0
##$DBPNAM0= <>
##$DBPNAM1= <>
##$DBPNAM2= <>
##$DBPNAM3= <>
##$DBPNAM4= <>
##$DBPNAM5= <>
##$DBPNAM6= <>
##$DBPNAM7= <>
##$DBPOAL= (0..7)
0.5 0.5 0.5 0.5 0.5 0.5 0.5 0.5 
##$DBPOFFS= (0..7)
0 0 0 0 0 0 0 0 
##$DE= 6
##$DECBNUC= <off>
##$DECIM= 32
##$DECNUC= <off>
##$DECSTAT= 4
##$DIGMOD= 1
##$DIGTYP= 9
##$DL= (0..7)
0 120 120 120 120 120 120 120 
##$DP= (0..7)
150 150 150 150 150 150 150 150 
##$DP07= 0
$$ [...]
##$SW= 21.9926040160658
##$SWIBOX= (0..15)
0 0 2 0 0 0 0 0 0 0 0 0 0 0 0 0 
##$SW_h= 4401.40845070422
##$TD= 16384
##$TD0= 1
##$TE= 300
##$TE2= 300
##$TE3= 300
##$TEG= 300
##$TL= (0..7)
0 120 120 120 120 120 120 120 
##$TP= (0..7)
150 150 150 150 150 150 150 150 
##$TP07= 0
##$TPNAME0= <>
##$TPNAME1= <>
##$TPNAME2= <>
##$TPNAME3= <>
##$TPNAME4= <>
##$TPNAME5= <>
##$TPNAME6= <>
##$TPNAME7= <>
##$TPOAL= (0..7)
0.5 0.5 0.5 0.5 0.5 0.5 0.5 0.5 
##$TPOFFS= (0..7)
0 0 0 0 0 0 0 0 
##$TUNHIN= 0
##$TUNHOUT= 0
##$TUNXOUT= 0
##$USERA1= <user>
##$USERA2= <user>
##$USERA3= <user>
##$USERA4= <user>
##$USERA5= <user>
##$V9= 5
##$VALIST= <valist>
##$VCLIST= <CCCCCCCCCCCCCCC>
##$VD= 0
##$VDLIST= <DDDDDDDDDDDDDDD>
##$VPLIST= <PPPPPPPPPPPPPPP>
##$VTLIST= <TTTTTTTTTTTTTTT>
##$WBST= 1024
##$WBSW= 25
##$XGAIN= (0..3)
0 0 0 0 
##$XL= 0
##$YL= 0
##$YMAX_a= 1456383
##$YMIN_a= -1190309
##$ZGOPTNS= <>
##$ZL1= 120
##$ZL2= 120
##$ZL3= 120
##$ZL4= 120
##$ABSF1= 10
##$ABSF2= 0
##$ABSG= 5
##$ABSL= 3
##$ALPHA= 0
##$AQORDER= 0
##$ASSFAC= 0
##$ASSFACI= 0
##$ASSFACX= 0
##$ASSWID= 0
##$AUNMP= <proc_1d>
##$AXLEFT= 0
##$AXRIGHT= 0
##$AXTYPE= 0
##$AXUNIT= <>
##$AZFE= 0.1
##$AZFW= 0.1
##$BCFW= 1
##$BC_mod= 2
##$BYTORDP= 1
##$COROFFS= 0
##$CY= 7568.61572265625
##$DATMOD= 1
##$DC= 2
##$DFILT= <>
##$DTYPP= 0
##$F1P= 17.9538593292236
##$F2P= -4.03888763876832
##$FCOR= 0.5
##$FTSIZE= 32768
##$FT_mod= 4
##$GAMMA= 1
##$GB= 1
##$INTBC= 1
##$INTSCL= 1
##$ISEN= 128
##$LB= 0.02
##$LEV0= 0
##$LPBIN= 0
##$MAXI= 945.577
##$MC2= 0
##$MEAN= 0
##$ME_mod= 0
##$MI= -402.1523
##$NCOEF= 0
##$NC_proc= 0
##$NLEV= 6
##$NOISF1= 8.587773
##$NOISF2= 6.764455
##$NSP= 1
##$NTH_PI= 0
##$NZP= 0
##$OFFSET= 17.49637
##$PC= 1
##$PHC0= 37.70108
##$PHC1= 3.282697
##$PH_mod= 0
##$PKNL= yes
##$PPARMOD= 0
##$PPDIAG= 0
##$PPIPTYP= 0
##$PPMPNUM= 100
##$PPRESOL= 1
##$PSCAL= 0
##$PSIGN= 0
##$REVERSE= no
##$SF= 200.13
##$SI= 32768
##$SIGF1= 18.5376
##$SIGF2= -6.396296
##$SINO= 400
##$SIOLD= 32768
##$SREGLST= <1H.CDCl3>
##$SSB= 3
##$STSI= 0
##$STSR= 0
##$SW_p= 4401.40845070422
##$SYMM= 0
##$S_DEV= 0
##$TDeff= 0
##$TDoff= 0
##$TI= <>
##$TILT= no
##$TM1= 0
##$TM2= 0
##$TOPLEV= 0
##$USERP1= <user>
##$USERP2= <user>
##$USERP3= <user>
##$USERP4= <user>
##$USERP5= <user>
##$WDW= 1
##$XDIM= 8192
##$YMAX_p= 0
##$YMIN_p= 0
$$ End of Bruker specific parameters
$$ ---------------------------------
##NTUPLES= NMR FID
##VAR_NAME=  TIME,          FID/REAL,        FID/IMAG
##SYMBOL=    X,             R,               I
##VAR_TYPE=  INDEPENDENT,   DEPENDENT,       DEPENDENT
##VAR_FORM=  AFFN,          ASDF,            ASDF
##VAR_DIM=   8192,          8192,            8192
##UNITS=     SECONDS,       ARBITRARY UNITS, ARBITRARY UNITS
##FACTOR=    0.0002272,     1,               1
##FIRST=     0,             0,               0
##LAST=      1.8609952,     -108,            312
##MIN=       0,             -1190309,        -1190309
##MAX=       1.8609952,     1456383,         1456383
$$ Real data points
##PAGE= N=1
##DATA TABLE= (X++(R..R)), XYDATA
0@%%%%%%%%%J6l2L2l2L6n2O4q0J12j34J62j91K27k73L21l84M48n13N94o90P88
30D19r01J029j170J329j501J690j898K129k381K653k956L288l649M041m469M943
46B596n455O016o635P306q047Q868r775J0787j1915J3186j4631J6285j8208K0466
60A0844k3169K6479l0629L6013m3324N3878p0528J00868j73943O73335Q96559
71A456383j022992q70751k96477K23286J26452L17887M04356K17515k08802k02582
81A44275j21734k08440l39868j7367L53256M22954K63677J85596j53933p07914
91a79498p74452P2774Q49015O28391j32406l15680m270J1479l23070l05186J00390
102c72513L10642J70723J07459J54858p101l09991l33914j07680L7357J20108
$$ y = [0, 0, 0, 0, 0, 0, 0, 0, 0, 0, 16, -16, 16, -16, 20, -32, 32, -48, 64, -70, 92, -99, 128, -145, 176, -208, 240, -273, 321, -369, 419, -482, 547, -623, 706, -795, 895, -1003, 1126, -1255, 1398, -1558, 1730, -1919, 2122, -2347, 2596, -2859, 3157, -3478, 3828, -4219, 4649, -5126, 5661, -6254, 6932, -7699, 8586, -9622, 10844, -12325, 14154, -16475, 19538, -23786, 30092, -40436, 60432, -113511, 559824, 1456383, 433391, -437360, -733837, -510551, -384099, -66212, 338144, 555659, 346857, 144275, 22541, -185899, -525767, -543134, -189878, 233076, 496753, 682349, 528416, -179498, -953950, -881176, -32161, 596230, 463824, 148144, 143874, 155353, -167717, -472903, -372513, -61871, 108852, 216311, 371169, 364068, 54077, -279837, -387517, -350160, -230052]
112b30052L33492M03326K1333m18175l34719K0676J8885j92066K2983N17125N01658
123F64466j04882n15146l43286m8687J4923P3836K60223K97166Q6934q8119j28800
134A68628k33134l45379j55513K57013M35678K77116R9003l6632l41603o13423
144d88246l40412L58813O94233L36371j47319k39392j37403j65098j92083k9009
154c49545J56698J90259J89106K11306O0153k81461m59443k60305Q2183K98529
164a62520L85361L27866K03m31808n00147j01757K69850K35331L6642L2080J22400
175B13501M3725j35836j93683j40925q7247K4507K30127L24837J41546j48224
185B72328k75501k23210j09148N1164K26974K50496O7686r8915p8518k4885j14140
$$ y = [-230052, 103440, 506766, 528099, 109924, -224795, -204119, -185234, -377300, -354317, 162808, 664466, 559584, 44438, -298848, -347535, -332612, -258776, 1447, 298613, 385547, 297428, 168628, -64506, -409885, -565398, -308385, 127293, 404409, 503412, 466780, 125177, -488246, -828658, -469845, 224388, 560759, 413440, 174048, 36645, -128453, -320536, -349545, -192847, -2588, 186518, 397824, 457977, 176516, -282927, -543232, -461049, -162520, 222841, 550707, 550910, 119102, -381045, -482802, -212952, 22379, 59021, 91101, 213501, 257226, 121390, -72293, -213218, -300465, -275958, -45831, 279006, 420552, 272328, -3173, -226383, -335531, -284367, -57393, 193103, 260789, 161874, 83356, 58471, -55669]
196e5669k01250o7897J80442K68752J57569J2567r9438k07842k39745j00202J16364
207b36349K22912J91113J13999P450j49925k61607k03997k1641J39720K25272
217B6947K41564J34783j08372l14174k83725o0761J35116J96680J82417J30559
227B81034J1818j39827k18652j82563p6187O6478K18682K83376J61846q9436k81329
238C5240k86227j30403Q3365K46093K61689J12297q6162j81521j47602p7091k8229
249a98551K8387J10359J63980J32105K0390j17254k10992j91744m2526J48241
259a57605K38669J66870M744j26441j60931j10436k6029M1209P0284P8210Q4931
270A03475P2124M978j02354j73939j40195q677J36914K01458J44920O473j25172
$$ y = [-55669, -256919, -324816, -144374, 124378, 281947, 294514, 195076, -12766, -252511, -352713, -236349, -13437, 177676, 291675, 299125, 149200, -112407, -316404, -338045, -198325, 26947, 268511, 403294, 294922, -19252, -302977, -363738, -228622, -31942, 150475, 281034, 292852, 153025, -65627, -248190, -324377, -257899, -39217, 244159, 406005, 316569, 35240, -250987, -381390, -298025, -51932, 209757, 322054, 235892, 54371, -93231, -170322, -198551, -170164, -59805, 104175, 236280, 256670, 139416, -71576, -263320, -305846, -157605, 81064, 247934, 252678, 126237, -34694, -145130, -171159, -129950, -59666, 18544, 103475, 175599, 180577, 78223, -95716, -235911, -244588, -107674, 93784, 238704, 245177, 120005]
281A20005j74742j28842l0888O2735J18977J31513J00257K2718q6580j75728j77658
292b18233o8992R3909K10065K05858Q2213q9097k06617k01622q6115O0146J57368
303f1117J74785J20799J5437j05476j85143j74793p1376P7852J98169K16798J06138
314C12073p6241k10710k10487r1156N9184J59061J72095J03527p432j01906j39489
325c1481j20146n9160L3613J29569J68938J09125k0217j35977j70995j12303N402
336b03632J15057J49641R4918L566o0919q3254q2496o3217j5149N1259J02086
347G860J08882O2487k6737j17490j46929q3782L0179J15097J27035P9032N039
358A60673o5058j04961r8979n3855J1134Q0349J30832J22832L4710r1815j71944
$$ y = [120005, -54737, -183579, -214467, -151732, -32755, 98758, 199015, 221733, 135153, -40575, -218233, -287225, -193316, 16749, 222607, 304820, 215723, 9106, -192516, -278631, -218485, -61117, 113668, 234467, 249904, 144428, -40715, -215508, -286884, -209032, -10863, 205935, 312073, 235832, 25122, -185365, -276521, -217337, -58276, 113819, 217346, 209914, 108008, -31481, -151627, -210787, -177174, -47605, 121333, 230458, 210241, 74264, -96731, -209034, -203632, -88575, 61066, 155984, 159550, 98631, 15377, -67119, -130336, -145485, -94226, 7860, 116742, 179229, 152492, 35002, -111927, -195709, -165530, -50433, 76602, 155634, 160673, 95615, -9346, -108325, -162180, -151046, -70697, 60135, 182967, 217677, 125862, -46082]
369d6082j50570m2404Q8739J70887J57609N5899p0658j46542j41857p7149J3393
380a88735J00358J49672J29228L8026q1170j65206j65438p2101P1049J78839J79994
391A74516P4445o6227j56531j55736p8320K8565J11332J34745R5983J9230o3141
402A18861j20847j26906o7700L5708J25939J46031Q2269k6015j14237j33789p9844
413a60530R662Q0821J00663P3457K4034k6355o6396q5339p0232j7863N1639J00906
425A4467R8752M1649m1183j01984j04690n0136K4618P6094Q6070O2713J9739l2052
437I4057p6855r3041o6399j983P4354J22551J06184K2448q1747j38793j14624
448a53848k9404O5918J23130J16551N1596l5583r9446j14886q1870j1681P3291
$$ y = [-46082, -196652, -239056, -150317, 20570, 178179, 234078, 163420, 16878, -124979, -202128, -188735, -88377, 61295, 190523, 228549, 147379, -17827, -183265, -255366, -184317, -5478, 174516, 248961, 182734, 26203, -129533, -207853, -179288, -67956, 66789, 162772, 182002, 118861, -1986, -128892, -196592, -160884, -34945, 111086, 193355, 167340, 53103, -80686, -160530, -150868, -70047, 30616, 104073, 128107, 101752, 35356, -49983, -120215, -138078, -86439, 14467, 113219, 154868, 113685, 11701, -92989, -143125, -118507, -42413, 43657, 106370, 126109, 94057, 17202, -75839, -142238, -144221, -69867, 52684, 158868, 181316, 99569, -39224, -153848, -183252, -117334, 5796, 122347, 173943, 138360, 38914, -75972, -157842, -169523, -96232]
459i6232J31986J22343M0370o8166j40539j37556n9004N5764J40201J41089O1670
470A91926m2201j11477j22090p8163J740Q2077J19839R5847K7113n2655j10465
481A491j16387n6949L9059J10230J14395N9337j8462q2396j03909p0946l375N6232
493g1680Q0807P2614L9568j5082p1474r2470o0389K248N7790Q3226P0182K1161
505A16501l9291p3236o5135l2805L058L8023O6012O7693L3147k1050o8065q8518
517f3666o6806L21P8886J11302P3074k770o5926r1860p7570k6913L9037Q3154
529i737Q3915N0349j426o0374j03031r4174k5415O3965J19647J11966M2200n8781
541A19104j31356j22438l7776N8765J08178J00086N1739j8616q3080j04334o9318
$$ y = [-96232, 35754, 158097, 198467, 130301, -10238, -147794, -206798, -151034, -10833, 130256, 191926, 149725, 38248, -83842, -162005, -160265, -78188, 41651, 137498, 164611, 111956, 1491, -114896, -171845, -132786, -22556, 91839, 151176, 132714, 50318, -53591, -124537, -127912, -71680, 9127, 81741, 121309, 106227, 34753, -57717, -118106, -115858, -58068, 25158, 95340, 116501, 77210, 3974, -61161, -93966, -90908, -52885, 13127, 80820, 113967, 92917, 24852, -63666, -130472, -130151, -51265, 60037, 133111, 130341, 64415, -27445, -105015, -131928, -92891, -9737, 74178, 124527, 123101, 62727, -40304, -134478, -159893, -95928, 23719, 135685, 177885, 119104, -12252, -134690, -172466, -113701, -5523, 94563, 146302, 127686, 44606, -59728, -129046]
552a29046m179N5819R2211R2065M3384l8144j02117j06674n3165K6255R2585J09589
564G8583O1526k1534q0452q4931n2761q652L9199P5520P1837K5237k8112n5186
576B0274n7599m4476j0883L6919O7246N7994K1481j8941n1301o4434m4120K160
588h5680M2629N7578N2539K9247j7950o7615p5892l2744K0593M7796N4019N0534
600G5054K4292k7521p0534p1574l6275J1677N8375Q6723O9708M797o6446r8535
612d0259p9404j9640N8632J11032R2314J2372o2382q3955o6108l5518R791O5821
624c7304R3412O2777k629n7678q3605p8138l2573M3355J01143R6334L4852m1666
636I8280r4384r6864m0344M1980Q7317O9297K3648j0239l5118n9493n9906j8047
$$ y = [-129046, -133225, -77406, 14805, 106870, 150254, 112110, 9993, -96681, -149846, -123591, -31006, 78583, 140109, 118575, 38123, -46808, -99569, -108221, -69022, 6498, 78335, 103572, 75460, 20274, -37325, -81801, -92684, -55765, 11481, 69475, 90956, 72015, 20714, -43720, -87840, -85680, -43051, 14527, 67066, 96313, 78363, 10748, -65144, -97888, -77295, -29499, 24520, 75054, 99346, 71825, 1291, -70283, -106558, -94881, -36506, 50217, 119925, 124722, 58276, -40259, -119663, -139303, -80671, 30361, 122675, 135047, 72665, -11290, -77398, -112916, -103125, -37304, 56108, 118885, 116256, 58578, -25027, -103165, -135738, -92383, 8760, 105094, 139946, 98280, 3896, -92968, -133312, -91332, -4015, 65282, 88930, 78691, 43573, -15920, -75826, -93873]
648i3873L5498N7851M8724K9928J404m1025p0209n3822k124M4255O1336M9429
660F7372J3567l0620n2409l9332j4309J040J6808M1521N0264K1094k2641m3253
672I102m0047l1929j3682K6470O4748O1911J6795l3786o1283o1001l2884J6833
684g8753O0515O8660M0836k342m4781p2166o2870j1823M6612P0379N5716K4563
696I4546j3427n6093p9961n5876P696O5816Q3531N8734N485n4325q7875p0064
708a01813j0496N0859P9379O6008K0043l5781o9297o1331k3476J6499M3015N4400
720B8009M5961J2037l4199o3415n7084k0587K6077N9741O1720K8414k0686n4294
732A1694n4512k6781R871L6105M1448K8171O683j3414k7774l3436k6740p216J8560
$$ y = [-93873, -58375, -524, 48200, 78128, 79532, 38507, -31702, -85524, -87648, -43393, 17943, 67372, 80939, 50319, -2090, -41422, -55731, -54691, -37883, 3638, 53902, 74996, 52355, 9102, -30945, -62874, -76556, -50086, 14662, 76573, 93368, 59582, -1701, -62702, -95586, -78753, -18238, 50422, 91258, 88916, 44135, -28031, -90901, -102724, -56112, 14267, 69983, 94546, 81119, 25026, -54935, -110811, -103115, -37299, 46232, 104966, 110451, 56126, -31749, -101813, -112309, -61450, 17929, 83937, 103980, 68199, -1098, -62429, -85905, -69406, -26391, 28009, 73970, 86007, 51808, -11607, -68691, -89278, -63201, -3460, 58260, 86674, 65988, 11694, -42818, -69599, -59728, -23623, 17825, 45996, 52679, 39265, 11491, -21945, -48685, -55901, -37341]
745c7341L9462M3532K3214j4426m5493m8910k5605O965L3272M4977L6674R342
757F5663k2836m2175m2409k5714M644L8054N4136M0278N716l0196n4791n7378
769f7008k6465K8557O8909O3434K2312k1887n1457o2431m4820M178N5688P1330
781D0340M4770M0m0510o3733n5918j4499L4457N8437N2541K8494j0060n3917p0990
794e0548l9087J6278M9882N1858L9501J3528l1044o6898n6056o122L6536M7592
806E420L9164K0156j1617m0560m2109k0317O24J5790L3925M1806J8352k0379l6330
819C925k6986j8272j0376J6218M6554M0944J142k7430k5575j9345k0673q425K1039
832b7260L7821K7976J0298n099k7797m7393l4356Q190L9386M0467L0197J4819
$$ y = [-37341, 2121, 45653, 68867, 54441, 8948, -39962, -65567, -58602, -25330, 19647, 56321, 65663, 42827, 652, -41757, -67471, -62827, -24773, 29363, 69641, 75357, 45161, -9630, -67008, -93473, -64916, 3993, 67427, 89739, 67852, 16395, -46036, -90856, -86678, -30990, 40340, 85110, 85150, 44640, -19093, -75011, -89510, -55053, 3384, 55925, 84419, 74359, 20442, -50548, -89635, -73357, -23475, 28383, 67884, 81412, 50368, -16530, -72586, -78708, -42172, 5420, 44584, 64740, 53123, 12563, -29546, -49863, -49239, -33449, 476, 42282, 60634, 40255, 3925, -23061, -41333, -51709, -35491, 11063, 52007, 53149, 25719, 144, -19201, -39874, -48299, -27260, 10561, 38537, 48835, 43736, 15939, -31454, -65810, -57620, -18234, 22233, 52430, 67249]
844F7249j9760n7995n5736q391L4786M2517L5081K7948K241m2511o4174l7686
856g6431P917L7138M9399M8187J8101l4603o5532m8974j0160K0842M4665N8454
868D9003L7068j8679n9567n2058k0288L930K6204N1472N0617P363m0587n0748
880a6270l1868j1304J1337L9887M9157K1117j7653l2754k9428k5136j0598K1590
892c1923M3431K9822N43j3542j7461k7044k7537j259K8993L0857J3352L690j031
905C0891j7527l2712k2294M487J9491K1060K3786J9828n729l5249l7677j5203
917d6848O263J9605L2899L5586J0701k6503m2040l0490j1781P267L1800M7726
929C4185L1674r132l9937m3601l0182o536K7033N2943M5203O605l0582m4497l9227
$$ y = [67249, 47489, -10506, -66242, -74633, -39847, 2670, 37751, 65699, 67940, 25429, -38745, -76431, -68514, -31376, 18023, 66210, 84311, 49708, -15824, -64798, -74958, -54116, -9451, 49003, 86071, 67392, 7825, -44233, -64521, -60591, -34387, 17085, 67702, 75065, 34478, -16270, -48138, -59442, -48105, -8218, 40939, 62056, 44403, 11649, -17779, -42915, -53513, -31923, 11508, 41330, 41873, 28331, 10870, -16174, -43711, -44970, -15977, 14880, 28232, 31922, 30891, 13364, -19348, -41642, -37155, -17664, 3396, 27182, 47010, 41281, 6032, -31645, -46848, -40585, -20980, 11919, 47505, 58206, 31703, -10337, -40827, -52608, -45341, -13541, 34185, 65859, 56727, 16790, -26811, -56993, -63529, -36496, 16447, 61650, 68255, 37673, -6824, -46051]
942d6051k0180J3056M5427N0440K3245j2691l5720m2999l3719m038L3505N0222
954B0497L4335K635k3799l8091l7445j6446J7129L9061L4952J4425o928k3633
966A6692l2717k6063k719K1640L0475K3408Q774q599k4053k8158j5710M691J8716
979a3623K1571J7342P689p087k0434k3040j3777L13J2958K1921K3299J1924q937
992C0119k5460k7186j5731J479J8607K9734K6627P175j7355l1100k8915j4854
1004d6860O411K8585L8612K5848l626k9797l8332k9107o565K2429M2515L7847
1016D7960J0037k1041l7548l6658k0183R248L7574M3922K3140p706k9837l8207
1028a9299l1322n874K7621M4108L1464M006j8968l2034l4039j8023J2529L4954
$$ y = [-46051, -66231, -53175, -7748, 42692, 65937, 53246, 17526, -25473, -59192, -63230, -29725, 20497, 54832, 57467, 33668, -4423, -41868, -58314, -41185, -2124, 32828, 47253, 40325, 16692, -16025, -42088, -44807, -23167, 7308, 30716, 39490, 30891, 6838, -21320, -37030, -32339, -13623, 7948, 25290, 32979, 25892, 5458, -17582, -31359, -31046, -18088, 3833, 27132, 39056, 30119, 4659, -22527, -38258, -36779, -18172, 11562, 38189, 45364, 28009, -3091, -32006, -46860, -40449, -11864, 26748, 52596, 48970, 19173, -19159, -48266, -54831, -32402, 10113, 47960, 57997, 36956, -592, -37250, -57433, -48185, -10611, 33311, 56451, 48745, 18908, -19299, -50621, -56495, -28874, 15234, 46698, 50704, 31736, -298, -34337, -52360, -39831, -4877]
1040d877L2855J4706m221k0380l1694k6631k216K2186K7708J9150Q468n328k2476
1053G250k8364j3452P644J6109J5378J5863J1244o162k2604k1039p863J264P802
1066a6930J8621K3311R378j1962k0277j6684j3008n644J3029K9184K3832K989
1078C5839j2740j9488k4729k1137J993K9468L4866J7488k664j7502l0449l2312
1090d1367j0028K2967L7261K7138R529q134k8661l9994k3585J1678L4539L3061
1102B4404K0205K633k2338m1436l2654j36K6345L1779K5709J2984j1256l5209
1114A030l5292j0924J3086K2887K6061K3033L135k5229l4826j8602K315J3184
1126b0142K0215K4342J3082j1358k5271j8555o459J37Q475J9575J8953L251j0290
$$ y = [-4877, 27978, 42684, 38463, 18083, -13611, -40242, -42458, -20272, 7436, 26586, 35054, 29726, 7250, -21114, -34566, -26922, -10813, 4565, 20428, 31672, 25510, 2906, -18133, -25996, -24732, -16930, 1691, 25002, 34380, 22418, 2141, -14543, -27551, -33195, -20166, 9018, 32850, 35839, 23099, 3611, -21118, -42255, -40262, -10794, 24072, 41560, 38896, 21394, -9055, -41367, -51395, -28428, 8833, 35971, 45500, 37366, 8705, -31289, -54874, -43196, -8657, 24404, 44609, 47242, 24904, -16532, -49186, -49322, -22977, 8802, 34511, 47495, 36239, 1030, -34262, -45186, -32100, -9213, 16848, 39881, 43016, 17787, -17039, -35641, -33326, -20142, 73, 24415, 37497, 26139, 868, -17687, -24146, -24009, -15534, 4041, 22994, 26245, 15955]
1139A5955j2006j2009j4030n999J2931K2701J3670R47m064r412j8905j8165m11
1152b8797J7064J9117J2944P635k520j9181k6801j4718N479J8191K3173K1999
1164C3585P307j8390l3747k4853l226J3887K4448K9135J8231r734l3104l2093
1176b8554j3044O441K0805K9966K5438K654k3124l2308k3674o943J2942L0357
1188I56L2121J2364j4335k8285k6613j5790K715K4311L3123J8867o263k1565k2090
1201a0484j5793n033J0651K2324J9736O196o637j3816j7044j3980j883J2261J7823
1214D321J3802N726m401j5047j8651r602M900J2396J1508Q756N401k349j1558
1227E202j4533r650j870O230J4329J7919J0887m697j8379k2022j4467J254J8151
$$ y = [15955, 3949, -8060, -22090, -28089, -15158, 7543, 21213, 22160, 18096, 8684, -10221, -28386, -28797, -11733, 7384, 20328, 27963, 25443, 6262, -20539, -35257, -29778, -11587, 11586, 33585, 40892, 22502, -11245, -36098, -39324, -25437, -989, 28146, 46377, 36643, 3539, -28554, -41598, -35157, -14352, 15614, 41052, 43706, 20582, -11726, -35400, -42343, -29401, 956, 33077, 45441, 31106, 2821, -23792, -39582, -36867, -12556, 20567, 39434, 33171, 11606, -10484, -26277, -31310, -20659, 1665, 21401, 27597, 20960, 7144, -9900, -23880, -25763, -13502, 4321, 18123, 23849, 19448, 4401, -14250, -23852, -18952, -6556, 4952, 13708, 19109, 16760, 5202, -9331, -18981, -20851, -14621, -292, 17627, 28514, 23817, 5438, -16584, -31051, -29797, -11646]
1240a1646K5712J7865j76j6257k2612j9031p270R355K2538K3836J2375m950j9476
1253A0263k5516j9706k348J8316K9786K4789N702j7085l0796k7329q046J5436
1265b6534K9048K6109R846j0506k4362k4808j2503N180J8618K2082J5365J847
1277B9382j2360k0429j8726p937P264J9418K1518J1634m815j7800k0448j2362
1289b5661J647J3984J7726J1541N45q038j1238j0002n719L04N936R248R840P368
1303A7481N28r379j5917j3338k387R863J6736J5297N880p363j6381j5944p670
1316b2594K709J1083J5364J3456M560p329j5949j7844j1957J434J7508K5607J8016
1329C4064j486k0018k6913j9464j218J8655K7965K0636J793j6081k3782j9650
$$ y = [-11646, 14066, 31931, 31755, 15498, -7114, -26145, -33415, -24060, -1522, 22314, 34689, 29739, 10263, -15253, -34959, -37307, -18991, 10795, 35584, 41286, 24201, -6595, -33924, -41970, -26534, 2514, 28623, 38469, 27963, 3601, -21207, -33710, -28530, -9912, 12170, 27535, 29382, 17022, -3407, -22133, -30070, -22806, -3388, 18130, 29764, 24949, 7149, -13299, -25661, -24014, -10030, 7696, 19237, 19782, 11744, 506, -9496, -15215, -14911, -8975, 273, 10113, 17481, 18009, 8630, -7287, -20625, -23012, -13149, 3587, 18884, 24764, 17401, 1020, -14924, -22594, -19885, -8802, 6562, 20018, 24578, 17249, 1300, -16544, -28501, -27067, -9559, 16048, 34064, 32578, 12560, -14353, -33817, -35035, -16380, 11585, 32221, 34014, 17933, -5849, -25499]
1341b5499o380R907K0533K0111J0400l076j5352k1935j7786k417J5505K4091J9114
1354B7216M569j2094k2961k1461o981J1603K1514J8131O117p031j5198j5035p460
1367a9071K191Q384J0394R616N496k228r627j1936q536k074N773J2486J3308N610
1381A9786n783j2502j1439n715J209P183J0049Q417L683j781p167j1322j0956
1394a6338l821O851J4584J5404Q498m602j7625k1307j1176O353J9081K0260J1409
1407B7571k759j5760k0666j4134k36J2555J8491J6211O363p734j8474j9583j0646
1420b8801L655J7051K2956J6203j552j8956k4206j5368O61J5222K1764J6794K134
1433B7557j3090j9157j4468l888O867J3913J4447P900k118j0119j3214j1024l449
$$ y = [-25499, -31879, -21972, -1439, 18672, 29072, 25996, 10644, -11291, -29077, -31494, -15989, 8102, 27216, 31785, 19691, -3270, -24731, -31712, -20109, 1405, 19536, 25653, 18622, 3424, -11611, -19071, -16880, -8496, 1898, 11514, 17010, 14782, 5155, -6781, -15317, -17391, -11618, 868, 14176, 19786, 14003, 1501, -9938, -15653, -14444, -7261, 2788, 11205, 14888, 13107, 5940, -5382, -16338, -20159, -13308, 1276, 16680, 25178, 20576, 2951, -18356, -29532, -23179, -4098, 16162, 27571, 24812, 9052, -11614, -25748, -25984, -13429, 5062, 21273, 27636, 19902, 1428, -18155, -28801, -25146, -8095, 14861, 31064, 29512, 10556, -13650, -29018, -28357, -13135, 8629, 25423, 27557, 14467, -4690, -19158, -23046, -16179, -2266, 12181, 20081, 17963, 7844, -5370, -16394, -19843]
1446a9843P052J4119J2685M417m821j0594j1665p279J297Q887J0279O144J069
1459A1747k719n835p794o249j647L536P658R541P198j88r016j3128r904j654P719
1474a0735J4013J3368M700p094j4396j3824p005K769J2126J6215J1783L14j1365
1487A0869j6931j4367m762Q321J8280J8551P948p446j8457j9582j0337M708J7416
1500e789K0265J1926k406j4608j8897j3767j490J1619J8110J4671L991p841j5228
1513E56j5362p931M058J4088J6014R134k101j1054j3882j0035j438P723J2401
1526B171J0234L263m230q930r509n878M38O066Q356O951L226j834o932q968o004
1541a1580j53M730P331P744N203r42p823j0450p372j267N097J0356J1491N949
$$ y = [-19843, -12791, 1328, 14013, 18430, 13609, 3015, -8650, -15929, -14632, -5745, 4534, 10678, 11747, 9028, 3193, -4601, -10850, -12497, -8961, -1303, 8238, 15436, 15248, 6232, -6896, -16800, -18454, -10735, 3278, 16646, 21346, 14252, -144, -13968, -20973, -18204, -6078, 10137, 21920, 22234, 10869, -6062, -20429, -25191, -16870, 1410, 19961, 27909, 20463, 2006, -17576, -27913, -23205, -5789, 14476, 26402, 23996, 9388, -9509, -23276, -24766, -13147, 4963, 19634, 23625, 15784, 556, -14806, -22737, -18679, -4591, 11423, 20557, 18456, 7402, -6480, -16515, -17953, -10230, 2171, 12405, 15668, 11438, 2508, -7001, -12879, -12441, -6375, 1981, 8932, 12158, 10324, 3392, -5576, -11580, -11733, -7003, 328, 8072, 13275, 12333, 4510, -5940, -13312, -14579, -9482, 874, 12365, 18314]
1555A8314m156j1921j2871p909O37J0187J5515J1969Q27j0053j4646j2723n515
1568b2345N857J5953J6901P440n442j4043j6228j1451M80J4108J9378J2452n76
1581B2484j1340j6506j4674m423J0030J8066J4129L535o292j2687j4592q842L438
1594a7674J3252J3683P537J21p363j3189j2040k331Q087J1341Q766M534j698r362
1608C664j1914n570L118O432N857N664L980j812p436p119l186q64J268O155R250
1623G487N177k379o519p164p012l953M477J1696R829K086l538o256r471r603j744
1638a6887R278J3117Q717K369l993j1524j5017p806N906J4429J3629P869r91j2065
1652G031j8144j1510L141J3045J3686R914L375p545j6679j4570k434Q479J2243
$$ y = [18314, 14158, 2237, -10634, -18543, -17906, -7719, 7796, 19765, 20592, 10539, -4107, -16830, -22345, -16488, -535, 16366, 23806, 18364, 4321, -11907, -23358, -22878, -8770, 10608, 23060, 22484, 11144, -5362, -20036, -24459, -14429, 3637, 17766, 21301, 15009, 2322, -12270, -21112, -17674, -4422, 9261, 16798, 16919, 9556, -3633, -15673, -18004, -9917, 1424, 10190, 14724, 13026, 3664, -8250, -13820, -10702, -4270, 1587, 7251, 11231, 9419, 1983, -5136, -8322, -9186, -7918, -1763, 7487, 12664, 10285, 3766, -3398, -10410, -14363, -9886, 1810, 11639, 13725, 10187, 3931, -5540, -15143, -16887, -7609, 5508, 14225, 16594, 12601, 1077, -13940, -21746, -15840, -1411, 12218, 20087, 19096, 7031, -11113, -22623, -19482, -6437, 7249, 17163, 20538, 12993, -3686, -18256, -20690, -12211, 32]
1665C2J1762P935k088j3510j5866p479L127R508J2480J1018J913j0216j4346q241
1679a3971j16M663Q285J0406N765m009r652p291l013q82K427P621Q171K195l429
1694G170m722m983n598k604M209Q036N291J259k42k685p212p703j550M847O528
1709D1N853N144J226o733j1449p672J59N915R323J0303N292n395j3120j1468l896
1724a6477L320R152J2892R861j247j1996j3975q288m75P377J3522J2952L452q399
1738A1671j3899j1615m942M173J2655J4377O699m527j1113j1375p744p29Q427
1751g942J3507R676J64p347r896q656m040L557R863R820M016k511o688q069n682
1766a0228o1N274O621M530J891p05m090o393m644k17L105M427M821L849L29m386
$$ y = [32, 11794, 19729, 17641, 4131, -11735, -19214, -16087, -6579, 5901, 16919, 18832, 8616, -5730, -13971, -14087, -9424, -1139, 9267, 15032, 11023, 1371, -5920, -8933, -9815, -7388, 233, 8404, 10599, 7170, 2448, -2535, -8133, -10737, -6528, 1508, 6799, 8058, 7816, 5131, -2081, -9784, -11334, -6487, 41, 5894, 11038, 12264, 5531, -5918, -13590, -13431, -7516, 1807, 12110, 17402, 12007, -1113, -12581, -16477, -13157, -4005, 8887, 18748, 17501, 5505, -8470, -16758, -17233, -9856, 3666, 16618, 20070, 11671, -2228, -13843, -18785, -14612, -1957, 12420, 19119, 14592, 3479, -7896, -15640, -16369, -7942, 5565, 15241, 15405, 8058, -1838, -10494, -14534, -10977, -1114, 8706, 12722, 10211, 3523, -4546, -10228, -10289, -5015, 1606, 6136, 8027, 7322, 3232, -3161, -7805, -8022, -4917, -490, 4331, 8180, 8509, 4123]
1782D123o993n305j146K985N967O453L795p39n056p419o526k255M032R006R086
1797A0008M099l111q976j0661o880J208R472J2745Q531p11r293j2376q843j111
1811a5899O803J1426J0445L902m993j1103j1112n510K391R336J1935Q301k65q907
1825F750j2430r273j240P672J2421R757J411o753j0042q143k936L430Q255Q238
1839G117L409k065m935n770n087k138K688O475O187K752r55m335o569n059o7M454
1855c898N397L537J459p19l418m676l007o01O99K428N270N727J512m350p355o310
1871h305k949K349Q329R936M288m077q718q128m631N77O690R849O699J2n291p857
1887a227q155m733K901J0116J0779N158k263q463j1684q802R37J0949J2975O620
$$ y = [4123, -2870, -8175, -9321, -6336, -369, 6084, 9879, 9140, 4084, -3335, -9861, -12116, -8084, 922, 10008, 14107, 10996, 2020, -8641, -15521, -14313, -4841, 7904, 16435, 15724, 6431, -5945, -14788, -15899, -9096, 2330, 12775, 16677, 11684, 581, -10531, -16041, -13650, -4314, 7621, 15922, 15657, 6750, -5680, -14953, -16193, -8521, 3900, 13657, 15068, 8315, -1727, -9870, -12806, -9376, -1121, 7117, 10526, 8461, 3526, -2244, -7331, -9469, -6781, -306, 5881, 8633, 7678, 3343, -3226, -8285, -8352, -3898, 1499, 5036, 6495, 5776, 2358, -2318, -5325, -5926, -5227, -2799, 2471, 8198, 9710, 5360, -1995, -8305, -11254, -8905, -576, 9360, 13648, 9571, 853, -7275, -11906, -11329, -4639, 5210, 11909, 11921, 6630, -1227, -9382, -14115, -11214, -1098, 9681, 14839, 12576, 4113, -7571, -16373, -15436, -4487, 8488, 15108]
1901A5108j748p734j0412q266q12P421J0032O302J082l065o629q023m522J845
1915i421O306O994N337J687m386r107p332m43N141O321N040K331j924n854n460
1930d770j183J777J776J705K855K767M07j954l095l888l636r8N023O832L658p93
1946G383l667n490n507j995L599O621N072J816o02l494o595o295j417M465P693
1961A587P230L642k847r324j0380m347M144R540R660N188k405r423j0630n032
1975a3397K630P376Q221N941R36n292q885p146j914L437P288Q280M888k010q105
1990B248r105m811J477O737Q519N433q57o057p014m088j4L142M867M165J463j346
2006D759k771l095k901j688R46L614M286K595k03k746m107l519j084J799L579
$$ y = [15108, 13360, 5626, -4786, -13052, -13864, -6443, 3589, 9891, 10973, 7908, 1279, -6744, -11266, -9421, -3115, 3879, 9216, 10903, 6517, -2590, -9922, -10365, -5224, 1097, 6137, 8468, 6544, 690, -4770, -5953, -4176, -2400, -695, 2160, 4927, 5334, 3380, 285, -3603, -7239, -7337, -2314, 4518, 8176, 7383, 3716, -1774, -7281, -9276, -5677, 944, 6016, 7832, 7230, 3736, -2859, -9154, -10571, -6106, 1587, 8817, 12459, 9612, 288, -10092, -14439, -10295, -755, 8905, 14093, 11688, 2265, -8365, -13397, -10767, -3391, 4830, 10771, 11707, 6415, -2470, -9616, -11530, -8093, -805, 7475, 12363, 10353, 2248, -6857, -11668, -10191, -3454, 5065, 10498, 9641, 3584, -3430, -7518, -7532, -4390, 477, 4642, 6105, 4759, 1988, -1107, -4008, -5696, -4750, -1136, 3150, 5745, 5542, 2796, -1311, -4830, -5914, -4115, -536]
2021e36L563K124j4k079l481l651k367L57L644N740M661O28m153p172o057j481
2037a0274M214P816P026K347l629p873p746l163K948P108P379M213o14n556q211
2052d015o364p59N215Q268P068K382l847q441q299l203L389P848Q049L977k233
2067I035p231p658l641J432M853O038M665Q06l667n939m461j184J708L871M782
2082C409L189n27l781m387k814n39J902L696L397J022j151j883k119k353j491
2097d430Q13K654K662J909J142o99l517m625k389J242L709M415L539P51l392n897
2113b113m657r38K575N088N818L267j765o101o547l454O07M568P237N936M91n437
2129D575p676n489j254L497P249P223K436l634p010o427l082J500O100P507M000
$$ y = [-536, 3027, 5151, 5137, 3058, -423, -4074, -6441, -6084, -2440, 3300, 7961, 8589, 4436, -2736, -8793, -10274, -6060, 1756, 8782, 11129, 7500, -373, -8119, -11282, -8334, -1226, 6153, 10366, 9752, 4196, -4015, -10379, -11138, -5923, 2345, 9413, 11795, 7948, -493, -8792, -11995, -8606, -758, 7291, 11268, 9035, 1804, -5854, -9495, -8063, -3210, 2828, 7493, 8299, 4632, -1307, -5768, -6952, -5244, -1373, 3409, 6598, 6071, 2290, -2097, -4911, -5450, -3548, 148, 3545, 4567, 3416, 1533, -586, -2939, -4430, -3617, -963, 1699, 3608, 4750, 4051, 534, -4091, -6480, -5238, -1529, 2886, 6425, 7176, 3784, -2113, -6770, -7708, -5133, -45, 5773, 9040, 7275, 1174, -5373, -8827, -8220, -3652, 3585, 9521, 10012, 4575, -3101, -8590, -9844, -6347, 902, 8125, 10561, 6927, -83, -6510, -9592, -8092, -1992, 5515, 9515]
2144I515j519n340o149m376n55M081O768M902L00l329m859m445k101J798M800
2159e09M485J673r57k602l540l053n12K288L187K138J038q3j728k928k145k10
2175c458J039J447K065K231P67j459k654k513j763l19K256M253L439M46k463l947
2191f33m077k267J498N033N399K450j344m127n384m081j58M292O225M555P66l146
2207E001o120o007k108L206O494N946K531j852n860o978l620J918N896O169L439
2222H055n59m367o238m355OL793N259M188J369k373m967m587j671J572L645M198
2238B968K762l92l439m082k195K12J781K574K441J037q45j925j780j219o49K96
2254b455J479K044J558O47o03k116k889j844M71K299K844K326R35j371l518l713
$$ y = [9515, 7996, 2656, -3493, -7869, -8424, -4343, 2425, 7327, 7627, 4298, -561, -5006, -7107, -5309, -509, 3976, 5649, 4692, 2090, -1450, -4503, -5015, -2727, 460, 2598, 3636, 3553, 1825, -1103, -3248, -3458, -2419, -972, 1093, 3324, 4091, 2632, -22, -2535, -4298, -4617, -2361, 1892, 5331, 5777, 3314, -633, -4710, -6977, -5479, -446, 4953, 7403, 6059, 1932, -3452, -7533, -7691, -3399, 2826, 7381, 8147, 5001, -1119, -7126, -9234, -6028, 466, 6412, 8943, 7091, 1231, -5747, -9367, -7449, -1553, 4616, 8055, 7496, 3129, -3109, -7464, -7458, -3665, 1594, 5782, 7151, 4778, -189, -4776, -6447, -4875, -1230, 2968, 5730, 5338, 1899, -2183, -4378, -4166, -2385, 189, 2630, 3667, 2822, 897, -883, -2102, -2751, -2455, -976, 1068, 2626, 3273, 2670, 554, -2335, -4179, -3708, -1409, 1435, 3761, 4696, 3325, -193, -3906]
2270c906j609J200L271L991K953Q9l367n103l918n95L081N421N000J440l068n867
2286i87n164j847K234N326N812K839j759n260n624l084O82M129N658M132K29l659
2302C657n481m352j066K715N179M735J574k156m477m351k058J139L736M084K132
2317E010o08k552l087k235n06J433K544K217R49m68j480j953j572n08P75J573
2333d68J659J110K17p97j632j739j124k5J228K187K210J018r15k587l015j852
2349d525L17K671L809K870J61k778m257l399p93K285M373M231J690j945m535m667
2365d492k258J202M196N093L145n95m005n173l617j77L407N280M084O30k984m746
2381a010m031j407J932M424M399J769j568l740l842k160N33L024L814K368k11
$$ y = [-3906, -5515, -4315, -1044, 2947, 5900, 5989, 2622, -2481, -6399, -6994, -3913, 1508, 6508, 7948, 4880, -987, -6151, -7998, -5764, -438, 5374, 8213, 6454, 1194, -4430, -7514, -6832, -2703, 2955, 7087, 7316, 3657, -1824, -6176, -7242, -4527, 652, 5387, 6961, 4805, 328, -4023, -6081, -4942, -1206, 2878, 5010, 4402, 1850, -1237, -3472, -3978, -2545, -1, 2216, 3165, 2697, 1217, -736, -2308, -2816, -2041, -468, 1191, 2301, 2518, 1721, 89, -1650, -2774, -2799, -1571, 616, 2826, 3844, 2929, 342, -2673, -4525, -4208, -1537, 2272, 5142, 5303, 2525, -1732, -5131, -5924, -3639, 734, 4965, 6655, 4710, 175, -4492, -6750, -5548, -1352, 3741, 6886, 6291, 2286, -2887, -6504, -6681, -3274, 2006, 6090, 6720, 3736, -1010, -5041, -6448, -4516, -92, 4307, 6076, 4508, 768, -3074, -5234, -4701, -1677, 2137, 4505, 4294]
2396D294k251l012k391n96J540K698K050N72o46j337j771j365j55J040J320J012
2412A002P37L11o14j447j414o85K3Q12J699J853P38q28j844k008j566l45J780
2429a796L235K579L31j913l102l026j493J340L819L946J659j295l479m075k554
2444e824O62L677M348K602j62k675m257l752p85K898M647L508Q88j870l953m235
2460d283j875J771M214L966J716j103l415l951k072R12K905L050J934K62j842
2475B189l138k398j72J597J993J662J083j38j746k227j153K97J089J231J097N03
2491A769l65q10p40o52p61k31Q21J353J068N85P4j008k250k037j16J948K611J796
2509C055M66j158k615k810j181J147K828L000J763n05k779l577k256J60K389L588
$$ y = [4294, 2043, -969, -3360, -3956, -2416, 282, 2332, 2904, 2258, 921, -850, -2215, -2370, -1330, -10, 1002, 1739, 2050, 1436, -11, -1425, -2110, -2087, -1275, 424, 2277, 3015, 2187, 343, -1665, -3231, -3576, -1796, 1439, 4018, 4349, 2436, -666, -3692, -5185, -3845, -26, 3920, 5579, 4284, 805, -3270, -5824, -5162, -1485, 2863, 5465, 5303, 2628, -1629, -5381, -6166, -3268, 1379, 4887, 5775, 3905, -48, -4283, -6158, -4387, -173, 3793, 5509, 4406, 991, -2960, -5032, -4120, -1215, 1835, 3769, 4031, 2189, -949, -3347, -3519, -1922, 71, 1733, 2816, 2678, 932, -1295, -2448, -2151, -1062, 169, 1266, 1769, 1404, 594, -146, -798, -1559, -1790, -969, 384, 1452, 2037, 2111, 1103, -1147, -3184, -3300, -1352, 1259, 3055, 3521, 2363, -252, -3062, -4243, -3096, -268, 2732, 4495, 3990, 1211, -2366, -4622, -4462, -2073, 1515]
2525A515L218Q38k548m517l517m64K359L842L465J397j718m012l833j401J530
2540c846L384L443J792p55k788l259k085m3K047L261K635L90j979k910k155o03
2556c471J024K237K328J063q65j996j678o09L28Q05R44Q43M43n7n58q35q37n21
2574a412K3N80J041J106O45l42j279j560r34O0R51J500J539Q82m92k013k490j356
2592c551N58K171K691J888P0k145l397k586j32K397L504K676M50k032l421k903
2608c762q43J487L133L205J598j075l220l339j620O02K424L263K498J30k589l610
2624a718k314O1K012K880K332N66j622k669k080n62Q99J946K002R00o69j461j292
2641g89q19l28N44J493J392K04p31p53n46n90l74L69Q14N96K56K94P9n96j073
$$ y = [1515, 4733, 5571, 3023, -1494, -5011, -5475, -3116, 726, 4191, 5588, 3870, -142, -3975, -5376, -3846, -462, 2981, 4773, 4018, 1230, -2029, -4114, -4157, -2110, 1151, 3786, 4176, 2197, -713, -2868, -3471, -2447, -210, 2118, 3181, 2316, 320, -1358, -1967, -1639, -834, 110, 953, 1396, 1339, 781, -54, -891, -1412, -1389, -809, 232, 1338, 1983, 1641, 362, -1198, -2132, -2072, -1121, 379, 1918, 2800, 2308, 295, -2195, -3551, -2993, -822, 1869, 3757, 3827, 1682, -1715, -4301, -4433, -2036, 1468, 4144, 4594, 2562, -859, -3762, -4605, -3118, 15, 3220, 4818, 3743, 523, -2816, -4436, -3834, -1410, 1853, 4351, 4481, 1892, -1718, -4032, -3971, -1959, 921, 3253, 3819, 2197, -472, -2552, -3114, -2215, -269, 1733, 2633, 1964, 503, -789, -1608, -1936, -1392, 101, 1493, 1697, 966, 213, -333, -923, -1297, -928, -114, 482, 738, 1032, 1111, 515, -558]
2660e58q34k38L25J147J746J128n95j974j879q93J58J338K393K080O6k067k626
2677a283j729l69J150K612K718R60j393k719k608j430N65K804L422J677r21k573
2693H83k819j976j15K282L536K231l57k128k571k049o35J430K878K299M05j199
2709B095j985k071j200O46K214K070O87m43j132j581j390j08J370J528N95n1k73
2726I71o25r33n15K59M49J65K95O79M13l24o32n39n91n94J86J310J421N21m12
2745A504r44j385j396l35J328K148J518K74r69j981k231j005J131K506K209R94
2761C366n55k114k834j730O33K490K671J537m3j864k924k253n5K011K759K017
2777C112N00j393k768k416n59J388K297K069R52o83k167k300r49P11J626J706
$$ y = [-558, -1392, -1630, -1305, -158, 1588, 2716, 2121, 147, -1732, -2625, -2467, -1129, 1264, 3344, 3410, 1343, -1283, -3012, -3381, -2231, 381, 3099, 4059, 2666, -53, -2661, -4091, -3526, -722, 2700, 4377, 3456, 883, -1936, -3912, -4027, -1745, 1791, 4022, 3665, 1537, -1034, -3083, -3718, -2288, 590, 2889, 3294, 2095, 110, -1961, -3161, -2515, -301, 1769, 2456, 2013, 881, -700, -2090, -2198, -828, 700, 1295, 1244, 971, 346, -587, -1102, -843, -394, -229, 66, 745, 1158, 834, 202, -337, -928, -1522, -1336, -26, 1395, 1916, 1504, 560, -825, -2221, -2556, -1228, 920, 2438, 2712, 1743, -238, -2469, -3474, -2343, 163, 2372, 3366, 2811, 697, -2137, -3867, -3234, -744, 1927, 3464, 3421, 1557, -1367, -3620, -3675, -1664, 1095, 3112, 3612, 2219, -549, -2965, -3524, -2136, 161, 2230, 3182, 2499, 332, -1968, -2917, -2206, -580, 1126]
2793A126J114Mj276j769j080M9Q25J156R96L45m89r27o50k29J5K16M47M41K15
2812E29P3K7j38n60p60m08K84P52R48P58R2q52j373j072k41P36J442J504O76o38
2832A779j710j753r56L85J661K174J392k32j815k358j611j7J710K555J873J14
2848C191j606k457j958m38J321K420K062O11j043k084k106r93O92J992K097J081
2864B782l77j585k043j335J43J551J825J118Qj029j519j157j34Q56J102P75K33
2881A214k89p11o86l12J33K37K76L60L65N2k76k87k27l15l03P6N10N99M14J42
2901I72k38p99j015n29M11J067J196Q31q6j299j799j074L33J372J717J264J38
2918B462j319k136j498l5J257J867J602N77r37k078j905o33P81J814J977J134
$$ y = [1126, 2240, 2244, 968, -801, -1881, -1832, -1007, 149, 1145, 1490, 1001, 74, -576, -805, -790, -574, -127, 314, 529, 602, 629, 491, -69, -829, -1237, -953, -201, 747, 1505, 1597, 745, -628, -1700, -1941, -1205, 237, 1741, 2417, 1779, 69, -1684, -2640, -2255, -594, 1580, 2972, 2740, 925, -1433, -3044, -3061, -1351, 1204, 3077, 3191, 1585, -872, -2830, -3268, -1947, 473, 2535, 3146, 2103, 19, -2087, -3080, -2388, -396, 1701, 2782, 2405, 820, -1223, -2558, -2415, -864, 961, 2079, 2087, 1058, -461, -1618, -1752, -896, 206, 981, 1214, 925, 214, -472, -784, -651, -414, -138, 222, 587, 639, 363, 76, -151, -466, -769, -693, -183, 416, 830, 972, 734, -65, -1080, -1609, -1198, -131, 1065, 1896, 1810, 511, -1288, -2362, -2029, -657, 1060, 2324, 2462, 1143, -993, -2491, -2526, -1269, 598, 2200, 2777, 1840, -238, -2143, -2776, -1995, -181, 1796, 2930]
2934B930n39j992k107r94M20J542J971J367j82j632j935j024J53J028J507J249
2950A762K00r61j371r24k37M29R69J068M63m24q37o48l21j6L98O65M28j44k97
2969B02q6l7j71k35o4J9Q2L34O25L76l02p87p48m43R2P81J228Q32j76j039j238
2990g55r04k04Q12J597J410K63r95j592j460n99O74J799J838O92p32j690j772
3007a618r95M00J743K016J023m26j468j770j239j5J364J915J264nj075j621j358
3024a865l11R57J604J243K54o49j248j172n01N42J112R36K74k52n90p25m84Q1
3042g94M68M82K27N9o9k13k18j01m2j21j02J49L21L54K52J7l28p14p38j11O53
3063e69J031Q21J96n72j203j157m02O86J386J278N21n86j371j460o78M43J291
$$ y = [2930, 2391, 399, -1708, -2702, -2282, -740, 1231, 2598, 2416, 784, -1151, -2175, -2022, -994, 513, 1762, 1962, 1001, -370, -1294, -1531, -1102, -133, 935, 1398, 974, 137, -511, -832, -848, -450, 215, 643, 499, 202, 116, 79, -92, -327, -391, -372, -290, 44, 669, 1045, 743, -44, -792, -1235, -1143, -362, 866, 1698, 1522, 483, -755, -1659, -1863, -1051, 546, 1956, 2219, 1224, -368, -1828, -2427, -1753, 46, 1884, 2576, 1844, 154, -1618, -2613, -2213, -470, 1546, 2569, 2143, 675, -1095, -2334, -2349, -985, 930, 2194, 2189, 1114, -507, -1865, -2176, -1219, 385, 1628, 1882, 1233, -15, -1187, -1688, -1146, -34, 902, 1176, 924, 334, -391, -875, -794, -326, 156, 383, 442, 373, 160, -58, -159, -201, -322, -424, -275, 46, 400, 652, 669, 341, -373, -1111, -1222, -569, 462, 1283, 1479, 907, -296, -1453, -1855, -1169, 217, 1495, 2016, 1430, 59, -1401, -2079, -1636, -345]
3080c45J524R64j09j299j779j198Q6J260J758J274J69j116j863j435k03J085J743
3097E16J362K61q92j527j245l73O16J233J166N46l63j037j084n38J51P37R13O58
3115A100N5o17q52n66L4M81N50K95l6k34k25p2P5M3j15k06r6J58M62M51J09l84
3137D10p03n87o3M12P21O73L14l10q51r02m69K62Q02J010P79J7q77j371j039q7
3157a859R93J576J188J45j086j651j236j52J004J577J286K81r35j500j190k87
3173a846O29J169J236O36l37j182j295p06K17R96J245Q34o1r70j220p70Q0Q36
3191e09J059O53j84p10o97l04R3L08L74K80nk08j59J6Kj26j52K4J36J34J35J19
3213B79M6j39k05k73k85m5L71O77N28j1n59p90p31k29O49J271J058Mr69j261r30
$$ y = [-345, 1179, 2143, 2034, 735, -1044, -2242, -2156, -896, 862, 2136, 2305, 1189, -674, -2109, -2312, -1227, 516, 1878, 2139, 1247, -280, -1525, -1898, -1282, -49, 1117, 1663, 1300, 263, -821, -1359, -1208, -471, 442, 1100, 1155, 538, -314, -880, -846, -365, 185, 480, 444, 210, -15, -87, -12, 31, -84, -290, -386, -228, 234, 685, 794, 410, -293, -880, -943, -531, 190, 863, 1177, 867, 16, -886, -1355, -1093, -291, 719, 1498, 1515, 638, -733, -1772, -1859, -866, 710, 1898, 2043, 957, -694, -1930, -2082, -1078, 499, 1785, 2066, 1131, -369, -1559, -1846, -1217, -48, 1188, 1824, 1487, 305, -990, -1696, -1479, -483, 762, 1596, 1535, 565, -655, -1425, -1345, -509, 550, 1203, 1019, 309, -388, -692, -599, -291, 83, 363, 358, 150, -9, 7, 9, -117, -269, -245, -109, 25, 160, 279, 325, 186, -19, -292, -577, -622, -251, 426, 954, 943, 384, -406, -1137, -1366, -717, 554, 1612, 1616, 647, -614, -1544]
3234a544j18Q30J346J054J86p52j297j095m09N76J296J200M96m01j067j299q85
3251a883J51J252J562P96k70j120j343q93R9J058J350P88j65q86j059o77M0O99
3269e01Q14N15M8l02n31o04k85K81N50M32J16j21k39l25k28R0K67J67o9j62RJ24
3291D6K34J52j53m90m65n9M37O46N00J30m42q93q06r7O81R84P00J99m98r86r62
3312a142m00M67J068J070N66l00j115j294o83K84J100J306Q70j37j113j478q75
3329a806J77J085J297Q53Jq90j273r07n0P86J085Q43K20n76r80q64k57M30Q12
3348a4P98L29k94p60o96k56K57N14M71K42j60l58l19o8J30J65O6n3p3qJ45K01
3370B59P4j56l16l21j22K09N01M99K03k57o42o62l08K93P36P92M63k32q24r76
$$ y = [-1544, -1662, -832, 514, 1568, 1754, 1002, -295, -1390, -1799, -1223, 73, 1273, 1769, 1368, 301, -998, -1883, -1732, -480, 1082, 1878, 1608, 488, -855, -1748, -1649, -591, 759, 1547, 1382, 496, -563, -1240, -1200, -501, 313, 828, 876, 574, 43, -561, -846, -565, -15, 417, 533, 412, 173, -152, -380, -290, -23, 144, 75, -87, -78, 46, 280, 432, 279, -211, -676, -735, -298, 348, 848, 978, 536, -357, -1163, -1260, -579, 405, 1105, 1304, 806, -180, -1142, -1542, -1075, -7, 1063, 1629, 1329, 214, -1080, -1763, -1479, -379, 927, 1797, 1660, 547, -931, -1806, -1629, -544, 753, 1606, 1607, 717, -556, -1463, -1513, -727, 358, 1201, 1421, 845, -135, -999, -1256, -826, -14, 784, 1113, 819, 59, -637, -893, -636, -122, 349, 591, 431, 73, -246, -314, -184, -19, 47, -6, -79, -87, 58, 259, 333, 177, -139, -460, -582, -373, 128, 627, 830, 573, -69, -731, -1039, -746, -10, 782, 1245, 1013, 189, -787]
3390g87n80K05Q93J061O58r2q75j170q12K8Q69J218Q68J02q26j276r53j31P60
3409h40J186R69K74o17j192j049k76N98J017R03L82l60r10r31l95K98P56P73M68
3428A054j65o40p43l46J66M32M68L70Ml88m52j58J87K04Q5Ml2o5k5J18J72j5k41
3451fk86j23N4K99M56L25j62n53n21k46P5L98O89O15J0p00q84n68KN79R36Q57
3473A246J50p18j146q65j52O43J186J039K28p61j157q71k97M31J055J161M56n59
3491A069j087r28l96K02Q57J066O25k10r01r65n61R0P48R78N46k06o67o45m05
3510g90m8M27O97M29j66m61l09o9l9Q7K36K13m7j53n6M4M8j3mo7k42o4K50L56
3534B59J73j5j62l69n47k05M40Q10N82j0m73p54p21k17N39J021P99J35n12r47
$$ y = [-787, -1367, -1162, -269, 792, 1450, 1358, 483, -687, -1499, -1471, -602, 616, 1484, 1586, 760, -516, -1469, -1600, -840, 346, 1315, 1589, 972, -220, -1269, -1545, -947, 70, 973, 1355, 995, 85, -846, -1241, -943, -187, 586, 1054, 889, 249, -494, -840, -674, -242, 226, 596, 600, 212, -240, -398, -211, -7, 78, 82, 50, -15, -40, 78, 250, 235, -6, -292, -415, -361, -62, 394, 719, 557, 4, -517, -763, -688, -290, 399, 1014, 1024, 324, -560, -1128, -1126, -547, 389, 1246, 1396, 678, -468, -1333, -1485, -842, 344, 1383, 1611, 850, -307, -1178, -1475, -1044, 11, 1172, 1628, 1069, -18, -946, -1342, -1140, -283, 783, 1408, 1198, 297, -668, -1229, -1139, -391, 587, 1133, 927, 260, -385, -790, -838, -411, 286, 715, 549, 88, -221, -290, -329, -242, -6, 207, 160, 7, -49, -5, 43, 30, 26, -41, -283, -347, -97, 259, 432, 417, 255, -114, -661, -866, -426, 384, 966, 956, 483, -271, -992, -1209, -670, 351, 1150, 1285, 773, -174]
3554a74r40l33N29J087Q78L29l31q74j109o34L07J091J102N19k12q74j096p61
3572a496J42R34J118O24q1p57j016o90M8P24Q52N28L7m05p36o48p1M44O21M03
3592E75J21k32m31m57j12K44L47K17L0j34j88j43O9J81M7j56j87l3J06K09K64
3613C37J50j98m66m23j06L12N06N29K21l09o85o62k33L14P13P70M13k80q38q99
3633h34m38K51Q52R75N65j84q91j050n93J34Q28J069O84q0p71j031p11m4O72R97
3653D00P90J00n98r71p75j61N00Q88P50J99m51p61o70k37L33O73N81J67k64m64
3673B9m18j85J45L58L20Q8r6j70j71q3P8J19M8q3q6jJ29J51J24j7k36l84k10J39
3697d12M39M93K28j53n25o50l43K48O14O74L77j42o35q42m82J47O99Q16N50Mo22
$$ y = [-174, -1114, -1447, -918, 169, 1047, 1376, 1045, 171, -938, -1572, -1265, -174, 928, 1447, 1235, 361, -735, -1496, -1354, -420, 698, 1322, 1241, 484, -532, -1222, -1174, -450, 402, 930, 967, 562, -174, -822, -893, -449, 172, 575, 696, 464, 33, -424, -536, -292, 55, 272, 302, 168, -20, -163, -94, 87, 134, -22, -209, -242, -136, 73, 337, 487, 289, -177, -600, -706, -394, 112, 641, 862, 553, -132, -794, -1027, -713, 0, 770, 1183, 903, 65, -834, -1272, -1021, -169, 806, 1371, 1187, 296, -754, -1347, -1213, -385, 684, 1368, 1288, 517, -514, -1225, -1269, -597, 400, 1190, 1290, 692, -279, -1054, -1215, -715, 173, 923, 1122, 671, -90, -760, -997, -664, 9, 590, 757, 493, 29, -389, -574, -429, -71, 249, 337, 241, 71, -100, -183, -105, 14, 62, -21, -107, -108, 21, 172, 296, 279, 43, -341, -551, -412, 27, 520, 748, 595, 70, -580, -923, -675, -61, 613, 990, 848, 213, -629, -1111, -964, -265, 551, 1101, 1105, 483]
3718D83r72p51k2P00R80P50J51o21j066q79j25O59R80Q07K63n22r98q60j93M97
3738g39Q08P16L06k47p42p41l39K57N64O24M10j09n23o28k89J21L61M38L00m5
3758E03l74l65r0J88J64O3j7o2j08K1J55J54k5k42k38j22Q1K89L61K30j32l93
3780D1m65k34L8L67O23N14j1n55p67n22n6N37Q86P50J01o61j006p61j03O20J025
3801C61Q59J39o20r69q07k63M29R41R25L57m37q59q46m37J95P84R47N48k13p88
3821B46q37n15J16O77Q12M80j53n79o18l79N7M19N33L01r4k67k84j71o8J20K26
3842B2J54%j05l6j4NJ4j9r3j06l4J39K71K36K5k34m50m15n7M03O37M83L1m61p37
3867c41o12q2N28Q24O70J05m89q37p50k37M40Q64Q16L47l33q79r07m76K92R12
$$ y = [483, -489, -1240, -1262, -562, 418, 1168, 1319, 698, -368, -1247, -1372, -713, 267, 1074, 1337, 815, -183, -1043, -1236, -739, 69, 785, 1091, 844, 102, -639, -978, -721, -157, 467, 877, 768, 245, -383, -672, -551, -190, 248, 548, 503, 129, -236, -326, -138, 26, 89, 72, 10, -98, -77, 78, 232, 207, -35, -273, -395, -314, -25, 336, 566, 434, 41, -424, -658, -620, -253, 370, 884, 873, 318, -449, -971, -1027, -490, 396, 1146, 1247, 586, -420, -1181, -1284, -664, 361, 1220, 1359, 739, -230, -1037, -1300, -871, 70, 995, 1352, 915, 56, -790, -1227, -1032, -248, 699, 1247, 1034, 246, -591, -1106, -990, -313, 499, 979, 826, 247, -371, -750, -693, -274, 259, 560, 466, 199, -85, -256, -324, -204, 22, 176, 176, 71, 35, 21, 26, 40, 21, -72, -178, -212, -73, 198, 434, 459, 225, -225, -640, -697, -294, 343, 826, 857, 396, -341, -953, -1035, -507, 317, 987, 1092, 603, -234, -984, -1221, -781, 83, 899, 1246, 913, 34, -873, -1349, -1057, -145]
3887a45R61N21k17q39j015n70J61Q34R63N44j16o88q62n80L1O02P70N45J6m26
3907D90o46n15j18L12N42M54J59k23m48m03j07J51L22K51M9p9j74j16%P3L6o3
3929e3j30m0J52K35J82j8k02l55l02k1K84M99M27O6l28o00n32j50L56O52O33K90
3951A045l08p55p95l67L19Q17Q45M33k21q03r60n55J86Q38R88N76j17p73r85o29
3971a221J0O88R31P09Q3n94r49p10j16N03Q13O95K09l48p62o81k26L22O09N66
3991E31K24j79m60m77k24J35L29L34J66n4k13j75p1L4L4KK5J2N8P4J32M8j57k82
4015a54k50k7J85L79L64J63k37n43n11k20K42O13O60L37k60p06p39m06J80O87
4035b43Q94N79j37p76r62o17P2O93J007P47N5p07j033p67j27O10R83Q32K04m99
$$ y = [-145, 816, 1337, 1120, 281, -734, -1304, -1143, -309, 654, 1198, 1082, 394, -468, -1048, -1017, -415, 355, 900, 916, 490, -156, -671, -789, -477, 65, 519, 678, 455, 7, -396, -503, -352, -30, 221, 270, 191, 17, -99, -99, -26, 10, -53, -183, -223, -71, 164, 346, 328, 126, -229, -531, -552, -268, 231, 658, 724, 396, -204, -736, -886, -530, 122, 755, 1045, 737, -18, -813, -1180, -861, -44, 801, 1234, 1013, 210, -750, -1305, -1119, -281, 707, 1283, 1166, 393, -592, -1221, -1211, -523, 408, 1117, 1200, 606, -343, -1053, -1169, -666, 147, 842, 1051, 703, -59, -740, -966, -644, -35, 531, 755, 576, 116, -361, -585, -450, -121, 213, 379, 325, 112, -63, -134, -100, -66, -64, -39, -27, 31, 105, 237, 285, 128, -154, -404, -431, -246, 133, 497, 660, 423, -120, -631, -851, -609, 4, 664, 1001, 741, 35, -704, -1110, -930, -243, 651, 1230, 1093, 317, -645, -1262, -1190, -497, 510, 1257, 1312, 605, -428, -1195, -1322, -712, 271, 1103, 1307, 808]
4055H08r28q04l22L77Q76Q35L43l38p39p40l42J59O17O86L73j37n05n52l41P2
4075f02L46M37K36j0k17k44j88n3J10J37O6nJ3P9O0k9r8j70j47p3J18L17L35J68
4099E86j52m21n15k70J66N33O40L63j14n68p98n32O6O92Q94N97n0o47r12p14p1
4120a227N84R76P92J79n74r57q47k78M67R32Q88L72l57q92r66m25L19Q45Q82M21
4140A134j77p19q04m78R8O04P25M71j8m66o18m17k8L23M62L62J17k01l47k95j11
4161c83J10K09J67O7j5k8k2n0o9r2r8p2Q2K30L07J70j31l90m61k41J23M64N56
4184D33L87r0m97o90n14ON57Q14O05M6n12q43p26k15M77R52Q43K92m67r30r05
4205i77l76L84R16R50M30k67q54r96n39K35Q15R25N04p5o14r00o26n0O01Q14N94
$$ y = [808, -120, -924, -1246, -869, 7, 842, 1185, 847, 108, -632, -974, -815, -198, 488, 861, 724, 219, -333, -674, -602, -256, 181, 417, 407, 190, -54, -242, -295, -185, -48, 18, 13, 26, 105, 165, 136, 38, -132, -279, -352, -234, 83, 418, 586, 434, 13, -502, -772, -606, -73, 567, 930, 816, 248, -550, -1082, -1016, -324, 570, 1167, 1117, 470, -442, -1156, -1227, -643, 333, 1125, 1304, 730, -227, -1074, -1352, -885, 47, 935, 1307, 950, 58, -908, -1333, -1014, -169, 713, 1134, 957, 238, -566, -1044, -946, -342, 383, 854, 836, 370, -248, -665, -693, -370, 92, 454, 571, 370, 23, -272, -383, -273, -64, 103, 170, 155, 127, 105, 55, -14, -106, -204, -276, -194, 36, 343, 513, 382, -8, -469, -710, -587, -123, 433, 820, 730, 233, -457, -971, -965, -408, 406, 1011, 1057, 545, -298, -1024, -1239, -762, 190, 1033, 1325, 858, -72, -977, -1353, -969, -53, 897, 1327, 1060, 206, -790, -1329, -1094, -279, 646, 1150, 1075, 461, -439, -1065, -1115, -514, 300, 894]
4226H94Q4m49o75n94j42L23N63M76K05j89m34m34j50J52K45J94J45N4o3j62j29
4247h6j2k4q3nJ19K06J86J06q9l00l91k12J14L60M72L93J6m30p21n25j9M96P33
4270C04O31J81m49q70q05k48M51Q90Q80L73l52r60r71m59K90Q52J005O29j23q87
4290C62j098o31Q3P53R86P82P0o73j032p42r0N11Q83P55K41m27p77o47k57K30
4310g18N74O62L46j80m95m91k56L7K58L75K91Kk03j74j36q0k4L4O9O4J25J83J16
4333C79j16l21l39j40N7L05M64M19Rm25o01n04j21L86P26O77K53l68p95q01m18
4354a274K75Q82J005N09k72q87j011o10J07Q48J131P20o7q00j057p95r3O89J056
4373C56Q25J83n39r51q96l35M19R41Q75L14k89p67q14m16J67O56P46L67j09m67
$$ y = [894, 978, 529, -146, -740, -882, -559, 4, 480, 685, 496, 62, -372, -522, -370, -125, 69, 214, 268, 205, 43, -86, -98, -122, -205, -210, -91, 115, 301, 407, 318, 18, -373, -585, -471, -111, 361, 754, 770, 340, -381, -906, -925, -429, 304, 935, 1116, 667, -203, -1008, -1256, -805, 85, 965, 1338, 986, 26, -945, -1404, -1114, -262, 743, 1372, 1249, 362, -736, -1367, -1284, -531, 455, 1237, 1307, 634, -398, -1140, -1230, -719, 164, 919, 1160, 733, -44, -691, -948, -718, -144, 518, 864, 684, 189, -302, -558, -521, -263, 112, 403, 405, 202, 28, -108, -188, -212, -178, -109, -45, 80, 263, 379, 263, -58, -397, -537, -480, -175, 289, 708, 717, 292, -309, -813, -934, -548, 178, 855, 1108, 740, -55, -856, -1274, -999, -117, 888, 1397, 1125, 238, -773, -1383, -1276, -428, 703, 1423, 1356, 556, -501, -1296, -1389, -700, 356, 1181, 1364, 825, -126, -1022, -1357, -938, 3, 878, 1192, 903, 136, -678, -1094, -927, -271, 475, 842, 733, 266]
4393B66n52l75PK91M01L16Q1q8k57k44j52K9O6R9J79J59Q9m8j29j79k38j55J7
4416d17K64M29L50P6l15n56n50k02L22O83P07L23k79q02q58m48K72Q26R14N69
4436A308j71p73j021o81K4P41J030Q04J21o54j067q89k20N27J058R87L57m93j032
4455d4r53m11L60R26R33M66k33q05q43m80R9O12P57N24Lm31o31m87j58K55N39
4476bM54J80j71l28l26k40K0J83K44J34N0L3j6j01k02j97j51J4K50M01L59N0l28
4499C10m93n12j88K96O44O66K75k46o59p27m99J11P28R22N96j6o94r72p86j31
4519a375O78J077Q96K06o02j076j005l36N37J101R80L95l75r60j053n51K92Q81
4537b90R87N67p1p10r73o88l6O29Q62O47J53m40p64o67j69L45N81N07K52j47m06
$$ y = [266, -286, -661, -654, -363, 38, 354, 435, 347, 90, -154, -306, -277, -211, -112, 67, 226, 315, 267, 138, -41, -279, -434, -417, -153, 276, 626, 702, 387, -169, -719, -921, -599, 84, 791, 1114, 835, 33, -825, -1273, -1001, -175, 739, 1308, 1137, 364, -657, -1338, -1314, -573, 457, 1261, 1382, 728, -339, -1228, -1448, -921, 137, 1124, 1481, 988, -44, -997, -1408, -1048, -122, 811, 1277, 1044, 239, -604, -1084, -985, -373, 384, 908, 911, 480, -151, -638, -796, -541, -2, 452, 632, 461, 133, -193, -433, -413, -230, 14, 148, 198, 231, 215, 114, -88, -285, -436, -422, -172, 229, 588, 638, 310, -183, -695, -883, -587, 57, 723, 998, 752, 93, -634, -1133, -1022, -294, 628, 1224, 1208, 514, -458, -1244, -1375, -697, 380, 1276, 1482, 880, -196, -1201, -1537, -1000, 101, 1081, 1476, 1101, 141, -912, -1463, -1171, -290, 697, 1264, 1193, 483, -490, -1178, -1214, -585, 277, 924, 1077, 637, -127, -794, -963, -618, -37, 470, 722, 575, 169]
4558A69m39k05O8J82K09K06J42Kj38j61j19j90j20P5K77L16K19M7k13m43m57k01
4580g74K26N22N88L75j13o02q10n32N9O44Q90O71J28o41j052q39j57N81J051R29
4600A144L39m82j057j055m33L86J004J088O11k38r97j111o41J16Q30J078P77K7
4618A386p58j025p50r7N28R28P76K14m17q18o94k49K66O01O07L13j46m36m69l04
4638e44l5K36L55K68R9q6j25j75k15j22l3J32K18K41K23K8j89m15l99j75J86M62
4660f5N93L58r1n33p16n37n0N46Q81P41J34n60r58q36k80M48J032R78M17m16r94
4681I2j044n50K74R63J107O52j38q75j136p54j3P72J121Q24R7o50j025q66k19
4700a368M96R67Q42K83l63q14p39l74K21O35P02L64q3m29n37m12o3K68M00L76
$$ y = [169, -270, -475, -407, -225, -16, 190, 332, 334, 196, 35, -84, -274, -394, -319, -42, 274, 493, 540, 327, -116, -573, -774, -548, -26, 562, 937, 824, 222, -588, -1120, -1061, -417, 473, 1144, 1272, 631, -421, -1260, -1417, -836, 215, 1144, 1483, 1001, -56, -1111, -1544, -1158, -154, 934, 1545, 1307, 310, -801, -1442, -1326, -496, 582, 1359, 1386, 628, -397, -1147, -1244, -716, 212, 988, 1202, 785, -33, -727, -976, -710, -109, 498, 811, 665, 229, -240, -544, -579, -343, 12, 280, 379, 293, 168, -7, -222, -344, -377, -245, -27, 214, 437, 465, 276, -139, -538, -713, -527, -65, 528, 886, 795, 262, -454, -991, -1041, -495, 386, 1127, 1261, 701, -257, -1093, -1373, -925, 107, 1085, 1502, 1086, 92, -952, -1502, -1228, -265, 842, 1494, 1356, 481, -655, -1409, -1422, -650, 471, 1295, 1392, 742, -283, -1149, -1368, -872, 95, 937, 1220, 857, 43, -696, -1070, -849, -214, 488, 852, 769, 340, -197, -609, -672, -404, -4, 372]
4720C72J53q2k33l15k00p0P2J59K12K14J14J0j98l27l23j79J11M22N21L70o5m65
4742B73o75n67n5N13Q18O70K00m96q72q24l19L79R33R30M78k84q99j038o24J41
4762a318Q98J129P38m1p95j170q51o3P39J140R00J94o16j061r08l11M77R22Q95
4781H98L94k79p95q69m78J42O53P55N11J6m69o80n24j01L32M99M25J71j38l42
4801A21l05k16pJ25J60K20J77P5j2j77k87l15j46J49L90M57L08l3l86n95n07r7
4823i01M02P22O69K37l55p83q43m31K86Q48R72N70j68q74j117o87Q6Q39J128Q07
4843A407O8p64j181r10j57O38J122R68L27m94j072j005m20L48R37J011N50k08
4861A165q53r51n74J03O59Q61N94K6m99p31n37j27K96N61M80K00j47l29l83k35
$$ y = [372, 525, 443, 210, -105, -305, -375, -303, -144, 68, 282, 396, 406, 208, -119, -442, -621, -510, -88, 433, 803, 738, 273, -402, -969, -1024, -511, 307, 977, 1177, 681, -191, -1015, -1334, -955, -22, 908, 1386, 1102, 203, -835, -1459, -1318, -420, 709, 1447, 1406, 611, -559, -1410, -1473, -734, 406, 1306, 1500, 884, -177, -1085, -1396, -919, 3, 898, 1292, 1013, 218, -651, -1129, -987, -334, 421, 932, 948, 479, -201, -725, -826, -494, 5, 430, 601, 463, 121, -184, -400, -407, -282, -122, 98, 275, 350, 338, 161, -126, -441, -587, -438, -48, 409, 717, 684, 298, -297, -804, -901, -499, 223, 892, 1129, 774, -9, -852, -1283, -997, -149, 823, 1393, 1225, 351, -766, -1453, -1367, -528, 600, 1407, 1475, 711, -470, -1380, -1537, -899, 223, 1191, 1518, 1024, -48, -1053, -1473, -1125, -188, 823, 1373, 1165, 312, -639, -1213, -1110, -451, 410, 1004, 1030, 531, -200, -737, -864, -568, -7, 473, 673, 526, 197, -186, -421]
4881d21k8J39K70K49J39L1q8j95k57k35p1J21L17L62K97k1l32n54m93j24L27O81
4903A14O80K70k96p63q10m31K27P66R44O26j23q00j016p34k4P15J110Q46J90o40
4923H51j120r90l12N63J107J055M03m08j031j071n19K66R33J034O07j46p98r69
4941e45o35pO17Q84O47J33m67p68o27k05K99O14N43K60j32m10m59l00RK17L07
4962b5K86J17j7j25k06k56j98j3J54L07L48K15m7l05m73m06j36K97O04N90K75
4983I86k45o34p46m57J05O77R20O40k3o96j032p69r6O42J070Q79K51n76j073r87
5003a164l73M70J031J028M84l28r37j059o25J73Q46J098O93m4p52j012p38q0O24
5022f65R20P47J80m46q27o76k43K91O34N87L03q4m10n21l69n0K71L64L07J66m9
$$ y = [-421, -449, -310, -40, 209, 348, 379, 291, 96, -161, -396, -467, -346, -29, 333, 630, 609, 277, -277, -770, -894, -567, 114, 794, 1064, 768, 5, -805, -1236, -1009, -243, 701, 1327, 1204, 404, -612, -1346, -1370, -655, 455, 1301, 1491, 851, -269, -1259, -1571, -1008, 99, 1154, 1557, 1149, 118, -953, -1472, -1206, -273, 761, 1368, 1222, 424, -545, -1180, -1187, -570, 314, 961, 1094, 627, -141, -768, -973, -674, -60, 483, 743, 611, 201, -258, -558, -549, -332, -25, 261, 378, 361, 236, 30, -226, -424, -437, -283, 24, 372, 587, 540, 235, -238, -644, -780, -483, 121, 711, 986, 741, 107, -639, -1096, -991, -314, 606, 1246, 1223, 527, -505, -1274, -1370, -728, 342, 1221, 1472, 896, -177, -1164, -1537, -1067, -36, 992, 1476, 1148, 211, -848, -1473, -1300, -454, 644, 1337, 1293, 541, -471, -1209, -1289, -665, 255, 1002, 1182, 736, -91, -767, -1010, -719, -85, 502, 805, 721, 311, -210, -579, -629, -358, 6, 313, 479, 430]
5043D30k22k78k39j17O3J80K51K39J50k1k21l96l86j52K09N15N72L02j55n63p11
5064e50n01N6O33Q63O37J7n94r35p49j67N06R79Q85L42m24j001j025m61L50R89
5084a50J048O18j91r26j147p25J17Q55J099P47J9p04j052p70j63N43R38P98K80
5103A234m14p96p73l33K17O01P06M41p8m92o11m01kL06M45L48J35j49k47k81j81
5124c25l1P0J58K12J89J57mk11l83l32j15K17M28M92K93j03n19o66m53N0N14P40
5146C78O10J13n00q42p66k65M27R10R37L94l57r83r91n34K40R27J095O66j44q81
5166D34j108p03lP28J070Q35J41o16r99q70k75M70R45Q68L46l27p90q26m39J91
5186i28O84P52M40q4m95o02m41o9L15M74L97J33j44k82l35j96l6J20J96K34K02
$$ y = [430, 208, -70, -309, -426, -363, -183, 68, 307, 457, 436, 215, -181, -567, -719, -510, 5, 577, 879, 724, 161, -550, -1051, -995, -362, 501, 1138, 1155, 561, -374, -1123, -1290, -784, 195, 1080, 1422, 998, -3, -1028, -1489, -1139, -150, 898, 1516, 1325, 399, -748, -1473, -1356, -501, 598, 1345, 1364, 660, -392, -1162, -1325, -782, 156, 954, 1234, 820, 24, -749, -1082, -865, -264, 442, 883, 805, 313, -298, -699, -701, -395, 50, 398, 533, 384, 137, -144, -325, -356, -286, -128, 84, 273, 430, 426, 215, -168, -500, -615, -398, 30, 522, 815, 712, 193, -473, -926, -876, -362, 378, 988, 1101, 601, -241, -1007, -1272, -845, 65, 1002, 1396, 1039, 56, -935, -1469, -1229, -302, 793, 1459, 1315, 434, -674, -1377, -1380, -652, 418, 1253, 1394, 778, -221, -1091, -1366, -896, 49, 917, 1263, 936, 146, -680, -1119, -928, -244, 508, 948, 864, 369, -233, -674, -743, -428, 46, 443, 576, 432, 150, -185, -381, -417, -297, -101, 133, 335]
5207C35M9j00k26k81k48p1J80L76M43K33j22m33n36m28j8M26P09O06J64m28q01
5228a71p55k88L72Q54Q65M67k76q78r89n68J89Q19J039O68pp37j093p98j19O81
5248g25J048Q62K44n43j019r08l46M01R23R08M34k52q33q94m49J22O51P71N42
5267I37J5n06o91n10q1K94N38M67K10j50l53l82k50k1J63K96K54J55Oj24k30k95
5289b58j95J4J65L21L59K21o1l94n11m06l3L59O30N84K06l37p48p35l42K39P82
5310a40Q78N15j96p74r53o29K8P40J049P59P3o81j037q38k36N38J058R65L53m75
5330I97r84r77m67L40R23R66N37j99p72r23o03M1O47Q68N87N4m20p27o12k03K90
5351f37N89N41K54j29m00m71k89k1K32L28K66J59m4k02k24j96j52pJ26K80L26
$$ y = [335, 384, 284, 58, -223, -471, -542, -362, 14, 457, 690, 568, 135, -401, -829, -847, -421, 288, 894, 1058, 630, -171, -926, -1214, -842, 12, 877, 1344, 1068, 190, -799, -1367, -1178, -359, 680, 1348, 1341, 604, -489, -1287, -1406, -725, 323, 1185, 1429, 886, -133, -1041, -1387, -986, -63, 845, 1279, 1027, 194, -700, -1149, -1027, -376, 395, 937, 952, 446, -245, -755, -836, -542, -4, 463, 673, 523, 170, -212, -462, -483, -320, -24, 230, 385, 391, 267, 37, -258, -453, -439, -274, 47, 406, 627, 566, 172, -339, -745, -778, -419, 211, 795, 1001, 664, -84, -819, -1161, -922, -140, 738, 1253, 1057, 283, -670, -1299, -1271, -531, 518, 1277, 1350, 669, -368, -1206, -1442, -904, 154, 1119, 1472, 997, 13, -964, -1431, -1091, -168, 798, 1335, 1136, 364, -559, -1162, -1121, -474, 394, 981, 1035, 615, -112, -724, -927, -637, -48, 493, 747, 618, 218, -253, -542, -563, -331, -3, 263, 422, 378, 176, -48, -244, -396, -403, -277, 3, 329]
5372C29K19p7k97m36m00j03L07N80N82K31k87o25p09l88K15O74Q25N33o1o68r35
5393d91o96o9O71R84Q03J66n27j030r58l10M81J029R79M15l43r66j014n28K17
5412a187Q36R92O25n2p31r70o61m7N67Q42O90K10m06p61o82k50K63N90N93L13
5432G74j12m38m76l18JK24L56L09J05n1j95k05k22j29J4J75K57K67J52m0k74m17
5454b43l41p5K59M78N21K18j83n72o44m42J23O03P79N66J9o12q87p04j23N60R41
5475B41Q18K77m84r62q91m18L75R26R79N25k24q60j028o11R9P59J013P13L0o57
5495F20r49p36j57N09Q80P39K35l77p28p24l03K20N79O47L47p8m00n43l86m8K42
5516d11M02L45J54p9k37l03k24q3O6J97K56K51J19q2k47l80k92p1K26M67M71K42
$$ y = [329, 548, 471, 174, -262, -662, -765, -458, 122, 704, 935, 648, 23, -686, -1074, -859, -185, 640, 1173, 1112, 444, -491, -1187, -1256, -585, 399, 1202, 1368, 841, -189, -1147, -1457, -976, 53, 1032, 1447, 1104, 138, -876, -1404, -1187, -351, 641, 1266, 1214, 483, -487, -1148, -1195, -628, 214, 904, 1114, 708, -53, -735, -985, -722, -132, 461, 774, 662, 224, -252, -570, -569, -345, 11, 320, 425, 374, 179, -26, -248, -377, -363, -188, 69, 336, 488, 448, 174, -243, -584, -659, -400, 78, 599, 817, 634, 62, -582, -1024, -901, -298, 481, 1047, 1066, 454, -433, -1137, -1260, -700, 241, 1059, 1336, 852, -110, -1001, -1419, -1044, -118, 861, 1386, 1162, 302, -726, -1337, -1238, -479, 534, 1247, 1277, 620, -329, -1065, -1222, -713, 167, 906, 1141, 764, 36, -688, -991, -771, -192, 455, 802, 724, 324, -219, -605, -653, -411, -9, 336, 490, 411, 174, -129, -353, -436, -370, -173, 83, 334, 453, 371, 124, -256, -548, -619, -393, 74, 545, 787]
5538G87j54n11o29m09P1N37P09N67R5n16q33p14j84M25Q81Q34L46l54q74r37m83
5559a346K40Q49J015O06j37q04j021o96LO69J020P75J38n74r89p83k40M40Q67
5578C2Q01L58l11p38p79m00J40O11P14M33k6m25n75m45r7K42M53M02J98q7k81
5599B20l25k39q2J00K09K83K02Q4r5k46l23k67o2J77L88M39K46j25m32n39m33
5620h20k1M06O97O06J32l96p64p40k93L58P98Q76M13k66q06r11n78J48P68R87
5640E94O86po83j024p70j45O24J016Q36K38m89r32q88l61L72Q46Q66M33k18p23
5660B71q28m96J02N51P30M92N6l88n88n27j72K48M46M57K33p1l16l59k55p1J32
5681c53K43K58J99L1q6k06k66k49p2J55L46L99K58q8l48n32m08n1L72O13N77J96
$$ y = [787, 633, 122, -507, -916, -845, -308, 401, 968, 1063, 547, -286, -1000, -1184, -759, 122, 956, 1302, 948, 74, -863, -1346, -1106, -257, 758, 1364, 1227, 423, -598, -1294, -1291, -622, 398, 1173, 1311, 737, -252, -1035, -1275, -835, 32, 833, 1191, 880, 142, -637, -1037, -897, -286, 428, 861, 835, 410, -165, -610, -707, -465, -12, 390, 588, 501, 220, -105, -344, -426, -326, -117, 166, 368, 452, 357, 111, -212, -479, -541, -364, 24, 463, 709, 584, 152, -387, -820, -841, -435, 262, 868, 1000, 604, -160, -900, -1193, -835, -37, 839, 1252, 986, 180, -731, -1309, -1161, -393, 594, 1280, 1273, 590, -434, -1204, -1349, -725, 291, 1127, 1365, 876, -56, -944, -1305, -933, -87, 779, 1212, 994, 271, -557, -1053, -951, -400, 330, 822, 878, 490, -98, -625, -797, -549, -103, 354, 587, 516, 200, -159, -414, -485, -353, -110, 148, 347, 378, 292, 86, -180, -429, -501, -346, 0, 399, 657, 569, 221, -311, -719, -770, -398, 215, 792, 988]
5703I88l44o99p02l40K68P08Q27M95j43p54r21o07L3O88R71P37R6o19j004q43
5723a165k08N19R68Q75L32l87r05r02m20K41Q05R00M98j13o39q51n43k1N02P61
5743B47N75J27l59o25n49k19K34M78M87K62p1l28l88k75o4J46K44K80J64L3r6
5764C03k41k85j90m9J69L16L48K11p6l24m94l54p2L12N60N51K05k68o16o92l52
5785a038J65O50P98N34o6o50q75o41p1N98R30P66J90n10r39q18l25L92Q88R07
5805H85M38k74q42q96n50J49P21R05O00k1o12q38o69o6M63P53O50J80l30o44o01
5826e99k70J83M95N31L33m5l15m58l25r0J48L09L16K04Lj40k63k42j56k8J75K87
5848E3L05J83m8k77m38l48q9K50N05N10K45j86n44o65m14J13N80P31N43L0n42
$$ y = [988, 644, -55, -757, -1097, -829, -121, 706, 1201, 1058, 304, -617, -1224, -1191, -503, 468, 1205, 1301, 682, -322, -1165, -1373, -854, 114, 989, 1321, 934, 29, -873, -1293, -1052, -247, 653, 1151, 1038, 399, -452, -995, -1016, -514, 247, 822, 949, 590, -35, -584, -803, -569, -91, 396, 658, 587, 259, -129, -404, -468, -322, -78, 202, 366, 399, 303, 62, -223, -413, -462, -293, 23, 371, 582, 506, 182, -312, -666, -738, -426, 134, 685, 890, 622, 6, -686, -1038, -873, -223, 575, 1109, 1043, 393, -482, -1123, -1194, -596, 334, 1100, 1290, 780, -159, -977, -1302, -910, -22, 885, 1323, 1049, 207, -689, -1239, -1090, -369, 536, 1136, 1115, 503, -335, -1004, -1070, -607, 146, 796, 976, 646, 2, -599, -869, -686, -191, 340, 673, 628, 313, -145, -470, -560, -412, -103, 213, 417, 420, 280, 17, -225, -381, -409, -234, 53, 358, 541, 493, 216, -222, -570, -659, -409, 96, 606, 851, 665, 121, -544, -958, -845, -265, 466, 1009, 1039, 497]
5869D97q36o84j62M90Q68P81K92m06q52q78m05K70Q42R18N25j66p80r31o06N9
5889a164O68R17O52Q9n52q55o94j82M23P75O68K81k66o17o53l53J22M81N82L69
5909F91j3l13m23l91j18J60L00L36K27j8j82k55k27j41kJ23K74K69J82m1k47l75
5931a84l27j08J72M43N01K77j36n09o00l92J8M97O86N77R4m45p76p07k04L93Q21
5952I1P92L26k95p91q72m90J89P77R42N62r0p03r23o50n1N96Q99P19J62m79q50
5973a39p32k57L47O93P28L40j77n97o82m17P9M64N70M17O2k92m63m29j53J76L35
5994a27L33K26k2j56k50k50j27rJ67K68K57J38m7j84l53l03j40J76M09M49K69
6015G24j07m01n55m41j7M06O59N57J46l74p36o75k55K77P34P94M18k09p39q81
$$ y = [497, -339, -1023, -1185, -695, 173, 954, 1246, 840, -12, -890, -1295, -1025, -183, 735, 1260, 1094, 314, -617, -1223, -1164, -496, 421, 1073, 1162, 610, -245, -939, -1121, -698, 77, 745, 1026, 760, 143, -510, -863, -741, -260, 322, 691, 678, 365, -58, -449, -567, -407, -107, 229, 456, 438, 256, 1, -226, -367, -369, -246, 28, 297, 479, 438, 191, -184, -511, -619, -447, -4, 497, 774, 638, 129, -471, -863, -845, -348, 338, 915, 1009, 564, -212, -919, -1123, -730, 91, 883, 1209, 914, 123, -749, -1239, -1050, -273, 669, 1231, 1141, 438, -485, -1135, -1186, -590, 309, 1028, 1190, 711, -139, -871, -1128, -781, -88, 640, 980, 803, 206, -476, -893, -814, -350, 220, 637, 699, 407, -56, -485, -638, -462, -127, 206, 432, 410, 254, 4, -246, -373, -382, -215, 53, 310, 448, 401, 217, -136, -439, -579, -403, 6, 455, 724, 617, 216, -339, -780, -797, -391, 268, 825, 971, 597, -139, -814, -1069, -792, -58, 736, 1154, 945, 206, -675]
6035f75n24J31O89Q73O17M6n85q94p34j39M87Q52P66K61l47q05p60l48K22O91
6055a76P47M52j20n75p05m32j9M33N78M67J23k93m83m38j71J25L43L57K50j0j77
6076B76k95k54j53M0J90K46K31J17m1k12l06k78r5J63L21M07K70l1l57n32m15
6097g08p6L60N89N53K18k97o51o56l36K03O33P73M91r8o52q13n63l7N54Q37P05
6118A029J54m95q50p50k52L86P98P77L58k58p49p92m33J41O43P64M74m6n13o97
6138c11n12q4L84O27M95J73k29m87m95k32J16L62M03K67L3k13l07k59j32M4J92
6159a65K34K41J01m1k03k81k38r2J13K59L91K53j4k90m52m17j09K70M90N38K27
6180H15j74n37o29m00J06N33P25N14k5n04p78o16j11M56Q36O81K19l97p93p59
$$ y = [-675, -1199, -1068, -379, 494, 1111, 1157, 572, -322, -1056, -1195, -708, 144, 910, 1171, 824, 19, -741, -1089, -867, -176, 571, 1023, 903, 328, -377, -809, -828, -395, 183, 650, 773, 480, -3, -441, -612, -487, -144, 213, 463, 453, 276, -19, -273, -426, -386, -196, 50, 281, 398, 357, 145, -161, -439, -534, -371, -50, 357, 627, 596, 239, -293, -708, -784, -424, 165, 718, 936, 639, -12, -668, -1004, -801, -168, 605, 1096, 998, 346, -467, -1030, -1067, -513, 324, 1029, 1183, 688, -162, -912, -1164, -778, 20, 797, 1155, 897, 148, -644, -1077, -936, -293, 471, 945, 899, 386, -311, -823, -907, -523, 104, 599, 772, 543, 56, -439, -671, -555, -193, 210, 477, 510, 297, -10, -269, -401, -357, -165, 69, 310, 411, 370, 167, -114, -352, -444, -331, -72, 319, 572, 558, 268, -184, -601, -710, -440, 50, 588, 815, 641, 104, -525, -925, -819, -286, 439, 953, 928, 424, -354, -970, -1081, -625, 211, 892, 1111, 714, -79, -838]
6200h38l03L03P26P92M17j55o89p94m94Q9N82P50N32O1m71o85n64j40L33O02N35
6221E89K20k09m92m81k59N3L40M15K98K7j71l27k78j44L6J95K32K29P3n3j78k43
6243a28k13r9J14K36L31K35K1k34m10l63j41K00M36N02K78j26m85o06l95N8M90
6264b99O88M87P6m57p22o06j72L84P38O93K65k98p13p39m10J97O62P83N07j01
6284I63o17p78n36rM81P50N53J50m07o50n96k04K68N72N52K77j38m23n13l34J6
6305f23L30M15L44R3j82l37l30j52R1K01K67J75Q5p5j71k30j76r1Q2K33K86K32
6327D67qk04l69l25j62J49M10M61K77r8m12n39m16l0M15O07N17J46l63o45o53
6348g75k18K77O58P21L48j80o30p39m83J01N78P75N38Mm94p38o01j02L94O93O28
$$ y = [-838, -1141, -838, -112, 680, 1097, 942, 253, -541, -1035, -946, -364, 386, 918, 979, 508, -177, -741, -881, -548, 54, 589, 809, 600, 108, -373, -632, -579, -239, 176, 474, 501, 330, 3, -275, -419, -383, -188, 44, 273, 346, 293, 115, -128, -341, -440, -326, -90, 241, 476, 497, 263, -147, -510, -651, -451, -15, 487, 765, 639, 154, -452, -847, -789, -299, 389, 876, 952, 495, -227, -833, -1005, -621, 117, 810, 1075, 777, 64, -675, -1085, -888, -226, 557, 1064, 963, 346, -432, -968, -977, -496, 254, 807, 957, 550, -100, -696, -900, -632, -60, 492, 769, 631, 208, -305, -639, -623, -293, 122, 466, 559, 377, 40, -290, -442, -351, -150, 117, 292, 377, 302, 131, -99, -275, -366, -284, -51, 235, 467, 459, 255, -114, -439, -601, -452, -42, 419, 696, 598, 186, -353, -769, -799, -384, 223, 740, 886, 523, -122, -775, -993, -716, -58, 663, 1011, 831, 201, -538, -1021, -920, -342, 433, 971, 975, 481, -257, -858, -960, -566, 127, 755]
6369G55K16k96o00o55k91J88N26O03L30o9m29n31l83JK88M54L53J03j80l25l31
6390b73j94M5K22K57K19P4r0j73k21j93n0Q9K30K52J97K2j82l09l10j28Q2L43
6412i1M17L07j9l40m83m29q5K93N48N35K16k59n89n99l18J72N73O67M20q0n54
6433C02p22m92k8M88P09N88J06l94p09o29k29L29O66O33L04k16n80o37l77J29
6453g59N01N98M08l4l69n49l97p8K77M60L99J26j55l23l39k01K1K04K87K36P3
6474C86o9k13k28j54m7R2J92K17J79L1j49k73k91j63P2K62L68L15L3k67m58m07
6496e72j34K46M79M99K31j57n12n80l47Q7N08O72M21j8m48o80n07j05M14O68O00
6517G65J88l10o77o33k81K48O17O35L71j36n39o39m29M8M47N81M43O5l47n26m44
$$ y = [755, 971, 675, 75, -580, -871, -683, -157, 446, 776, 707, 278, -253, -636, -635, -347, 107, 460, 563, 383, 58, -273, -467, -422, -200, 57, 276, 350, 260, 87, -134, -327, -377, -288, -58, 194, 391, 413, 231, -78, -388, -516, -434, -91, 326, 633, 614, 274, -209, -638, -723, -430, 118, 653, 869, 610, 21, -578, -896, -724, -151, 516, 936, 856, 302, -420, -912, -940, -452, 257, 845, 951, 557, -152, -781, -1010, -681, -15, 618, 922, 706, 126, -511, -888, -759, -258, 340, 748, 714, 345, -204, -601, -679, -402, 58, 457, 583, 428, 105, -234, -435, -414, -210, 77, 313, 386, 317, 104, -124, -278, -325, -233, -41, 176, 355, 386, 237, -36, -327, -490, -418, -156, 212, 527, 560, 293, -165, -572, -706, -460, 19, 518, 749, 592, 80, -500, -847, -760, -252, 420, 841, 823, 375, -305, -812, -917, -503, 165, 765, 953, 643, -34, -667, -948, -700, -83, 552, 923, 787, 248, -391, -820, -772, -325, 256, 699, 764, 417, -109, -553]
6538e53j45K18M40M05K05r2l39l61k39LK06K74K43J21q2k04k30j59n9J05J93K02
6560A52J73J6j27k31k74j39O3K47L21K95N6k30l95m04j38J58M39M91K75j12m58
6581A78n48l73OM23O00M88N8l66o42n76j74L15O27O31K60k24n97o57l66J24N74
6602b39O50M19n6m58o15m56o0L53N87M80J44k48m94m86k08J65M08M31K71n2k95
6623B41l80k93l4J74L28K54J24r2j94k39j88l1J04J81K26J25K1j23k11k59j36
6644d02K9K19K91K67P4j69l73l48j81J02L78M48K94k6l56n02m34o4L49N69M86
6665F51J56k53n64n83k39J75N60O31L46j20n28o23m37L9M48O28M85O4l71o06n18
6686f59j36K57N58N22K25k11m65n17k59P8L89M63L03jk74m08l05r0J75L13L08
$$ y = [-553, -698, -480, -40, 365, 570, 478, 139, -222, -461, -458, -252, 22, 265, 386, 304, 100, -130, -289, -348, -243, -50, 152, 325, 341, 214, -17, -291, -430, -367, -120, 201, 496, 552, 322, -73, -477, -615, -457, -18, 473, 748, 636, 178, -370, -743, -737, -314, 286, 774, 832, 466, -176, -752, -926, -611, 16, 647, 907, 683, 86, -571, -937, -813, -239, 411, 830, 774, 316, -299, -755, -815, -462, 125, 605, 749, 501, 7, -479, -687, -522, -114, 317, 588, 536, 241, -139, -432, -466, -292, 36, 290, 414, 322, 128, -111, -299, -330, -226, -45, 181, 306, 327, 204, -7, -266, -402, -373, -154, 137, 404, 478, 309, -64, -412, -593, -491, -113, 335, 629, 603, 247, -255, -689, -753, -404, 165, 651, 807, 554, -10, -593, -832, -657, -97, 534, 880, 760, 232, -391, -828, -789, -341, 287, 772, 836, 465, -141, -659, -795, -538, 20, 542, 767, 556, 91, -426, -685, -607, -218, 245, 548, 547, 273, -135, -440, -530, -355, -42, 266]
6707B66J38p1j87k56j94n4J14J76K36J28J4j06j81k13j58J6J69K85K52J04j36
6728C42l03l40j92J1L31M05L45J7k91m95m00j29K37N09N13K18k00m95n81l19J22
6749f95M58O08L99l7m16o25m61o3L83O02N24J43l12n66n41k14K22M92N75K70j33
6770F13m31n12l16K6L56M55L54N3k32l88l59j23J38L06L01J94m8k04k46k16o7
6791c46P8J93K09J56J1r4j93k24j21j1J45K53K42J32j23k64l14k23K5K64L73L41
6813E09O1k33m12m31j45J82M28M99K60j01m68n31l51M6M18N79M45M8l81o01m83
6834f62j36K95N77N19K27k10n39n46l09J18M87N44L44k6m00n27l56n5K83M51L90
6855D69J14j88l66l73j74O6K89L45K24j0j66k76k28r7Q9J71K55J60J3j05j74k02
$$ y = [266, 404, 333, 146, -110, -304, -358, -244, -68, 168, 296, 310, 204, 23, -190, -348, -332, -163, 122, 374, 478, 342, 39, -301, -493, -482, -151, 254, 599, 616, 325, -170, -570, -699, -462, 47, 560, 778, 578, 83, -498, -817, -695, -237, 371, 770, 733, 317, -308, -769, -832, -449, 153, 677, 820, 508, -58, -599, -813, -591, -99, 476, 746, 613, 182, -330, -646, -620, -264, 191, 545, 598, 366, -22, -381, -504, -366, -60, 241, 435, 387, 183, -63, -279, -346, -268, -75, 134, 290, 301, 207, 14, -210, -331, -342, -197, 56, 298, 430, 307, 43, -271, -494, -469, -205, 168, 509, 570, 337, -75, -506, -651, -469, -41, 458, 718, 617, 149, -382, -733, -687, -269, 310, 755, 803, 422, -179, -662, -798, -503, 74, 593, 820, 610, 71, -475, -784, -666, -179, 365, 709, 683, 283, -244, -600, -655, -372, 79, 469, 583, 395, 29, -344, -518, -452, -163, 182, 406, 396, 230, -46, -274, -371, -282, -111, 144, 304, 317, 212, 38, -164]
6877a64j38J3J34K32K08J03o1k15k93k30oK06L48L06J06j54l75m33k07J14L90
6898a16M91K88l9l77n25l89m2L33N21M82J26k66n41n31k07J99N02N57L25j36m61
6919A94n60l52L5M03N37L87O2l13n02m19j21K19M48M25J47j02l64l78k48N4K79
6940a69L43K32M6j84k91k46r5O7K02K16J54K6r9k07j66j35J2R6K18K01J32o5j99
6963H9k48k34m2J75L06L23J50j21l28l91k43N5L16M60L44Lk66m79m36j07K54N01
6985H1M79K13k09m82n35k79J16M61N51L47m7m04n44m19j5L10N27M24J09k50m71
7006c7m60j78J77M08M50K32r3l43m08k52NK50L58K61O7j51k65k81r1N7J77K21
7028A04J69M3p2j89j85j30lR8J85K03J08j9j77k37k22o8J39K71L05J44p0k71l75
$$ y = [-164, -302, -289, -155, 77, 285, 388, 327, 112, -181, -411, -417, -211, 137, 443, 549, 395, 20, -413, -620, -506, -116, 375, 663, 624, 247, -278, -667, -709, -376, 145, 627, 753, 487, -54, -585, -792, -593, -91, 466, 791, 655, 194, -366, -718, -683, -280, 257, 644, 706, 393, -109, -528, -649, -430, 18, 443, 590, 488, 124, -254, -502, -448, -169, 174, 406, 452, 268, -23, -269, -364, -297, -95, 121, 275, 301, 202, -5, -171, -306, -294, -198, 20, 221, 353, 288, 89, -159, -393, -435, -260, 46, 369, 519, 398, 70, -321, -564, -509, -193, 267, 611, 614, 348, -131, -567, -674, -420, 81, 560, 773, 564, 82, -453, -732, -616, -155, 396, 743, 696, 292, -252, -671, -686, -376, 151, 575, 684, 434, -37, -497, -675, -498, -90, 360, 592, 499, 156, -252, -504, -499, -249, 109, 370, 437, 286, 21, -260, -351, -294, -117, 104, 273, 316, 244, 55, -130, -260, -263, -165, 20, 223, 331, 312, 135, -102, -324, -392, -253, 18, 323, 467, 397, 126, -249]
7051b49k65QK60M16L32Q0k26m50m21j47J80M52M55K56j28m17n18k93N2L72N18
7072B67M07Ql29n21m30r5K82M84M73J65j94m52m70k33J35L80M54K46k3k97m09
7093a52l02l2K04L49K85J02j18k73k63j51K2J61K43J83N8r5j61k21j19oR0J86
7115a0J83J08j0j47k25j92o7R2K38K69J83k5k51l15k53l7K12L60L52J14j69l70
7137D0m26k20J31L73M46L19n6l76m78l58m0L32N06M12R1k60n07m40j77J92M52
7158d4M65K52j26l97m97k74N2L34M18L22L7k39m05l32q8J77L36L00J55q8k49k74
7180a65j80NJ87K30J98N2p5j69k02j09j5J00J59J74J06k3j52j89j65p3O7J88K43
7203A92J72kj79k99k62q7J55L22L19J74j05l38l87k38L5L24M34L27J8k73m75l82
$$ y = [-249, -514, -506, -246, 170, 502, 582, 356, -94, -515, -662, -482, -30, 425, 681, 553, 136, -382, -675, -623, -251, 267, 674, 682, 353, -168, -598, -693, -411, 73, 546, 711, 517, 65, -405, -638, -503, -123, 331, 577, 554, 257, -152, -454, -486, -282, 67, 352, 454, 336, 63, -200, -351, -329, -168, 75, 258, 316, 221, 60, -161, -280, -286, -196, -10, 173, 281, 271, 124, -101, -293, -360, -268, -30, 239, 422, 397, 146, -169, -422, -459, -247, 113, 465, 579, 410, 40, -386, -606, -475, -102, 344, 663, 607, 231, -247, -605, -645, -313, 193, 605, 696, 436, -71, -511, -688, -496, -44, 421, 673, 547, 150, -347, -621, -569, -235, 183, 505, 542, 303, -102, -434, -522, -345, -9, 291, 446, 358, 109, -165, -345, -340, -153, 77, 275, 327, 252, 83, -119, -228, -243, -143, 16, 190, 296, 273, 121, -68, -233, -306, -239, -51, 192, 364, 362, 183, -116, -378, -465, -310, 12, 331, 505, 400, 62, -325, -563, -528, -204, 230, 557, 575, 302, -173, -555]
7225e55r2K53M55M19J97k04m25m59k35J32M05M60K95n4l60m37l21l7L08M11L39
7246D95P8k10l68l56j20J31L22L16J61n1k44l03j76l6J62K42J89P1p4j60k00j10
7268b41k5R1J70J34Q7L7j31j74j46j01N9J81K16J62L6j58k66k32j05J17K82L19
7290C12J74n3k69l68k82lK76M02L28P1k43m05l89j40J77M07M29K07j39m05m41
7311c54k70Q4L40M52K98J0l01m38l40p2K63L92L61J24j72l47l53j69R5K96L39
7332B38J89k3k24k96j93l4J42K19K10R0l7j80j82j37j5R4J39J50J03j8p7j64j60
7355a66r5L7J56J82J62M8j20k25k41j10N8K42K97J82l0k44l19k59k7K07L48L31
7377D14J07j69l67l76j67J40L42M12K68r5l36m17l08J8L02M14L50N5k59l95l63
$$ y = [-555, -647, -394, 61, 480, 677, 473, 48, -411, -646, -514, -109, 351, 646, 592, 232, -205, -526, -563, -255, 156, 495, 573, 363, -5, -361, -481, -350, -28, 288, 449, 398, 154, -149, -325, -361, -199, 43, 232, 303, 229, 69, -131, -241, -266, -175, -5, 129, 216, 253, 122, -52, -198, -299, -240, -59, 157, 319, 355, 197, -69, -301, -406, -289, -7, 312, 486, 433, 164, -204, -486, -489, -213, 189, 517, 588, 345, -60, -449, -589, -412, -5, 424, 631, 492, 87, -354, -624, -540, -200, 252, 550, 560, 259, -179, -519, -591, -328, 64, 425, 549, 377, 30, -323, -492, -397, -101, 238, 427, 404, 180, -116, -309, -343, -201, 18, 228, 318, 281, 101, -81, -218, -233, -139, 0, 150, 253, 235, 158, -6, -166, -261, -224, -68, 114, 276, 324, 204, -21, -262, -372, -314, -72, 225, 407, 377, 133, -186, -445, -472, -265, 83, 414, 521, 352, -15, -391, -558, -418, -76, 336, 604, 509, 173, -244, -552, -534, -232, 182, 532, 587, 328, -67, -430]
7398d30j14J79L67L82J73j22l35l68j93M3K68L32K09J6k02k70k28q5J40K08K14
7419A84J15l5j65k07j25k4O4J64J47J02k5p5j47j32o9J9J34J74J40N5r3j87j92
7442a78j34M7J88K59K04J8j84k99k52q7J45L06L13J76j22l39l35k50P5L03M04
7463B58K61kk79m04l32n6K25M00L64J07j80l97l67j48J26L39L72K10p5k79l57
7484b14k38J3K46L15K41K8j51k80k40q2J12K06K38J21m0j39k10j28k5P2J39J76
7506A60O1k0q8j21j41n4J0J21J55J17M7q4j49j79j30J2J58K35J84M9j51k56k60
7529c24r0J00K58L09J77l4k72l56k39J2K67L47K92P1k30l67l32r6J80L74L53J37
7551E37j10l49l84k05J01L05L53K43k0k75l38k66j5J80L22K50O8j28k76k35j35
$$ y = [-430, -544, -365, 2, 384, 557, 435, 100, -268, -461, -418, -150, 182, 391, 407, 205, -65, -293, -378, -238, -30, 184, 299, 264, 99, -108, -233, -257, -193, -29, 118, 220, 195, 120, -27, -159, -228, -209, -75, 99, 239, 294, 201, 14, -178, -312, -265, -77, 182, 386, 404, 220, -79, -331, -418, -273, 33, 346, 522, 400, 61, -274, -524, -449, -146, 258, 519, 517, 238, -166, -498, -554, -329, 71, 435, 542, 362, -35, -402, -550, -424, -85, 287, 497, 422, 143, -214, -452, -439, -193, 122, 363, 391, 240, -40, -280, -362, -250, -44, 194, 315, 275, 136, -74, -202, -227, -155, -16, 160, 221, 201, 113, -8, -149, -203, -193, -72, 83, 200, 247, 163, 14, -165, -295, -283, -125, 110, 294, 343, 192, -64, -324, -414, -314, -56, 253, 430, 396, 124, -232, -471, -459, -192, 155, 447, 518, 288, -79, -411, -507, -327, 47, 400, 537, 427, 78, -306, -511, -410, -105, 248, 491, 471, 196, -142, -408, -423, -243, 79, 329, 397, 269, -7, -242, -377]
7572c77R1J91K36J29k0j39j97j37l0P4J31J54P6jn7j27j22o4J1J07J24J08P5l0
7596B06j43j75j13j3J25K01J89P0j03k14k42j40O4K01K98J84kk23l15k51l4J81
7618b49L34K99R0j76l35l20j43J25L23L36J96r5k71l39k57K4K61L38K68L0k05
7639B34l20k65r8J76K84K95R6r5k46k51j18K2J84K34J48Jj18j69j70n4O6J29J28
7662I3J00J0q0j41j05o1MQ2J05J10O2k8j09j50j03j2P6J68J57Q4m9j81k27j21
7686c16OJ85K56K01K9j60k94k28q3J30K97K89J26r0k76l07j91N0K75L37K30k8
7708D38k47l26k52k5J92L17K73P7j53k92l16j07J08K61K79J45o2k22k52j64jJ67
7730a62K26J71L1j10j68j63q8N4J42J31J06Po1j28r7m6J2O7J03R1M3j0p9j33r5
$$ y = [-377, -286, -95, 141, 270, 250, 111, -86, -223, -253, -179, -48, 106, 182, 181, 124, -3, -125, -189, -178, -71, 53, 161, 236, 206, 63, -112, -225, -238, -113, 88, 277, 347, 244, 30, -212, -352, -288, -87, 211, 395, 393, 170, -145, -396, -430, -249, 85, 384, 474, 298, -37, -357, -500, -375, -52, 284, 480, 385, 114, -225, -482, -458, -197, 141, 409, 439, 234, -86, -351, -449, -273, 11, 306, 402, 307, 61, -190, -308, -286, -102, 132, 280, 281, 163, -6, -176, -230, -164, -35, 93, 193, 203, 123, -18, -123, -184, -180, -98, 7, 117, 179, 151, 42, -108, -211, -223, -147, 21, 178, 262, 213, 32, -195, -316, -310, -125, 131, 332, 361, 201, -93, -321, -404, -274, 23, 312, 438, 348, 72, -235, -426, -376, -101, 236, 466, 438, 191, -135, -387, -412, -220, 97, 370, 447, 294, 2, -314, -421, -313, -52, 227, 372, 310, 88, -164, -328, -329, -162, 64, 235, 266, 156, -12, -175, -263, -209, -67, 64, 170, 177, 116, -12, -109, -155, -143, -76, 27, 118, 161, 151, 72, -61, -156]
7755a56l0P2J26J50R2k9j35k07j32m1J51K28J95N2j06k44k43j30Q6K58K82J57
7777C96o8k32l08k08J4K12L10K56L9j82l26k58q8J45L17K88J15j16k64k88j33
7798c79Q1K26K73J55j5j88k51j71l0J29K32J68O9r4j65j78p8M8J24J32Q8J0q2
7821A04r9j04n9J1O3Q1J08K1k5n0j27r5k8M9J14J41Q4J5j24j58j65l1J04J96J88
7846B14J12q5k03k37j38M4K05K89J76lj99k91k13k4J39K98K86O2j45k76k90q7
7868c66Q3K53K86J52q6k33k80j63NK11K65J76kj26k60j78n7J07K20J76R5q4j66
7891B8j77r0K1J21J67Q9L3q0j02j03l8KN6R1P6N8qp0j00o8m9K7Q8J25R8J1r0j49
7919c3j35p6N7J78J68J25l9j81k05j57j6J72K43J96K6j50k65k05o5J00K54K50
$$ y = [-156, -186, -114, 12, 162, 254, 225, 90, -117, -249, -290, -139, 89, 284, 336, 230, -14, -257, -387, -301, -43, 239, 396, 328, 96, -212, -420, -406, -194, 116, 372, 411, 229, -97, -355, -443, -298, 19, 307, 422, 306, 42, -246, -379, -298, -72, 201, 356, 341, 153, -98, -269, -299, -170, 62, 230, 299, 205, 40, -138, -216, -168, -44, 88, 176, 186, 104, 5, -99, -158, -147, -84, -3, 105, 126, 101, 51, -76, -171, -199, -150, -36, 105, 189, 204, 80, -78, -243, -274, -170, 26, 214, 326, 241, 38, -199, -337, -293, -88, 201, 377, 374, 175, -116, -329, -353, -214, 84, 370, 432, 287, 11, -279, -366, -283, -30, 256, 408, 322, 89, -191, -354, -349, -138, 127, 303, 301, 175, -85, -263, -320, -213, 7, 183, 278, 194, 28, -149, -239, -218, -97, 70, 159, 192, 112, 10, -93, -131, -129, -73, 18, 94, 152, 144, 74, -26, -94, -143, -116, -28, 97, 195, 206, 116, -33, -168, -244, -187, -9, 159, 284, 245, 64, -141, -298, -314, -142, 101, 297, 323, 173, -92, -297, -362, -262, -8, 242]
7941B42J07q8k30k62j29L0K22K62K03kk00k70j93j7J49K65K06N6j21k17k22o2
7963b71O1J95J81J08m9j31j76j19J4Q2J37J09N5o2j16r1o6K0M5P8O4L5j0m7q5
7988c9o7l3J1O9J08P6K5m3j29j12p7M9J16J67J05pj07j90j43m9J30K08J81Q8j10
8013B27k20k08j14O7J94K65J41m6k08k54j75J0J74K57K12Rj37k64k04p8J30K20
8035bK34P2q7k10j92j32P9J44J88J41k1j24j69j19k6J04J42R7O5m2r1j09o6J6
8059a08O3N6Q3M1l0m5o3n5l7J0M1R7P6L3m4j07j00p5rJ04J44J25K0j07j62j53
8085b02p6Q0J86K02P3m3k06k08j25M4J70K31J85Nj79k58j99lJ28K57K29N9j16
8108B34k36k29p0N8K34K10J21m8j86j97j34RJ63J97J14Jj15j45j48n0O9J33J27
$$ y = [242, 349, 261, 31, -231, -360, -330, -108, 154, 357, 355, 155, -115, -308, -325, -176, 89, 295, 351, 230, 13, -209, -271, -210, -15, 166, 274, 225, 94, -82, -201, -187, -105, 32, 141, 196, 134, 18, -73, -139, -119, -74, 4, 68, 103, 93, 46, -39, -106, -139, -128, -59, 49, 125, 150, 107, -22, -134, -211, -162, -46, 121, 226, 219, 112, -78, -221, -270, -140, 68, 249, 337, 227, 7, -201, -315, -248, -54, 211, 352, 306, 98, -156, -331, -321, -147, 110, 322, 331, 194, -70, -274, -352, -222, -2, 232, 304, 217, 7, -185, -317, -238, -94, 94, 235, 214, 90, -79, -198, -224, -120, 22, 119, 184, 142, 51, -58, -124, -108, -45, 11, 94, 135, 105, 60, -3, -58, -95, -85, -44, 53, 129, 162, 118, 11, -89, -164, -173, -69, 75, 200, 220, 113, -49, -202, -278, -198, -12, 190, 263, 220, 14, -194, -319, -275, -105, 126, 311, 316, 137, -121, -320, -323, -195, 62, 291, 350, 234, -2, -231, -301, -243, -9, 201, 322, 274, 88, -109, -243, -234, -71, 126, 240, 241, 126, -19, -167, -217, -148, -15, 112]
8131A12O2k4j02j14p7LO5O5P4J1Rn8n9m3m2mN3Q5P7L8j2p7j20p6KO8J35J18N1
8160B20p2j53j52o4M9J34J99J18j5j60j95j62l4J58K10J88N2j35k28j99r6J05
8182b32K32K21J07p7k16k16j43K8J88
$$ y = [112, 174, 150, 48, -66, -143, -140, -75, -10, 64, 75, 84, 26, -33, -76, -118, -122, -69, 16, 93, 131, 119, 42, -78, -154, -152, -84, 51, 169, 220, 148, -5, -157, -221, -172, -38, 161, 279, 264, 104, -91, -253, -287, -129, 81, 269, 321, 186, -42, -241, -337, -232, 0, 221, 328, 251, 35, -181, -324, -296, -108]
8191a08
$$ Imaginary data points
##PAGE= N=2
##DATA TABLE= (X++(I..I)), XYDATA
0@%%%%%%%%%Jj7L2l2L2m8O4p4R0j12J44j76K08k40K73l21L84m48N22o03O90p94
31d25R08j030J170j326J497j684J886k114K364k635K934l255L608l994M415m878
47b559N383n936O539p201P935q744R641j0646J1770j3041J4491j6167J8129k0452
61a0858K3262k6741L1183l7092M5372n7906P9345j25718L99250n11380r99026
72a190309L57779N95502M27254J63878K24913j14728l88522l48167k9363m5787
82c47550m8658J90109M83498K97293l9412k35297l65229n77559l07533N07073
92d43265R84320L81348m91893n71495n1246P6628j80793j26835K89923L95273
102B61965J02157r3489n8762j49097l18635k07923J25546K68697K19561K18659
$$ y = [0, 0, 0, 0, 0, 0, 0, 0, 0, 0, 1, -16, 16, -16, 16, -32, 32, -42, 48, -64, 80, -96, 112, -128, 145, -176, 208, -240, 282, -321, 369, -425, 483, -547, 623, -703, 794, -890, 996, -1118, 1246, -1389, 1545, -1710, 1898, -2096, 2319, -2559, 2824, -3112, 3427, -3774, 4161, -4583, 5058, -5588, 6182, -6859, 7632, -8535, 9594, -10858, 12404, -14337, 16846, -20246, 25126, -32780, 46565, -79153, 320097, -191283, -1190309, -832530, -237028, 190226, 354104, 579017, 464289, 75767, -272400, -301763, -347550, -396208, -206099, 277399, 574692, 535280, 299983, -65246, -642805, -950338, -443265, 541055, 922403, 430510, -140985, -192231, -115603, -296396, -423231, -133308, 261965, 364122, 270633, 211871, 62774, -255861, -463784, -338238, -69541, 150020, 368679]
112C68679J39447k31143n14835k59028J97904K19497j7536R9915M16040K27154
122F46094l97989o25668j99910K33485K55299J67390K05786J37620j24956k78529
132A8622k06035j38609j07144J13063M16589L95127L9397k31967k86510l46932
142c34399l37057O3351O24602O46731L3549m78360m02609r8887r143p341J36179
153a63384K61364J83151M5124k3933j53709l50146l22797K8250L66229M02117
163B72266K30178Q58k90457n00241l20903J79090M63540K58472o0846r5886Q499
174A44570n0198j88319j61364q594R3309J55694K29165J78753p7014l15144k90090
185b89232p6478J07460K08256K44366J41729q7581k21522j33738j2813l9098p1984
$$ y = [368679, 508126, 276983, -237852, -496880, -298976, -79479, -97015, 2900, 418940, 646094, 248105, -377563, -577473, -343988, -88689, 78701, 284487, 422107, 297151, 18622, -187413, -326022, -433166, -320103, 96486, 491613, 531010, 299043, 12533, -334399, -671456, -608105, 16497, 663228, 696777, 218417, -184192, -283079, -292222, -299563, -163384, 97980, 281131, 326255, 302322, 148613, -201533, -524330, -496080, -129851, 272266, 502444, 503302, 212845, -287396, -608299, -429209, 34331, 292803, 231957, 136071, 144570, 94372, -93947, -255311, -263905, -170596, -14902, 214263, 393016, 316002, 858, -289232, -365710, -258250, -49994, 194372, 336101, 248520, 26998, -106740, -119553, -158651, -230635]
196b30635P3873K56766K17912o632j74670k04119j75134q9836Q9777K51074K34605
207B42981P3809p2905j56224k10620j88427k8538J73157K54557J93684P0890q8425
218B63939k59438l04445j19539J59287K86548K08031O5272m7007j45039k11141
228a03532j72062l2158J13429K01512K21523J40027n9280k65525l06271j40995
238d03332R9286K60319K71300J33772q1660k34254k17103p5984M9194R4968J07927
249D433J21212R5151K55j18486j87251j62659m1793J26896K37256J94849K0815
260B90678j52281k06150j33336r798Q6078J16984R2010M8328J2931k4219q1515
271C9710j32938j17654j1992J25021J96068J46697N917j36960j93997j37599j3322
$$ y = [-230635, -156762, 100004, 317916, 311284, 136614, -67505, -242639, -332475, -242698, 8376, 242981, 316790, 243885, 87661, -122959, -311386, -339924, -166767, 87790, 281474, 352364, 263939, 4501, -299944, -419483, -260196, 26352, 234383, 299655, 252648, 107609, -103532, -275594, -307752, -194323, 7189, 228712, 368739, 309459, 43934, -262337, -403332, -304046, -43727, 227573, 361345, 279685, 45431, -171672, -247656, -198462, -103494, 4433, 125645, 220796, 221051, 102565, -84686, -247345, -289138, -162242, 75014, 269863, 290678, 138397, -67753, -201089, -210887, -124809, -7825, 84185, 132513, 145444, 121225, 39710, -93228, -210882, -222874, -97853, 98215, 244912, 250829, 113869, -80128, -217727, -231049]
282b31049R9873J47410J25233O0617j9176r6611j49656j43001n3378Q8777J98646
293B7685J97221P6228r3701k11905k08364q5267Q0759J88817J86197R5918k3921
304B29667j25838j76942j50742m6232R1395J90662J96041R4627p1658k09591k24357
315b02968j00020P6647J90345J88012R4272l2188j31064j58491j09505k0686O5091
326a40555J26051J44400R4081k1594j38562j76318j10666J3755J25032J64216
336G9840J09672l303r7337j18431q0467k8803J7248O2124R4788Q9413L8254l8104
348A24894j06688j30731q1575K7081J25553J43687P7186j8971q9895j13676q9786
359a32921k9138M1381R2159J09281Q7412J9004q1703j57175j43920l7791R5119
$$ y = [-231049, -131176, 16234, 141467, 202084, 182908, 86297, -63359, -206360, -259738, -170961, 27685, 224906, 301134, 207433, -4472, -212836, -298103, -217344, -28527, 157670, 253588, 229667, 103829, -73113, -223855, -270087, -178692, 11970, 208011, 302638, 230980, 21389, -202968, -302988, -226341, -35996, 152016, 246288, 214100, 83036, -75455, -184960, -205646, -140555, -14504, 129896, 223977, 202383, 63821, -112497, -223163, -209408, -84376, 79840, 189512, 186209, 88872, -29559, -110026, -138829, -121581, -59457, 35331, 124744, 162998, 124894, 18206, -112525, -194100, -167019, -41466, 102221, 179407, 160436, 70541, -43135, -132921, -162059, -120678, -28519, 80762, 168174, 187178, 105475, -51700, -195620, -233411, -138292]
370a38292J73193J54732N0975q1287j64780j51918o0801M6986J20376J40634J04065
381A93883J6413q9754j58907j48249n6786P3255J72777J78757P7447p2064j74041
392A2731j69245p3059M9814J33955J44867Q6563o132q7422j25133j09553m6211
403a88825M4861J23169J41056P8890l1277j23115j42675q2293J8861J00462J19610
414E8724P5630L961n4817q1258p6938m7919J171N7365R4582Q7324L1606m6435
426A02996j03502j05025m7756L5175R3602R6850N3216n520n3181p9145p7812m4370
438a34472J4590P5236J07152Q7994J5984p7640j35648j14584k4021P8160J32116
449B4867J14545M0329n1412j13693j16133o3464J3672Q3010J20407J04967L0497
$$ y = [-138292, 34901, 189633, 240608, 159321, -5459, -157377, -218178, -171192, -50816, 89818, 193883, 210296, 120542, -38365, -186614, -243400, -170145, 2632, 181389, 258836, 186772, 12731, -156514, -229573, -179759, -45804, 99063, 185626, 179494, 92072, -33061, -142614, -188825, -143964, -20795, 120261, 199151, 167874, 44759, -97916, -180209, -161348, -60886, 58724, 134354, 138315, 83498, 2240, -74698, -122617, -121446, -64081, 30501, 117825, 149431, 102996, -506, -105531, -153287, -118112, -24510, 72340, 125556, 120036, 66855, -12290, -90102, -134472, -119882, -44646, 62506, 150500, 166484, 88844, -46804, -161388, -185409, -107249, 24867, 139412, 179741, 128329, 14636, -101497, -164961, -151289, -68279, 52128, 157095, 187592]
460A87592p1328j39785j30930m9173O0871J40490J43479O3123n2857j30886j30141
471a09545o5501K1516R3475J21598Q9830J1914o9319j13220j04192m5640M1778
482a27306J13352J21110N7715l2968r6506j07120o6802N188P2123R5832O9118
493A03736J7555l2831p1156q4767n6034Q695O9313Q8698O3114J0783m6269q1361
505a0524p2172k4789K6457N4797O0934N0815J9172k9885p0133p7158m7949P349
517a13086O9962J04564P6838l858q0067j02372p0309j1393M9459Q8837Q4188L6329
529A29092k4659o9499q8270p3949j7698O2310J15824J03642L2052n9453j24090
540a4698j22438m4755O3715J27332J09380L7792l8496r0406j02801o5109Q320
$$ y = [187592, 116264, -23521, -154451, -203624, -142753, -2263, 141216, 204339, 151482, 20596, -109545, -175046, -153530, -60055, 61543, 151373, 163287, 93968, -19252, -123444, -169084, -127306, -13954, 107156, 164871, 131903, 35397, -71723, -138525, -133337, -61214, 34618, 103736, 121291, 88460, 17304, -67463, -123497, -114802, -45489, 43209, 106323, 117106, 70837, -10524, -82696, -107485, -81028, -26231, 34703, 85518, 104690, 74805, 4672, -72486, -120435, -113086, -43124, 61440, 138278, 134420, 54353, -48019, -118328, -129721, -80262, 8575, 92763, 129092, 104433, 34934, -53336, -127285, -144983, -82673, 33151, 136793, 168845, 109392, -14698, -137136, -181891, -118176, 9156, 118536, 156328, 117832, 27426, -75375, -140484, -132164]
551a32164P3941R6776P5989K5665m1277r8009j04998m9121L5328R7125J06789
562H6044O0900k0908r1536j02897n3235J2902N6798P3646O5148K4220l5487p2496
574C099o3819k8659P391L9843O3515N7637J6216l2908n9147n7823l4755O867N0086
587c2457O5546M5036Q936k5870n7062o9727l9246K3612O7623O3204L2338K122
599H4055k9463o2221o8526l0763K6103O4717P3586N3649K325o3176r8214p4032
611a21960q312O0098J01152R1547K2719o6778j07911p5597j2403L5267O4194P9054
623F1070N8705m641o9857r0011o3448j4215M3230R1228R4285L6057m7162r8889
635c648r3934m0285L7498R5904R1234K7986l6728n9467n3157m1469j4873L3103
$$ y = [-132164, -58223, 38553, 114542, 140207, 98930, 921, -104077, -153198, -117870, -20745, 86044, 146944, 126036, 34500, -68397, -121632, -108730, -51932, 21714, 86862, 111082, 75595, 3099, -60720, -89379, -81988, -42145, 21370, 79007, 95223, 62315, 3168, -54655, -89410, -82543, -32457, 33089, 78125, 87061, 61191, 4129, -65598, -104844, -81232, -13609, 49595, 81933, 84055, 54592, -7629, -76155, -106918, -80815, -16098, 57488, 111137, 113462, 50286, -47928, -121960, -130272, -70174, 30978, 122525, 145244, 78466, -29445, -105042, -117445, -82178, -17984, 61070, 119775, 115134, 45277, -44734, -108182, -122397, -79167, 12061, 106346, 142403, 95241, -3648, -97582, -137867, -100369, -4465, 86769, 114755, 78027, 18560, -34597, -76066, -90939, -57836]
647e7836O8495N7331J5589j9820m1338n6318m9779o240M8398O9960M8503O532
659H3477l4203n8274m9855j2110K3215L3482L1796L2548J9660j8372n2093m8320
671d9049j7846Q390K7088M8055N4096K0655l5569o8473n8338k1285K2658N9243
683a0375O8495L8213j3717n3751o6165n1647j0275M5284P8324O1290J1139l3412
695F3403n6899o3548m5748N378O4754Q6789N5364m496n8199q3531o7189j0704
707a14626N5015Q6560O6870J3800m1987p4169o6467k2229K9833N7680N4169L2240
719G6689Q44l5257o0562n4691j6254L1635O1340N9224K6181k2407n8838o0195
731e2291k7309J6691M5784M8064K7462k195k5418l4107k9993j7086K284K3104
$$ y = [-57836, 10659, 67990, 83579, 63759, 22421, -33897, -83676, -89916, -41518, 28442, 76945, 83477, 49274, -9000, -58855, -70965, -47750, -14268, 17528, 50076, 69736, 51364, -729, -49049, -66895, -58505, -31417, 16638, 70734, 91389, 55820, -12653, -70991, -92276, -69618, -10375, 58120, 96333, 82616, 28865, -37300, -88947, -99222, -53938, 24386, 85676, 96815, 63403, 6504, -57044, -102792, -97414, -32660, 54129, 109493, 104997, 46798, -36733, -103922, -114626, -59611, 26949, 93819, 107619, 65632, -8537, -75004, -97233, -67400, -9720, 44449, 76689, 77533, 42276, -18286, -72977, -89231, -57596, 3744, 62968, 89149, 66742, 7904, -52291, -79600, -62909, -17125, 30939, 58401, 56206, 30788, -3319, -33312, -50398, -48114, -25010]
743b5010L6605L5156J6285j4966m3442m9338k5174J3472M1107M5475L0162K479
755F2811k7788m5480l9917j5617J3933L8154M8641L5569J77l7080n3968m5689
767f6254j7248K4944O2911O6450K4958l1450o2186n7535l1323P875N1076P1914
779D4132M7957o137n1016o4276m8651j0884L6552O5574N5013J6383k2748n0006
791A1893o1135m1468J1297O0084O4654L1425n180l2481n4746n5764j6061M0476
803d7006O4032M2853P490j9920l9719m5338k3997J1355L1465L1824K7847J6418
815E7304j3792m3262l9832j0401J0852J8052L0066L8344J4385k9561m6051k4537
827c8433j272N238J4722L2370L2144N714j9964k8602l1462k7743p4L9630N1596
$$ y = [-25010, 11595, 46751, 63036, 48070, 4628, -44710, -69884, -56412, -15305, 30170, 60332, 62811, 35023, -10457, -50374, -65991, -52058, -13904, 34737, 70306, 70483, 33403, -20565, -66254, -83502, -58558, 4353, 70803, 95761, 64311, 2125, -55410, -86733, -78858, -27782, 44132, 92089, 85952, 34936, -29340, -77991, -88875, -52323, 13251, 68264, 84647, 61899, 11893, -49242, -90710, -79413, -19329, 45325, 76750, 71570, 39089, -15657, -71421, -87482, -47006, 17026, 59879, 67369, 47449, 7730, -37608, -61605, -50250, -18785, 13039, 40886, 57304, 43512, 250, -39582, -49983, -39131, -21079, 8987, 47331, 61716, 32155, -13896, -38433, -39705, -34467, -19745, 12625, 44769, 50483, 30519, 1917, -29545, -57288, -57362, -17732, 33864]
840C3864K6410m501k3514m1066m9704k1290L3601O1438M0710O689j2947l1455
852A8235n2041m3489M375M9632N5619L4287O916k7421n9979n7574j1827L6826
864d6441N2813M4735K6478r973n4998o6143k6792K2469M1872M0662L5984J3034
876G3700l2922o2106m2747M59K7410L6253L9556K5387j3453m5304m0465j4492
888d8724M260J8251L5763L6928O910k6876l2137j9435j2327l244K0987L8420K3717
901D2493o282j8662j6199j9488k0767r40K5907L0684J6247M264n810k4897l7834
914c1284k1392J2734L1579K9283K1623Q219j9408m3695l7220n388K1362L1595
926a992L4783K6919l636m0709n0503k6899N726K9744M4226M1773J0981l2592n3517
$$ y = [33864, 60274, 55773, 32259, -8807, -58511, -79801, -46200, 15238, 55948, 62637, 49690, 18235, -33806, -77295, -72920, -23288, 32331, 66618, 73534, 46113, -13866, -71440, -83267, -46441, 6372, 51107, 77585, 67612, 12614, -53529, -80321, -57852, -15980, 24682, 60666, 73700, 40778, -21328, -64075, -63616, -36206, 47, 39603, 64990, 51537, 6233, -34232, -48724, -44464, -26213, 9550, 46478, 53388, 26512, -5625, -25060, -37387, -40631, -19644, 18776, 42493, 36211, 17549, 1350, -18138, -38905, -39845, -13938, 16746, 32993, 37257, 31447, 6550, -31284, -52676, -39942, -8363, 20920, 42543, 50762, 31354, -12341, -49561, -54949, -33587, -1992, 32791, 59710, 56074, 15365, -35138, -62037, -56311, -26567, 17659, 59432, 70413, 37821, -15696]
939a5696l9290q925J9186M0889M7534K5972j5240m4756m4750k4727K196L0721
951b6886M8691L8351J914l2642m3213l2481j0690J6975L9740L9923J4871j5517
963C9036l1056l0698k0508j077K2486L4536K5356L462j5582k5208k5543j4611
975c9407O022K3587K5992J4894M78j1500k0045k1637j2031M847J8087K1653J7387
988B8327O756r537k4605k7216j3580P082K2278K6986K1148M499j7908l2427k8403
1001c6600r151J2782K8136L2845K2332l697l1098m0313k6107K71K4772L8896L5236
1014D8304J0259k3424m2468l5943j2795J3772L5218M1914K4500r902l6767l9854
1026b7186k4281n28K5454M2646L5308L971k7279l7487k9025j1694J1811L4151
$$ y = [-15696, -54986, -63911, -44725, -3836, 43698, 69670, 54430, 9674, -35076, -59803, -57607, -26886, 21805, 60156, 62070, 29428, -13785, -46266, -56956, -39981, -241, 39682, 54553, 39036, 7980, -22718, -43226, -44303, -21817, 12719, 38075, 41537, 25955, 747, -24796, -39407, -33385, -9798, 16194, 31088, 31566, 20066, 21, -21616, -33647, -28800, -10713, 10940, 28327, 35083, 25546, 941, -26275, -39855, -32773, -10495, 16491, 37639, 42138, 24230, -8197, -36600, -45751, -32969, -4833, 28012, 50344, 46647, 15549, -24764, -50871, -50600, -25828, 13068, 48304, 58563, 35139, -7329, -43272, -56067, -42295, -7077, 34837, 59337, 49435, 12668, -27186, -51467, -51995, -26541, 16105, 51413, 55384, 28105, -9382, -38407, -50101, -38290, -4139]
1038d139L7630J6154j2416k7504k8322k1092l352K1480L4303K3117R78j3895k0679
1051B263k3787j5906O147K4415K2683R701R73o067j8009k3730j1043Q722J6785
1064f853J5109J4282R089q420k4694k1965o214N132J1831K1093K3542O461j8065
1077B0328k6814j9384r617K381K1924L4989K2403p249k6779k8169k1838q291J7155
1090b8961L8698L3229N135j9213k8516k9986k1135O025L6136M0769J7809q668
1102D1322k4464l3264l0644n705K8403M1195K5614K207j5253k9324l4276j6413
1114e0602J5831L3593K7202J2521j309j9253l4091k6110K620K4449K4893J6544
1126B6288Q131p244k5358k6683p622J0723J4862J4399J4816O343j1422k0531j3485
$$ y = [-4139, 33491, 49645, 37229, 9725, -18597, -39689, -43041, -21561, 12742, 35859, 36837, 22942, 2263, -21524, -37430, -31283, -6868, 15815, 25516, 26489, 20422, 2413, -21317, -32360, -23638, -6853, 8256, 22538, 31627, 23207, -1487, -23452, -29666, -24534, -12703, 8390, 31932, 38393, 20328, -6486, -25870, -35487, -33106, -11182, 23807, 46210, 38961, 12182, -15987, -37825, -46116, -28961, 9737, 42966, 48101, 28888, 372, -29614, -50749, -44724, -8588, 32181, 49990, 41322, 16858, -16406, -47050, -52755, -24352, 16843, 42457, 44664, 29411, 87, -34189, -50602, -34771, -1178, 26024, 38545, 37236, 17983, -16108, -42218, -39598, -15149, 9744, 26288, 34419, 27175, 1817, -24866, -32488, -21765, -6903, 7496, 22312, 28655, 17233, -3298, -16783]
1139a6783m127j15P701J9662J9242J635j3946j4719j1137j0801l354J4307K4276
1152A1841J5019r32r510j4652k0239j5554M330K2922K4696J4451J571j4364k9366
1165i787k7870m670K0790K8876K2565J0913p298k8822l5396j6181J2598K7964
1177f318K7112J8311J727k1108l4586k5494j718J8647K8416K7686J2886j3343
1189C2218l2672k9863j0951Q834K3025K9605K1082l642k6586k9063j4283K141
1201c0155J3439K0806K0193P039j0730j9304j6503r181M30J2102J9319J4850K212
$$ y = [-16783, -20910, -21025, -13324, 6338, 25580, 27215, 13269, -1450, -12587, -23388, -26742, -12435, 11841, 26860, 25928, 16418, 1766, -18473, -34027, -29697, -6775, 17921, 32372, 33943, 19579, -9787, -37657, -42327, -21537, 7339, 29904, 40817, 33519, 4697, -30699, -46880, -34282, -6318, 20794, 39105, 40832, 19724, -14862, -40356, -42074, -23427, 4989, 32675, 45561, 32218, -454, -30317, -41268, -32434, -9409, 20196, 41278, 37636, 11050, -18013, -32296, -30155, -16716, 4090, 24283, 31322, 20592, 1288, -15215, -24396, -23966, -11864, 7455, 22305, 24517]
$$ [...]
8191C12
##END NTUPLES=NMR FID
##END=
