##TITLE=1H ikalashn
AM_NV 172(nlock)
20.12.2024
##JCAMPDX= 6.0         $$ Bruker NMR JCAMP-DX V2.0
##DATA TYPE= NMR FID
##DATA CLASS= NTUPLES
##ORIGIN= UXNMR, Bruker Analytische Messtechnik GmbH
##OWNER= root
$$ TOPSPIN		Version 1.3
$$ 2024-12-20 14:20:19.312 +0400  Irina@DPX200
$$ Compression mode = diff/dup
##.OBSERVE FREQUENCY= 200.131300845
##.OBSERVE NUCLEUS= ^1H
##.DELAY= (6, 6)
##.ACQUISITION MODE= SIMULTANEOUS
##.ACQUISITION SCHEME= undefined
##.AVERAGES= 16
##.DIGITISER RES= 18
##SPECTROMETER/DATA SYSTEM= spect
##.PULSE SEQUENCE= zg
##.SOLVENT NAME= DMSO
##.SHIFT REFERENCE= INTERNAL, DMSO, 1, 17.49637
##AUDIT TRAIL= $$ (NUMBER, WHEN, WHO, WHERE, WHAT)
$$ ##TITLE= Audit trail, TOPSPIN		Version 1.3
$$ ##JCAMPDX= 5.01
$$ ##ORIGIN= Bruker BioSpin GmbH
$$ ##OWNER= Irina
$$ $$ F:/spectra/data/iren/nmr/1H/4/audita.txt
$$ ##AUDIT TRAIL=  $$ (NUMBER, WHEN, WHO, WHERE, VERSION, WHAT)
(   1,<2024-12-20 14:20:04.015 +0400>,<Irina>,<DPX200>,<TOPSPIN 1.3>,
      <created by zg
	started at 2024-12-20 14:18:55.984 +0400,
	POWCHK disabled, PULCHK disabled
       configuration hash MD5:
       BE 6D 3F 07 2A EA 11 49 91 17 2B D3 AF B3 58 0D
       data hash MD5: 16K
       09 37 49 13 BC 2E 4C E5 0E 7D 0B F9 03 69 2F 0C>)
$$ ##END=
$$ 
$$ $$ hash MD5
$$ $$ BC 6D DB 37 24 B8 8C 93 47 D5 67 1F BB 87 58 01
##$RELAX= 
##$RELAX= 
##$RELAX= 
##$RELAX= 
##$RELAX= 
##$RELAX= 
##$RELAX= 
##$RELAX= 
##$RELAX= 
$$ Bruker specific parameters
$$ --------------------------
##$DU= <F:/spectra>
##$EXPNO= 4
##$NAME= <1H>
##$PROCNO= 1
##$TYPE= <nmr>
##$USER= <iren>
##$AMP= (0..31)
100 100 100 100 100 100 100 100 100 100 100 100 100 100 100 100 100 100 
100 100 100 100 100 100 100 100 100 100 100 100 100 100 
##$ANAVPT= -1
##$AQSEQ= 0
##$AQ_mod= 1
##$AUNM= <au_zg>
##$AUTOPOS= <>
##$BF1= 200.13
##$BF2= 200.13
##$BF3= 200.13
##$BF4= 200.13
##$BF5= 200.13
##$BF6= 200.13
##$BF7= 200.13
##$BF8= 200.13
##$BYTORDA= 1
##$CFDGTYP= 0
##$CFRGTYP= 5
##$CHEMSTR= <none>
##$CNST= (0..63)
1 1 145 1 1 1 1 1 1 1 1 1 1 1 1 1 1 1 1 1 1 1 1 1 1 1 1 1 1 1 1 1 1 1 
1 1 1 1 1 1 1 1 1 1 1 1 1 1 1 1 1 1 1 1 1 1 1 1 1 1 1 1 1 1 
##$CPDPRG= <>
##$CPDPRG1= <>
##$CPDPRG2= <>
##$CPDPRG3= <>
##$CPDPRG4= <mlev>
##$CPDPRG5= <mlev>
##$CPDPRG6= <mlev>
##$CPDPRG7= <mlev>
##$CPDPRG8= <mlev>
##$CPDPRGB= <>
##$CPDPRGT= <>
##$D= (0..63)
0 2 0 0 0 0 0 0 0 0.06 0 0.03 0 0 0 0 0.0002 0 0 0 0 0 0 0 0 0 0 0 0 0 
0 0 0 0 0 0 0 0 0 0 0 0 0 0 0 0 0 0 0 0 0 0 0 0 0 0 0 0 0 0 0 0 0 0 
##$DATE= 1734690000
##$DBL= (0..7)
120 120 120 120 120 120 120 120 
##$DBP= (0..7)
150 150 150 150 150 150 150 150 
##$DBP07= 0
##$DBPNAM0= <>
##$DBPNAM1= <>
##$DBPNAM2= <>
##$DBPNAM3= <>
##$DBPNAM4= <>
##$DBPNAM5= <>
##$DBPNAM6= <>
##$DBPNAM7= <>
##$DBPOAL= (0..7)
0.5 0.5 0.5 0.5 0.5 0.5 0.5 0.5 
##$DBPOFFS= (0..7)
0 0 0 0 0 0 0 0 
##$DE= 6
##$DECBNUC= <off>
##$DECIM= 32
##$DECNUC= <off>
##$DECSTAT= 4
##$DIGMOD= 1
##$DIGTYP= 9
##$DL= (0..7)
0 120 120 120 120 120 120 120 
##$DP= (0..7)
150 150 150 150 150 150 150 150 
##$DP07= 0
$$ [...]
##$SW= 21.9926040160658
##$SWIBOX= (0..15)
0 0 2 0 0 0 0 0 0 0 0 0 0 0 0 0 
##$SW_h= 4401.40845070422
##$TD= 16384
##$TD0= 1
##$TE= 300
##$TE2= 300
##$TE3= 300
##$TEG= 300
##$TL= (0..7)
0 120 120 120 120 120 120 120 
##$TP= (0..7)
150 150 150 150 150 150 150 150 
##$TP07= 0
##$TPNAME0= <>
##$TPNAME1= <>
##$TPNAME2= <>
##$TPNAME3= <>
##$TPNAME4= <>
##$TPNAME5= <>
##$TPNAME6= <>
##$TPNAME7= <>
##$TPOAL= (0..7)
0.5 0.5 0.5 0.5 0.5 0.5 0.5 0.5 
##$TPOFFS= (0..7)
0 0 0 0 0 0 0 0 
##$TUNHIN= 0
##$TUNHOUT= 0
##$TUNXOUT= 0
##$USERA1= <user>
##$USERA2= <user>
##$USERA3= <user>
##$USERA4= <user>
##$USERA5= <user>
##$V9= 5
##$VALIST= <valist>
##$VCLIST= <CCCCCCCCCCCCCCC>
##$VD= 0
##$VDLIST= <DDDDDDDDDDDDDDD>
##$VPLIST= <PPPPPPPPPPPPPPP>
##$VTLIST= <TTTTTTTTTTTTTTT>
##$WBST= 1024
##$WBSW= 25
##$XGAIN= (0..3)
0 0 0 0 
##$XL= 0
##$YL= 0
##$YMAX_a= 942210
##$YMIN_a= -705724
##$ZGOPTNS= <>
##$ZL1= 120
##$ZL2= 120
##$ZL3= 120
##$ZL4= 120
##$ABSF1= 10
##$ABSF2= 0
##$ABSG= 5
##$ABSL= 3
##$ALPHA= 0
##$AQORDER= 0
##$ASSFAC= 0
##$ASSFACI= 0
##$ASSFACX= 0
##$ASSWID= 0
##$AUNMP= <proc_1d>
##$AXLEFT= 0
##$AXRIGHT= 0
##$AXTYPE= 0
##$AXUNIT= <>
##$AZFE= 0.1
##$AZFW= 0.1
##$BCFW= 1
##$BC_mod= 2
##$BYTORDP= 1
##$COROFFS= 0
##$CY= 7568.61572265625
##$DATMOD= 1
##$DC= 2
##$DFILT= <>
##$DTYPP= 0
##$F1P= 17.9538593292236
##$F2P= -4.03888763876832
##$FCOR= 0.5
##$FTSIZE= 32768
##$FT_mod= 4
##$GAMMA= 1
##$GB= 1
##$INTBC= 1
##$INTSCL= 1
##$ISEN= 128
##$LB= 0.02
##$LEV0= 0
##$LPBIN= 0
##$MAXI= 945.577
##$MC2= 0
##$MEAN= 0
##$ME_mod= 0
##$MI= -402.1523
##$NCOEF= 0
##$NC_proc= 0
##$NLEV= 6
##$NOISF1= 8.587773
##$NOISF2= 6.764455
##$NSP= 1
##$NTH_PI= 0
##$NZP= 0
##$OFFSET= 17.49637
##$PC= 1
##$PHC0= 171.5127
##$PHC1= 7.948051
##$PH_mod= 0
##$PKNL= yes
##$PPARMOD= 0
##$PPDIAG= 0
##$PPIPTYP= 0
##$PPMPNUM= 100
##$PPRESOL= 1
##$PSCAL= 0
##$PSIGN= 0
##$REVERSE= no
##$SF= 200.13
##$SI= 32768
##$SIGF1= 18.5376
##$SIGF2= -6.396296
##$SINO= 400
##$SIOLD= 32768
##$SREGLST= <1H.CDCl3>
##$SSB= 3
##$STSI= 0
##$STSR= 0
##$SW_p= 4401.40845070422
##$SYMM= 0
##$S_DEV= 0
##$TDeff= 0
##$TDoff= 0
##$TI= <>
##$TILT= no
##$TM1= 0
##$TM2= 0
##$TOPLEV= 0
##$USERP1= <user>
##$USERP2= <user>
##$USERP3= <user>
##$USERP4= <user>
##$USERP5= <user>
##$WDW= 1
##$XDIM= 8192
##$YMAX_p= 0
##$YMIN_p= 0
$$ End of Bruker specific parameters
$$ ---------------------------------
##NTUPLES= NMR FID
##VAR_NAME=  TIME,          FID/REAL,        FID/IMAG
##SYMBOL=    X,             R,               I
##VAR_TYPE=  INDEPENDENT,   DEPENDENT,       DEPENDENT
##VAR_FORM=  AFFN,          ASDF,            ASDF
##VAR_DIM=   8192,          8192,            8192
##UNITS=     SECONDS,       ARBITRARY UNITS, ARBITRARY UNITS
##FACTOR=    0.0002272,     1,               1
##FIRST=     0,             0,               0
##LAST=      1.8609952,     -23,             18
##MIN=       0,             -705724,         -705724
##MAX=       1.8609952,     942210,          942210
$$ Real data points
##PAGE= N=1
##DATA TABLE= (X++(R..R)), XYDATA
$$ plain form
0 0 0 0 0 0 0 0 0 0 16 -16 16 -16 32 -33 48 -64 80 -96 112 -144 176 -208 240 -288 336 -400 453 -528 608
29 608 -704 801 -913 1041 -1171 1329 -1491 1678 -1878 2101 -2342 2610 -2900 3215 -3559 3939
45 3939 -4350 4802 -5291 5833 -6426 7075 -7795 8590 -9478 10472 -11587 12861 -14316
58 -14316 16006 -17998 20381 -23293 26948 -31684 38095 -47300 61689 -87517 148322 -583361
70 -583361 -237533 273845 -574995 462863 138979 166510 888331 -7151 -175352 437441
80 437441 -226209 -128403 -138695 -529779 -100365 -25901 -256338 40037 167391 270794 263901
91 263901 268296 101090 -194026 41343 -73570 -466205 -99226 -53985 65174 317160 -202104
102 -202104 52339 462541 -144090 -84977 -20566 -168145 239293 -155460 -368499 196431
$$ packed form
0@%%%%%%%%J6l2L2l2M8o5Q1j12J44j76K08k56L20l84M48n28O24p36Q53r81J136
29F08j312J505j714J954k212K500k820L169l556L979m443M952n510O115o774P498
45C939q289R152j0093J1124j2259J3501j4870J6385j8068J9950k2059K4448k7177
58a4316L0322l4004L8379m3674N0241n8632O9779q5395J08989j49206K35839p31683
70e83361L45828N11378q48840J037858l23884K7531P21821q95482j68201O12793
80D37441o63650R7806j0292l91084M29414P4464k30437K96375J27354J03403o893
91B63901M395j67206k95116K35369j14913l92635L66979M5241J19159K51986n19264
102b02104K54443M10202o06631N9113O4411j47579M07438l94753k13039N64930
$$ plain form
112 196431 34584 22259 62976 -108135 364253 158196 -242929 94892 -155765 -163519 48485
123 48485 -304897 66492 208095 -97841 319014 44812 -239830 251256 -70373 -185022
133 -185022 99030 -197750 65297 214664 -223471 -15680 155411 47642 44177 -157331
143 -157331 -34350 151134 -88136 -203401 -94250 145905 118219 -82866 169280 182929
153 182929 36462 131957 -209797 -205558 72174 -292585 -163140 90277 -138176 182701
163 182701 226086 -12663 286315 93581 -49432 199684 -193269 -283614 -6190 -182773
173 -182773 -158728 -104451 -61737 261618 184193 53700 197936 166219 106504 -109138 -257513
184 -257513 -56682 -107214 -186373 -95950 -62840 178505 163577 -25235 203590 170036 -17698
$$ packed form
112A96431j61847j2325M0717j71111M72388k06057m01125L37821k50657p754K12004
123D8485l53382L71389J41603l05936M16855k74202k84642M91086l21629j14649
133a85022K84052k96780K63047J49367m38135K07791J71091j07769l465k01508
143a57331J22981J85484k39270j15265J09151K40155k7686k01085K52146J3649
153A82929j46467R5495l41754M239K77732l64759J29445K53417k28453L20877
163A82701M3385k38749K98978j92734j43013K49116l92953r0345K77424j76583
173a82773K4045N4277M2714L23355p7425j30493J44236l1717n9715k15642j48375
184b57513K00831n0532p9159R0423L3110K41345j4928j88812K28825l3554j87734
$$ plain form
195 -17698 40547 -113524 -130088 -61971 -198221 -53349 6330 -75159 140006 162869 79040
206 79040 110102 16311 55630 18622 -180985 -117000 -53217 -38134 -24202 -119577 72727 215080
218 215080 2435 5807 73799 40515 29990 -135322 -97489 70904 -50144 -55060 23615
229 23615 -1383 77404 24351 -40227 60314 5164 -42171 -4845 -36810 -14379 -30759 -8403
241 -8403 93119 9913 -14486 80439 33035 -26459 -95193 -84568 49375 -31892 -92144 60547
253 60547 89472 64092 15034 -49116 61540 49931 -95905 -52132 3290 -505 -24263 -80777
265 -80777 11081 80477 -302 21681 73910 42070 -5069 -54986 -40331 -42300 -85315 -17998
277 -17998 52257 54390 52795 36593 61700 36027 -78364 -73324 -12263 -23717 -54634 -72102
$$ packed form
195a7698N8245j54071j6564O8117j36250J44872N9679q1489K15165K2863q3829
206G9040L1062r3791L9319l7008j99607O3985O3783J5083J3932r5375J92304J42353
218B15080k12645L372O7992l3284j0525j65312L7833J68393j21048m916P8675
229B3615k4998P8787n3053o4578J00541n5150m7335L7326l1965K2431j6380K2356
241h403J01522q3206k4399R4925m7404n9494o8734J0625J33943q1267o0252J52691
253F0547K8925k5380m9058o4150J10656j1609j45836M3773N5422l795k3758n6514
265h0777R1858O9396q0779K1983N2229l1840m7139m9917J4655j969m3015O7317
277a7998P0255K133j595j6202K5107k5673j14391N040O1061j1454l0917j7468
$$ plain form
289 -72102 8791 73914 -8605 -5534 103592 119215 60993 -8854 -13423 -1363 -105980 -161459
301 -161459 -84301 -29004 -2353 20688 64056 123720 83404 17702 32730 26538 -20519 -51603
313 -51603 -40574 -9624 -52304 -94416 -27991 23003 3328 8249 64849 105594 46398 -36256
325 -36256 -20967 4309 -39285 -67522 -17873 55760 46259 -18135 -11413 25819 -7766 -61139
337 -61139 -41671 25034 32362 -13506 -3715 40683 24077 -21352 -7422 45916 41475 -13156 -21285
350 -21285 -57 -30663 -82621 -67067 6293 35294 10543 31084 82997 62497 -11198 -34529
362 -34529 1669 4386 -45204 -45340 14975 24250 -29810 -45915 2137 27171 -5823 -10126 45894
375 45894 62578 3145 -35366 -5389 12554 -23990 -32073 25094 52256 1912 -38535 -15102
$$ packed form
289g2102Q0893O5123q2519L071J09126J5623n8222o9847m569J2060j04617n5479
301a61459P7158N5297K6651K3041M3368N9664m0316o5702J5028o192m7057l1084
313e1603J1029L0950m2680m2112O6425N0994j9675M921N6600M0745n9196q2654
325c6256J5289K5276m3594k8237M9649P3633r501o4394O722L7232l3585n3373
337f1139J9468O6705P328m5868R791M4398j6606m5429J3930N3338m441n4631q129
350b1285K1228l0606n1958J5554P3360K9001k4751K0541N1913k0500p3695k3331
362c4529L6198K717m9590j36O0315R275n4060j6105M8052K5034l2994m303N6020
375D5894J6684n9433l8511K9977J7943l6544q083N7167K7162n0344m0447K3433
$$ plain form
387 -15102 -3610 -46717 -57452 4124 51001 32589 9224 35377 55377 6100 -39673 -9516
399 -9516 24784 -6493 -50523 -31502 5496 -27708 -61943 -6570 54262 44593 18162 33592
411 33592 57747 13218 -50290 -34910 -1859 -16848 -35574 -16441 30386 26376 -26399 -13844
423 -13844 29717 13618 -17480 -8631 34330 30425 -36288 -31566 22836 5932 -24687 -5333 36790
436 36790 36392 -25789 -32970 11384 -5637 -33670 -22826 14029 45777 6714 -14954 34627 29941
449 29941 -17995 -32619 -7250 23939 -20265 -46796 16947 17706 -24093 -11584 16747 43026
461 43026 13067 -19402 28086 18928 -32455 -25101 -14731 10419 574 -43663 11993 44262 -6912
474 -6912 -11035 4539 31400 16486 -53329 -4552 44813 -19332 -26463 -598 16398 18957 -34914
$$ packed form
387a5102J1492m3107j0735O1576M6877j8412k3365K6153K0000m9277m5773L0157
399i516L4300l1277m4030J9021L6998l3204l4235N5373O0832r669k6431J5430
411C3592K4155m4529o3508J5380L3051j4989j8726J9133M6827m010n2775J2555
423a3844M3561j6099l1098Q849M2961l905o6713M722N4402j6904l0619J9354M2123
436C6790l98o2181p181M4354j7021k8033J0844L6855L1748l9063k1668M9581m686
449B9941m7936j4624K5369L1189m4204k6531O3743P59m1799J2509K8331K6279
461D3026k9959l2469M7488r158n1383P354J0370K5150r845m4237N5656L2269n1174
474f912m123J5574K6861j4914o9815M8777M9365o4145p131K5865J6996K559n3871
$$ plain form
487 -34914 -6011 40170 -10744 -10132 2078 1711 28464 -22976 -25038 32793 -12576 -24600 4087
500 4087 9519 30486 -24338 -24982 52776 -5880 -35995 18790 21045 25968 -24152 -40600 36737
513 36737 -11422 -51398 -3053 -4195 34581 14580 -36923 50763 41195 -25871 1748 -12755
525 -12755 15996 12147 -64753 12699 23800 -60691 -3374 7782 -2565 28403 -8207 36335
537 36335 46024 -40086 -1625 11041 -19134 -3114 -36693 13086 51978 -30299 -18326 4621
549 4621 7055 13093 -65980 2226 84741 -26526 -17594 17072 -9730 35454 -32666 -26714 79467
562 79467 -11703 -20546 19393 -56392 859 -8191 -59932 47467 17295 -13059 58337 6771
574 6771 5144 276 -36380 43505 -7965 -61637 33370 9495 -20051 -31130 -49835 53172
$$ packed form
487c4914K8903M6181n0914O12J2210l67K6753n1440k062N7831m5369j2024K8687
500D087N432K0967n4824o44P7758n8656l0115N4785K255M923n0120j6448P7337
513C6737m8159l9976M8345j142L8776k0001n1503Q7686r568o7066K7619j4503
525a2755K8751l849p6900P7452J1101q4491N7317J1156j0347L0968l6610M4542
537C6335R689q6110L8461J2666l0175J6020l3579M9779L8892q2277J1973K2947
549D621K434O038p9073O8206Q2515j11267Q932L4666k6802M5184o8120N952J06181
562G9467r1170q843L9939p5785N7251r050n1741J07399l0172l0354P1396n1566
574F771j627m868l6656P9885n1470n3672R5007k3875k9546j1079j8705J03007
$$ plain form
586 53172 20892 -46718 48127 37180 22979 16318 -70363 13433 41023 -56631 -5594 5780
598 5780 7350 24875 -68705 -15842 33361 -43428 21287 34227 10910 57376 -10780 7926
610 7926 21102 -80858 10899 27517 -54829 18975 -28700 -26131 55584 -71626 -26536 90107
622 90107 12460 39936 12435 -25147 79121 -33430 -109437 18577 4774 -13854 -6346 -22128
634 -22128 43026 13115 -30307 4579 -1977 36611 18969 -21901 35020 -15048 -27530 18272
646 18272 -49088 7712 28561 -33380 68038 -3986 -86292 58982 -7047 -61611 24173 -18948
658 -18948 55080 60917 -76493 26641 53507 -41154 -4833 -35893 413 59756 -53519 -41761
670 -41761 19149 -2898 12215 -25985 12075 79000 -2562 2430 14780 -35643 4590 -27783
$$ packed form
586E3172l2280o7610R4845j0947j4201o661q6681Q3796K7590r7654N1037J1374
598E780J570J7525r3580N2863M9203p6789O4715J2940k3317M6466o8156J8706
610G926J3176j01960R1757J6618q2346P3804m7675K569Q1715j27210M5090J16643
622I0107p7647K7476k7501l7582J04268j12551p6007J28014j3803j8628P508j5782
634b2128O5154k9911m3422L4886o556L8588j7642m0870N6921n0068j2482M5802
646A8272o7360N6800K0849o1941J01418p2024q2306J45274o6029n4564Q5784m3121
658a8948P4028N837j37410J03134K6866r4661L6321l1060L6306N9343j13275J1758
670d1761O0910k2047J5113l8200L8060O6925q1562M992J2350n0423M0233l2373
$$ plain form
682 -27783 -33971 24456 -33999 9023 51064 -39800 -616 21030 -2982 37656 -24719 -14874
694 -14874 58410 -7228 -26296 -29894 -15472 56225 -32066 -53088 52968 15232 -1940 -19020
706 -19020 -41056 62016 9112 -51537 48637 6195 -408 36161 -59092 -5062 31633 -54787
718 -54787 7192 11772 -29944 30117 3105 -2429 20418 -25452 23769 38298 -32899 -16908
730 -16908 9346 15912 -16124 -54769 16824 35514 -6823 640 -15236 31306 42323 -59833
742 -59833 -18963 30452 -14153 4814 -26590 -12726 63082 -16468 -24598 42333 -8895 1412
754 1412 9164 -28671 10289 -12448 -22038 26129 -18443 -14031 27109 7306 16450 -10198 -13919
767 -13919 39901 -4726 -34000 -8756 -3714 28595 -14053 -44650 44499 35018 -20006 -7745
$$ packed form
682b7783o188N8427n8455M3022M2041r0864L9184K1646k4012M0638o2375R845
694a4874P3284o5638j9068l598J4422P1697q8291k1022J06056l7736j7172j7080
706a9020k2036J03072n2904o0649J00174m2442o603L6569r5253N4030L6695q6420
718e4787O1979M580m1716O0061k7012n534K2847m5870M9221J4529p1197J5991
730a6908K6254O566l2036l8645P1593J8690m2337P463j5876M6542J1017j02156
742e9833M0870M9415m4605J8967l1404J3864P5808p9550q130O6931n1228J0307
754A412P752l7835L8960k2737r590M8167m4572M412M1140j9803R144k6648l721
767a3919N3820m4627k9274K5244N042L2309m2648l0597Q9149r481n5024J2261
$$ plain form
779 -7745 -7203 22517 2038 -50600 5961 20378 -10161 8283 -7326 8173 27162 -14113 2748
792 2748 11807 -13517 2132 -9306 -9569 -4637 -32245 12419 29992 -18657 7331 31690 20702
805 20702 2008 -39452 -3693 27689 -26419 -24527 3026 13044 19707 -28965 -21245 35481 10256
818 10256 -7442 1827 8641 28418 -12750 -32604 10491 -4746 -12707 8189 28 10138 -1539
831 -1539 -14809 10491 -13707 -21736 20918 19382 10967 2642 -3071 24487 -686 -38896 -11557
844 -11557 10091 8882 -16759 -30550 19724 22049 -25447 -12293 19600 33860 17315 -13800
856 -13800 10939 18514 -23872 -28056 -17184 -5737 8400 -4593 5198 18399 -4519 -5751 2468
869 2468 599 2283 -1854 17146 20898 -18569 -16290 8426 2014 -10560 -17291 12217 32579 -14505
$$ packed form
779g745N42K9720k0479n2638N6561J4417l0539J8444j5609J5499J8989m1275J6861
792B748R059k5324J5649j1438k63M932k7608M4664J7573m8649K5988K4359j0988
805B0702j8694m1460L5759L1382n4108J892K7553J0018O663m8672P720N6726k5225
818A0256j7698R269O814J9777m1168j9854M3095j5237p961K0896q161J0110j1677
831a539j3270K5300k4198q029M2654j536q415q325n713K7558k5173l8210K7339
844a1557K1648j209k5641j3791N0274K325m7496J3154L1893J4260j6545l1115
856a3800K4739P575m2386m184J0872J1447J4137j2993R791J3201k2918j232Q219
869B468j869J684m137J9000L752l9467K279K4716o412j2574o731K9508K0362m7084
$$ plain form
883 -14505 -30816 -46 3701 -4378 -14632 2501 45513 26322 -12373 -439 8403 -5208 -23945
896 -23945 -24369 4086 5466 -15298 -7141 7095 5188 -1039 8003 26129 16120 2402 9575 2934
910 2934 -16086 -31171 -25709 2694 -1412 -17246 11465 30815 12497 -7698 -8962 16492 18208
923 18208 -15525 -9822 18411 7394 -20082 -25413 -3531 9706 -6837 -8455 15488 20803 -534
936 -534 -13631 -277 6109 -7956 -3927 13924 15264 2406 -8897 -1586 1575 -20386 -18393 9717
950 9717 10601 -4584 -5810 7134 14707 -4672 -14862 11898 23655 573 -12690 632 9020
963 9020 -10984 -26775 -7093 13958 4711 -8076 5258 18671 1594 -14270 -3294 7901
975 7901 3554 -5574 -581 14073 3503 -15843 -4598 8398 -2204 -11641 -2473 12668 3631
$$ packed form
883a4505j6311L0770L747q079j0254J7133M3012j9191l8695J1934Q842j3611j8737
896b3945m24K8455J380k0764Q157J4236j907o227R042J8126j0009j3718P173o641
910B934j9020j5085N462K8403m106j5834K8711J9350j8318k0195j264K5454J716
923A8208l3733N703K8233j1017k7476n331K1882J3237j6543j618K3943N315k1337
936e34j3097J3354O386j4065M029J7851J340j2858j1303P311L161k1961J993K8110
950I717Q84j5185j226J2944P573j9379j0190K6760J1757k3082j3263J3322Q388
963I020k0004j5791J9682K1051r247j2787J3334J3413j7077j5864J0976J1195
975G901m347r128M993J4654j0570j9346J1245J2996j0602r437R168J5141r037
$$ plain form
988 3631 -16349 -4759 14486 3956 -9466 2655 20473 10691 -11747 -8637 4430 -2938 -18154
1001 -18154 -14165 8268 12132 -6037 -2914 15009 12965 -2958 -7536 8615 10975 -14209 -15775
1014 -15775 4282 -153 -13584 -8659 9239 14952 -974 -1447 15088 10591 -6179 -11639 -1295
1027 -1295 5779 -11669 -17681 3737 10636 -1060 -6710 7609 21526 -4 -14748 5998 8292
1040 8292 -9246 -13343 -2799 9683 -3258 -14966 5943 12981 1061 -757 3538 13113 3701
1053 3701 -17002 -5212 6218 -5879 -12623 -4670 14061 7655 -14588 2249 16405 -1260 -8348
1066 -8348 -1475 12467 8088 -14794 -2226 10815 -6444 -9578 -6818 3153 12489 -8996 -6814
1079 -6814 14622 1708 -8862 -5990 5112 16424 -5410 -6671 19025 2841 -15445 -9023 -1690
$$ packed form
988C631j9980J1590J9245j0530j3422J2121J7818r782k2438L110J3067p368j5216
1001a8154L989K2433L864j8169L123J7923k044j5923m578J6151K360k5184j566
1014a5775K0057m435j3431M925J7898N713j5926m73J6535m497j6770n460J0344
1027a295P074j7448o012K1418O899j1696n650J4319J3917k1530j4744K0746K294
1040H292j7538m097J0544J2482j2941j1708K0909P038j1920j818M295R575r412
1053C701k0703J1790J1430j2097o744P953J8731o406k2243J6837J4156j7665p088
1066h348O873J3942m379k2882J2568J3041j7259l134K760R971R336k1485K182
1079f814K1436j2914j0570K872J1102J1312k1834j261K5696j6184j8286O422P333
$$ plain form
1092 -1690 4464 -9707 -8175 16355 5555 -7133 -2252 -182 11176 -79 -9706 15235 11386
1105 11386 -7905 -9833 -8057 6928 -5538 -20351 13988 16505 -7379 -2291 -655 5826 -1207
1118 -1207 -16973 10911 16091 -4647 3878 -864 -106 2204 -21110 -3207 14132 -6700 -3131
1131 -3131 609 3607 5689 -19071 -262 25700 -445 -288 11538 6197 1018 -23313 -15334 7941
1145 7941 -10983 -8537 5534 6150 14604 -5284 -7627 18639 5024 -1487 4405 1939 11073 -15513
1159 -15513 -26177 6652 -9349 -16479 8845 7818 16133 5221 -8059 18918 28 -18173
1171 -18173 8445 1544 2577 2926 -19054 4134 5290 -22197 -4858 6928 11966 8194 -12951
1184 -12951 10722 15822 -17355 -7893 4827 8758 7356 -11062 6862 9134 -18806 -6811 -6445
$$ packed form
1092a690O154j4171J532K4530j0800j2688M881K070J1358j1255r627K4941l849
1105A1386j9291j928J776J4985j2466j4813L4339K517k3884N088J636O481p033
1118a207j5766K7884N180k0738Q525m742P58K310k3314J7903J7339k0832L569
1131c131L740K998K082k4760J8809K5962k6145J57J1826n341n179k4331P979K3275
1145G941j8924K446J4071O16Q454j9888k343K6266j3615o511N892k466R134k6586
1159a5513j0664L2829j6001p130K5324j027Q315j0912j3280K6977j8890j8201
1171a8173K6618o901J033L49k1980K3188J156k7487J7339J1786N038l772k1145
1184a2951K3673N100l3177R462J2720L931j402j8418J7924K272k7940J1995L66
$$ plain form
1197 -6445 -5537 11642 -7473 4429 20758 -9126 -1107 5569 -3384 10121 -9121 -2036 22955
1210 22955 -16638 -19338 6906 -5200 -1669 -6569 666 28649 -111 -12266 8511 -1503 1302
1223 1302 -6958 -13558 18635 6891 -12898 1037 -2209 4489 -3577 -17043 15226 9003 -12736
1236 -12736 6702 1616 -2269 3 -8007 13731 6468 -11342 11220 2317 -9171 -5531 -16679
1249 -16679 5606 7394 -15814 7673 13354 6795 6230 -16480 8891 21070 -22360 -7734 9473
1262 9473 -5476 -1138 -17260 -5848 20189 -7759 -1379 17676 1252 8530 -699 -11884 6964
1275 6964 -6763 -11375 4468 -1490 1180 -3266 -356 15508 -7198 -8259 14535 2322 -3688
1288 -3688 -8828 -3966 16938 -9886 -16147 14854 3654 1469 357 -11821 15780 6626 -20694
$$ packed form
1197f445R08J7179j9115J1902J6329k9884Q019O676q953J3505j9242P085K4991
1210B2955l9593k700K6244j2106L531m900P235K7983k8760j2155K0777j0014K805
1223A302q260o600L2193j1744j9789J3935l246O698q066j3466L2269o223k1739
1236a2736J9438n086l885K272q010K1738p263j7810K2562q903j1488L640j1148
1249a6679K2285J788k3208K3487N681o559n65k2710K5371J2179m3430J4626J7207
1262I473j4949M338j6122J1412K6037k7948O380J9055j6424P278r229j1185J8848
1275F964j3727m612J5843n958K670m446K910J5864k2706j061K2794j2213o010
1288c688n140M862K0904k6824o261L1001j1200k185j112j2178K7601r154k7320
$$ plain form
1301 -20694 2357 3934 -852 1358 -12980 9030 13281 -13458 2996 6670 -5450 637 -6027
1314 -6027 4088 5314 -12504 7934 9254 -8649 1479 -2936 2695 7349 -17449 -2664 12989
1327 12989 -4304 -3334 -5661 5282 19170 -10628 -8495 17012 3564 -6203 -10352 -4666 8602
1340 8602 -10336 -9759 9319 2884 6584 3136 -3021 10322 -3664 -8542 6548 -5114 -2608 931
1354 931 -5777 9027 -5215 -13753 16806 7550 -7766 2473 1951 7980 -6418 -21916 6717
1367 6717 9989 -5398 1516 1702 11592 7863 -17003 -4303 6647 -3955 -3956 -7590 4176 10375
1381 10375 -10279 -520 10766 -1328 4274 4581 2424 3821 -11374 -5255 1921 -14444 -7860 4532
1395 4532 7453 8774 -3866 3571 15528 -2220 -8855 -3824 4757 10274 -12636 -11870 11242 -1312
$$ packed form
1301b0694K3051J577m786K210j4338K2010M251k6739J6454L674j2120O087o664
1314f027J0115J226j7818K0438J320j7903J0128m415N631M654k4798J4785J5653
1327A2989j7293R70k327J0943J3888k9798K133K5507j3448r767m149N686J3268
1340H602j8938N77J9078o435L700l448o157J3343j3986m878J5090j1662K506L539
1354I31o708J4804j4242q538L0559r256j5316J0239n22O029j4398j5498K8633
1367F717L272j5387O914J86R890l729k4866J2700J0950j0602jl634J1766O199
1381A0375k0654R759J1286j2094N602L07k157J397j5195O119P176j6365O584J2392
1395D532K921J321j2640P437J1957j7748o635N031Q581N517k2910P66K3112j2554
$$ plain form
1409 -1312 -10834 -5936 815 15873 1910 -7508 12044 3081 -6911 -649 -5466 4213 5876 -5287
1423 -5287 5347 897 -11035 -3473 -3447 -1168 -256 -2984 13528 11109 -7766 -1465 6077 4177 -4770
1438 -4770 -11421 7120 9977 -11149 -10717 -2280 3213 2176 -8899 4033 18724 4923 -3796 -3087
1452 -3087 404 1138 -10791 -5343 7728 935 -488 1238 -445 632 -6314 -484 8334 -3847
1466 -3847 -1880 6843 927 -1652 -7972 -2663 13606 1063 -7637 6019 6004 -1852 -12256 -13334
1480 -13334 6230 5510 -8313 1475 12525 9619 -1202 -6799 3638 4801 -5549 -5322 -732 1407
1494 1407 -4169 -9122 267 2210 -1969 5891 8565 6141 2428 -3650 2165 41 -13057 -4870 6323
1509 6323 1667 -3769 -4514 4852 7771 -6869 -6976 7142 8444 -889 -6855 1642 8136 -3551 -8948
$$ packed form
1409a312r522M898O751J5058j3963r418J9552q963r992O262m817R679J663j1163
1423e287J0634m450j1932P562K6K279R12k728J6512k419j8875O301P542j900q947
1438d770o651J8541K857k1126M32Q437N493j037j1075J2932J4691j3801q719P09
1452c087L491P34j1929N448J3071o793j423J726j683J077o946N830Q818j2181
1466c847J967Q723n916k579o320N309J6269j2543q700J3656j5p856j0404j078
1480a3334J9564p20j3823R788J1050k906j0821n597J0437J163j0350K27M590K139
1494A407n576m953R389J943m179P860K674k424l713o078N815k124j3098Q187J1193
1509F323m656n436p45R366K919j4640j07J4118J302r333n966Q497O494j1687n397
$$ plain form
1524 -8948 33 6179 2706 -5846 -1634 6379 -2720 -6962 163 1809 2366 495 1089 7228 119
1539 119 -6640 1345 2035 -4453 -5050 424 6459 -10 -7303 1847 8214 -37 -6582 20 8298 864
1555 864 -8554 -3057 4128 2218 -5086 -4049 7997 6709 -4751 -2208 3648 1174 -4252 -6445 1588
1570 1588 4265 -4602 -1581 6921 3199 -2109 -641 3781 1855 -6038 -4344 2958 956 -5189 -3872
1585 -3872 5034 6132 -2965 -2481 5929 5663 -2757 -7533 607 5126 -6157 -7743 3682 5459 95
1600 95 -1869 3098 7396 -816 -6353 110 1258 -3821 -5028 -287 4954 932 -3087 2795 6199
1615 6199 856 -4281 539 6323 -2498 -8985 -827 2541 -2708 -5358 558 9253 3859 -3953 2541
1630 2541 5099 -1307 -5216 -4344 2886 3012 -5319 -1954 4831 1015 -4724 -3478 4463 4218 -4060 -399
$$ packed form
1524h948Q981O146l473q552M212Q013r099m242P125J646N57j871N94O139p109
1539A19o759P985O90o488n97N474O035o469p293R150O367q251o545O602Q278p434
1555H64r418N497P185j910p304J037J2046j288j1460K543N856k474n426k193Q033
1570A588K677q867L021Q502l722n308J468M422j926p893J694P302k002o145J317
1585c872Q906J098r097M84Q410k66q420m776Q140M519j1283j586J1425J777n364
1600I5j964M967M298q212n537O463J148n079j207M741N241m022m019N882L404
1615F199n343n137M820N784q821o487Q158L368n249k650N916Q695n394p812O494
1630B541K558o406l909Q72P230J26q331L365O785l816n739J246P941k45q278L661
$$ plain form
1646 -399 6193 1309 -4747 -2931 4306 2904 -4770 -125 5037 -193 -4686 -5900 -360 3292 -4022
1661 -4022 -1510 8431 6656 350 -3406 737 4266 -6057 -7181 4445 3182 -3664 -4137 272 3676
1676 3676 -2920 -3091 6691 5687 505 -1366 -1252 1741 -4060 -7749 1849 5114 1224 -1040 538
1691 538 5481 -2405 -10144 645 4881 -1498 -1717 2161 6459 401 -6668 1951 4910 -716 -1188
1706 -1188 -1553 1829 -502 -9832 -3985 3147 460 936 2721 8767 8103 -5239 -2595 4018 -4819
1721 -4819 -7134 -2723 1928 2637 -5927 -2317 6104 -82 -1289 2861 4991 6601 -2062 -4996 1837
1736 1837 -1862 -6327 -4770 1253 7236 -1409 -3600 6855 1800 -5524 -3205 700 5299 -1007 -3057
1751 -3057 6883 1581 -4767 -1326 -1683 3022 1074 -5602 3082 3155 -5284 -3436 -1039 4353 3109 -4255
$$ packed form
1646c99O592m884o056J816P237j402p674M645N162n230m493j214N540L652p314
1661d022K512R941j775o306l756M143L529j0323j124J1626j263o846m73M409L404
1676C676o596j71R782j004n182j871J14K993n801l689R598L265l890k264J578
1691E38M943p886p739J0789M236o379k19L878M298o058p069Q619K959n626m72
1706a188l65L382k331r330N847P132k687M76J785O046o64j3342K644O613q837
1721d819k315M411M651P09q564L610Q421o186j207M150K130J610q663k934O833
1736A837l699m465J557O023N983q645k191J0455n055p324K319L905M599o306k050
1751c057R940n302o348L441l57M705j948o676Q684P3q439J848K397N392j244p364
$$ plain form
1767 -4255 5513 8353 -3790 -4362 -1086 418 -1958 -7107 2151 6583 -1934 -1155 535 1734 2382
1782 2382 -4848 -53 6398 -974 -2698 -1879 522 2997 -5965 -1632 8566 -407 -3126 1093 413
1797 413 538 -6504 -3562 7120 -225 -1583 4982 2351 2754 -2851 -6036 3919 42 -5732 -723
1812 -723 372 2909 -2032 -5802 7371 6223 -3277 1676 3353 1608 -3536 -7958 1150 524 -5872
1827 -5872 783 2592 3290 3153 -2760 3205 4161 -4204 -1505 -388 273 -545 -7598 1662 6570 -4549
1843 -4549 -160 5198 2560 1253 -5686 -13 5799 -6443 -4486 2510 -311 2115 -1979 -980 8421
1858 8421 308 -4171 1523 336 622 -3883 -4274 5427 -193 -4703 2885 2842 1357 -1997 -2007 5122
1874 5122 -1743 -5391 3010 1117 73 -981 -3072 5565 1796 -5495 1989 2070 309 -1901 -7013
$$ packed form
1767d255R768K840j2143n72L276J504k376n149R258M432q517P79J690J199O48
1782B382p230M795O451p372j724Q19K401K475q962M333J0198q973k719M219o80
1797D13J25p042K942J0682p345j358O565k631M03n605l185R955l877n774N009
1812g23J095K537m941l770J3173j148r500M953J677j745n144m422R108o26o396
1827e872O655J809O98j37n913N965R56q365K699J117O61q18p053R260M908j1119
1843d549M389N358k638j307o939N673N812j2242J957O996k821K426m094R99R401
1858H421q113m479N694j187K86m505l91R701n620m510P588m3j485l354j0P129
1874E122o865l648Q401j893j044j054k091Q637l769p291P484Q1j761k210n112
$$ plain form
1889 -7013 3453 4141 -6967 800 5967 2431 849 -3669 1929 2849 -7198 -1960 2170 -749 1346
1904 1346 -2288 600 4556 -3460 -605 4177 878 923 -3498 -763 3997 -6535 -4189 5660 1782
1919 1782 402 -835 1170 5838 -4714 -6589 2773 125 -865 -965 -497 6890 956 -4747 2247
1934 2247 1789 256 -1627 -3490 3453 -1102 -7410 816 1308 -335 1987 1732 6862 2555 -4993 1963
1950 1963 221 -5692 -3126 -2817 2728 2571 -5146 1817 5303 -397 -786 -1454 4276 5444 -5784 -2689
1966 -2689 3138 -2249 -3449 -3360 1820 5887 -2072 -294 4223 -1616 -1643 -2177 -1594 3531 -1114 -383 5445
1983 5445 7 -1912 -1068 -812 2238 -3534 -3498 5376 754 -4487 -1973 1178 4447 -1157 -2454 6672
1999 6672 4179 -2265 -3433 -3138 1663 -1913 -6330 2389 4417 838 306 -1501 2668 1494 -4828
$$ packed form
1889g013J0466O88j1108P767N167l536j582m518N598R20j0047N238M130k919K095
1904A346l634K888L956q016K855M782l299M5m421K735M760j0532K346R849l878
1919A782j380j237K005M668j0552j875R362k648r90j00M68P387n934n703O994
1934B247m58j533j883j863O943m555o308Q226M92j643K322k55N130m307p548O956
1950A963j742n913K566L09N545j57p717O963L486n700l89o68N730J168j1228L095
1966b689N827n387j200Q9N180M067p959J778M517n839k7n34N83N125m645P31N828
1983E445n438j919Q44K56L050n772L6Q874m622n241K514L151L269n604j297R126
1999F672k493o444j168K95M801l576m417Q719K028l579n32j807M169j174o322
$$ plain form
2014 -4828 1466 3207 -1798 163 -587 -339 -337 -4266 1788 4497 -2004 -364 1839 824 -1323 -5822
2030 -5822 -194 5573 5 -1398 1923 4138 1743 -6325 -3498 3546 -644 -3466 -1472 2151 3844
2045 3844 -2750 -2300 4513 1792 -24 848 203 1677 -2658 -4723 426 -1522 -2575 1766 2701 3010
2061 3010 -123 -1196 3884 110 -4909 -752 2059 1406 -2605 -3619 3669 2905 -3511 -1397 2488
2076 2488 3725 -204 -4832 683 2927 -3093 -3129 499 3193 2298 -1853 866 3169 -1638 -2463 -521
2092 -521 -19 -618 -2378 560 2545 -1203 -581 2459 2417 26 -2981 632 3273 -2879 -4011 645
2108 645 2089 146 -3319 76 5765 903 -3154 229 1942 559 -3239 -3047 2628 1481 -2445
2123 -2445 -191 2386 1929 -963 -1598 1813 445 -2719 -564 1344 286 -1852 -928 3025 1003 -2491
$$ packed form
2014d828O294J741n005J961p50K48Kl929O054K709o501J640K203j015k147m499
2030e822N628N767n568j403L321K215k395q068K827P044m190k822J994L623J693
2045C844o594M50O813k721j816Q72o45J474m335k065N149j948j053M341R35L09
2061C010l133j073N080l774n019M157K811o53m011j014P288p64o416K114L885
2076B488J237l929m628N515K244o020l6L628K694q95m151K719K303m807q25J942
2092e21N02n99j760K938J985l748O22L040m2k391l007L613K641o152j132M656
2108F45J444j943l465L395N689m862m057L383J713j383l798J92N675j147l926
2123b445K254K577m57k892o35L411j368l164K155J908j058k138R24L953k022l494
$$ plain form
2139 -2491 489 2507 547 -2430 -2586 2187 1847 -3385 -1615 2753 2477 -907 -2382 2008 3040 -2894
2155 -2894 -3515 801 1642 -624 -1620 1737 3178 -714 -1517 877 1017 -758 -2238 -4 1471 -1979
2171 -1979 -2137 1399 2024 119 -1147 2008 4167 -1069 -3427 555 893 -2534 -3792 -7 3736 519
2187 519 -2024 1318 2915 491 -2174 -974 2450 511 -2929 -1041 1422 384 -2203 -1129 2871
2202 2871 1350 -1827 762 2355 -452 -2935 -1755 1649 424 -1986 1408 3677 970 -1878 -1824
2217 -1824 1169 764 -3080 -1582 2358 1623 -1949 -2341 1988 2715 -1672 -850 3248 2443 -1292 -2578
2233 -2578 -68 87 -3265 -1870 1909 2073 589 -539 888 1652 -1883 -2038 1810 2157 -329 -1842
2249 -1842 449 1998 -2432 -3572 1465 2440 -644 -1629 1173 2846 -1273 -3067 849 2160 538
$$ packed form
2139b491K980K018j960k977j56M773l40n232J770M368k76l384j475M390J032n934
2155b894o21M316Q41k266r96L357J441l892q03K394J40j775j480K234J475l450
2171a979j58L536O25j905j266L155K159n236k358L982L38l427j258L785L743l217
2187E19k543L342J597k424k665J200L424j939l440J888K463j038k587J074M000
2202B871j521l177K589J593k807k483J180L404j225k410L394K269k707k848N4
2217a824K993m05l844J498L940p35l572l92M329P27m387Q22M098q05l735j286
2233b578K510J55l352J395L779J64j484j128J427P64l535j55L848L47k486j513
2249a842K291J549m430j140N037R75l084r85K802J673m119j794L916J311j622
$$ plain form
2264 538 -623 415 2492 -415 -3895 -1550 701 -72 -1327 104 3576 1354 -2425 499 2370
2279 2370 -385 -1784 -136 2230 -113 -3396 -610 1237 -950 -1606 68 3151 2629 -1450 -702 1537
2295 1537 -313 -2675 -2200 2040 2753 -1921 -1038 2472 434 -2129 -1559 1484 1897 -1874 -997 1938
2311 1938 77 -1377 -969 820 2453 -374 -897 2155 934 -1971 -2775 -583 1781 -1477 -2056 3025
2327 3025 2616 -970 -1216 860 2272 -1155 -2554 1642 1390 -1503 -1562 -615 1317 -159 -2349 1196
2343 1196 2806 399 -884 -454 1621 -244 -3589 358 2766 -462 -1283 145 1558 -331 -3243
2358 -3243 383 2585 -463 -677 374 1456 959 -2540 -812 2338 -11 -1426 -776 1201 1521 -2910
2374 -2910 -1676 3046 562 -1408 349 1811 1507 -2317 -1802 2025 -449 -1919 2 727 1669 -658
$$ packed form
2264E38j161J038K077k907l480K345K251p73j255J431L472k222l779K924J871
2279B370k755j399J648K366k343l283K786J847k187o56J674L083n22m079P48K239
2295A537j850k362M75M240P13m674Q83L510k038k563N70L043M13l771Q77K935
2311A938j861j454M08J789J633k827n23L052j221k905q04K192K364l258n79N081
2327C025m09l586k46K076J412l427j399M196k52k893n9R47J932j476k190L545
2343A196J610k407j283M30K075j865l345L947K408l228q21J428J413j889k912
2358c243L626K202l048k14J051J082m97l499J728L150k349j415O50J977L20m431
2374b910J234M722k484j970J757J462l04l824N15L827k474j470J921P25R42k327
$$ plain form
2390 -658 -1609 2277 1226 -1642 -851 450 1524 -1393 -2928 1888 1586 -2052 -566 1611 2200 -509
2406 -509 -2171 1767 1198 -2369 -1135 43 1017 41 -2331 1189 2589 -794 -526 465 1392 355 -3307
2423 -3307 -88 2534 -1722 -1439 1132 1444 543 -2164 286 2817 -1378 -1538 854 491 291 -2068
2439 -2068 -1016 2651 -83 -1417 885 1490 1289 -2031 -2026 2295 -362 -2823 361 1677 1198 -1224
2455 -1224 -1102 2575 98 -2143 645 986 848 -734 -1993 1461 360 -2413 -65 1116 1607 -71
2471 -71 -2165 2065 1435 -3267 -469 1652 925 92 -1565 1603 1831 -3110 -1421 918 104 200 -1234
2488 -1234 797 2699 -1348 -1495 1111 1030 387 -1488 318 2272 -2071 -2579 392 319 -132 -1072 1167
2505 1167 3596 -703 -1419 1380 -51 -703 -1682 -784 2764 -308 -2371 937 762 -79 -1112 -857 3251
$$ packed form
2390f58r51L886j051k868P91J301J074k917j535M816l02l638J486K177N89k709
2406e09j662L938n69l567J234J178R74r76k372L520J400l383K68R91R27j037l662
2423c307L219K622m256K83K571L12r01k707K450K531m195j60K392l63k00k359
2439b068J052L667k734j334K302O05k01l320NM321k657k461L184J316m79k422
2455a224J22L677k477k241K788L41j38j582j259L454j101k773K348J181M91j678
2471g1k094M230o30m702K798K121p27q33j657L168K28m941J689K339q14R6j434
2488a234K031J902m047j47K606q1o43j875J806J954m343n08K971p3m51r40K239
2505A167K429m299p16K799j431o52r79Q98L548l072k063L308j75q41j033K55M108
$$ plain form
2522 3251 1030 -2635 415 989 -686 -1543 -1175 2453 1259 -1774 1040 1262 -725 -1209 -1869 764
2538 764 1001 -1827 626 2094 342 -706 -1413 1373 1672 -2291 -232 2251 -260 -2026 -2168 630
2554 630 1466 -1871 41 2939 1341 -57 -1568 -92 1571 -2129 -1723 1674 833 -38 -1223 -561
2570 -561 1858 -1260 -1688 2421 1331 -334 -378 -260 1040 -1324 -2185 1804 1530 -722 -614 229 1365
2587 1365 -1084 -2700 809 1736 -70 -779 264 2625 86 -3046 109 1377 -342 -927 -670 1721
2603 1721 587 -2799 -139 1530 -169 144 253 1250 972 -2102 -769 1033 -848 -1013 91 1573
2619 1573 1263 -1825 -412 1992 -517 -1762 -290 1638 1401 -1984 -1138 1992 309 -1289 -483 1218
2635 1218 2058 -1190 -2115 1076 551 -1377 -1061 467 1701 -330 -1106 1495 1058 -793 -694 105 704
$$ packed form
2522C251k221l665L050N74j675q57L68L628j194l033K814K22j987m84o60K633
2538G64K37k828K453J468j752j048p07K786K99l963K059K483k511j766j42K798
2554F30Q36l337J912K898j598j398j511J476J663l700M06L397q41q71j185O62
2570e61K419l118m28M109j090j665m4J18J300k364q61L989k74k252J08Q43J136
2587A365k449j616L509R27j806p09J043K361k539l132L155J268j719n85K57K391
2603A721j134l386K660J669j699L13J09R97k78l074J333J802j881j65J104J482
2619A573l10l088J413K404k509j245J472J928k37l385Q46L130j683j598Q06J701
2635A218Q40l248r25L191n25j928L16J528J234k031p76K601m37j851R9P99N99
$$ plain form
2652 704 -1138 -1527 1280 654 -1209 -420 774 1654 -320 -1687 1581 1544 -1697 -1479 212 1273 -280
2669 -280 -2338 632 2430 -378 -1163 427 1495 269 -2037 -500 1432 -235 -1227 -207 1153 605
2685 605 -1238 159 1642 -262 -1040 -23 795 174 -1669 -158 1782 -586 -1641 269 1470 723
2701 723 -1370 -541 1915 110 -2016 -593 1351 1183 -1220 -1164 1647 873 -1605 -1022 778 1128 -849
2718 -849 -1065 1535 995 -1077 -515 474 655 -508 -1031 1147 943 -1502 -970 648 662 -646 -967 1540
2736 1540 1829 -1133 -1267 862 954 -1120 -1802 783 1714 -652 -1142 528 1197 -268 -1735 151 1754
2753 1754 -133 -1040 164 808 -167 -1662 -132 1855 21 -944 725 1020 -592 -1811 -394 1286
2769 1286 -280 -1175 863 1804 329 -1367 -491 1453 160 -1530 -107 1446 503 -1771 -1499 1138
$$ packed form
2652G04j842l89K807o26j863P89J194Q80j974j367L268l7l241K18J691J061j553
2669b80k058K970J798k808p85J590J068j226k306J537J932j667r92J020J360n48
2685F05j843J397J483j904p78J017Q18o21j843J511J940k368j055J910J201p47
2701G23k093Q29K456j805k126J423J944j68k403N6K811p74k478N83J800L50j977
2718h49k16K600n40k072N62R89J81j163n23K178k04k445N32J618J4j308l21K507
2736A540K89k962j34K129R2k074o82K585R31k366m90J670O69j465j467J886J603
2753A754j887r07J204O44r75j495J530J987j834r65J669K95j612j219J417J680
2769A286j566q95K038R41j475j696Q76J944j293j690J423J553r43k274K72K637
$$ plain form
2785 1138 580 -1253 249 1968 1194 -765 -1016 685 47 -1694 -400 1068 481 -593 -702 724
2801 724 518 -1370 -514 1564 1260 -568 -862 1040 685 -2015 -1459 1156 1281 -589 -996 1065 1226
2818 1226 -1417 -1459 707 1166 110 -715 536 1468 -675 -1640 16 733 -106 -814 456 1586 -529
2835 -529 -1611 419 826 -558 -713 943 1747 -448 -1550 285 723 -696 -1233 244 1817 226
2851 226 -1620 -192 1086 -64 -1442 -439 1916 890 -1459 -194 1243 -39 -1373 -638 1239
2866 1239 624 -1135 -80 936 -141 -992 -560 952 885 -776 -2 1351 298 -1253 -1096 821 857
2883 857 -1500 -651 1700 686 -1255 -935 1026 1136 -1075 -711 1449 881 -794 -1155 121 887 -840
2900 -840 -1206 825 1149 -219 -958 212 1264 -680 -1349 986 1111 -618 -897 344 1036 -854 -1458
$$ packed form
2785A138n58j833J502J719p74j959k51J701o38j741J294J468n87j074j09J426
2801G24k06j888Q56K078l04j828k94J902l55k700N56K615J25j870m07K061J61
2818A226k643m2K166M59j056q25J251R32k143r65J656P17q39p08J270J130k115
2835e29j082K030M07j384j55J656Q04k195j102J835M38j419n37J477J573j591
2851B26j846J428J278j150j378J003K355j026k349J265J437j282j334P35J877
2866A239o15j759J055J016j077q51M32J512o7j661P74J353j053j551J57J917L6
2883H57k357Q49K351j014j941L20J961J10k211L64K160n68j675l61J276P66j727
2900h40l66K031L24j368p39J170J052j944o69K335J25j729k79J241O92j890o04
$$ plain form
2917 -1458 932 1057 -507 -592 360 1216 -181 -1671 188 1300 -203 -1057 -60 1477 237 -1838 -59
2934 -59 1528 -55 -1008 -29 1283 221 -1610 -118 1133 -201 -730 -128 915 624 -1189 -319 1254
2951 1254 70 -983 -515 883 816 -1473 -701 1591 266 -1205 -366 1029 873 -1265 -789 1386 338
2968 338 -990 -447 506 899 -784 -1087 1131 888 -695 -640 378 961 -760 -1452 1063 1131 -828 -539
2986 -539 691 1017 -682 -1368 934 886 -961 -588 395 843 -276 -1510 425 1243 -479 -629 378
3003 378 1228 124 -1862 -56 1346 -717 -1011 468 1169 196 -1493 -25 1293 -608 -886 363
3019 363 929 530 -1081 -334 1253 -323 -1200 -60 959 830 -1141 -661 1497 -233 -1612 7 1174
3036 1174 919 -660 -424 1494 -8 -1611 -392 508 577 -569 -795 1221 601 -1285 -576 622 923
$$ packed form
2917a458K390J25j564q5R52Q56j397j490J859J112j503q54R97J537j240k075J779
2934e9J587j583r53R79J312j062j831J492J251j334n29O02J043k91j813Q70J573
2951A254j184j053M68J398o7k289P72K292j325j471Q39J395j56k138M76K175j048
2968C38j328N43R53L93j683l03K218k43j583N5J018N83j721o92K515O8j959K89
2986e39J230L26j699o86K302m8j847L73R83M48j119j234J935Q18j722j50J007
3003C78Q50j104j986J806J402k063k94J479P01r73j689J468J318j901k78J249
3019C63N66l99j611P47J587j576q77J140J019j29j971M80K158j730j379J619J167
3036A174k55j579K36J918j502j603J219R00O9j146k26K016o20j886P09J198L01
$$ plain form
3053 923 -361 -862 1337 873 -1551 -918 354 527 -479 -912 1335 1248 -1224 -680 467 400 -266 -1024
3071 -1024 769 1530 -758 -844 417 571 -269 -1426 294 1704 -568 -1023 551 631 -367 -1338 290
3088 290 1803 -166 -658 662 454 -416 -1478 -535 1307 -63 -878 590 972 192 -1228 -602 1540
3105 1540 174 -1243 441 1045 -29 -1406 -942 1127 176 -1093 551 1184 419 -781 -1069 793
3121 793 440 -1263 18 1155 610 -565 -989 822 628 -1447 -358 1151 514 -538 -788 758 706
3138 706 -1326 -497 1159 768 -210 -767 556 790 -1457 -1158 697 727 -63 -742 570 1402 -943 -1258
3156 -1258 671 698 -216 -774 285 1226 -805 -1368 450 589 -153 -473 321 1312 -368 -1365 246 630
3174 630 -206 -720 146 1535 -69 -1478 309 873 -311 -958 -152 1392 173 -1392 174 1025 -2
$$ packed form
3053I23j284n01K199m64k424O33J272J73j006m33K247q7k472N44J147o7o66p58
3071a024J793P61k288q6J261J54q40j157J720J410k272m55J574Q0r98r71J628
3088B90J513j969m92J320k08q70j062R43J842j370q15J468L82p80j420O26K142
3105A540j366j417J684O04j074j377M64K069r51j269J644O33p65j200k88J862
3121G93l53j703J281J137n45j175m24J811j94k075J089J509o37j052k50J546n2
3138G06k032Q29J656l91r78n57J323K34k247K99J855L0p90o79J312Q32k345l15
3156a258J929K7r14n58J059R41k031n63J818J39p42l20P94R91j680r97J611L84
3174F30q36n14Q66J389j604j409J787N64j184o47Q06J544j219j565J566Q51j027
$$ plain form
3191 -2 -733 -425 1149 603 -1284 -302 848 18 -883 -647 1025 810 -1061 -101 1093 59 -778 -583
3209 -583 629 587 -1212 -415 1132 242 -692 -453 766 940 -992 -753 1086 463 -878 -859 532 1056
3227 1056 -809 -899 1034 844 -459 -773 331 1071 -654 -1168 603 588 -444 -610 239 1154 -177 -1043
3245 -1043 592 734 -595 -745 137 987 -208 -1207 520 1007 -526 -856 180 1110 -27 -1316 200
3262 200 1009 -400 -997 -163 1098 537 -1076 4 1223 -124 -1059 -440 693 444 -1017 -149 1204
3279 1204 47 -827 -168 681 443 -796 -219 1095 122 -980 -482 584 491 -952 -434 1388 556 -910
3297 -910 -521 544 549 -974 -855 1188 834 -700 -463 411 543 -678 -1059 657 858 -531 -568 352 584
3316 584 -527 -962 701 1033 -370 -431 468 588 -679 -1344 354 905 -532 -440 707 954 -147 -1173
$$ packed form
3191bp31L08J574n46j887R82J150q30r01K36J672k15j871R60J194j034q37J95
3209e83J212m2j799P97J547q90r34K39J219J74j932K39J839o23j341J9J391N24
3227A056j865r0J933j90j303l14J104P40j725n14J771j5j032j66Q49R15j331q66
3245a043J635J42j329j50Q82Q50j195r99J727M87j533l30J036R30j137j289J516
3262B00Q09j409n97Q34J261n61j613J080J219j347r35O19J133k49j461Q68J353
3279A204j157q74O59Q49k38j239N77J314r73j102M98J066r3j443N18J822q32j466
3297i10L89J065Nj523J19K043l54j534K37Q74J32j221l81J716K01j389l7R20K32
3316E84j111m35J663L32j403o1Q99J20j267o65J698N51j437R2J147K47j101j026
$$ plain form
3334 -1173 86 1096 -338 -824 357 929 -5 -1250 -321 979 -78 -831 345 1124 249 -1001 -294
3351 -294 725 -329 -893 246 946 400 -705 -297 773 -259 -1192 -65 897 479 -670 -482 1024
3368 1024 237 -1323 -274 1138 636 -620 -512 759 246 -1248 -712 658 703 -274 -358 860 654 -798
3386 -798 -662 386 500 -321 -616 716 777 -920 -737 604 416 -483 -488 802 994 -765 -911 491 467
3405 467 -564 -728 526 1214 -247 -995 159 638 -384 -1095 118 1273 26 -843 216 675 -210
3422 -210 -865 9 1038 42 -782 216 478 -372 -782 -78 918 226 -682 259 887 -114 -1028 -339 986
3441 986 221 -1034 13 1112 184 -991 -455 935 420 -988 -220 871 307 -624 -623 497 598 -701
3459 -701 -430 765 452 -514 -583 341 429 -775 -536 828 525 -528 -365 691 517 -853 -590 744
$$ packed form
3334a173J259J010j434m86J181N72r34j245R29J300j057p53J176P79q75j250P07
3351b94J019j054n64J139P00n46j105M08J070j032r33J127R62m18j149J88J506
3368A024p87j560J049J412n02j256J08J271n13j494N36J370M5r77q4J218k06j452
3386g98J36J048J14q21k95J332O1j697J83J341j88q99nJ290J92j759j46J402k4
3405D67j031j64J254O88j461p48J154M79j022p11J213J155j247q69J059M59q85
3422b10o55Q74J029r96q24R98K62q50m10P04R96o92r08R41O28j001r14O89J325
3441I86p65j255J047J099r28j175N36J390n15j408P68J091n64r31JJ120J01j299
3459g01K71J195l13r66o9R24Q8j204K39J364l03j053J63J056j74j370K63J334
$$ plain form
3477 744 482 -550 -597 470 792 -606 -822 660 829 -248 -748 210 972 -395 -1124 354 770 -269
3495 -269 -637 174 895 -123 -824 309 639 -300 -583 9 626 -60 -822 215 812 -141 -659 -18 836
3514 836 31 -1041 40 979 -138 -896 -103 840 131 -977 -51 958 134 -719 -329 622 367 -841
3532 -841 -303 839 361 -503 -375 523 470 -857 -500 872 324 -583 -239 573 473 -759 -511 851 368
3551 368 -619 -306 443 463 -651 -796 580 596 -451 -441 512 808 -462 -974 403 601 -524 -584 431
3570 431 830 -305 -830 372 532 -478 -500 226 762 -50 -844 186 624 -426 -609 210 954 227 -864
3589 -864 72 748 -484 -923 74 832 258 -682 92 850 -187 -785 -75 666 335 -673 -188 726 -72
3608 -72 -873 -335 577 455 -594 -125 984 129 -829 -351 421 326 -677 -285 970 288 -739 -345 318
$$ packed form
3477G44k62j032m7J067L22j398k16J482J69j077n00R58P62j367p29J478M16j039
3495b69l68Q11P21j018p01J133L30r39k83N92O17o86p62J037N97r53n18O41Q54
3514H36q05j072J081R39j117p58P93R43p09j108R26J009q24q53L90R51k55j208
3532h41N38J142m78q64J28Q98n3j327L57J372n48r07L44Q12j00j232K48J362m83
3551C68r87L13P49K0j114j45J376J6j047J0R53K96j270n12J377J98j125o0J015
3570D31L99j135n25J202J60j010k2P26N36q12p94J030M38j050j83Q19P44p27j091
3589h64R36O76j232m39R97P58n74r40P74P58j037n98P10P41l31j008M85R14p98
3608g2q01N38R12j22j049M69J109q55r58M78P72r5j003L92J255o82j027L94O63
$$ plain form
3627 318 328 -535 -464 877 599 -544 -397 283 407 -491 -699 725 746 -519 -447 273 320 -532 -704 626
3647 626 850 -279 -285 332 354 -442 -875 280 733 -241 -432 269 582 -235 -984 205 860 -246 -478 283
3667 283 587 -151 -1016 -49 774 -232 -438 313 608 125 -804 -316 692 -101 -671 163 718 287 -642
3686 -642 -255 764 12 -762 58 711 246 -646 -345 631 14 -752 -60 703 502 -405 -399 657 169 -852
3706 -852 -322 466 467 -343 -501 651 413 -773 -362 463 406 -302 -526 555 487 -718 -426 363 377 -195
3726 -195 -487 441 667 -578 -580 298 396 -174 -581 378 884 -366 -632 341 459 -246 -643 183 749 -245
3746 -245 -610 241 503 -40 -575 51 792 -113 -675 66 405 -49 -692 -145 836 4 -668 241 541 -15
3766 -15 -582 -265 646 31 -808 15 544 83 -435 -234 688 334 -721 -169 560 119 -551 -420 534 342
$$ packed form
3627C18J0q63P1J341k78j143J47O80J24q98k08J424K1j265P2P20M7q52j72J330
3647F26K24j129oO17K2p96m33J155M53r74j91P01L13q17p49J189O55j106k32P61
3667B83L04p38q65R67Q23j006k06P51K95m83r29M88J008p93n70Q34N55m31r29
3686f42L87J019p52p74Q20O53m65q92L01R76o17p66O92P63k01r07OJ056m88j021
3706h52N30P88Jq10j58J152k38j186M11Q25n7p08k24J081o8j205K92P89J4n72
3726a95k92R28K26j245kQ78R8n70m07R59N06j250k66R73J18p05l97Q26N66r94
3746b45l65Q51K62n43n35O26P41r05n62P41L39m54o43N47R81q32o72R09L00n56
3766a5n67L17R11o15q39Q23N29m61n18K01R22l54j055N52P29m41o70J31R54j92
$$ plain form
3786 342 -659 -207 629 294 -339 -346 479 429 -664 -397 428 207 -332 -367 428 600 -460 -410 445 282 -389
3807 -389 -516 302 610 -456 -522 466 394 -303 -471 250 676 -353 -637 328 336 -303 -519 29 706 -8 -593
3828 -593 330 549 -241 -568 -110 509 -32 -633 234 671 -155 -514 -19 518 41 -537 155 592 -78 -574
3848 -574 -230 488 172 -608 98 803 97 -529 -302 363 126 -743 -174 758 225 -413 -168 348 276 -568
3868 -568 -301 603 227 -488 -353 220 248 -544 -370 657 444 -282 -186 331 351 -568 -633 424 341 -409 -205
3889 -205 413 485 -302 -600 327 478 -306 -326 312 477 -260 -709 119 494 -198 -345 324 613 -135 -694 68
3910 68 382 -330 -397 236 591 84 -559 50 499 -290 -531 98 492 114 -601 -162 565 -89 -640 81 644
3931 644 204 -482 -164 510 -42 -675 -167 435 255 -335 -89 606 163 -521 -206 295 213 -365 -230 596
$$ packed form
3786C42j001M52Q36l35o33pQ25n0j093K67Q25k21n39l5P95J72j060N0Q55j63o71
3807c89j27Q18L08j066o6R88p2o97j68P21M26j029k84R65Qo39k16N48O77p14n85
3828e93R23K19p90l27M58O19n41o01Q67M37q26l59M95N37m77n78O92M37o70m96
3848e74L44P18l16p80P06P05p06o26K27O65k37q69N69R32n33o38K45N16p2q44
3868e68K67R04l76p15J35N73K8p92J74J027k13p26R6N17K0r19o5J057q3p50K04
3889b05O18P2p87k98R27J51p84k0O38J65p37m49Q28L75o92j47O69K89p48n59P62
3910F8L14p12o7O33L55n07o43O09M49p89k41O29L94l78p15M39P27o54n51P21N63
3931F44m40o86L18O74n52o33N08O02j80n90K46O95m43o84L15N01q2n78J35Q26
$$ plain form
3951 596 252 -597 -231 395 221 -345 -240 560 346 -623 -426 305 205 -373 -337 508 569 -273 -373 198 301
3972 301 -345 -568 284 536 -273 -384 206 306 -171 -411 271 612 -229 -409 217 197 -299 -444 118 548
3992 548 -82 -389 284 479 -169 -555 6 530 -88 -537 132 554 8 -562 -67 596 48 -490 72 442
4012 442 31 -476 -268 409 132 -451 -7 461 122 -360 -197 371 95 -562 -139 463 151 -385 -141 495
4032 495 200 -527 -155 474 174 -400 -322 380 320 -453 -263 465 362 -248 -348 268 437 -382 -457 315 290
4053 290 -270 -346 245 463 -195 -329 282 307 -245 -376 116 340 -271 -394 275 386 -145 -379 139 477 -194
4074 -194 -504 208 419 -184 -505 -15 488 -32 -465 186 519 -25 -410 -116 384 33 -493 -11 460 92
4094 92 -322 -69 416 122 -459 -53 441 55 -372 -122 359 99 -485 -80 481 154 -310 -117 372 191
$$ packed form
3951E96l44q49L66O26j74n66J05Q00k14r69J97P31j00n78L6Q45O1q42j00N71J03
3972C01o46k23Q52K52q09j11N90J00m77k40O82L41q41j80O26k0m96j45N62M30
3992E48o30l07O73J95o48l86N61N24o18m49O69M22n46n70M95O63n48n38N62L70
4012D42m11n07K08O77k77n83M44M68l39m82J63N68k76o57M23O02l12n36K44O36
4032D95k95p27L72O29l00n74P8P02o0p73J90P28j03o10j00O16J69q19p5P72k5
4053B90n60p6N91K18o58j34O11K5n52j31M92K24o11j23O69J11n31k34N18L38o71
4074a94l10P12K11o03l21M90N03n20m33O51L33n44l85K94N00l51n26M82M71l68
4094I2m14K53M85k94n81M06M94l86m27K50M81k60n84M05N61l27m64J93M89j81
$$ plain form
4114 191 -503 -282 377 189 -308 -194 365 364 -382 -339 327 204 -298 -238 278 354 -326 -357 269 219 -239 -214 236
4137 236 393 -216 -415 196 259 -269 -272 255 455 -100 -379 213 333 -264 -389 113 424 -61 -391 180 373
4158 373 -149 -384 36 432 44 -396 94 367 -147 -442 -103 365 93 -379 109 461 -69 -423 -132 276
4178 276 62 -403 20 491 41 -348 -140 277 138 -373 -95 472 132 -360 -205 218 163 -365 -144 489
4198 489 244 -267 -161 215 137 -380 -265 406 256 -214 -133 230 224 -290 -317 324 295 -208 -196 184 253 -308 -434
4221 -434 257 320 -165 -185 204 289 -207 -483 102 322 -170 -213 164 331 -77 -428 41 322 -141 -266 123
4242 123 359 -21 -398 43 350 -126 -271 129 370 54 -394 -21 329 -115 -347 12 346 152 -334 -92
4262 -92 392 -21 -347 -59 285 146 -317 -154 366 55 -360 -79 253 145 -263 -171 332 86 -366 -152 198
$$ packed form
4114A91o94K21O59j88m97J14N59jp46M3O66j23n02O0N16P6o80l1O26n0m58K5M50
4137B36J57o09j99O11O3n28lN27K00n55k79N92J20n97j25N02L11m85l30N71J93
4158C73n22k35M20L96l88m40M90K73n14k95L39M68k72m72M88L52n30l54K91M08
4178B76k14m65M23M71m50l89K08M17j39n11K78N67l40m92J55M23n5n28K21O33
4198D89k45n11J06L76p8n17J15O71j50m70Q1L63on14k7O41k9n03J2L80O9n61j26
4221d34O91O3m85k0L89Q5m96k76N85K20m92m3L77J67m08l51M69K81m63j25L89
4242A23K36l80l77M41L07m76j45M00K41l16m48L73L50m44k32L59L34j94m86K42
4262i2M84m13l26K88L44j39m63J63N20l11m15K81L32j08m08R2N03k46m52K14L50
$$ plain form
4283 198 165 -203 -167 346 222 -334 -185 190 203 -225 -265 309 275 -284 -172 215 222 -163 -276 227 291 -225 -207
4306 -207 129 204 -128 -314 166 381 -153 -262 113 196 -120 -350 91 341 -161 -287 140 228 -51 -273 33
4327 33 329 -108 -340 74 237 -23 -289 -42 356 -4 -310 39 295 19 -299 -93 332 26 -325 -3
4347 -3 279 80 -217 -75 307 94 -312 -68 220 73 -201 -119 298 174 -294 -103 263 112 -226 -194 236
4368 236 158 -306 -134 268 124 -197 -219 196 238 -221 -155 202 110 -217 -278 113 288 -117 -192 211 206 -174 -270
4391 -270 95 295 -121 -216 191 230 -142 -243 69 272 -78 -213 189 252 -73 -278 -31 259 -11 -244 134
4412 134 332 -25 -282 -62 231 -14 -317 49 280 -25 -229 -43 225 33 -289 -24 266 38 -211 -76
4432 -76 157 18 -332 -102 291 123 -159 -63 219 86 -325 -153 281 131 -165 -63 197 121 -246 -167 224
$$ packed form
4283A98l3l68L6N13j24n56J49L75J3m28m0N74l4n59J12L87Pl85j13N03O4n16J8
4306b07L36P5l32j86M80K15n34j09L75Q3l16k30M41K50n02j26M27Q8k79k22L06
4327C3K96m37k32M14J63k60k66K47L98l60l06L49K56k76l18K06M25l06l51L22
4347cK82j99k97J42L82k13m06K44K88j47k74Q2M17j24m68J91L66j51l38L2M30
4368B36p8m64J72M02j44l21k2M15M2m59O6L57r2l27o1L91J75m05p5M03nl80r6
4391b70L65K00m16r5M07L9l72j01L12K03l50j35M02O3l25k05K47K90k70k33L78
4412A34J98l57k57K20K93k45l03L66K31l05k04J86K68j92l22K65K90k28k49J35
4432g6K33j39l50K30L93j68k82R6K82j33m11J72M34j50k96J02K60p6l67P9L91
$$ plain form
4453 224 142 -136 -94 189 169 -224 -246 161 145 -161 -109 185 227 -180 -273 124 143 -193 -138 152 217 -116 -251 102
4477 102 194 -155 -186 94 205 -72 -262 48 214 -124 -253 58 246 2 -233 67 198 -138 -266 8 232
4498 232 31 -188 58 255 -41 -218 -22 204 42 -203 -14 265 1 -268 -36 200 77 -195 -30 286
4518 286 40 -256 -93 144 54 -203 -71 247 124 -201 -95 141 80 -176 -156 200 140 -206 -109 137 116 -148
4540 -148 -154 194 180 -161 -127 137 100 -171 -180 180 191 -106 -117 131 160 -109 -198 119 208 -94 -164 94 182 -53 -207
4565 -207 67 224 -77 -190 74 154 -56 -223 -6 195 -63 -183 62 174 -16 -220 -36 185 -38 -218
4585 -218 9 175 6 -198 -20 229 26 -197 4 213 25 -215 -82 209 54 -186 -36 188 83 -139
4605 -139 -76 196 99 -182 -85 152 70 -165 -111 141 127 -143 -58 147 73 -152 -137 116 108 -165 -118 138 80 -136
$$ packed form
4453B24q2k78M2K83k0l93k2M07j6l06N2K94M2m07r3L97J9l36N5K90O5l33j35L53
4477A02R2l49l1K80J11k77j90L10J66l38j29L11J88k44k35L00J31l36j28K74K24
4498B32k01k19K46J97k96j77J96K26j62k45J89K79k64k69K32K36j23k72J65L16
4518B86k46k96J63K37r0k57J32L18j23l25J06K36o1k56K0L56o0l46R7K46k1k64
4540a48oL48j4l41L4K64l7k71rL60J1k97j1K48K9k69q9L17Q9l02p0K58Q8k35j54
4565b07K74J57l01j13K64Q0k10j67K17K01k58j20K45J12j90k04J84K21k23j80
4585b18K27J66j69k04J78K49k03k23K01K09j88k40J33K91j55k40J50K24j05k22
4605a39O3K72r7k81R7K37q2k35N4K52j4k70Q5K05p4k25J5K53qk73M7K56n8k16
$$ plain form
4629 -136 -152 84 147 -140 -150 116 113 -126 -196 52 165 -100 -159 106 147 -71 -162 23 137 -68 -163 91 182 -12
4653 -12 -133 31 171 -44 -156 61 174 -3 -144 -1 153 -32 -189 44 184 20 -148 -30 155 -13
4673 -13 -210 -20 164 24 -138 -52 154 45 -175 -56 128 47 -128 -66 135 65 -168 -84 119 68 -104 -56 142
4696 142 93 -125 -93 124 54 -117 -74 135 131 -110 -88 153 91 -118 -105 93 142 -71 -104 97 103 -125 -114 79 152
4721 152 -49 -130 71 98 -102 -134 15 137 -56 -131 67 122 -69 -129 -9 111 -26 -160 55 143 -43 -135 -15
4744 -15 111 0 -154 29 161 -13 -138 -4 104 31 -141 18 173 32 -109 -12 101 13 -146 -26 158
4765 158 51 -87 -32 105 39 -157 -57 140 66 -116 -56 73 37 -166 -95 125 72 -86 -61 63 56 -133 -121 91
4789 91 60 -81 -60 77 115 -87 -123 88 93 -98 -59 76 102 -80 -105 69 102 -59 -66 67 124 -45 -128 41 98
$$ packed form
4629a36j6K36O3k87j0K66lk39p0K48J13k65n9K65M1k18r1J85J14k05r5K54R1j94
4653a2j21J64J40k15j12K17J13j77j41J43J54j85j57K33J40j64j68J18J85j68
4673a3j97J90J84j40j62Q6K06j09k20J19J84q1j75O2K01p0k33Q4K03n1j72M8J98
4696A42m9k18L2K17p0j71M3K09mk41K2K41o2k09J3J98M9k13l3K01Ok28J1J93P3
4721A52k01q1K01K7k00l2J49J22j93p5J98N5j91o0J20J20j37j34K15Q8j86r2J20
4744a5J26j11j54J83J32j74j25J34J08p3j72J59J55j41j41R7J13q8j59J20J84
4765A58j07j38N5J37o6j96J00J97p4j82O0J29l6k03P1K20n3j58K5J24pj89J2K12
4789I1l1j41K1J37L8k02l6K11Nj91L9J35K6j82k5J74L3j61pJ33N7j69q3J69N7
$$ plain form
4814 98 -65 -118 22 101 -11 -132 31 126 -53 -129 0 113 -4 -132 9 113 -39 -100 1 77 -5 -120 -10
4837 -10 94 -27 -128 -16 76 -1 -118 -27 127 26 -131 -29 103 21 -121 -17 116 41 -103 -45 82 49 -91
4860 -91 -34 110 62 -89 -45 77 65 -75 -68 95 79 -85 -44 69 55 -78 -105 75 60 -89 -74 76 59 -81 -99
4885 -99 40 83 -66 -84 52 70 -33 -109 33 109 -62 -92 51 84 -5 -103 20 111 -37 -87 41 95 1 -77 27
4910 27 117 -10 -81 38 77 3 -99 -12 104 -10 -85 -1 82 2 -114 -15 100 25 -102 -19 59 -12 -77 -50 76 44
4936 44 -93 -40 68 26 -95 -49 80 40 -67 -58 84 30 -87 -49 65 56 -61 -32 82 48 -62 -71 61 66 -52 -40
4962 -40 64 61 -43 -76 36 68 -58 -69 70 73 -36 -81 25 69 -62 -87 49 78 -44 -80 -6 49 -51 -92 37
4987 37 79 -23 -78 -11 53 -30 -109 4 71 -3 -77 -6 77 -3 -90 9 99 6 -54 18 75 0 -89 0 73 27 -36 -2 79
$$ packed form
4814I8j63n3J40P9j12j21J63R5j79p6J29J13j17j28J41J04j52o1J01P6q2j15J10
4837a0J04j21j01J12R2p7j17R1J54j01j57J02J32q2j42J04J33p5j44N8J27l3j40
4860i1N7J44m8j51M4J22j2j40PJ63j6j64M1J13j4j33k7J80j5j49J5J50j7j40j8
4885i9J39M3j49j8J36J8j03p6J42P6j71l0J43L3q9r8J23R1j48n0J28N4r4p8J04
4910B7R0j27p1J19L9p4j02Q7J16j14p5Q4Q3q0j16R9J15p5j27Q3P8p1o5K7J26l2
4936D4j37N3J08m2j21M6J29m0j07RJ42n4j17L8J14rj17K9J14l4j10rJ32Nj18J2
4962d0J04lj04l3J12L2j26j1J39Lj09m5J06M4j31k5J36K9j22l6P4N5j00m1J29
4987C7M2j02n5O7O4q3p9J13O7p4p4P1Q3q0q7R9R0r3o0P2N7p5q9Q9P3m6o3L4Q1
$$ plain form
5016 79 9 -84 -23 88 22 -45 9 85 37 -91 -42 56 6 -63 -22 57 42 -59 -51 46 13 -70 -31 57 42 -58 -75 32
5044 32 10 -68 -59 53 84 -40 -60 43 48 -57 -38 55 66 -9 -48 43 53 -40 -44 42 81 -26 -52 35 58 -32 -70 6 62
5073 62 -17 -60 44 66 -27 -86 -12 45 -13 -63 9 59 -13 -64 -9 41 -2 -74 -8 66 1 -63 -8 36 -3 -75 3 72 19 -61
5103 -61 -4 31 6 -71 -22 55 24 -43 -8 52 19 -51 -28 73 33 -32 -23 55 47 -40 -19 51 33 -47 -35 43 23 -43 -54 34 13
5134 13 -71 -42 46 37 -47 -48 21 45 -59 -42 32 27 -18 -54 22 45 -34 -48 36 58 -21 -11 19 33 -26 -43 40 41 -5 -23 29 64
5166 64 -14 -14 23 66 8 -39 15 74 -3 -47 13 60 1 -40 3 42 10 -40 9 29 -16 -59 -11 38 -11 -53 -24 43 -4 -77 -42
5197 -42 30 6 -56 -3 50 21 -44 -18 39 21 -45 -2 50 29 -28 -29 29 14 -25 -18 47 30 -27 -24 48 33 -42 -25 30 35 -32 -35 33
5230 33 33 -48 -32 27 17 -26 -53 25 25 -46 -49 21 23 -13 -39 17 30 -25 -57 4 19 -26 -39 -1 41 -9 -45 -2 30 -14 -34 17
$$ packed form
5016G9p0r3O1J11o6o7N4P6m8j28M9R8n0o9M1P9j5j01QR7l3q3L9Q8j5j00j7J07
5044C2k2p8RJ12L1j24k0J03Nj05J9R3J1p5l9R1J0r3mQ6L9j07k6Q7K3r0l8P6N6
5073F2p9m3J04K2r3n9P4N7n8n0P2N0p2n1N5N0m3p2O6P4o5o4N5M4l9p2P8O9n3q0
5103f1N7L5k5p7M9P7l1o7L5O0l3p0K3J01m0o5RP8qq7K1P0j8q0J2P8k0o6j1Q8k1
5134A3q4K9Q8rq4jO9K4j04J7P4nm5l6P6K3p9j4Q4K2p9J0L0J4n9j7Q3Jm6j8N2L5
5166F4p8%L7M3n8m7N4N9p7m4O0M7n9m1M3L9l2n0M9K0m5m3M8M9m9m2K9O7m7p3L5
5197d2P2k4o2N3N3k9o5K6N7j8o6M3N2k1n7jN8j5l9PO5j7n7LP2j5p5J7N5No7lO8
5230C3%q1J6N9j0m3k7P8%p1lP0Kl6k6N6J3n5l2O1J5m5j3L8M2n0l6M3L2m4k0N1
$$ plain form
5262 17 61 -14 -44 15 36 -4 -22 8 55 12 -53 5 45 -7 -41 14 37 2 -50 -2 29 -25 -46 -5 38 2 -38 -5 26 3
5292 3 -28 -4 35 25 -30 -33 30 27 -46 -30 27 22 -37 -13 57 16 -39 -23 28 23 -35 -8 47 38 -18 -16 25 38 -26 -23 48 31 -16 -13 17
5327 17 40 -30 -39 43 37 -24 -58 2 40 -38 -49 20 27 -26 -28 5 24 -24 -56 -6 29 -9 -37 14 40 5 -42 -1 47 7 -35 8
5359 8 56 17 -54 21 40 4 -15 -3 29 3 -36 2 38 17 -19 -13 43 38 -47 -24 55 -3 -49 -12 25 19 -38 -13 22 6 -48 -36
5391 -36 10 17 -39 -53 17 -10 -47 -25 18 19 -42 -46 30 9 -52 -30 32 17 -35 -15 39 31 -13 -18 27 32 -1 -28 22 30 -28 -30 14 25
5425 25 -18 -46 2 47 -35 -42 16 17 -17 -47 -8 36 -30 -37 17 24 -9 -37 -6 35 -20 -56 -7 11 -13 -50 -16 32 -12 -38 -12 41
5457 41 5 -31 -18 44 1 -32 -5 43 22 -17 -8 41 18 -14 7 24 26 -16 -6 51 18 -38 -5 14 22 -33 -19 38 4 -55 -25 18
5489 18 6 -37 -24 22 14 -43 -28 1 8 -37 -52 11 26 -24 -35 16 19 -39 -44 17 40 -17 -36 24 21 -6 -29 15 26 -1 -21 8 34
$$ packed form
5262A7M4p5l0N9K1m0j8L0M7m3o5N8M0n2l4N5K3l5n2M8L1n4k1M1M3l6m0L3L1k3
5292Cl1K4L9j0n5lO3lp3J6N7nn9K4P0m1n5J6N1nn8K7N5rn6KM1J3o4LP1j7m7LL0
5327A7K3p0rQ2oo1l4O0L8p8j1O9Pn3kL3J9m8l2N0L5l8k8N1K6l5m7M1M8m0m2M3
5359HM8l9p1P5J9l6j9J2L2k6l9L8L6k1l6ON6nq5K3P9n8m6L7L7on7K5L5j6n4J2
5391c6M6Pn6j4P0k7l7K2M3Jo1mP6k1o1K2O2j5n2K0N4qm4nM5Nl3k7N0Qn8kM4J1
5425B5m3k8M8M5q2pN8Jl4l0L9M4o6pN4Pl3k8L1M1n5l6M9J8k4l7L4M8m4k6K6N3
5457D1l6l6J3O2m3l3K7M8k1l9RM9k3l2K1J7Km2J0N7l3n6L3J9Qn5J4N7l4n9L0M3
5489A8j2m3J3M6qn7J5K9Pm5j5O3J5n0j1N1Ln8nO1K3n7j9O0lk7k3M4J1k7k0K9K6
$$ plain form
5522 34 -13 -33 -1 54 -13 -22 11 47 2 -27 11 41 -1 -34 5 23 -11 -35 -29 26 -3 -57 -9 19 -6 -50 -37 11 -9 -58 -19
5553 -19 23 6 -51 -19 31 4 -40 -26 28 20 -32 -13 17 0 -28 -10 38 26 0 -21 32 29 -34 -23 16 23 -23 -26 12 13 -36 -45 17
5586 17 10 -16 -26 4 24 -32 -53 11 17 -32 -30 -7 32 -42 -36 -1 13 -23 -41 24 31 4 -37 -1 36 -14 -27 12 34 9 -35 25 40
5619 40 4 -3 16 31 3 -21 6 30 -1 -33 8 42 -4 -40 3 23 2 -36 -16 27 2 -41 -14 13 2 -33 -35 11 24 -45 -23
5650 -23 23 13 -49 -40 12 0 -49 -28 31 12 -35 -26 31 15 -19 -21 40 25 -10 -5 18 27 -29 -16 26 19 -26 -25 13 38 4 -40 18 37
5684 37 -28 -26 28 28 -26 -38 -6 32 -4 -48 1 22 -27 -46 1 8 -15 -55 -5 24 8 -30 -5 34 10 -26 -15 27 -7 -44 10 27
5716 27 8 -33 -9 42 10 -20 -14 44 14 -35 -9 25 24 -21 -15 48 20 -33 -8 35 0 -25 -28 34 6 -23 -17 32 14 -25 -21 19 -4
5749 -4 -29 -33 -4 4 -26 -38 14 25 -31 -23 14 22 -27 -24 20 21 -28 -12 28 49 -9 -15 17 35 -30 -16 17 34 -5 -35 4 25 -6 -21
$$ packed form
5522C4m7k0L2N5o7rL3L6m5k9L8L0m2l3L9J8l4k4ON5k9n4M8K8k5m4J3M8k0m9L9
5553a9M2j7n7L2N0k7m4J4N4qn2J9L0j7k8J8M8j2k6k1N3lo3J1L9Pm6lL8Jm9rO2
5586A7pk6j0L0K0n6k1O4Om9KK3L9p4OL5J4l6j8O5Pk7m1L6L7n0j3L9K2k5m4O0J5
5619D0l6pJ9J5k8k4K7K4l1l2M1L4m6l6M3K0k1l8K0M3k5m3K7K7j1l5kM6J3o9K2
5650b3M6j0o2RN2j2m9K1N9j9m7RN7j6l4kO1j5l5NK3Rn6J3M2pm5JL8K5l4m4N8J9
5684C7o5KN4%n4j2L2L8l6m4M9K1m9j9M7Pk3m0N0K9j6l8K5L9k4l6J1M2l4l7N4J7
5716B7j9m1K4N1l2l0ON8l0m9K6L4jm5OO3k8n3K5M3l5k5lO2k8k9OM9j8l9MM0k3
5749dk5mK9Ql0j2N2J1n6QL7Qm9LM4Jm9J6M0K1n8oL2J8o5J4L3J7l9l0L9K1l1j5
$$ plain form
5783 -21 1 27 -6 -38 -12 39 -31 -54 -14 25 -3 -28 4 30 -10 -51 -20 10 11 -44 -31 24 -9 -52 -29 33 8 -17 -20 18 0
5814 0 -55 -9 40 9 -39 0 36 29 -22 -11 31 30 -17 -13 44 40 -27 -25 29 16 -25 -16 16 35 -32 -26 27 1 -35 -34 12 14 -30 -23 9 10
5850 10 -19 -40 0 23 -11 -34 13 10 -12 -38 5 18 -4 -46 4 29 -8 -49 -2 24 0 -29 6 36 0 -23 -11 48 14 -13 -5
5881 -5 32 9 -35 -12 17 -3 -51 -16 26 2 -33 -23 29 -11 -53 -20 27 -9 -37 -31 8 -4 -49 -29 11 7 -20 -14 31 12 -34 -30 15
5914 15 32 -15 -42 22 39 -18 -38 22 30 -6 -26 13 44 -22 -43 24 24 6 -29 26 49 7 -28 10 31 -15 -15 9 37 -17 -36 14
5946 14 30 -14 -46 -2 30 -2 -59 -22 16 -14 -54 -16 27 11 -44 -5 23 -5 -28 -12 32 5 -30 -3 45 21 -47 -4 19 26 -21
5977 -21 -14 35 18 -21 -33 20 36 -29 -30 25 34 -35 -26 20 20 -26 -22 16 20 -30 -26 5 17 -30 -21 12 36 -29 -29 16 11 -9 -37 3 35 -12
6013 -12 -50 17 44 0 -46 -3 27 0 -34 0 23 20 -24 16 47 8 -15 6 39 2 -29 -2 43 -2 -35 -1 26 2 -41 -8 31
$$ packed form
5783b1K2K6l3l2K6N1p0k3M0L9k8k5L2K6m0m1L1L0Jn5J3N5l3m3K3O2k5k5lL8j8
5814@n5M6M9l1m8L9L6pn1J1M2jm7MN7mo7KN4j3m1RL2J9o7ON3k6l6JM6Km4PL2J
5850A0k9k1M0K3l4k3M7lk2k6M3J3k2m2N0K5l7m1M7K6k4k9L5L0l6k3J2N9l4k7Q
5881eL7k3m4K3K9k0m8L5M2k4l5J0N2m0m2L3M7l6k8OL9j2m5K0M0mk7OM5j9m6MM5
5914A5J7m7k7O4J7n7k0O0Ql6k0L9L1o6k1O7%j8l5N5K3m2l5L8K1m6%K4K8n4j9N0
5946A4J6m4l2M4L2l2n7L7L8l0m0L8M3j6n5L9K8k8k3J6M4k7l5K7M8k4o8M3K3Pm7
5977b1PM9j7l9j2N3J6o5jN5Ro9RM6%m6ML8Mn0ML1J2m7RL3K4o5%M5nk0k8M0L2m7
6013a2l8O7K7m4m6M3L0k7l4L4K3lm4M0L1l9k3K1L3l7l1K7M5m5l3L4K7k4m3L3L9
$$ plain form
6044 31 -2 -32 -21 22 -7 -33 -28 23 1 -34 -19 8 11 -46 -29 14 2 -40 -33 7 12 -44 -27 13 24 -27 -21 5 8 -17 -22 14 30 -3
6078 -3 -14 13 17 -14 -28 24 28 -4 -22 8 41 0 -42 16 30 -7 -34 17 13 -3 -42 -13 22 -26 -41 -4 33 -6 -42 -30 29 0
6110 0 -36 -3 25 1 -39 -9 32 -1 -42 -1 19 17 -40 -9 48 17 -37 -12 44 36 -20 -19 21 33 -46 -15 35 35 -13 -10 28 28 -16 -19
6144 -19 23 29 -19 -26 32 29 -29 -35 22 7 2 -29 15 32 -18 -39 28 10 -28 -46 3 25 -20 -52 25 39 -8 -33 17 39 7 -10 16
6177 16 37 17 -22 16 53 14 -11 11 46 -11 -44 -4 35 3 -23 15 41 15 -32 -27 41 10 -30 6 18 11 -30 -23 24 17 -21 -2
6209 -2 25 12 -9 -26 32 30 -27 -19 19 5 -35 -11 31 24 -36 -35 21 24 -19 -18 11 30 -5 -17 24 40 -4 -26 22 40 -7 -10 14 17 -15
6244 -15 -10 7 17 -8 -32 10 34 -8 -39 6 36 -19 -31 0 40 -12 -37 -2 34 4 -40 5 38 6 -32 -12 32 6 -55 -5 30
6275 30 -5 -35 -11 20 -10 -24 -7 36 5 -22 -2 47 23 -28 0 43 28 -14 -17 19 30 -35 -29 23 31 -22 -20 13 16 -17 -46 19 21
$$ packed form
6044C1l3l0J1M3k9k6NN1k2l5J5K7Ln7J7M3j2m2PM0Nn6J7M0J1n1OK6Lk5nL6J6l3
6078cj1K7Ml1j4N2Ml2j8L0L3m1m2N8J4l7k7N1mj6l9K9L5m8j5L7L7l9l6J2N9k9
6110@l6L3K8k4m0L0M1l3m1M1K0kn7L1N7l1n4K5N6qn6JM0J2p9L1N0%m8LL8%m4l
6144a9M2Om8pN8ln8oN7j5nl1M4J7n0k1O7j8l8j8M9K2m5l2P7J4m7k5N0K2l2j7K6
6177A6K1k0l9L8L7l9k5K2L5n7l3M0L9l2k6L8K6k6m7NO8l1m0L6J2pm1PM7pl8J9
6209bK7j3k1j7N8kn7QL8j4m0K4M2po0JN6Lm3JK9J9l5j2M1J6m4k2M8J8m7lK4Ll2
6244a5NJ7J0k5k4M2K4m2l1M5L0n5j2L1M0n2k5L5L6l0m4M5L3l2l8K0M4k6o1N0L5
6275C0l5l0K4L1l0j4J7M3l1k7K0M9k4n1K8M3j5m2lL6J1o5ON2Qn3KL3Ll3k9O5K
$$ plain form
6308 21 -20 -17 7 31 -20 -37 9 23 -8 -19 16 21 1 -22 9 37 -13 -32 15 30 14 -38 8 36 -1 -6 25 31 24 -47 -16 27 14
6341 14 -15 7 51 7 -28 -5 35 11 -29 -15 25 1 -28 -23 16 7 -28 -10 22 16 -23 -30 19 8 -33 -24 19 25 -33 -10 18 27 -21 -22
6375 -22 42 33 0 -20 30 28 5 -7 32 11 -7 -32 18 39 -5 -27 32 35 -31 -22 9 30 6 -36 -13 20 -29 -30 14 34 -10 -21 2
6408 2 25 -9 -35 -7 15 -8 -44 -12 31 7 -40 -26 25 -1 -44 -8 29 -4 -35 -11 33 15 -30 8 37 2 -26 -6 14 29 -37
6439 -37 -15 26 16 -23 -8 36 21 -30 -15 26 30 -31 -31 19 16 -20 -29 13 19 -8 -29 17 39 -31 -30 22 39 -4 -23 31 44 -11 -30
6472 -30 -4 21 -4 -31 9 29 -15 -23 9 38 7 -13 6 44 21 -31 13 20 -6 -33 -5 42 2 -18 1 32 8 -32 5 42 16
6503 16 -32 -7 24 4 -40 -9 31 10 -18 -30 18 3 -35 -25 26 20 -16 -30 26 8 -31 -20 25 27 -9 -9 28 26 -17 1 20 43
6535 43 0 -21 28 26 -3 -24 2 29 -9 -19 17 28 -6 -15 7 16 -11 -42 6 16 -25 -24 -2 32 -14 -50 -14 19 0 -22 -16 13 -6
$$ packed form
6308B1m1LK4K4n1j7M6J4l1j1L5Nk0k3L1K8n0j9M7J5j6n2M6K8l7nL1Opp1L1M3j3
6341A4k9K2M4m4l5K3M0k4m0J4M0k4k9NL9rl5J8L2ol9pM9j1m1RM3On8K3K8Rm8j
6375b2O4rl3k0N0kk3j2L9k1j8k5N0K1m4k2N9Lo6RL1K1k4m2K3L3m9jM4K0m4j1K3
6408BK3l4k6K8K2k3l6L2M3k4m7J4N1k6m3L6L7l3l1K4M4j8m5L8K9l5k8K0K0J5o6
6439c7K2M1j0l9J5M4j5n1J5M1Mo1%N0ll6rM2Ok7k1M6K2p0JN2J7m3j9N4J3n5j9
6472c0K6K5k5k7M0K0m4qL2K9l1k0J9L8k3n2M4Pk6k7K8M7m0k0J9L1k4m0L7L7k6
6503A6m8K5L1k0m4L1M0k1k8j2M8j5l8J0N1ol6j4N6j8l9J1M5Kl6%L7km3J8J9K3
6535D3m3k1M9kk9k1K6K7l8j0L6J1l4rK2Rk7l1M8J0m1JK2L4m6l6L6L3j9k2OK9j9
$$ plain form
6568 -6 -42 -16 20 -12 -51 -9 23 -6 -21 -6 18 3 -20 -17 37 31 -4 5 31 15 -15 -13 16 34 -12 -7 30 16 -21 -13 27 20 -44 -25
6602 -25 21 14 -21 -31 4 15 -17 -43 0 16 -23 -27 4 21 -33 -55 13 26 -17 -27 6 21 -26 -39 -2 26 -14 -29 6 9 -13 -29
6634 -29 -2 23 -2 -28 -11 19 7 -32 11 34 20 -28 0 25 4 -23 11 25 5 -15 9 24 -4 -27 -5 18 -11 -38 -26 27
6664 27 -3 -36 -34 6 0 -48 -22 28 16 -30 -30 18 8 -22 -20 9 19 -40 -20 42 9 -23 -3 5 33 -23 -29 11 23 -24 -38 15 21 -4
6698 -4 -18 33 24 0 -22 15 31 -9 -29 -13 16 -25 -36 -8 23 -9 -37 -11 39 -9 -40 -5 8 -14 -40 -2 30 11 -25 -11 18
6729 18 3 -31 -8 19 -3 -20 -5 39 23 -21 -5 34 32 -23 3 20 32 -14 -30 26 8 -16 -17 26 11 -30 -18 6 9 -37 -23 9
6761 9 15 -6 -27 4 10 -30 -26 16 13 -23 -44 -16 24 -30 -33 11 -2 -7 -57 8 19 -26 -27 14 25 -4 -11 0 53 -3 -19 3 48 -2 -28
6796 -28 6 33 -8 -30 7 18 -6 -40 2 27 -6 -19 7 24 5 -26 -14 19 0 -18 -9 17 2 -23 -27 17 13 -24 -17 13 23 -29
$$ packed form
6568fl6K6L6l2l9M2L2k9j5J5K4j5k3LN4ol5RK6j6l0KK9J8m6NL7j4l7QM0po4J9
6602b5M6pl5j0L5J1l2k6M3J6l9mL1J7n4k2O8J3m3j0L3J5m7j3L7K8m0j5L5Lk2j6
6634b9K7K5k5k6J7L0j2l9M3K3j4m8K8K5k1k7L4J4k0k0K4J5k8k3K2K3k9k7J2N3
6664B7l0l3KM0om8K6N0j2m6%M8j0l0KK9J0n9K0O2l3l2K0QK8n6oM0J2m7j4N3Ok5
6698dj4N1rk4k2L7J6m0k0J6K9m1j1K8L1l2k8K6N0m8l1L5J3k2k6L8L2j9l6J4K9
6729A8j5l4K3K7k2j7J5M4j6m4J6L9kn5K6J7J2m6j6N6j8k4jM3j5m1J2K4Lm6J4L2
6761IOk1k1L1Om0MM2ll6k1K8M0n4lM4j3nn0O5J1m5jM1J1k9pJ1N3n6j6K2M5n0k6
6796b8L4K7m1k2L7J1k4l4M2K5l3j3K6J7j9l1J2L3j9j8RK6j5k5mM4ml7PL0J0n2
$$ plain form
6828 -29 -22 11 16 -33 -20 22 8 -22 -26 7 12 -20 0 7 8 -8 -25 20 39 -6 -33 11 26 -6 -22 13 23 -28 -22 23 19 -3 -22 3
6862 3 15 -10 -51 1 28 5 -35 -10 30 7 -33 -3 29 -7 -22 -12 30 -3 -25 -18 37 5 -4 -5 37 11 -13 2 16 0 -12 -5 28
6895 28 14 -21 -21 18 34 -19 -12 23 17 -24 -10 16 25 -25 -5 45 17 -11 -9 15 14 -32 -32 15 4 -29 -34 -1 23 -16 -30 4 19 -23
6929 -23 -23 3 20 -4 -22 1 11 -1 -15 23 30 -4 -20 0 31 3 -9 12 45 5 -41 3 18 -8 -25 11 33 2 -42 13 20 0
6961 0 -46 13 20 4 -22 7 15 14 -30 -23 35 17 -15 -5 21 15 -36 -20 26 15 -23 -12 18 4 -19 -18 11 13 -11 -11 34 34 -7 -15 21 34
6997 34 -6 8 33 47 -4 -24 22 24 -20 -15 17 22 -10 -1 8 13 -13 -17 -4 26 -11 -16 5 28 -4 -24 -5 22 -7 -28 8 23 -2 -16
7031 -16 3 28 -11 -30 -15 4 12 -30 -7 31 9 -5 -8 22 12 -25 -7 27 19 -21 0 52 23 -31 -11 22 23 -27 4 40 18 -23
7063 -23 -28 14 18 -27 -35 10 18 -19 -24 8 19 -17 -27 19 20 -17 -26 11 22 -8 -12 10 27 -1 -15 11 24 4 -14 3 36 2 -14 20
$$ packed form
6828b9PL3Nm9J3M2j4l0mL3Nl2K0PJj6j7M5J9m5k7M4J5l2j6L5J0n1OM5mk2j9K5
6862CJ2k5m1N2K7k3m0K5M0k3m0L0L2l6j5J0M2l3k2PN5l2rjM2k6k4J5J4j6j2PL3
6895B8j4l5%L9J6n3PL5om1J4K6Rn0K0N0k8k8KK4jm6%M7j1l3nL3K4l9j4L4J5m2
6929b3%K6J7k4j8K3J0j2j4L8Pl4j6K0L1k8j2K1L3m0m6M4J5k6j7L6K2l1m4N5Pk0
6961@m6N9Pj6k6K9Qjm4PN8j8l2J0K6on1J6M6j1l8J1L0j4k3JK9Kk4%M5%m1qL6J3
6997C4m0J4K5J4n1k0M6Km4NL2Nl2RRNk6mJ3L0l7nK1K3l2k0J9K7k9k1L6J5k5j4
7031a6J9K5l9j9J5J9Qm2K3L8k2j4lL0j0l7J8L4qm0K1N2k9n4K0L3Jn0L1L6k2m1
7063b3nM2Mm5qM5Ql7nL2J1l6j0M6Jl7rL7J1l0mK2J7k8j4K6J3k0j8J7L3l4j6L4
$$ plain form
7097 20 27 -11 -24 8 58 10 -39 21 19 2 -20 16 17 2 -15 6 19 -4 -14 -4 33 22 -13 -8 26 -7 -39 -19 22 2 -54 -15
7129 -15 -2 -1 -38 -10 11 7 -15 0 18 4 -15 -9 22 23 -11 -1 23 20 -24 -16 6 28 -10 -25 19 3 0 -26 18 18 -25 -2 -1 8 -4
7164 -4 -16 11 11 -6 -18 22 23 -6 -15 10 22 -7 -35 0 16 0 -29 -4 21 -10 -51 -4 12 -5 -19 3 28 -7 -24 -3 52 11
7196 11 -10 9 39 0 -19 3 39 26 -5 -3 25 21 -23 -5 37 1 -5 -16 16 19 -18 -19 1 1 -22 -15 9 12 -17 -34 18 7 -31 -13
7230 -13 17 3 -12 -32 11 22 -18 -20 14 11 -20 -20 11 28 2 -24 11 24 -1 -17 17 26 14 -5 0 37 15 -15 15 16 25 -9 3 34
7264 34 0 -9 3 16 -12 -33 -13 14 4 -27 2 13 3 -29 -24 9 -5 -27 -1 24 2 -5 -1 9 -6 -14 -11 38 8 -22 -2 14 19 -7
7298 -7 -9 26 26 -6 -3 35 17 -10 -14 11 20 -3 0 16 19 -10 -25 17 25 -5 -4 22 18 -17 -16 -1 8 -2 -26 4 12 -2 -33 -17 20 -13 -26
7335 -26 -10 6 11 -19 -8 18 1 -20 -13 15 -5 -11 -4 17 12 -7 1 32 16 -13 3 19 12 -7 1 18 1 -24 -8 16 14 -22 -16 23 1
$$ packed form
7097B0Pl8j3L2N0m8m9O0kj7k2L6Jj5j7K1J3k3j0J0L7j1l5NL4l3l2K0M1k0n6L9
7129a5J3Jl7K8K1mk2J5J8j4j9OL1Jl4J0K4lm4QK2K2l8j5M4j6lk6M4%m3K3JRj2
7164dj2K7%j7j2M0Jk9rK5J2k9k8L5J6j6k9K5K5l1m1M7J6j7j4K2K5l5j7K1N5m1
7196A1k1J9L0l9j9K2L6j3l1KK8mm4J8M2l6oj1L2Ll7jK0%k3PK4Lk9j7N2j1l8J8
7230a3L0j4j5k0M3J1m0kL4ll1%L1J7k6k6L5J3k5j6L4Rj2j9NL7k2l0L0JRl4J2L1
7264C4l4rJ2J3k8k1K0K7j0l1K9J1j0l2NL3j4k2K6K5k2pMJ0j5qLM9l0l0K0J6Nk6
7298gkL5%l2LL8j8k7mK5Rk3LJ6Lk9j5M2Ql0JK6ml5JJ5Rj0k4L0Qj4l1J6L7l3j3
7335b6J6J6Nl0J1K6j7k1PK8k0oPK1nj9QL1j6k9J6J6pj9QJ7j7k5J6K4kl6OL9k2
$$ plain form
7370 1 -10 -11 10 7 -8 1 7 23 -5 -29 22 19 -24 -15 11 10 -13 -25 9 4 -6 0 7 20 4 -22 2 12 -10 -5 5 27 4 -10 11 25
7406 25 8 -15 1 27 5 -13 5 34 4 -9 10 21 11 -18 -6 14 12 -27 -30 17 6 -30 6 11 -3 -26 -11 10 3 -13 -17 24 4
7439 4 -22 -17 5 12 -14 -15 18 15 -4 -8 18 12 -16 -11 23 25 -19 -3 20 18 -4 -10 25 23 6 4 26 35 -6 -2 18 17 0 -17 6 20 -9 -16 -3
7478 -3 18 -17 -21 -10 7 -4 -28 -4 18 -2 -1 11 11 -11 -6 -1 18 5 -17 14 19 11 -33 -7 11 15 -11 7 21 4 -19 0 14 16 -9
7513 -9 6 18 4 -5 -9 26 11 -25 -5 5 9 -1 -12 26 7 -14 -15 1 7 -16 -12 -9 6 -26 -19 5 11 -18 -20 -13 8 -9 -17 12 6 -14 4
7550 4 19 20 1 -10 21 30 -3 -16 24 31 4 -16 -8 16 13 -7 6 18 1 -22 -5 18 2 -5 -10 -5 8 -18 -9 9 -11 -19 -2 -9 -6 -26 -7
7587 -7 28 -5 -24 -17 5 6 -24 -10 19 2 -27 -3 -1 -5 -2 -10 18 0 -16 -12 20 14 -4 -17 2 8 5 -8 -2 12 -15 -16 17 6 -13 -4 3 7
7625 7 -10 -15 10 9 -22 -31 -9 5 -4 -17 1 -2 -15 -16 3 23 -4 -10 2 19 -10 -7 -14 0 16 -26 -5 10 -4 -15 0 -7 0 -23 0 10
$$ packed form
7370Aj1jK1lj5ROJ6k8k4N1lm3RK6jk3j2L4nj0OPJ3j6k6K4J0k2NJ0K2k3j4K1J4
7406B5j7k3J6K6k2j8J8K9l0j3J9J1j0k9J2K0kl9lM7j1l6L6Nj4k3J5K1pj6mM1k0
7439Dk6NK2Pk6jL3lj9mK6ok8NL4Km4J6K3kk2oL5kj7kK2Rm1MK0jj7j7K3J4k9pJ3
7478cK1l5mJ1J7j1k4K4K2k0JJ2%k2NNJ9j3k2L1Nqm4K6J8Mk6J8J4j7k3J9J4Kk5
7513iJ5J2j4rmL5j5l6K0J0Mj0j1L8j9k1jJ6Ok3MLJ5l2PK4Ok9kPK1j7qK9ok0J8
7550DJ5Jj9j1L1Rl3j3M0Pk7k0QK4lk0J3J2j7k3J7K3j6pnNJ3k6RJ8k0qJ7pLk0J9
7587gL5l3j9PK2Jl0J4K9j7k9K4KmLqK8j8j6ML2oj8j3J9Olj3OJ4k7jL3j1j9RPM
7625Gj7nK5jl1rK2J4rj3J8lj3jJ9K0k7oJ2J7k9LpJ4J6m2K1J5j4j1J5pPk3K3J0
$$ plain form
7661 10 6 -5 -12 2 4 -16 -2 9 17 2 6 15 13 7 -12 22 3 -11 -22 0 7 -10 -16 17 4 -6 -30 -4 2 -21 -25 -6 0 -3 6 18 19 4
7699 4 2 22 20 -6 -7 16 27 14 0 13 8 -4 1 19 22 -4 2 6 5 -6 1 13 -2 15 -1 -8 15 10 -13 4 26 4 -8 2 -8 -1 -7 -12
7737 -12 0 -3 -3 3 5 -4 -17 5 -3 0 -8 3 3 -16 -23 8 5 11 8 8 5 4 0 -9 9 12 -4 4 6 13 1 -10 -4 10 4 -8 1 20 -1 3 -5 4 -10 -11 -11
7782 -11 3 -4 -8 -9 -1 -11 -12 -6 25 -13 -11 2 12 4 -15 -7 3 -2 -4 6 10 -1 -22 -5 11 -22 -10 9 11 10 -6 7 26 2 -3 -16 4 5
7820 5 -6 -1 10 5 -13 6 8 10 1 -9 -3 -2 -11 -17 -6 -5 -17 -22 6 12 -15 -9 17 2 -14 2 8 6 -8 -11 0 -2 -6 -14 8 9 -17 -16 6 16 0
7861 0 3 -4 19 9 -10 2 -3 2 5 4 17 25 6 14 17 -9 -8 -7 -7 8 -8 0 7 12 -20 -7 0 -4 -26 -17 6 -17 -12 -23 -5 -22 -9 -20 12 14 -5
7902 -5 -10 11 -4 -21 8 9 12 7 6 9 0 -8 -7 11 6 7 15 12 22 1 2 3 -6 -3 -2 -5 6 -11 -6 1 3 4 0 14 -24 -9 -5 -14 13 -7 -25 21 -2 -2
7946 -2 0 -2 -5 3 -13 -10 14 -3 -5 -7 5 11 4 -1 19 6 7 9 14 -3 -15 14 1 9 -2 3 0 17 -4 -18 5 7 -6 8 15 -2 -6 -5 -9 9 -19
$$ packed form
7661A0mj1pJ4Kk0J4J1Qj5MRkoj9L4j9j4j1K2Pj7oL3j3j0k4K6Ok3mJ9OlRJ2Jj5
7699DkK0kk6jK3J1j3j4J3nj2NJ8Lk6OMjj1PJ2j5J7j6pK3nk3J7K2k2j2J0j0Pon
7737a2J2l%OKrj3K2qLqJ1%j9pL1lOl%ljmrJ8Lj6QKPj2j1OJ4oj2RJ9k1MqRj4j%
7782a1J4pmjQj0jOL1l8KJ3J0qj9QJ0nkJ0Mj1k1J7J6l3J2J9Kjj6J3J9k4nj3K0J
7820Ej1NJ1nj8J9KKrj0OJroJ1Jj2nK8Ok7OK6j5j6J6Okj4lJ1kmqK2Jk6JK2J0j6
7861@LpK3j0j9J2nNLjJ3Qj9QLk6JJ%J5j6QPNl2J3Pmk2RK3k3Nj1J8j7J3j1L2Kj9
7902enK1j5j7K9JLnjLrqJJ8nJQlJ0k1JJrLJlJ1j7NPKJmJ4l8J5MrK7k0j8M6k3%
7946bKklQj6LK4j7kkJ2OpnK0j3JKNj7j2K9j3Qj1NlJ7k1j4K3Kj3J4Pj7mJmJ8k8
$$ plain form
7987 -19 -7 -2 3 8 -10 18 -7 -9 -7 -11 4 -11 -17 -3 3 -1 -13 -10 11 0 -18 3 0 -13 -11 3 15 3 -8 2 10 -12 16 6 18 -7 6
8024 6 15 16 19 -3 -8 6 0 11 -7 8 -8 -12 -30 -2 -1 -17 -16 -5 -2 -23 -7 -17 -11 -14 -12 9 1 -3 8 9 -5 -12 -12 9 9 1 -8 10 7 -21 -2
8065 -2 12 -9 -2 13 6 -1 -19 -13 3 16 -7 -11 -3 -1 -9 0 10 15 6 -13 -8 10 -6 -7 4 5 -11 -30 -5 -1 -15 -16 -15 20 9 -15 -25 -1 -4 -1
8105 -1 -3 7 8 -13 1 2 5 -5 9 17 10 -3 1 15 7 5 -2 -11 -19 -17 -8 2 8 -9 -13 -10 3 -2 2 13 -7 6 -2 -3 -3 -3 1 14 4 -9 -9 2 0 -6
8149 -6 -18 -10 -14 -25 -24 9 13 -3 2 9 5 -5 -5 2 15 -16 -2 -2 -5 9 -7 4 13 7 -15 2 15 1 -15 8 -1 -19 -8 9 8 3 -20 -1 0
8188 0 6 -8 -23
$$ packed form
7987a9J2NNNj8K8k5kKmJ5j5oJ4Omj2LK1j1j8K1lj3KJ4J2j2j1J0Qk2K8j0J2k5J3
8024FRJLk2nJ4oJ1j8J5j6mj8K8Jj6JJ1Lk1J6j0OlKK1qmJ1Jj4p%K1%qrJ8lk8J9
8065bJ4k1PJ5ppj8OJ6J3k3mQKqRJ0Nrj9NJ8j6jJ1Jj6j9K5Mj4jJL5j1k4j0K4lL
8105akJ0Jk1J4JLj0J4Qpj3MJ4qkprqKRJ0Oj7mLJ3nMJ1k0J3qj%%MJ3j0j3%J1ko
8149fj2Qmj1JL3Mj6NPmj0%PJ3l1J4%lJ4j6J1Rok2J7J3j4j6K3rj8J1J7jnk3J9J
8188@Oj4j5
8191b3
$$ Imaginary data points
##PAGE= N=2
##DATA TABLE= (X++(I..I)), XYDATA
$$ plain form
0 0 0 0 0 0 0 0 0 0 0 0 0 0 0 0 0 16 -9 16 -16 16 -16 16 -24 25 -32 32 -34 41 -48 52 -57 64 -72 73 -88 89
36 89 -104 110 -122 131 -144 159 -168 184 -202 220 -238 261 -285 313 -345 382 -424 474 -533 607
56 607 -696 803 -947 1130 -1380 1715 -2200 2917 -4043 5954 -9549 17503 -41250 231040
70 231040 942210 -108595 383593 621476 -97550 525608 -105934 -705724 161495 -231106
80 -231106 -469935 -21073 -329946 17987 336764 -10064 197381 352028 224907 129927
90 129927 -26720 -131651 -349756 -165478 -7144 -345891 -3197 285138 111977 301700
100 301700 -72271 -147775 384858 -157085 -340579 67888 -130545 118708 30042 -349566
110 -349566 245786 244093 -76048 108778 -71785 149480 151299 -407567 -69983 -2288 -215327
$$ packed form
0@%%%%%%%%%%%%%%%J6k5K5l2L2l2L2m0M9n7O4o6P5q9J00j09J21j36J45j61J77
36H9j93K14k32K53k75L03l27L52l86M22m58M99n46N98o58P27q06Q98j007J140
56F07j303J499j750K077k510L095l915N117o960R997j5503K7052n8753K72290
70B31040P11170j050805M92188K37883p19026O23158o31542n99790Q67219l92601
80b31106k38829M48862l08873L47933L18777l46828K07445J54647j27121r4980
90A29927j56647j04931k18105J84278J58334l38747L42694K88335j73161J89723
100C01700l73971p5504N32633n41943j83494M08467j98433K49253q8666l79608
110c49566N95352j693l20141J84826j80563K21265J819n58866L37584O7695k13039
$$ plain form
121 -215327 148596 -61504 36823 375944 -75308 87819 107709 -362797 101240 61895
131 61895 -294345 120300 -17643 -29987 266484 -161133 -104076 222854 -1592 -49810 -117192
142 -117192 -78082 157586 -47926 -170729 29953 201891 174085 -82335 43934 149598
152 149598 -134140 -79342 -191128 -279190 125528 -57207 -115208 299590 77274 130004 299283
163 299283 -89480 48349 43755 -277268 -12804 -168111 -357587 71596 22384 -57900 136754
174 136754 124872 295811 224508 -71323 30507 10468 -135138 -220844 -295006 -39793 51371
185 51371 -71930 71711 132222 213033 211869 -67330 39092 95010 -183076 -122392 -120917
196 -120917 -169706 6043 -49506 21720 174193 42106 141355 184903 -19739 -17335 -64516
$$ packed form
121b15327L63923k10100R8327L39121m51252J63127J9890m70506M64037l9345
131F1895l56240M14645j37943j2344K96471m27617N7057L26930k24446m8218o7382
142a17192L9110K35668k05512j22803K00682J71938k7806k56420J26269J05664
152A49598k83738N4798j11786q8062M04718j82735n8001M14798k22316N2730J69279
163B99283l88763J37829m594l21023K64464j55307j89476M29183m9212q0284J94654
174A36754j1882J70939p1303k95831J01830k0039j45606q5706p4162K55213R1164
185E1371j23301J43641O0511Q0811j164k79199J06422N5918k78086O0684J475
196a20917m8789J75749n5549P1226J52473j32087R9249M3548k04642K404m7181
$$ plain form
207 -64516 -91267 -47201 -186723 -107903 58298 35396 56219 5746 87111 225241 -17692
218 -17692 -103485 34408 -24994 -51390 -114680 -100788 106044 25616 -57801 68788 36409
229 36409 41283 31015 -70364 16687 14357 -72134 -6462 -7069 -5051 21233 10079 81511 23027
242 23027 -59697 34717 1406 -82606 -78291 -50024 74803 46398 -55839 81431 115670 7905
254 7905 -27496 -72084 1898 36496 -106423 -65160 44743 17002 -2142 -27346 31442 108647
266 108647 10261 -18812 41325 -7472 -60173 -74483 -44075 -595 -18600 32799 102010 61097
278 61097 21204 -4661 -13081 -23504 -103758 -84717 18163 15178 -13134 -3891 54319 107796
290 107796 23276 -14557 78599 63318 -38486 -96912 -90362 -48042 -89433 -107621 16007 94856
$$ packed form
207f4516k6751M4066j39522P8820J66201k2902K0823n0473Q1365J38130k42933
218a7692q5793J37893n9402k6396o3290J3892K06832q0428q3417J26589l2379
229C6409M874j0268j01379Q7051k330q6491O5672o07K018K6284j1154P1432n8484
242B3027q2724R4414l3311q4012M315K8267J24827k8405j02237J37270L4239j07765
254G905l5401m4588P3982L4598j42919M1263J09903k7741j9144k5204N8788P7205
266A08647r8386k9073O0137m8797n2701j4310L0408M3480j8005N1399O9211m0913
278F1097l9893k5865q420j0423q0254J9041J02880k985k8312R243N8210N3477
290A07796q4520l7833R3156j5281j01804n8426O550M2320m1391j8188J23628P8849
$$ plain form
302 94856 88411 84762 82546 86937 26103 -62199 -47764 -28912 -65283 -71334 -39186 369 -13253
315 -13253 -40922 28350 86461 47105 26523 55777 58546 -13341 -90494 -59000 -2083 -25135
327 -25135 -38979 17033 71357 41790 -34601 -33758 13687 -7645 -47889 -14484 51046 49607 -7363
340 -7363 -9404 32575 15512 -30849 -16775 29750 17131 -42647 -49560 -12819 -20966 -47494 -10969
353 -10969 64093 80178 31988 21032 47877 12695 -61730 -69384 -15658 1883 -34667 -30405
365 -30405 29564 36524 -19372 -29721 23826 47888 9855 -5765 34938 38712 -26508 -59154
377 -59154 -15802 15257 -12834 -21657 26684 41886 -16697 -54941 -19599 9850 -15878 -17552
389 -17552 43436 75817 34036 -7327 4732 17261 -26970 -63819 -23614 17733 -11119 -47221
$$ packed form
302I4856o445l649k216M391o0834q8302J4435J8852l6371o051L2148L9555j3622
315a3253k7669O9272N8111l9356k0582K9254K769p1887p7153L1494N6917k3052
327b5135j3844N6012N4324k9567p6391Q43M7445k1332m0244L3405O5530j439n6970
340g363k041M1979j7063m6361J4074M6525j2619n9778o913L6741q147k6528L6525
353a0969P5062J6085m8190j0956K6845l5182p4425p654N3726J7541l6550M262
365c0405N9969O960n5896j0349N3547K4062l8033j5620M0703L774o5220l2646
377e9154M3352L1059k8091q823M8341J5202n8583l8244L5342K9449k5728j674
389a7552O0988L2381m1781m1363J2059J2529m4231l6849M0205M1347k8852l6102
$$ plain form
401 -47221 -19682 26027 7569 -21069 31046 82101 46234 -3726 -3044 10120 -27063 -75889
413 -75889 -43342 11907 2794 -14170 7334 40242 30116 -23024 -17023 32122 15265 -21216
425 -21216 -8813 23843 17634 -39545 -36784 28717 18505 -21485 -469 31064 19594 -35775
437 -35775 -43576 13856 10488 -21561 450 32221 44262 5547 -29542 13044 16698 -36796 -38021
450 -38021 -3048 22946 -5959 -37087 22533 38605 -16557 -4360 27813 31284 3398 -35782
462 -35782 829 12095 -43475 -27543 5373 14339 14572 -22890 11013 54054 -7926 -23813 8110
475 8110 15334 6009 -46810 -16870 51231 -11705 -36374 13442 18097 13577 -23339 -15329 42927
488 42927 -4018 -26603 10784 408 13408 -11443 -33987 30697 5440 -30478 16568 16151
$$ packed form
401d7221K7539M5709j8458k8638N2115N1055l5867m9960O82J3164l7183m8826
413g5889L2547N5249r113j6964K1504L2908j0126n3140O001M9145j6857l6481
425b1216J2403L2656o209n7179K761O5501j0212l9990K1016L1533j1470n5369
437c5775p801N7432l368l2049K2011L1771J2041l8715l5089M2586L654n3494j225
450c8021L4973K5994k8905l1128N9620J6072n5162J2197L2173L471k7886l9180
462c5782L6611J1266n5570J5932L2916Q966K33l7462L3903M3041o1980j5887L1923
475H110P224r325n2819K9940O8101o2936k4669M9816M655m520l6916Q010N8256
488D2927m6945k2585L7387j0376J3000k4851k2544O4684k5257l5918M7046m17
$$ plain form
500 16151 15739 -11400 -33246 42056 10378 -49297 18258 24356 -1889 -22724 -45630 27114 14151
513 14151 -49667 15149 30539 24883 25927 -34586 21279 43274 -50680 -22258 -529 -7059 13653
526 13653 -49638 -6462 50677 -42377 -6492 47224 2872 26701 4752 1699 32222 -49807
538 -49807 -33066 22884 -22041 -5501 -6785 4731 53400 -24984 -37551 21868 4384 9498
550 9498 -31193 -7825 89315 -14746 -54601 29925 -6573 9958 -5434 -41834 62797 4024
562 4024 -65666 17877 -31700 -15841 37143 -32100 43424 57412 -29686 34279 7898 -38445
574 -38445 -1786 -36423 14017 14866 -66369 23387 33761 -35575 -10144 -14886 50037 55058 -47706
587 -47706 27011 48115 -24862 -9494 -60781 -15939 58777 -47162 -23123 36584 -4053 15953
$$ packed form
500A6151m12k7139k1846P5302l1678n9675O7555O098k6245k0835k2906P2744j2963
513A4151o3818O4816J5390n656J044o0513N5865K1995r3954K8422K1729o530K0712
526A3653o3291M3176N7139r3054L5885N3716m4352K3829k1949l053L0523q2029
538d9807J6741N5950m4925J6540j284J1516M8669p8384j2567N9419j7484N114
550I498m0691K3368R7140j04061l9855Q4526l6498J6531j5392l6400J04631n8773
562D024o9690Q3543m9577J5859N2984o9243P5524J3988q7098O3965k6381m6343
574c8445L6659l4637N0440Q49q1235Q9756J0374o9336K5431m742O4923N021j02764
587d7706P4717K1104p2977J5368n1287M4842P4716j05939K4039N9707m0637K0006
$$ plain form
599 15953 -39398 -25487 67589 -9810 6403 58753 -7940 18622 -15656 -46292 12483 -62708
611 -62708 -17402 60913 -46377 -422 21960 -31967 59163 -12549 -37038 109216 23548 -23752
623 -23752 7485 -56373 20373 -15962 -120224 27331 56539 -17361 11408 -1979 31557 27820
635 27820 -39799 4942 16860 15808 18993 -38814 4030 -222 -47652 20209 -13964 -9153 55324
648 55324 -25999 19334 22164 -95336 34410 44119 -70326 35373 29050 15219 57831 -75480
660 -75480 -23965 67848 -54036 -31201 1945 -10118 55755 -30296 -55090 48222 18762 7693
672 7693 3048 1125 65010 -9643 -50230 5004 -39136 -14864 3038 -29576 36076 6878 -6993
685 -6993 58252 -25233 -24214 41441 -7547 12921 -8278 -36481 44648 -5465 -52894 -8805
$$ packed form
599A5953n5351J3911R3076p7399J6213N2350o6693K6562l4278l0636N8775p5191
611f2708M5306P8315j07290M5955K2382n3927R1130p1712k4489J46254q5668m7300
623b3752L1237o3858P6746l6335j04262J47555K9208p3900K8769j3387L3536l737
635B7820o7619M4741J1918j052L185n7807M2844m252m7430O7861l4173M811O4477
648E5324q1323M5333K830j17500J29746R709j14445J05699o323j3831M2612j33311
660g5480N1515R1813j21884K2835L3146j2063O5873q6051k4794J03312k9460j1069
672G693m645j923O3885p4653m0587N5234m4140K4272J7902l2614O5652k9198j3871
685f993O5245q3485J019O5655m8988K0468k1199k8203Q1129n0113m7429M4089
$$ plain form
697 -8805 -4298 46265 -1283 -59647 53821 35472 -31889 -7068 -25557 43125 36171 -64332
709 -64332 27183 30742 -38005 18941 -39815 -32929 52310 -32919 -10496 44773 -22104 19404
721 19404 23416 -20340 17243 -13339 -2085 34939 -37734 -31048 18732 8400 -10216 -36630
733 -36630 19146 54865 -12078 -10983 -1444 8386 31836 -52728 -38157 50097 -3974 -10226 2104
746 2104 -12826 54038 2623 -49705 36000 2602 -27495 11599 -25447 -1897 11066 -21725
758 -21725 26170 5864 -19503 33334 10715 -4857 -5325 -22812 24047 975 -45383 610
770 610 12378 18879 2783 -37930 34510 44484 -37912 -19688 2174 8317 6983 -41226 2710
783 2710 42215 -8817 572 5425 -2255 21998 -14052 -16715 12734 -16115 -7789 213 -11786
$$ packed form
697h805M507N0563m7548n8364J13468j8349o7361K4821j8489O8682o954j00503
709f4332R1515L559o8747N6946n8756O886Q5239q5229K2423N5269o6877M1508
721A9404M012m3756L7583l0582J1254L7024p2673O686M9780j0332j8616k6414
733c6630N5776L5719o6943J095R539R830K3450q4564J4571Q8254n4071o252J2330
746B104j4930O6864n1415n2328Q5705l3398l0097L9094l7046K3550J2963l2791
758b1725M7895k0306k5367N2837k2619j5572m68j7487M6859k3072m6358M5993
770F10J1768O501j6096m0713P2440R974q2396J8224K1862O143j334m8209M3936
783B710L9505n1032R389M853p680K4253l6050k663K9449k8849Q326Q002j1999
$$ plain form
796 -11786 6230 -8772 12202 42228 -11975 -6403 29376 115 -18376 -36972 -12311 33011
808 33011 -15182 -26554 20366 18236 12483 -16855 -21311 38568 18399 -21220 -320 3749 9753
821 9753 -13349 -39212 10103 13415 -13117 11966 6899 945 2078 -16081 6556 3523 -15149
834 -15149 25157 25313 -4060 -6007 -12439 4579 -4115 -40449 -8006 23411 8777 -9455 -18359
847 -18359 21098 32736 -19734 -10717 29209 25180 1711 -27589 -11551 8962 -28438 -30238 2000
860 2000 10876 19329 7365 2186 16463 -4302 -12276 5115 2484 2197 784 5907 10705 -22263
874 -22263 -23629 11752 5948 -9149 -7319 10995 26412 -14703 -35084 8248 18071 1934 -514
887 -514 9394 36000 14522 -33907 -19867 1322 -12176 -21529 -13395 13703 18474 -6229 -904
$$ packed form
796a1786J8016j5002K0974L0026n4203N572L5779k9261j8491j8596K4661M5322
808C3011m8193j1372M6920k130n753k9338m456N9879k0169l9619K0900M069O004
821I753k3102k5863M9315L312k6532K5083n067n954J133j8159K2637l033j8672
834a5149M0306J56k9373j947o432J7018q694l6334L2443L1417j4634j8232q904
847a8359L9457J1638n2470R017L9926m029k3469k9300J6038K0513l7400j800L2238
860B000Q876Q453j1964n179J4277k0765p974J7391k631k87j413N123M798l2968
874b2263j366L5381n804j5097J830J8314J5417m1115k0381M3332R823j6137k448
887e14R908K6606k1478m8429J4040K1189j3498r353Q134K7098M771k4703N325
$$ plain form
900 -904 17162 11865 3076 6549 16711 4384 -16811 -10744 -10252 -24254 -23995 -8485 18659 19635
914 19635 -2014 15694 31662 3098 -17839 -11704 9178 12227 -19016 -17867 13761 3450 -23578
927 -23578 -18594 7600 20625 3270 -4181 15812 16764 -7864 -18512 -1972 9407 -3278 -3538
940 -3538 12783 9026 -7840 -15816 -7652 1334 -11424 -10055 18461 18244 -3743 -4441 7600 11442
954 11442 -4340 -14299 9057 19301 -7849 -21433 -4541 5983 -9222 -19478 3065 23780
966 23780 10213 -6906 2762 14291 -2284 -17917 -3172 10703 3548 -5725 -2238 8790 824
979 824 -17392 -5833 11286 498 -9194 893 12707 4213 -13791 -3256 17404 6102 -10012
992 -10012 839 14719 2380 -19639 -14083 4228 -194 -11852 -3991 16215 17742 -3151 -4490
$$ packed form
900i04J8066n297q789L473J0162j2327k1195O067M92j4002K59J5510K7144R76
914A9635k1649J7708J5968k8564k0937O135K0882L049l1243J149L1628j0311k7028
927b3578M984K6194J3025j7355p451J9993R52k4628j0648J6540J1379j2685k60
940c538J6321l757j6866p976Q164Q986j2758J369K8516k17k1987o98J2041L842
954A1442j5782r959K3356J0244k7150j3584J6892J0524j5205j0256K2543K0715
966B3780j3567j7119R668J1529j6575j5633J4745J3875p155r273L487J1028p966
979H24j8216J1559J7119j0788r692J0087J1814q494j8004J0535K0660j1302j6114
992a0012J0851J3880j2339k2019N556J8311m422j1658P861K0206J527k0893j339
$$ plain form
1005 -4490 12761 7988 -9805 -12092 2265 6169 -14913 -16724 8070 7541 -7366 -416 15189
1018 15189 16036 -1761 -7178 7966 3589 -14384 -14511 -1503 6377 -5751 -11532 10259 17280 675
1032 675 -5046 5848 14584 -4272 -21214 509 8879 -10650 -11396 2731 11870 2191 -10772 7394
1046 7394 17102 -1285 -5134 940 4476 -1882 -18965 -7685 10325 -1681 -8036 2769 15001
1059 15001 9416 -13040 -1969 16967 -2697 -12203 110 8689 4731 -15392 -7702 12287 -4513
1072 -4513 -10728 1369 6256 12142 -4096 -9866 13720 3972 -12067 -1816 6743 12554 -3920
1085 -3920 -13724 11377 1779 -21608 -7109 4817 7031 -1090 -5215 16307 8934 -11866 -1722
1098 -1722 3323 6966 2301 -11618 7541 9352 -16063 -12428 -3158 6307 3645 -13136 12512 22059
$$ packed form
1005d490J7251m773j7793k287J4357L904k1082j811K4794n29j4907O950J5605
1018A5189Q47j7797n417J5144m377j7973j27J3008P880j2128n781K1791P021j6605
1032F75n721J0894Q736j8856j6942K1723Q370j9529p46J4127R139r679j2963J8166
1046G394R708j8387l849O074L536o358j7083J1280J8010j2006o355J0805J2232
1059A5001n585k2456J1071J8936j9664r506J2313Q579l958k0123P690J9989j6800
1072d513o215J2097M887N886j6238n770K3586r748j6039J0251Q559N811j6474
1085c920r804K5101r598k3387J4499J1926K214q121m125K1522p373k0800J0144
1098a722N045L643m665j3919J9159J811k5415L635R270R465k662j6781K5648R547
$$ plain form
1112 22059 -11344 -7909 3102 2019 1898 -11409 7062 19604 -9584 -6464 335 -7226 767
1125 767 -12405 -4221 20792 -1820 -7149 6314 2016 5014 -9393 -2520 27048 551 -13736
1138 -13736 5743 -3130 -10074 -18938 -13454 16844 3691 -5387 15095 9964 8163 -2248 -12201
1151 -12201 13900 5979 -12841 -683 -3932 -1876 -11914 -25066 10999 10738 -9577 17624 17264
1164 17264 6967 3605 -14532 5455 3210 -23890 4288 8427 -6997 1489 -14316 -2025 13852
1177 13852 -14673 -1709 19273 9775 5412 -11959 -428 15336 -17446 -12429 12344 6499 3122
1190 3122 -11187 -3852 9515 -17510 -9430 8292 105 14433 3211 -3009 18560 -7913 -12561
1203 -12561 9006 -4979 2285 -2410 -10797 16196 -10134 -25434 14022 6159 -2070 5448 2194
$$ packed form
1112B2059l3403L435J1011j083j21j3307J8471J2542k9188L120O799p561P993
1125G67j3172Q184K5013k2612n329J3463m298K998j4407O873K9568k6497j4287
1138a3736J9479q873o944q864N484L0298j3153r078K0482n131j801j0411r953
1151a2201K6101p921j8820J2158l249K056j0038j3152L6065k61k0315K7201l60
1164A7264j0297l362j8137J9987k245k7100K8178M139j5424Q486j5805J2291J5877
1177A3852k8525J2964K0982r498m363j7371J1531J5764l2782N017K4773n845l377
1190C122j4309P335J3367k7025Q080J7722q187J4328j1222o220K1569k6473m648
1203a2561K1567j3985P264m695q387K6993k6330j5300L9456p863q229P518l254
$$ plain form
1216 2194 21598 1217 -23840 4855 2198 -6447 -999 -9670 13779 11847 -18700 -1848 4145
1229 4145 -322 2140 -11681 10734 16310 -15663 598 7487 -6757 1866 -3474 6714 9542
1242 9542 -15627 1601 5181 -15438 -3616 -4895 5522 17411 -9319 4064 18925 -2081
1254 -2081 -1834 -13101 -3124 19343 -19977 -17649 16770 -2953 -4633 -3616 -3077 24476 2418 -9501
1268 -9501 17490 -336 -6377 -1616 -16066 2005 1304 -11815 7916 5233 -571 2555 -1254 11266
1282 11266 -2291 -13659 12524 3603 -11027 -4560 -2910 13431 -1492 -18207 15618 10645 -8003
1295 -8003 1101 -8885 6452 10526 -21870 -1794 13096 -3732 1673 -5810 3348 16357 -12790
1308 -12790 -5293 11123 -7120 -1969 -226 202 8261 -9013 1301 12708 -10879 -3523 2942
$$ packed form
1216B194J9404k0381k5057K8695k657q645N448q671K3449j932l0547J6852N993
1229D145m467K462j3821K2415N576l1973J6261O889j4244Q623n340J0188K828
1242I542k5169J7228L580k0619J1822j279J0417J1889k6730J3383J4861k1006
1254b081K47j1267R977K2467l9320K328L4419j9723j680J017N39K7553k2058j1919
1268i501K6991j7826o041M761j4450J8071p01j3119J9731k683n804L126l809J2520
1282A1266j3557j1368K6183q921j4630O467J650J6341j4923j6715L3825m973j8648
1295h003R104r986J5337M074l2396K0076J4890j6828N405p483R158J3009k9147
1308a2790P497J6416j8243N151J743M28Q059j7274J0314J1407k3587P356O465
$$ plain form
1321 2942 -2259 6530 -10986 -5970 17946 -1654 -6756 2067 3409 14721 -7566 -15985 14613
1334 14613 3207 -14270 -7517 -2402 10011 -1363 -8744 14095 8202 -66 2665 -6993 2739
1347 2739 -1188 -13078 5268 499 -6194 5192 -2778 4502 2866 -12214 13511 12431 -13800
1360 -13800 -1189 2982 -77 -3923 -17215 7326 18855 -5879 -1282 4505 3231 3265 -17448 -8626
1374 -8626 11904 -1685 -4149 -189 4021 12046 -6143 -4935 13270 -879 -3023 3061 -4609 -2366
1388 -2366 -10029 -8411 6506 -5139 -3007 14224 10295 6071 -3259 -3271 9940 -5366 -14830 -1580
1402 -1580 4070 6265 -9308 -13529 12546 5080 -11090 1089 7419 13573 3820 -12437 5436
1415 5436 4427 -12502 -1774 -450 1404 7145 -6320 -1506 2324 -11016 -2115 4566 2040 5606
$$ packed form
1321B942n201Q789j7516N016K3916j9600n102Q823J342J1312k2287q419L0598
1334A4613j1406j7477O753N115J2413j1374p381K2839n893q268K731r658R732
1347B739l927j1890J8346m769o693J1386p970P280j636j5080K5725j080k6231
1360a3800J2611M171l059l846j3292K4541J1529k4734M597N787j274L4k0713Q822
1374h626K0530j3589k464L960M210Q025j8189J208J8205j4149k144O084p670K243
1388b366p663J618J4917j1645K132J7231l929m224r330j2J3211j5306r464J3250
1402a580N650K195j5573m221K6075p466j6170J2179O330O154r753j6257J7873
1415E436j009j6929J0728J324J854N741j3465M814L830j3340Q901O681k526L566
$$ plain form
1429 5606 1666 8995 9163 -11795 -7046 5742 117 -6135 -9353 4327 10550 -11060 -10907 5385
1443 5385 7461 5418 -3042 2941 16476 73 -12908 -5859 -1493 513 -6337 -3848 10952 3934
1457 3934 -3632 1127 -1036 -269 -2427 -950 8802 -1191 -5338 6265 141 -4928 -3860 -1253 11901
1472 11901 2661 -11735 2323 4840 -6713 -9838 -6804 10320 12594 -4930 1175 12635 4116
1485 4116 -7120 -10177 43 4132 -6823 -6320 1357 2287 -1347 -4874 3681 8627 1393 4868 7315
1500 7315 -247 -3883 -7419 -3538 -135 -9671 -3031 10714 3730 -3750 -1872 4512 7130 -5442
1514 -5442 -7140 8022 7845 -4043 -7919 106 6870 -3377 -9246 2070 7579 1656 -5688 -2845
1528 -2845 6045 -746 -6964 2466 5162 2116 883 -630 3118 -1087 -8623 -379 3462 -3686 -3048
$$ packed form
1429E606l940P329J68k0958M749J2788n625o252l218J3680O223k1610J53J6292
1443E385K076k043q460N983J3535j6403j2981P049M366K006o850K489J4800p018
1457C934p566M759k163P67k158J477R752r993m147J1603o124n069J068K607J3154
1472A1901r240j4396J4058K517j1553l125L034J7124K274j7524O105J1460q519
1485D116j1236l057J0220M089j0955N03P677R30l634l527Q555M946p234L475K447
1500G315p562l636l536L881L403r536O640J3745o984p480J878O384K618j2572
1514e442j698J5162j77j1888l876Q025O764j0247n869J1316N509n923p344K843
1528b845Q890o791o218R430K696l046j233j513L748m205p536Q244L841p148O38
$$ plain form
1543 -3048 2886 6321 772 -6555 1425 8177 -1050 -7326 -282 6982 -30 -9205 -2235 6332 2815
1558 2815 -3624 -2433 7139 6054 -6869 -5122 3426 328 -4431 -4032 2867 6450 -2142 -2034 6943
1573 6943 2594 -4587 -2237 1821 300 -5874 -3920 4353 2705 -3446 -1376 6024 6134 -3343 -4151
1588 -4151 4394 3144 -5417 -7684 368 5960 -3399 -6112 6307 7781 -670 -2551 1455 4186 -2800
1603 -2800 -8450 -658 2940 -2446 -2523 2573 6088 1967 -3243 1594 4769 -1404 -5759 -1320 4145
1618 4145 -2582 -8886 520 5973 -304 -2234 3228 8752 2981 -6724 -1172 3542 -3693 -6125 -2316
1633 -2316 3456 4086 -3982 -2341 5515 1382 -4434 -1719 4951 4760 -3790 -2158 5268 236 -5841
1648 -5841 -2404 4060 3080 -4766 -1907 4640 -1186 -5525 -2968 2077 5968 -164 -892 8057 4511
$$ packed form
1543c048N934L435n549p327P980O752r227o276P044P264p012r175O970Q567l517
1558B815o439J191R572j085j2923J747Q548l098m759L99O899L583q592J08Q977
1573F943m349p181K350M058j521o174J954Q273j648o151K070P400J10r477q08
1588d151Q545j250q561k267Q052N592r359k713J2419J474q451j881M006K731o986
1603b800n650P792L598n386p7N096L515m121n210M837L175o173m355M439N465
1618D145o727o304R406N453o277j930N462N524n771r705N552M714p235k432L809
1633b316N772O30q068J641P856m133n816K715O670j91q550J632P426n032o077
1648e841L437O464r80p846K859O547n826m339K557N045L891o132p28Q949l546
$$ plain form
1663 4511 -4480 -5861 -1825 2477 -4356 -6777 5521 5290 -4067 -2937 2131 4671 -264 -2612 6076
1678 6076 4840 -3742 -4170 -2636 1 -1924 -5248 3811 7582 212 -2276 -818 2311 -1907 -8785
1693 -8785 1727 8501 -472 -1892 2516 4002 -631 -7329 326 5725 -2367 -3441 -1342 -105 121
1708 121 -6414 -1353 8583 4035 1586 3345 4257 2745 -8716 -8103 2791 -3416 -6717 1374 4468
1723 4468 3885 -2680 -1816 7802 2207 -2703 2937 2903 1384 -4634 -8230 391 91 -4954 -537 4484
1739 4484 7426 199 -5405 4564 2377 -7089 -2011 3080 4672 294 -4508 4075 1992 -7264 -1480
1754 -1480 1009 1640 2184 -4823 876 4720 -4951 -2568 3038 4435 3988 -3724 1225 6444 -6432
1769 -6432 -7717 289 880 -157 -3421 2594 8384 -1796 -3405 1790 753 1349 -3240 -1737 6117
$$ packed form
1663D511q991j381M036M302o833k421J2298k31r357J130N068K540m935k348Q688
1678F076j236q582m28J534K637j925l324R059L771p370k488J458L129m218o878
1693h785J0512O774q973j420M408J486m633o698P655N399q092j074K099J237K26
1708A21o535N061R936m548k449J759R12j512j1461O13J0894o207l301Q091L094
1723D468n83o565Q64R618n595m910N640l4j519o018l596Q621l00n045M417N021
1739D484K942p227n604R969k187r466N078N091J592m378m802Q583k083r256N784
1754a480K489O31N44p007N699L844r671K383N606J397m47p712M949N219j2876
1769f432j285Q006N91j037l264O015N790j0180j609N195j037N96m589J503P854
$$ plain form
1784 6117 -1163 -5116 -361 635 2817 -2703 -2526 8360 550 -6448 985 550 -670 -3021 -2323 8260
1800 8260 2795 -4051 3815 1257 -2276 -3076 -6272 2766 2949 -5572 569 3450 2141 503 -3868
1815 -3868 5753 7290 -5872 -2345 2307 -2181 -4365 -6394 1631 5082 -3238 1839 5903 1789 1660
1830 1660 -3154 -750 3328 -5304 -3658 1519 -360 411 -3728 1254 8819 -2698 -2695 5941 397 -2161
1846 -2161 -4690 -2319 5783 -3949 -5660 5695 2082 738 665 -1757 5996 651 -7514 570 1100
1861 1100 -1315 -1783 -3147 5208 2854 -5131 2664 3957 -1036 -1929 -2557 3324 219 -6088 2987 3347
1877 3347 -1824 -113 -1968 3277 3058 -6427 242 3600 -2057 -1608 -4091 2524 7007 -5071 -730
1892 -730 7692 263 -2325 -3765 -1057 3054 -5678 -2774 5526 375 524 50 -640 4430 -1975 -2708
$$ packed form
1784F117p280l953M755R96K182n520J77J0886p810o998P433m35j220k351O98J0583
1800H260n465o846P866k558l533q00l196R038J83q521O141K881j309j638m371
1815c868R621J537j3162L527M652m488k184k029Q025L451q320N077M064m114j29
1830A660m814K404M078q632J646N177j879P71m139M982P565j1517LQ636n544k558
1846b161k529K371Q102r732j711J1355l613j344p3k422P753n345q165Q084N30
1861A100k415m68j364Q355k354p985P795J293m993q93o28N881l105o307R075L60
1877C347n171J711j855N245k19r485O669L358n657M49k483O615M483j2078M341
1892g30Q422p429k588j440K708M111q732K904Q300n151J49m74o90N070o405p33
$$ plain form
1908 -2708 4538 -73 -1969 -2422 -2278 3852 -2967 -4230 7596 3332 -2203 -550 -665 2968 -3552
1923 -3552 -7506 4214 3472 -1501 997 356 4478 1257 -6752 659 2735 -2070 -1667 -2886 1945
1938 1945 1490 -5969 1934 5668 251 2334 1735 2347 415 -7865 -1838 1402 -5648 -1511 1808 3294
1954 3294 4477 -3273 396 6427 -1370 -2556 -320 1681 3488 -6081 -5374 4215 -804 -3202 363
1969 363 2899 6025 -1310 -3389 3467 -1609 -3520 18 -427 3630 1063 -2053 3886 -330 -4590
1984 -4590 -672 -504 1402 -1050 -3281 5060 2327 -5120 -471 3096 3869 -34 -3457 4201 2849
1999 2849 -6025 -4693 -1842 1724 1165 -3784 3335 6749 -464 -1262 -1250 576 1800 -4336 -223 4369
2015 4369 -2343 -1589 411 -1064 506 -1881 1273 5337 -1978 -2369 1978 -315 -1656 -3310 659
$$ packed form
1908b708P246m611j896m53J44O130o819j263J1826m264n535J653j15L633o520
1923c552l954J1720p42m973K498o41M122l221q009P411K076m805M03j219M831
1938A945m55p459P903L734n417K083n99O12j932q280O027L240p050M137L319J486
1954C294J183p750L669O031p797j186K236K001J807r569P07R589n019k398L565
1969C63K536L126p335k079O856n076j911L538m45M057k567l116N939m216m260
1984d590L918J68J906k452k231Q341k733p447M649L567P73l903l423P658j352
1999B849q874J332K851L566n59m949P119L414p213p98J2J826J224o136M113M592
2015D369o712P54K000j475J570k387L154M064p315l91M347k293j341j654L969
$$ plain form
2030 659 6791 603 -3083 1282 1893 -809 -6168 -3741 4924 1326 -3225 531 3099 3439 -1745 -3049
2046 -3049 4319 2161 -2623 -533 -1007 -619 -2085 -4312 1536 2131 -897 3171 3574 1182 -868 -2681
2062 -2681 1473 142 -5359 -548 3324 851 -1909 -2565 3339 3793 -3625 -1744 3227 2266 -1309 -4799
2078 -4799 -126 3906 -2129 -2684 2517 3507 1613 -2364 -1134 2235 -2086 -3463 305 800 168 -800
2094 -800 877 3204 -450 -1174 2252 1267 -1389 -3073 -442 2835 -2214 -3941 2073 3153 221 -2010
2110 -2010 197 5055 540 -4875 -511 1948 -371 -2679 -2086 3140 2749 -2298 -343 2663 1010
2125 1010 -1630 -2152 1041 836 -2590 -472 2080 458 -1219 -466 2635 1259 -2860 -236 2348 -431
2141 -431 -2616 -1822 2141 2476 -2750 -1460 3483 2127 -1642 -2505 1084 2543 -2848 -3561 1972 2726
$$ packed form
2030F59O132o188l686M365O11k702n359K427Q665l598m551L756K568L40n184j304
2046c049P368k158m784K090m74L88j466k227N848N95l028M068M03k392k050j813
2062b681M154j331n501M811L872k473k760o56N904M54p418J881M971r61l575l490
2078d799M673M032o035n55N201R90j894l977J230L369m321j377L768M95o32r68
2094h00J677K327l654p24L426r85k656j684K631L277n049j727O014J080k932k231
2110b010K207M858m515n415M364K459k319k308N93N226l91n047J955L006j653
2125A010k640n22L193k05l426K118K552j622j677P53L101j376m119K624K584k779
2141d31k185P94L963L35n226J290M943j356l769q63L589J459n391p13N533P54
$$ plain form
2157 2726 -241 -1134 1406 2624 -1329 -2662 546 772 -1126 -1796 138 1988 -826 -1522 2295 2521
2173 2521 -170 -1169 881 2470 -2107 -4683 197 1547 -1841 -2055 1699 4493 1018 -2519 738
2188 738 2465 -706 -2759 -1177 1979 519 -3021 -872 2149 763 -1469 -516 2867 1614 -2334
2203 -2334 -337 1825 -1113 -2883 -826 2378 1611 -1364 951 3066 -540 -3158 -1930 977 1141
2218 1141 -2220 -1035 3049 1781 -1866 -1701 2187 2961 -1578 -1658 2493 1207 -2868 -3221 -177 1023
2234 1023 -1619 -590 3358 2550 -144 -1058 -85 939 -1569 -2030 1969 2052 -1178 -2127 -75 1636 -1597
2251 -1597 -2891 2279 3349 -763 -1686 933 2226 -1247 -3106 1236 2783 -81 -1231 -386 1044
2266 1044 -916 -3855 -801 2435 1119 -205 714 2902 1012 -3141 -588 2202 -878 -2236 -136
$$ packed form
2157B726k967q93K540J218l953j333L208K26j898o70J934J850k814o96L817K26
2173B521k691r99K050J589m577k576M880J350l388k14L754K794l475l537L257
2188G38J727l171k053J582L156j460l540K149L021j386k232R53L383j253l948
2203b334J997K162k938j770K057L204p67k975K315K115l606k618J228K907J64
2218A141l361J185M084j268l647J65L888P74m539q0M151j286m075l53L044J200
2234A023k642J029L948q08k694r14R73J024k508m61L999Q3l230r49K052J711l233
2251a597j294N170J070m112r23K619J293l473j859M342J547k864j150Q45J430
2266A044j960k939L054L236j316j324R19K188j890m153K553K790l080j358K100
$$ plain form
2281 -136 1616 -171 -3167 -403 2490 12 -818 1163 2752 1627 -2469 -2121 1056 -398 -2307 -862
2297 -862 2459 2902 -1820 -1970 2222 444 -2434 -931 1730 1920 -1597 -1530 2075 463 -1626 -189
2313 -189 1171 1980 -423 -1925 1093 399 -2659 -2068 452 2513 134 -1525 2884 2681 -2043 -1864
$$ packed form
2281a36J752j787k996K764K893k478q30J981J589j125m096L48L177j454j909J445
2297h62L321M43m722j50M192j778k878J503K661J90l517O7L605j612k089J437
2313a89J360Q09k403j502L018o94l058N91K520K061k379j659M409k03m724J79
$$ [...]
8191A8
##END NTUPLES=NMR FID
##END=
