##TITLE=1H ikalashn
AM_NV 170DTOX
15.11.2024
##JCAMPDX= 6.0         $$ Bruker NMR JCAMP-DX V2.0
##DATA TYPE= NMR FID
##DATA CLASS= NTUPLES
##ORIGIN= UXNMR, Bruker Analytische Messtechnik GmbH
##OWNER= root
$$ TOPSPIN		Version 1.3
$$ 2024-11-15 13:53:48.468 +0400  Irina@DPX200
$$ Compression mode = diff/dup
##.OBSERVE FREQUENCY= 200.131300845
##.OBSERVE NUCLEUS= ^1H
##.DELAY= (6, 6)
##.ACQUISITION MODE= SIMULTANEOUS
##.ACQUISITION SCHEME= undefined
##.AVERAGES= 16
##.DIGITISER RES= 18
##SPECTROMETER/DATA SYSTEM= spect
##.PULSE SEQUENCE= zg
##.SOLVENT NAME= CDCl3
##.SHIFT REFERENCE= INTERNAL, CDCl3, 1, 17.49637
##AUDIT TRAIL= $$ (NUMBER, WHEN, WHO, WHERE, WHAT)
$$ ##TITLE= Audit trail, TOPSPIN		Version 1.3
$$ ##JCAMPDX= 5.01
$$ ##ORIGIN= Bruker BioSpin GmbH
$$ ##OWNER= Irina
$$ $$ F:/spectra/data/iren/nmr/1H/4/audita.txt
$$ ##AUDIT TRAIL=  $$ (NUMBER, WHEN, WHO, WHERE, VERSION, WHAT)
(   1,<2024-11-15 13:53:11.078 +0400>,<Irina>,<DPX200>,<TOPSPIN 1.3>,
      <created by zg
	started at 2024-11-15 13:52:03.187 +0400,
	POWCHK disabled, PULCHK disabled
       configuration hash MD5:
       BE 6D 3F 07 2A EA 11 49 91 17 2B D3 AF B3 58 0D
       data hash MD5: 16K
       CB 65 6D 34 59 C8 99 EF 72 DC 95 B1 82 F0 B1 2A>)
$$ ##END=
$$ 
$$ $$ hash MD5
$$ $$ 84 03 0F 91 49 A1 9F 1D 97 2B 53 1B FB 84 4B 42
##$RELAX= 
##$RELAX= 
##$RELAX= 
##$RELAX= 
##$RELAX= 
##$RELAX= 
##$RELAX= 
##$RELAX= 
##$RELAX= 
$$ Bruker specific parameters
$$ --------------------------
##$DU= <F:/spectra>
##$EXPNO= 4
##$NAME= <1H>
##$PROCNO= 1
##$TYPE= <nmr>
##$USER= <iren>
##$AMP= (0..31)
100 100 100 100 100 100 100 100 100 100 100 100 100 100 100 100 100 100 
100 100 100 100 100 100 100 100 100 100 100 100 100 100 
##$ANAVPT= -1
##$AQSEQ= 0
##$AQ_mod= 1
##$AUNM= <au_zg>
##$AUTOPOS= <>
##$BF1= 200.13
##$BF2= 200.13
##$BF3= 200.13
##$BF4= 200.13
##$BF5= 200.13
##$BF6= 200.13
##$BF7= 200.13
##$BF8= 200.13
##$BYTORDA= 1
##$CFDGTYP= 0
##$CFRGTYP= 5
##$CHEMSTR= <none>
##$CNST= (0..63)
1 1 145 1 1 1 1 1 1 1 1 1 1 1 1 1 1 1 1 1 1 1 1 1 1 1 1 1 1 1 1 1 1 1 
1 1 1 1 1 1 1 1 1 1 1 1 1 1 1 1 1 1 1 1 1 1 1 1 1 1 1 1 1 1 
##$CPDPRG= <>
##$CPDPRG1= <>
##$CPDPRG2= <>
##$CPDPRG3= <>
##$CPDPRG4= <mlev>
##$CPDPRG5= <mlev>
##$CPDPRG6= <mlev>
##$CPDPRG7= <mlev>
##$CPDPRG8= <mlev>
##$CPDPRGB= <>
##$CPDPRGT= <>
##$D= (0..63)
0 2 0 0 0 0 0 0 0 0.06 0 0.03 0 0 0 0 0.0002 0 0 0 0 0 0 0 0 0 0 0 0 0 
0 0 0 0 0 0 0 0 0 0 0 0 0 0 0 0 0 0 0 0 0 0 0 0 0 0 0 0 0 0 0 0 0 0 
##$DATE= 1731664388
##$DBL= (0..7)
120 120 120 120 120 120 120 120 
##$DBP= (0..7)
150 150 150 150 150 150 150 150 
##$DBP07= 0
##$DBPNAM0= <>
##$DBPNAM1= <>
##$DBPNAM2= <>
##$DBPNAM3= <>
##$DBPNAM4= <>
##$DBPNAM5= <>
##$DBPNAM6= <>
##$DBPNAM7= <>
##$DBPOAL= (0..7)
0.5 0.5 0.5 0.5 0.5 0.5 0.5 0.5 
##$DBPOFFS= (0..7)
0 0 0 0 0 0 0 0 
##$DE= 6
##$DECBNUC= <off>
##$DECIM= 32
##$DECNUC= <off>
##$DECSTAT= 4
##$DIGMOD= 1
##$DIGTYP= 9
##$DL= (0..7)
0 120 120 120 120 120 120 120 
##$DP= (0..7)
150 150 150 150 150 150 150 150 
##$DP07= 0
##$DPNAME0= <>
$$ [...]
##$SW= 21.9926040160658
##$SWIBOX= (0..15)
0 0 2 0 0 0 0 0 0 0 0 0 0 0 0 0 
##$SW_h= 4401.40845070422
##$TD= 16384
##$TD0= 1
##$TE= 300
##$TE2= 300
##$TE3= 300
##$TEG= 300
##$TL= (0..7)
0 120 120 120 120 120 120 120 
##$TP= (0..7)
150 150 150 150 150 150 150 150 
##$TP07= 0
##$TPNAME0= <>
##$TPNAME1= <>
##$TPNAME2= <>
##$TPNAME3= <>
##$TPNAME4= <>
##$TPNAME5= <>
##$TPNAME6= <>
##$TPNAME7= <>
##$TPOAL= (0..7)
0.5 0.5 0.5 0.5 0.5 0.5 0.5 0.5 
##$TPOFFS= (0..7)
0 0 0 0 0 0 0 0 
##$TUNHIN= 0
##$TUNHOUT= 0
##$TUNXOUT= 0
##$USERA1= <user>
##$USERA2= <user>
##$USERA3= <user>
##$USERA4= <user>
##$USERA5= <user>
##$V9= 5
##$VALIST= <valist>
##$VCLIST= <CCCCCCCCCCCCCCC>
##$VD= 0
##$VDLIST= <DDDDDDDDDDDDDDD>
##$VPLIST= <PPPPPPPPPPPPPPP>
##$VTLIST= <TTTTTTTTTTTTTTT>
##$WBST= 1024
##$WBSW= 25
##$XGAIN= (0..3)
0 0 0 0 
##$XL= 0
##$YL= 0
##$YMAX_a= 932745
##$YMIN_a= -1786135
##$ZGOPTNS= <>
##$ZL1= 120
##$ZL2= 120
##$ZL3= 120
##$ZL4= 120
##$ABSF1= 10
##$ABSF2= 0
##$ABSG= 5
##$ABSL= 3
##$ALPHA= 0
##$AQORDER= 0
##$ASSFAC= 0
##$ASSFACI= 0
##$ASSFACX= 0
##$ASSWID= 0
##$AUNMP= <proc_1d>
##$AXLEFT= 0
##$AXRIGHT= 0
##$AXTYPE= 0
##$AXUNIT= <>
##$AZFE= 0.1
##$AZFW= 0.1
##$BCFW= 1
##$BC_mod= 2
##$BYTORDP= 1
##$COROFFS= 0
##$CY= 7568.61572265625
##$DATMOD= 1
##$DC= 2
##$DFILT= <>
##$DTYPP= 0
##$F1P= 17.9538593292236
##$F2P= -4.03888763876832
##$FCOR= 0.5
##$FTSIZE= 32768
##$FT_mod= 4
##$GAMMA= 1
##$GB= 1
##$INTBC= 1
##$INTSCL= 1
##$ISEN= 128
##$LB= 0.02
##$LEV0= 0
##$LPBIN= 0
##$MAXI= 945.577
##$MC2= 0
##$MEAN= 0
##$ME_mod= 0
##$MI= -402.1523
##$NCOEF= 0
##$NC_proc= 0
##$NLEV= 6
##$NOISF1= 8.587773
##$NOISF2= 6.764455
##$NSP= 1
##$NTH_PI= 0
##$NZP= 0
##$OFFSET= 17.49637
##$PC= 1
##$PHC0= 208.2421
##$PHC1= 5.932018
##$PH_mod= 0
##$PKNL= yes
##$PPARMOD= 0
##$PPDIAG= 0
##$PPIPTYP= 0
##$PPMPNUM= 100
##$PPRESOL= 1
##$PSCAL= 0
##$PSIGN= 0
##$REVERSE= no
##$SF= 200.13
##$SI= 32768
##$SIGF1= 18.5376
##$SIGF2= -6.396296
##$SINO= 400
##$SIOLD= 32768
##$SREGLST= <1H.CDCl3>
##$SSB= 3
##$STSI= 0
##$STSR= 0
##$SW_p= 4401.40845070422
##$SYMM= 0
##$S_DEV= 0
##$TDeff= 0
##$TDoff= 0
##$TI= <>
##$TILT= no
##$TM1= 0
##$TM2= 0
##$TOPLEV= 0
##$USERP1= <user>
##$USERP2= <user>
##$USERP3= <user>
##$USERP4= <user>
##$USERP5= <user>
##$WDW= 1
##$XDIM= 8192
##$YMAX_p= 0
##$YMIN_p= 0
$$ End of Bruker specific parameters
$$ ---------------------------------
##NTUPLES= NMR FID
##VAR_NAME=  TIME,          FID/REAL,        FID/IMAG
##SYMBOL=    X,             R,               I
##VAR_TYPE=  INDEPENDENT,   DEPENDENT,       DEPENDENT
##VAR_FORM=  AFFN,          ASDF,            ASDF
##VAR_DIM=   8192,          8192,            8192
##UNITS=     SECONDS,       ARBITRARY UNITS, ARBITRARY UNITS
##FACTOR=    0.0002272,     1,               1
##FIRST=     0,             0,               0
##LAST=      1.8609952,     -141,            -279
##MIN=       0,             -1786135,        -1786135
##MAX=       1.8609952,     932745,          932745
$$ Real data points
##PAGE= N=1
##DATA TABLE= (X++(R..R)), XYDATA
0 0 0 0 0 0 0 0 16 0 16 -16 16 -32 32 -33 49 -64 80 -97 113 -144 176 -208 241 -289 337 -396 460 -529 610
29 610 -695 800 -911 1031 -1168 1316 -1481 1665 -1864 2081 -2324 2584 -2869 3184 -3522 3896
45 3896 -4301 4746 -5240 5770 -6352 7002 -7711 8505 -9386 10373 -11493 12765 -14231
58 -14231 15940 -17960 20401 -23404 27213 -32227 39154 -49371 66010 -97783 180426 -857358
70 -857358 -1786135 -62501 342603 -118921 -82192 792197 530184 -509087 -665947 411493
80 411493 932745 557560 245208 407823 228166 -221828 -330504 -27189 81482 -21457
90 -21457 -201835 -454516 -650354 -368037 93364 96626 -249346 -265444 -133317 -378018 -584031
101 -584031 -16480 729794 621585 -31392 -222340 -88031 -264456 -377520 185630 793845
111 793845 591306 2458 -179583 -188278 -397392 -318586 293685 616529 185873 -242905
121 -242905 -166735 -166131 -464556 -344791 270520 392423 -207510 -504801 -108701 138604 -89119
132 -89119 -66759 357332 375783 -151098 -346756 90143 460139 414640 345027 355550 122267
143 122267 -238661 -262856 29080 270138 395067 428566 158501 -337837 -507384 -194455
153 -194455 78203 83295 185255 369891 116935 -458490 -555065 -66570 219069 31641
163 31641 -51395 125902 25102 -378809 -410907 49435 323857 133466 -57472 -13404 -12290
174 -12290 -90865 51713 358632 432946 218613 1658 -116106 -174424 -61668 221954 349373
185 349373 144595 -125003 -248888 -352302 -427466 -217861 182210 287156 1715 -229433
195 -229433 -202146 -164365 -158183 73667 425970 450850 134208 -67435 934 77845 99438
206 99438 232304 354440 183623 -147398 -257160 -136367 -52811 -29265 48638 42033 -196816
217 -196816 -428854 -359522 -113320 31461 84369 141672 84971 -140718 -273133 -104959 179362
228 179362 316364 309968 246294 91912 -112266 -163227 7414 203727 250993 170659 24808
239 24808 -155936 -263801 -186175 -1347 106304 86361 2743 -120799 -242445 -226231 -30558
250 -30558 162583 180547 74722 -34145 -130029 -182089 -81545 145580 276245 183744 -1000
261 -1000 -121035 -166134 -136745 13919 208201 249040 90600 -95455 -173377 -161031 -81759
272 -81759 70667 196894 147948 -46801 -198044 -209000 -135840 -28779 93567 141857 31195
283 31195 -150695 -221227 -133527 8435 119314 173285 130811 -14972 -152683 -147652 -9135
294 -9135 134328 189609 144925 19199 -135178 -216213 -153033 3229 126154 132404 28134
305 28134 -121339 -227073 -216438 -89997 66435 145207 95846 -44367 -176543 -206965 -116570
316 -116570 26254 126088 125512 27839 -105749 -179033 -127421 15405 143262 175655 109573
327 109573 -7184 -107241 -118303 -14877 131560 201568 142389 4668 -125661 -184849 -140550
338 -140550 -13336 104142 109627 -4591 -144659 -212230 -174446 -53373 93756 182149 149721
349 149721 28693 -71511 -68892 28271 155379 244552 243081 137720 -11057 -96680 -61192
360 -61192 50928 144111 154008 74142 -56389 -163325 -169739 -62393 79622 151022 111749
371 111749 5280 -93294 -123025 -56704 76499 189345 196731 94983 -34983 -104869 -80920
382 -80920 15216 127122 179984 123710 -11480 -125506 -136780 -49950 66295 140846 129922
393 129922 30889 -98939 -163920 -111299 12563 109831 119830 46882 -65894 -155264 -155964 -54641
405 -54641 76464 137239 92482 -11534 -104810 -134993 -76672 46075 149235 148947 46037
416 46037 -77287 -140531 -117360 -27411 76905 120629 57207 -73476 -172796 -174760 -91794 18381
428 18381 93711 86662 -4817 -116245 -158872 -99425 16376 112537 134429 70226 -40793 -122282
440 -122282 -113554 -21639 86145 135857 94270 -13217 -115384 -141034 -74071 35597 114755
451 114755 113503 29874 -82915 -142549 -102048 5686 103074 133844 84535 -21000 -119019
462 -119019 -131711 -42476 74293 130116 101321 16418 -85370 -147960 -113025 4823 105180
473 105180 108152 32807 -56622 -119842 -124909 -45819 75283 134543 84140 -14058 -81460 -95521
485 -95521 -53841 40855 128966 121017 15620 -88934 -120990 -90060 -20077 69819 115504 52083
497 52083 -76127 -150040 -122007 -40366 49546 123389 127125 29973 -90097 -119878 -50144 43405
509 43405 112807 138626 86086 -36121 -129161 -112324 -25764 46781 80086 68292 -10742 -118516
521 -118516 -146873 -62278 39578 77715 69068 33534 -44802 -119085 -89703 34436 122410 104751
533 104751 38273 -25772 -89656 -114174 -38036 91313 148299 96379 6680 -65465 -100937 -61623
545 -61623 54007 150974 145492 70585 -7896 -78020 -108895 -35942 97006 138407 51007 -37148
557 -37148 -59375 -80411 -96411 -11317 127809 135387 -2959 -91176 -48824 -225 4597 59968
569 59968 145397 103855 -59265 -144345 -76721 10131 38360 63841 77910 -1609 -127565 -151816
581 -151816 -56845 44485 101831 130280 95289 -15550 -93674 -49824 46739 100461 123306
592 123306 124989 45740 -86956 -127084 -37303 46753 49073 35329 21733 -53721 -137757 -96150
604 -96150 37840 100516 68624 43123 17956 -63900 -105826 2196 138234 125276 25895
615 25895 -14492 -44277 -137471 -158970 -6135 132520 66890 -72619 -95310 -74118 -120455
626 -120455 -113948 40694 160932 80482 -61320 -80150 -35017 -31419 -6969 80933 111107 17952
638 17952 -78938 -86552 -51699 -7224 63965 98398 21031 -82368 -87290 -38077 -20823 22623
650 22623 122290 124465 -41871 -172512 -111209 -6142 -5369 368 85821 78266 -100384 -218848
662 -218848 -119235 19286 30624 22487 76838 57309 -79589 -137157 -25612 80167 69425
673 69425 45249 52200 -3651 -95343 -72349 43628 79653 20930 -8642 -14975 -76239 -109260
685 -109260 -4622 123192 109422 18068 -15025 -30022 -82861 -64120 79516 178367 113360
696 113360 7306 -30120 -66544 -114004 -49352 105836 149650 43820 -33400 -28817 -58746
707 -58746 -99555 -10920 133282 121374 -11916 -51846 3596 -4991 -46274 19973 110336 47047
719 47047 -90197 -98432 -8494 20015 7493 47025 62104 -37324 -133629 -90994 14630 65112
731 65112 89352 112265 52467 -80028 -127101 -40748 45819 71621 105186 121931 21438 -123157
743 -123157 -130713 -19550 40175 32544 58156 73989 -19806 -126592 -88691 25346 50546 11925
755 11925 17220 21790 -42450 -76571 5963 89061 56350 -11096 -20322 -30059 -69748 -37385 79844
768 79844 126797 42692 -42175 -55845 -70475 -86526 -6941 126497 145368 35466 -51531 -64028
780 -64028 -73536 -65887 28638 135549 118040 10296 -51035 -52895 -58012 -37831 44613 99682
792 99682 47362 -32196 -40962 -17944 -17034 6188 63633 62627 -20245 -70116 -28093 23340 32576
805 32576 46676 61595 4473 -95095 -112107 -30996 39780 56645 62271 43447 -42019 -126685
817 -126685 -104140 -4489 62076 76859 78367 42076 -50901 -113433 -68601 19919 56794 51229
829 51229 39883 -3936 -79694 -102612 -38028 28235 29116 3115 -12840 -41322 -70265 -40523
841 -40523 33707 62307 22086 -22213 -40654 -55813 -50148 10539 77146 66508 -7682 -64618
853 -64618 -80451 -76740 -39402 40484 96484 63534 -19340 -70665 -72933 -46905 8225 76466
865 76466 96207 40622 -33435 -65922 -58457 -29122 19094 57808 40424 -22695 -65888 -58974
877 -58974 -29058 4334 41357 54865 14820 -44491 -56176 -12900 36185 62270 66075 38353
889 38353 -22189 -70399 -57459 2600 54615 68072 43569 -9586 -64855 -78668 -36238 27249
901 27249 69516 75074 42822 -16025 -60221 -46670 12915 63549 74078 53659 13592 -36072
913 -36072 -60081 -26444 37842 70130 48162 4169 -29683 -43972 -29763 16342 65248 72651
925 72651 30381 -24389 -52093 -39910 1211 46546 65932 43115 -8779 -56670 -69756 -36881
937 -36881 22849 67453 63721 18266 -31422 -53621 -38416 6488 57587 79108 50382 -7504
949 -7504 -49762 -49664 -15617 26230 50758 41031 -822 -48625 -68486 -45850 3195 45026 51044
962 51044 17817 -29451 -56405 -45496 -4392 42630 66508 47158 -6375 -54995 -61995 -26840
974 -26840 19497 47237 42304 5581 -44751 -74468 -58596 -9015 35796 46578 21451 -21412
986 -21412 -56337 -59367 -24447 26023 55879 44374 1197 -43391 -59029 -34604 12634 49537
998 49537 51366 17883 -29007 -58763 -49822 -6785 39150 55047 32191 -11091 -47855 -56148 -28002
1011 -28002 20626 55133 49918 11030 -32700 -53950 -40026 2566 46627 59125 29919 -17430
1023 -17430 -49702 -49031 -17399 26980 53895 39651 -5764 -46212 -54520 -31243 8020 43399
1035 43399 51119 19741 -28433 -53710 -39016 -733 36546 54486 39247 -5909 -49286 -55184
1047 -55184 -21411 22099 47511 42610 8182 -37214 -59323 -38247 7497 42874 49100 26436
1059 26436 -14302 -48947 -48353 -10604 31715 47141 31600 -3268 -42666 -62030 -40764 7428
1071 7428 40793 35659 4232 -31655 -55748 -50432 -9696 38422 53082 26501 -13436 -40932
1083 -40932 -45629 -22013 21729 53221 43710 3631 -32917 -46104 -33074 3084 44407 57299
1095 57299 28405 -14857 -38223 -32970 -6117 32909 60343 47287 -311 -39833 -43209 -20486
1107 -20486 10260 39006 46489 15426 -32795 -52258 -29470 7919 36800 52172 43260 4170
1119 4170 -35578 -35263 2624 40064 54530 47309 18015 -26868 -53701 -34040 12254 42116 40298
1132 40298 17779 -15815 -46204 -45319 -4943 41473 57384 41848 13074 -16807 -32056 -13718
1144 -13718 28673 56352 47287 16425 -15454 -38688 -38644 -5691 34758 42143 12933 -20466 -38351
1157 -38351 -40432 -20369 22084 52999 37378 -8240 -38647 -39693 -25437 384 34575 46519
1169 46519 12611 -38461 -59150 -43236 -14740 14955 39741 36615 -2965 -43968 -47610 -18504
1181 -18504 14910 38448 43752 19178 -24015 -48074 -34576 -5054 16066 23962 12644 -22405
1193 -22405 -56136 -52143 -15743 13986 21454 17643 1396 -31242 -50609 -23916 26152 48936
1205 48936 35247 11726 -13289 -41902 -48160 -10418 37869 46424 16166 -17180 -40414 -54021
1217 -54021 -40894 3611 40636 34261 564 -25733 -38415 -38610 -14081 26905 43803 19057
1229 19057 -14507 -27245 -24869 -13330 15036 44105 37606 -1334 -28372 -22419 -2961 17706
1241 17706 41470 48950 18177 -26880 -40805 -20738 4525 25778 42669 31807 -15403 -55655
1253 -55655 -48497 -14172 10716 28092 41843 24731 -25176 -53234 -25774 17548 33850 35144
1265 35144 36071 15457 -25603 -38275 -2713 34327 35179 18334 4460 -15532 -35240 -24043 13988
1278 13988 35468 23493 965 -19122 -37718 -35343 2026 40725 39934 11916 -9890 -26438
1290 -26438 -41783 -27172 23987 58442 36807 -4920 -22100 -25526 -30304 -11462 34631 55682
1302 55682 23059 -18847 -28088 -20068 -12806 8143 37147 34442 -3970 -32227 -27934 -13343 1096
1315 1096 23840 34824 6564 -35071 -40975 -15550 4175 17128 35927 34289 -7753 -46238
1327 -46238 -33074 7797 29250 34895 41192 27052 -16770 -44340 -21917 16868 31381 28984
1339 28984 21499 -4790 -41007 -45392 -12037 15465 16532 10842 1820 -24370 -44200 -20681 24693
1352 24693 38539 20547 7984 1063 -18477 -25402 10262 53178 49711 13027 -10783 -19620 -30165
1365 -30165 -23321 15178 45657 29270 -9946 -31837 -37183 -35308 -12684 25207 37503 9957
1377 9957 -20600 -28514 -26819 -19712 6045 33377 24771 -11438 -30066 -20646 -8958 1023 21151
1390 21151 31183 5663 -30459 -34417 -10952 8311 20343 30720 19158 -20904 -50134 -37878
1402 -37878 -7446 10846 21876 26525 2795 -41481 -57155 -27462 7147 19160 24132 25640
1414 25640 2093 -34794 -38580 -3457 24970 23952 14612 6981 -11999 -31536 -22525 7873 22204
1427 22204 10213 -7153 -19731 -29021 -23044 4446 28980 25497 3548 -15497 -28304 -30692 -8456
1440 -8456 29268 44713 22958 -8529 -26260 -33659 -28827 425 38230 46116 18221 -11607 -22520
1453 -22520 -21218 -8736 19613 44288 37802 8450 -11756 -13992 -9432 2143 21116 26428 4158
1466 4158 -22136 -24295 -9476 2395 12161 21738 14323 -13354 -31127 -15774 14839 33665 37716
1479 37716 31580 10239 -19244 -29905 -9414 22094 39905 37466 17549 -13254 -36811 -34188
1491 -34188 -9632 15301 27593 24272 3989 -23742 -34949 -17938 8090 20403 18865 11689
1503 11689 -2588 -19002 -18340 4447 25335 23218 6248 -7858 -15117 -14917 -1013 21599 31385
1516 31385 16403 -9997 -28240 -30108 -15621 9342 28075 24062 75 -25634 -38952 -34734
1528 -34734 -12610 16883 31499 18806 -7577 -25665 -28025 -17375 3791 26024 30810 12031
1540 12031 -12274 -21936 -14775 -367 13973 20405 10945 -9787 -24204 -20889 -5253 10872 18428
1553 18428 11452 -8246 -26220 -26575 -9537 11256 24119 23490 7051 -17465 -31095 -21072 3864
1566 3864 24619 30104 19787 -2065 -23922 -29150 -12372 12507 27126 24103 7112 -14202 -26575
1579 -26575 -20142 -63 17320 20877 10814 -6449 -21330 -22011 -5611 14521 21671 12775 -3103
1592 -3103 -17300 -22562 -12311 9335 24846 20509 1338 -17330 -25492 -19622 -918 20130 26813
1605 26813 13169 -8901 -23816 -24477 -10939 10489 25476 21028 697 -18963 -26461 -20458 -4210
1618 -4210 14278 20393 6589 -15358 -27041 -22511 -8233 8728 20400 16743 -2055 -19523 -20207
1631 -20207 -5824 11474 23055 22996 8249 -12997 -23387 -15199 2358 16628 20947 11657 -8995
1644 -8995 -26716 -25686 -7782 11114 20252 18070 4271 -15592 -25193 -13089 9562 23303 22187
1657 22187 11757 -4117 -18785 -18594 46 20320 24963 15215 1087 -12091 -18005 -7797 14003
1670 14003 27806 22269 6205 -8328 -17190 -15124 1693 21529 24725 9029 -9320 -18926 -19190
1683 -19190 -8461 11801 26344 20233 743 -12752 -13520 -5970 8793 26088 30436 14405 -6806
1696 -6806 -15169 -10518 -217 13268 23120 15956 -6505 -23509 -21663 -8927 4245 15824 19127
1709 19127 5240 -16258 -23090 -10187 6559 16671 20903 15405 -3421 -21569 -20002 -2386 12015
1722 12015 15625 12208 563 -17952 -27271 -15237 5739 16266 14188 5706 -8220 -21990 -20237
1735 -20237 -574 17109 17684 7592 -4121 -17049 -24470 -14001 7956 18348 9643 -4236 -13787
1748 -13787 -20853 -19851 -2772 17840 20122 4231 -10711 -16824 -17661 -9822 8398 21191 12534
1761 12534 -7941 -20166 -20484 -14609 -1918 14023 17267 1415 -16427 -20207 -13403 -3486 9871
1774 9871 20513 14197 -6371 -19730 -15614 -4613 5198 14843 17631 3307 -17827 -23135 -9978
1787 -9978 4699 12589 16574 12127 -5041 -20555 -16126 2467 15666 18178 14812 4230 -12694
1800 -12694 -20613 -9072 9382 17350 14397 6430 -6592 -19327 -17226 1014 16959 17984 10156
1813 10156 659 -10398 -16025 -5301 14635 22907 14145 1812 -6556 -12704 -11401 3490 19793
1826 19793 19013 3606 -9258 -13654 -13368 -5210 11660 22318 13285 -5519 -15662 -14717 -8407 3640
1840 3640 18375 20791 4665 -13887 -18301 -11147 -1407 9520 17893 12810 -4781 -17882 -15331
1853 -15331 -4150 6032 13238 13930 3430 -11619 -16285 -7331 4952 12744 14448 7213 -7719
1866 -7719 -17745 -12204 2357 12120 13744 9270 -2710 -17931 -21432 -7093 10442 15672 10714
1879 10714 2851 -8474 -19633 -17349 1233 18392 19243 9176 -830 -9421 -14421 -7586 9491
1892 9491 20566 15359 2181 -7395 -11152 -8588 1863 13616 14744 4223 -6776 -10676 -8154
1905 -8154 76 11907 17567 9309 -5432 -12856 -10090 -2397 7984 17876 17274 2194 -14621 -18199
1919 -18199 -9044 3136 13318 18419 12031 -4799 -18159 -16708 -4649 7269 14011 13361 2881
1932 2881 -11714 -18031 -11651 -823 6576 8850 4621 -6581 -15974 -13032 -808 8099 8643 5003
1946 5003 -1933 -11421 -14560 -4051 10926 14886 6644 -3827 -12050 -17773 -14781 -246 13862 13471
1960 13471 795 -11405 -17587 -17873 -9384 6360 17157 12739 -1027 -11742 -14997 -11307 -1024
1973 -1024 10923 13874 4545 -7707 -13347 -11414 -4628 4829 10546 6030 -4992 -11457 -9097 -1940
1987 -1940 6201 12659 11428 324 -11335 -12617 -4707 4622 11607 13853 6352 -9143 -19123 -14211
2001 -14211 -1211 8738 13318 12513 3045 -11303 -16370 -6249 8047 14642 14078 9768 580 -9852
2015 -9852 -10607 637 11733 12670 6664 -367 -7104 -10479 -5101 6463 12948 8865 -455 -7973 -10504
2030 -10504 -5915 5038 14372 13820 4764 -5251 -11075 -10160 -786 12174 17590 10759 -576 -8005
2044 -8005 -10090 -6537 4140 15646 16479 5422 -5990 -9476 -7259 -1841 6772 12914 8254 -4470
2058 -4470 -12380 -9937 -2824 3854 9038 9236 999 -9402 -11224 -3413 6189 12066 13137 7557 -3663
2073 -3663 -11780 -9030 1181 9816 12344 8713 -916 -12130 -15952 -8763 2282 8376 7625 1566
2087 1566 -7492 -13894 -11220 -1100 7494 8923 4899 -2019 -8775 -9907 -2462 7378 10385 5678 -1716
2102 -1716 -8225 -11745 -8087 2596 10798 8451 -1204 -9694 -13452 -11885 -3903 7523 12715 6682
2116 6682 -4406 -11328 -11491 -6124 3297 11831 12286 4082 -5489 -9387 -7072 -527 7416 10935 6172
2131 6172 -3151 -8717 -7594 -2431 3957 8422 6620 -2005 -9987 -9890 -3057 4456 8906 8740 2268 -7654
2147 -7654 -12802 -8221 1687 9452 11304 6995 -2416 -11477 -12723 -5004 5230 11189 10554 3869 -5840
2162 -5840 -11582 -8311 690 7971 9483 6086 -873 -7967 -9078 -2536 5490 7719 4093 -1523 -6640
2177 -6640 -8880 -5207 3167 8721 6173 -1518 -8226 -10789 -8106 -258 8316 10165 3644 -5719 -11560
2192 -11560 -11267 -4714 5430 12269 10205 1569 -6631 -9641 -7083 427 9133 12092 6374 -2859 -8227
2207 -8227 -7904 -3804 2558 7435 6001 -1523 -8205 -8364 -3474 2809 7597 8241 2971 -4292 -6464 -1668
2223 -1668 5796 11211 12445 7854 -1242 -8068 -6784 436 7337 10177 8229 824 -8723 -12651 -7183
2238 -7183 2256 8392 9193 5745 -1285 -7866 -7543 352 8764 11297 8508 3079 -3027 -6173 -2682
2253 -2682 4910 9111 6919 1337 -4245 -7803 -6306 777 7434 7530 1886 -4325 -8022 -8252 -3025 5692
2269 5692 10042 5966 -2346 -7920 -9061 -6274 778 8450 9485 2419 -5752 -8817 -7086 -2199 4834
2284 4834 9384 6417 -2056 -7948 -7811 -4202 943 6002 6588 21 -7911 -9734 -5635 -411 4000
2299 4000 6527 3695 -4289 -9739 -7034 11 5122 7143 6125 287 -7749 -10084 -4325 3208 6422
2314 6422 5698 1970 -4896 -10545 -8610 -449 6038 6888 4254 -577 -6577 -8634 -3107 5147 8135
2329 8135 5316 723 -4251 -8371 -7157 351 6790 5782 282 -4392 -7313 -7977 -3208 5222 8890
2344 8890 4668 -1803 -5143 -5728 -3606 2799 9494 8962 1590 -4834 -6306 -4882 -1122 5069 8657
2359 8657 4360 -3979 -7933 -6283 -2762 1831 6810 7098 324 -6801 -7176 -2911 1458 5234 7551
2374 7551 4330 -3687 -8258 -5213 549 4322 6310 5870 297 -6911 -7713 -1629 4409 6457 6231 3495
2390 3495 -2899 -7719 -4775 2781 7071 6618 4242 52 -5634 -7152 -1340 5832 7239 4271 765
2405 765 -3441 -7040 -5143 2494 7793 6002 1107 -2356 -5045 -5870 -1263 6172 8461 3656 -2003
2420 -2003 -4527 -5090 -3380 2356 7730 6405 -319 -5255 -5857 -4345 -733 4827 7335 2981 -3873
2435 -3873 -6388 -4622 -1471 2923 7159 6376 -116 -5534 -5100 -1457 2069 5568 7247 3430 -3756
2450 -3756 -6716 -3336 1251 3956 5682 4938 -655 -6732 -6424 -751 3696 4838 4481 1692 -4168 -7743
2466 -7743 -4479 2229 5435 4567 2307 -1356 -5857 -6311 -768 5285 6311 3498 125 -3423 -5665
2481 -5665 -3380 2655 6358 4637 560 -3004 -5539 -5401 -919 4611 5264 1263 -2958 -5070 -5653 -3219
2497 -3219 2422 6398 4022 -1740 -5184 -5331 -3977 -601 4338 5732 966 -5189 -7072 -5182 -2256
2512 -2256 1492 4734 3812 -1733 -6295 -5911 -2473 1133 4066 4832 1390 -4108 -6284 -3739 -11 2525
2528 2525 3474 1773 -3011 -6939 -5893 -1321 2448 3609 2833 -209 -4448 -5913 -2036 3552 6249
2543 6249 5466 2710 -1420 -4986 -4380 752 5480 5891 3184 -516 -4258 -6066 -3388 2290 5541 4129
2559 4129 638 -2154 -3857 -3374 390 5050 6098 2915 -848 -2474 -2011 332 3968 6110 4322
2574 4322 5 -3083 -3080 -603 3261 6245 5585 1266 -3118 -4489 -2774 656 4570 6416 3660 -2080
2590 -2080 -5808 -5074 -1876 1522 4353 5009 1615 -3633 -5801 -3275 803 3511 4241 3010 -310 -3619
2606 -3619 -3681 -451 2810 3715 2122 -978 -3783 -4275 -1745 1761 3439 2452 -373 -3716 -5331 -3312
2622 -3312 1468 5163 5075 2075 -1646 -4380 -4691 -1459 3621 6398 4616 205 -3599 -5141 -3872 -247
2638 -247 3610 4530 2025 -1820 -4312 -4222 -1781 1631 3439 2172 -869 -2998 -3192 -1634 1024 3306
2654 3306 2999 -348 -3605 -3876 -1400 1635 3777 4247 2070 -2034 -4761 -3552 607 4325 5534 3952
2670 3952 310 -3510 -5005 -2911 1114 4234 4465 1816 -2257 -5039 -4628 -1696 1480 2913 2236 -416
2686 -416 -3406 -4280 -2062 1366 2946 2001 -88 -2040 -3101 -2186 817 3551 3308 333 -2761 -4098
2702 -4098 -3159 -457 2737 4158 2472 -1247 -4318 -4791 -2454 1394 4230 4060 1089 -2433 -4276 -3701
2718 -3701 -1072 2316 4055 2667 -852 -3323 -3330 -1515 862 2809 2990 794 -2155 -3152 -1550 1033
2734 1033 2776 2767 981 -1954 -3816 -3078 -443 2087 2829 1403 -1707 -4355 -4549 -1977 1402 3339
2750 3339 3149 1131 -1817 -3628 -2570 824 3788 4340 2811 260 -2149 -2854 -1127 1911 3504 2466
2766 2466 62 -2188 -3093 -2090 474 2682 2776 763 -1513 -2728 -2000 364 3044 3976 2359 -341
2782 -341 -2235 -2289 -679 2086 4163 3751 1042 -1741 -2577 -1525 700 3140 4078 2509 -470 -2386
2798 -2386 -2030 -233 1877 3124 2547 189 -2155 -2594 -1089 1090 2651 2795 1204 -1322 -2524 -1361
2814 -1361 1093 3023 3581 2430 -64 -2436 -2628 -506 1968 2893 2160 28 -2503 -3884 -2919 -308
2830 -308 1647 1851 466 -1528 -3161 -3117 -1141 1335 2264 1314 -478 -2160 -2775 -1550 678 2114 1460
2847 1460 -475 -2303 -3100 -2460 -303 1931 2217 403 -1836 -2977 -2733 -1170 1270 2811 1931 -674
2863 -674 -2750 -3185 -2264 -361 1655 2171 479 -2051 -3232 -2615 -1037 879 2172 1676 -426 -2048
2879 -2048 -1919 -505 1116 2245 2250 652 -1476 -2138 -935 896 2036 2175 1074 -1116 -2748 -2152 83
2896 83 1967 2591 1908 120 -2007 -2698 -1039 1426 2739 2440 1188 -696 -2201 -1956 169 2201 2542
2913 2542 1510 18 -1319 -1888 -827 1282 2396 1621 19 -1266 -1932 -1394 302 1941 1770 58
2929 58 -1514 -2172 -1952 -507 1552 2469 1277 -786 -1838 -1721 -772 993 2746 2754 754 -1331 -1820 -1105
2947 -1105 81 1539 2436 1489 -883 -2330 -1952 -709 470 1370 1359 -159 -2032 -2317 -977 528 1387
2964 1387 1618 789 -927 -1990 -1231 630 1852 2030 1446 35 -1557 -1821 -330 1502 2080 1535 416
2981 416 -1105 -2164 -1535 452 1879 1669 729 -381 -1545 -1816 -448 1512 2110 1214 18 -787 -1340
2998 -1340 -911 742 2124 1842 303 -832 -1209 -1034 -18 1636 2157 998 -702 -1417 -1190 -518 759
3015 759 1916 1529 -199 -1592 -1634 -978 -16 1145 1745 622 -1211 -1885 -1164 -107 768 1475 1406 -75
3033 -75 -1519 -1477 -243 808 1279 1346 503 -1084 -1846 -1000 358 1107 1100 573 -636 -1883 -1716 -370 887
3052 887 1076 644 -215 -1395 -2086 -1297 365 1198 718 -120 -940 -1788 -1780 -486 1008 1168 243 -590 -1174
3071 -1174 -1416 -848 673 1513 953 -240 -1032 -1205 -1034 -134 1082 1188 -48 -1236 -1586 -1251 -637 461
3089 461 1330 769 -673 -1469 -1154 -413 417 1276 1434 343 -1055 -1318 -536 235 883 1267 783 -548 -1483
3108 -1483 -1126 -29 720 1104 1057 228 -946 -1151 -176 916 1317 1270 806 -122 -944 -603 678 1502 1341
3127 1341 827 173 -668 -964 -43 1235 1578 1018 267 -383 -888 -564 645 1552 1311 350 -376 -860 -943
3146 -943 -175 976 1418 600 -367 -817 -838 -438 469 1320 1198 109 -653 -750 -377 281 1109 1365 598 -575
3166 -575 -1015 -679 -55 533 1052 767 -384 -1320 -1198 -486 204 689 809 153 -1008 -1460 -839 39 638
3185 638 748 414 -362 -1189 -1197 -279 555 746 529 -53 -850 -1170 -605 377 960 677 78 -605 -1131 -954 28
3206 28 919 886 258 -410 -966 -1071 -528 551 1136 732 -113 -739 -964 -625 184 1066 1170 483 -366 -758
3226 -758 -675 -114 666 1063 633 -289 -914 -809 -453 167 725 690 -100 -970 -1054 -505 199 684 847 360 -511
3247 -511 -1109 -760 53 683 1006 669 -101 -972 -1112 -531 309 790 775 288 -552 -1085 -811 21 649 775
3267 775 448 -139 -725 -891 -343 399 625 301 -216 -733 -979 -573 143 701 536 -118 -694 -899 -597 170
3287 170 950 1064 535 -276 -782 -732 -252 518 1112 868 24 -770 -998 -749 -86 597 851 390 -349 -779
3307 -779 -635 -126 492 794 670 148 -374 -377 -12 566 818 684 180 -467 -651 -173 502 860 839 364 -373
3328 -373 -797 -636 189 894 1086 699 -7 -700 -922 -448 411 935 898 351 -339 -744 -585 42 678 899
3348 899 609 81 -322 -392 -42 524 815 524 -58 -447 -512 -198 331 660 532 -86 -699 -857 -468 230 770
3369 770 841 366 -406 -852 -764 -169 614 934 744 -5 -702 -919 -600 39 604 720 284 -366 -849 -689 -179
3390 -179 385 530 309 -172 -649 -760 -324 221 523 219 -324 -797 -947 -511 108 510 489 -88 -704 -1049
3410 -1049 -811 -13 707 888 410 -258 -804 -910 -402 345 883 705 74 -616 -896 -649 -111 538 720 259
3430 259 -398 -754 -655 -176 434 726 491 -111 -602 -635 -216 434 859 701 37 -627 -831 -462 194 759 870
3451 870 400 -401 -966 -792 -88 622 886 620 -39 -671 -885 -460 347 901 909 379 -367 -765 -580 131 747
3472 747 946 592 -91 -673 -662 -102 630 946 607 -25 -644 -854 -525 231 822 799 167 -569 -956 -749 -87
3493 -87 666 981 557 -245 -849 -861 -355 410 962 825 166 -575 -876 -526 202 830 977 370 -430 -883 -702
3514 -702 -79 648 957 639 -137 -853 -929 -326 401 891 900 211 -617 -1007 -649 159 838 1001 575 -214 -876
3535 -876 -882 -148 662 1072 783 78 -664 -952 -494 333 931 878 284 -484 -985 -766 0 797 983 552 -293
3556 -293 -908 -964 -374 544 1043 869 29 -770 -978 -629 202 987 1118 470 -372 -907 -781 -158 664 1081
3576 1081 723 -179 -862 -1048 -586 228 846 823 96 -809 -1146 -798 -54 652 897 409 -477 -1138 -1007 -258
3596 -258 562 974 730 -112 -961 -1242 -644 269 922 945 282 -614 -1159 -932 -46 777 1049 667 -180 -1005
3616 -1005 -1101 -401 546 1014 787 87 -728 -1161 -803 145 899 978 341 -511 -1074 -902 -191 747 1158 682
3636 682 -168 -928 -1067 -492 470 1191 1049 193 -705 -1084 -823 41 976 1259 640 -357 -981 -935 -236 639
3656 639 1280 1113 120 -758 -989 -450 410 1115 1222 504 -579 -1093 -820 -8 830 1173 759 -213 -1073 -1103
3676 -1103 -348 611 1207 1057 259 -723 -1237 -747 269 1068 1178 589 -444 -1218 -1153 -219 755 1153 856
3695 856 -46 -997 -1273 -684 455 1130 1011 232 -615 -1207 -945 -7 992 1289 586 -403 -1093 -1128 -446 633
3715 633 1340 994 -46 -940 -1230 -774 226 1122 1226 417 -706 -1293 -1055 -221 782 1305 809 -312
3733 -312 -1197 -1249 -566 399 1195 1176 256 -905 -1287 -842 125 976 1283 697 -551 -1315 -1173 -219 669 1200
3753 1200 920 -64 -1154 -1441 -681 459 1161 1178 504 -609 -1363 -1045 117 1132 1394 892 -163 -1158
3771 -1158 -1391 -539 693 1316 1063 99 -919 -1457 -986 172 1164 1260 535 -480 -1214 -1189 -224 990 1476
3790 1476 913 -189 -1024 -1307 -709 408 1386 1226 192 -948 -1414 -1031 -98 1052 1504 740 -522 -1355
3808 -1355 -1252 -440 611 1356 1218 38 -1153 -1480 -855 199 1153 1386 619 -635 -1432 -1130 -79 1030
3826 1030 1485 1107 7 -1122 -1303 -482 663 1423 1298 369 -868 -1528 -1055 140 1094 1328 747 -433
3844 -433 -1495 -1458 -353 962 1448 1031 111 -942 -1493 -969 442 1525 1489 505 -650 -1306 -1184 -166
3862 -166 1127 1608 1006 -163 -1133 -1353 -560 704 1572 1326 213 -891 -1368 -1049 75 1267 1526 686
3880 686 -653 -1425 -1306 -347 885 1677 1327 61 -1193 -1406 -704 464 1426 1494 543 -821 -1529 -1244
3898 -1244 -235 910 1421 856 -464 -1547 -1561 -637 497 1222 1188 232 -1087 -1701 -1035 337 1298 1398
3916 1398 610 -528 -1445 -1427 -398 1004 1654 1080 -148 -1339 -1593 -859 453 1339 1385 504 -844 -1725
3934 -1725 -1424 -177 1072 1367 655 -458 -1405 -1639 -865 497 1478 1147 -114 -1178 -1495 -924 221
3951 221 1360 1563 746 -656 -1566 -1255 -102 1245 1752 1145 -177 -1282 -1576 -837 488 1661 1692 421
3969 421 -1036 -1691 -1203 -93 1094 1622 1092 -196 -1463 -1514 -469 892 1593 1297 274 -895 -1382
3986 -1382 -847 422 1487 1619 590 -787 -1526 -1182 -5 1163 1563 1017 -271 -1587 -1826 -720 860
4003 860 1733 1424 352 -910 -1686 -1361 36 1512 1971 1069 -348 -1391 -1444 -536 761 1587 1412 199
4021 199 -1118 -1617 -949 355 1306 1285 365 -848 -1488 -1222 -90 1182 1642 885 -576 -1571 -1525 -521
4039 -521 841 1813 1592 231 -1295 -1884 -1240 300 1574 1873 1035 -513 -1698 -1768 -597 850 1733
4056 1733 1444 138 -1242 -1711 -1016 257 1367 1528 700 -648 -1494 -1151 121 1305 1655 928 -330
4073 -330 -1340 -1463 -441 1003 1836 1347 -74 -1387 -1897 -1175 287 1574 1810 726 -910 -1915 -1793
4090 -1793 -533 1043 1804 1388 -9 -1438 -1962 -1231 251 1503 1618 519 -899 -1637 -1363 -156 1135
4107 1135 1691 974 -434 -1497 -1443 -387 910 1625 1250 -78 -1478 -1959 -1175 336 1510 1591 479
4124 479 -1109 -2116 -1798 -376 1182 1940 1347 -165 -1611 -1962 -956 624 1761 1764 612 -963 -1813
4141 -1813 -1478 -121 1286 1659 902 -447 -1539 -1660 -609 846 1715 1292 -67 -1389 -1820 -1057 500
4158 500 1686 1659 562 -990 -1824 -1484 -104 1514 2167 1398 -157 -1451 -1654 -673 896 2074 2033 665
4176 665 -1016 -1836 -1347 69 1430 1845 1031 -581 -1780 -1795 -609 914 1728 1431 66 -1355 -1710
4193 -1710 -890 610 1813 1900 768 -804 -1755 -1415 67 1476 2014 1251 -230 -1696 -1932 -811 907
4210 907 1960 1690 405 -1129 -1938 -1377 180 1689 2017 1017 -545 -1692 -1702 -492 1149 1989 1478
4227 1478 9 -1411 -1820 -1029 641 1856 1890 646 -1002 -1905 -1499 -170 1340 1950 1054 -623 -1942
4244 -1942 -2066 -1016 571 1679 1507 11 -1559 -2165 -1418 77 1470 1911 1004 -766 -1924 -1693 -310
4261 -310 1170 1925 1422 -143 -1695 -2091 -1077 585 1697 1662 486 -1223 -2166 -1661 -46 1443 1968
4278 1968 1199 -382 -1836 -1982 -720 1008 1941 1569 222 -1363 -2190 -1470 233 1691 1859 735 -777
4295 -777 -1864 -1832 -401 1340 2141 1376 -191 -1524 -1936 -1012 713 2073 1857 347 -1327 -2071 -1589
4312 -1589 -111 1586 2169 1210 -578 -1848 -1794 -568 1157 2237 1865 301 -1364 -1919 -1169 387 1802
4329 1802 2094 917 -937 -2026 -1683 -371 1173 1985 1417 -348 -1953 -2158 -972 680 1697 1647 348
4346 348 -1512 -2487 -1717 43 1473 1851 1049 -618 -2045 -2105 -554 1285 2108 1672 288 -1347 -2038
4363 -2038 -1258 565 1952 1954 742 -892 -2017 -1848 -362 1401 2152 1324 -353 -1638 -1874 -790 1087
4380 1087 2410 2122 649 -922 -1748 -1198 408 2077 2440 1178 -644 -1844 -1884 -769 1057 2253
4396 2253 1666 -197 -1786 -2070 -1194 360 1923 2304 1007 -962 -1925 -1354 151 1642 2335 1793 -11
4413 -11 -1659 -1846 -500 1163 2196 1996 574 -1229 -2127 -1357 323 1815 2080 1007 -896 -2255 -2120
4430 -2120 -577 1141 1880 1447 -129 -1928 -2552 -1475 512 1862 1786 580 -1111 -2331 -2026 -303
4446 -303 1580 2069 1100 -482 -1964 -2271 -1133 843 2087 1649 54 -1518 -2227 -1612 101 1811 2107
4463 2107 748 -1057 -2145 -2013 -630 1177 2177 1468 -420 -2062 -2376 -1284 482 1896 1987 564
4479 564 -1371 -2292 -1722 -74 1678 2356 1421 -571 -2003 -2093 -810 877 2035 1835 186 -1764 -2435
4496 -2435 -1467 258 1606 1942 950 -872 -2248 -1912 -200 1595 2318 1609 -34 -1598 -2024 -867 1112
4513 1112 2372 2189 664 -1215 -2220 -1644 129 1898 2293 1300 -601 -2071 -2249 -885 1171 2312
4529 2312 1783 125 -1516 -2188 -1460 452 2159 2375 1061 -777 -1839 -1613 -130 1649 2520 1730 -134
4546 -134 -1688 -1962 -893 923 2295 2062 417 -1512 -2250 -1590 80 1786 2410 1296 -719 -2190
4562 -2190 -2042 -491 1387 2387 2041 315 -1554 -2327 -1343 544 2052 2172 935 -969 -2264 -1985
4578 -1985 -342 1454 2164 1386 -407 -2082 -2344 -1087 773 1947 1766 236 -1592 -2551 -1867 27
4594 27 1798 2151 996 -795 -2128 -2127 -632 1434 2483 1896 83 -1624 -2191 -1306 562 2064 2172
4611 2172 692 -1229 -2330 -1997 -400 1441 2160 1346 -519 -2067 -2124 -841 1040 2353 2136 530
4627 530 -1372 -2122 -1250 542 2168 2508 1368 -709 -2149 -1992 -418 1400 2355 1783 34 -1802 -2409
4644 -2409 -1329 609 2056 2039 730 -1154 -2317 -1888 -160 1632 2165 1227 -541 -2030 -2206 -822
4660 -822 1129 2232 1757 119 -1648 -2418 -1613 394 1981 2184 827 -1083 -2416 -2364 -730 1325 2310
4677 2310 1499 -396 -2102 -2568 -1606 361 1952 2003 484 -1426 -2402 -1974 -386 1404 2013 1038 -808
4694 -808 -2165 -2234 -918 830 2013 1639 -41 -1831 -2355 -1362 472 2084 2280 944 -1116 -2422 -2001
4711 -2001 -286 1623 2561 1816 -177 -2051 -2481 -1226 879 2307 2416 1083 -848 -2026 -1505 373
4727 373 2144 2675 1826 136 -1358 -1620 -393 1430 2384 1862 182 -1524 -2166 -1306 527 1892 1944
4744 1944 570 -1251 -2389 -1959 -134 1953 2672 1726 -93 -1719 -2145 -962 1200 2800 2664 878
4760 878 -1134 -2141 -1696 -66 1790 2535 1446 -519 -2061 -2110 -877 877 2036 1692 137 -1579
4776 -1579 -2121 -1218 565 1970 2074 720 -1146 -2191 -1653 25 1777 2432 1467 -583 -2291 -2434 -1029
4793 -1029 949 2220 1939 258 -1865 -2864 -2168 -198 1579 2155 1194 -804 -2311 -2398 -875 1149 2211
4810 2211 1791 264 -1486 -2174 -1285 551 1958 1935 593 -1192 -2219 -1820 -209 1555 2165 1123 -761
4827 -761 -2192 -2191 -844 1107 2413 2068 305 -1653 -2511 -1723 232 1978 2350 1055 -1008 -2504 -2549
4844 -2549 -1072 961 2118 1521 -283 -1982 -2435 -1482 274 1848 2084 830 -1113 -2168 -1597 71
4860 71 1654 2215 1450 -360 -1974 -2130 -729 1223 2344 1934 277 -1544 -2288 -1450 461 2216 2550
4877 2550 1287 -702 -2102 -1944 -419 1541 2449 1949 211 -1660 -2363 -1316 654 2089 2055 688
4893 688 -1101 -2206 -1887 -314 1582 2247 1170 -694 -2051 -2127 -922 992 2270 1873 220 -1558
4909 -1558 -2227 -1396 527 2158 2469 1197 -809 -2087 -1926 -399 1446 2447 1825 -182 -1981 -2381
4925 -2381 -1262 511 1876 2024 598 -1339 -2413 -1846 -73 1620 2182 1320 -459 -1970 -2092 -758
4941 -758 1127 2212 1899 261 -1631 -2327 -1363 471 1927 2185 1066 -745 -2143 -1995 -237 1706
4957 1706 2424 1700 75 -1453 -2113 -1077 890 2411 2273 685 -1077 -2015 -1565 23 1845 2491 1468
4974 1468 -359 -1833 -1917 -577 1313 2441 2011 283 -1477 -2152 -1443 299 1956 2249 903 -1047
4990 -1047 -2213 -1920 -549 1275 2283 1606 -240 -1958 -2262 -1100 675 1968 1967 499 -1453 -2393 -1746
5007 -1746 -121 1511 2066 1086 -780 -2332 -2327 -866 912 1907 1581 48 -1850 -2599 -1736 210 1690
5024 1690 1885 720 -1094 -2403 -2185 -576 1291 2051 1372 -321 -1908 -2304 -1170 736 1999 1865
5040 1865 429 -1282 -2288 -1825 -45 1734 2189 1117 -619 -1919 -2031 -742 1222 2398 1877 124
5056 124 -1557 -2141 -1300 436 2015 2248 903 -1028 -2155 -1899 -397 1369 2318 1621 -233 -1777 -2028
5073 -2028 -908 849 2230 2203 747 -1174 -2051 -1367 230 1752 2185 1230 -600 -2072 -2101 -644 1122
5090 1122 2023 1672 97 -1661 -2273 -1272 578 2023 2239 1061 -789 -2031 -1733 -74 1734 2374
5106 2374 1668 -97 -1721 -2141 -1090 768 2015 1828 379 -1386 -2273 -1747 -90 1592 2042 1080 -638
5123 -638 -1891 -1892 -537 1296 2320 1874 289 -1326 -1829 -962 814 2231 2379 1009 -882 -1960 -1603
5140 -1603 -142 1511 2284 1458 -355 -1999 -2272 -1049 740 1958 1896 479 -1309 -2210 -1561 154 1795
5157 1795 2257 1272 -498 -1826 -1862 -520 1185 2124 1635 15 -1647 -2258 -1330 428 1760 1752 518 -1124
5175 -1124 -2187 -1850 -239 1544 2229 1350 -367 -1787 -2016 -865 973 2207 1943 342 -1428 -2285
5191 -2285 -1701 -11 1607 1996 887 -893 -2133 -2124 -850 965 2034 1571 -133 -1675 -2100 -1226 363
5208 363 1730 1905 711 -1161 -2181 -1696 -96 1454 1989 1206 -468 -1917 -1980 -720 1016 2131 1875
5225 1875 388 -1395 -2155 -1359 349 1806 2119 1119 -747 -2183 -2119 -600 1140 1934 1348 -161 -1740
5242 -1740 -2398 -1567 274 1660 1661 366 -1208 -2169 -1818 -323 1325 1922 1104 -463 -1747 -1936 -759
5259 -759 1096 2140 1760 262 -1287 -1943 -1317 316 1956 2151 889 -977 -2027 -1860 -564 1187
5275 1187 2169 1663 -82 -1677 -1969 -1008 702 2063 2223 962 -840 -1724 -1297 157 1679 2311 1459
5292 1459 -328 -1772 -1789 -672 943 1921 1713 215 -1545 -2127 -1174 437 1765 2098 1135 -595 -1828
5309 -1828 -1535 15 1625 2341 1802 304 -1390 -1898 -850 951 2110 1976 729 -923 -1958 -1619
5325 -1619 20 1616 2070 1128 -427 -1694 -1931 -843 912 1934 1571 76 -1500 -2182 -1458 180
5341 180 1644 1818 639 -939 -2076 -1995 -620 1198 2005 1265 -379 -1767 -2111 -1310 312 1780 1735
5358 1735 328 -1353 -2146 -1603 -211 1326 1963 1213 -521 -1806 -1752 -536 1085 2103 1798 254 -1463
5375 -1463 -2006 -1145 435 1743 2006 890 -954 -2156 -1769 -383 1174 1991 1509 -123 -1728 -2136 -1069
5392 -1069 647 1743 1784 569 -1156 -2166 -1585 0 1382 1780 1035 -468 -1830 -1883 -548 1180 1985
5409 1985 1577 205 -1273 -1924 -1193 588 2030 1978 720 -934 -1972 -1851 -423 1304 2083 1354 -275
5426 -275 -1788 -2144 -1122 578 1836 1746 422 -1125 -1975 -1667 -248 1364 1884 934 -687 -1816 -1823 -854
5444 -854 730 1792 1461 -170 -1696 -2000 -1093 422 1683 1875 741 -1036 -2036 -1618 -161 1394
5460 1394 2083 1430 -278 -1739 -2050 -904 692 1891 1944 701 -1104 -2009 -1423 97 1517 2018 1337
5477 1337 -240 -1605 -1698 -447 1113 1907 1517 220 -1178 -1747 -996 606 1809 1760 686 -859 -1863
5494 -1863 -1566 -87 1528 2099 1297 -238 -1612 -1910 -842 959 2192 1985 611 -1036 -1856 -1406 128
5511 128 1676 2144 1254 -381 -1626 -1712 -606 927 1930 1562 145 -1312 -1809 -1055 433 1754 1888
5528 1888 771 -904 -1737 -1300 5 1452 2105 1457 -221 -1692 -1870 -675 942 1937 1764 432 -1265
5545 -1265 -2153 -1566 23 1492 1907 997 -602 -1911 -1954 -727 940 1853 1474 125 -1403 -1987 -1200
5562 -1200 360 1545 1586 501 -1050 -1982 -1732 -398 1084 1676 939 -640 -1928 -2085 -1010 608 1682
5579 1682 1531 170 -1417 -2126 -1568 -4 1521 1905 870 -784 -1938 -1922 -795 838 1782 1440 -108
5596 -108 -1609 -2094 -1255 222 1496 1693 658 -934 -1949 -1578 -152 1287 1879 1192 -357 -1665 -1872
5613 -1872 -842 750 1804 1612 221 -1407 -2137 -1442 105 1438 1877 1036 -552 -1797 -1745 -368 1332
5630 1332 2201 1764 349 -1039 -1616 -871 743 2105 2195 910 -658 -1637 -1333 -56 1399 2012 1298
5647 1298 -318 -1596 -1846 -795 783 1858 1671 316 -1175 -1875 -1332 176 1652 2081 1093 -579
5663 -579 -1710 -1705 -395 1102 1912 1485 -43 -1489 -2014 -1204 370 1577 1664 538 -995 -1959 -1614 -218
5681 -218 1282 1976 1301 -202 -1581 -1782 -656 941 1944 1773 488 -1073 -1926 -1330 212 1582 1828
5698 1828 835 -738 -1929 -1916 -624 922 1763 1287 -161 -1597 -2021 -1157 395 1700 1790 677 -927
5715 -927 -1813 -1436 3 1547 2086 1330 -187 -1536 -1673 -576 974 2029 1764 435 -1110 -1807 -1181
5732 -1181 258 1615 1992 1006 -617 -1779 -1681 -405 1093 1875 1422 -42 -1535 -1951 -1050 499 1648
5749 1648 1658 565 -992 -1941 -1566 -86 1379 1872 1158 -344 -1619 -1858 -742 883 1872 1556 181
5766 181 -1322 -2012 -1457 69 1464 1702 716 -882 -1937 -1833 -624 972 1825 1287 -171 -1509 -1836
5783 -1836 -1047 475 1680 1706 490 -1152 -1917 -1586 -265 1174 1758 933 -714 -1911 -1938 -861 579
5800 579 1600 1408 18 -1530 -2096 -1342 178 1422 1721 861 -719 -1907 -1699 -344 1199 1923 1471
5817 1471 31 -1372 -1778 -868 703 1822 1795 695 -928 -1874 -1452 -49 1306 1725 1010 -420 -1715
5834 -1715 -1916 -700 916 1840 1461 272 -1100 -1760 -1160 452 1847 1995 911 -542 -1593 -1502 -287
5851 -287 1328 2070 1396 -105 -1425 -1741 -957 643 1925 1939 635 -853 -1626 -1220 87 1564 2180
5868 2180 1417 -166 -1359 -1453 -473 984 2004 1788 376 -1120 -1608 -967 429 1638 1913 900 -758
5885 -758 -1741 -1440 -215 1058 1759 1292 -258 -1759 -2040 -1017 478 1538 1580 452 -1145 -2074 -1532
5902 -1532 0 1466 1896 1218 -233 -1532 -1747 -592 993 1800 1494 260 -1177 -1884 -1289 174 1351
5919 1351 1497 568 -841 -1889 -1743 -427 1086 1667 1027 -346 -1569 -1893 -1052 608 1739 1503 242
5936 242 -1194 -1927 -1569 -147 1404 1848 939 -619 -1699 -1806 -845 789 1826 1521 42 -1320 -1806
5953 -1806 -1261 132 1448 1710 686 -882 -1703 -1422 -267 1104 1850 1366 -151 -1420 -1533 -567 797
5970 797 1816 1764 506 -1110 -1806 -1281 100 1355 1823 1067 -619 -1904 -1859 -612 901 1729 1456 254
5988 254 -1380 -1963 -1127 409 1497 1672 822 -653 -1784 -1677 -299 1156 1643 1047 -206 -1508 -1900
6005 -1900 -902 681 1677 1412 331 -1049 -1800 -1409 94 1520 1736 733 -633 -1628 -1772 -716 934
6022 934 1876 1362 -82 -1310 -1779 -1151 304 1710 1898 767 -754 -1586 -1361 -254 1190 1921 1244
6039 1244 -288 -1482 -1675 -816 501 1663 1596 240 -1252 -1733 -1152 39 1370 1880 1151 -466 -1650
6056 -1650 -1411 -184 1139 1908 1632 316 -1206 -1649 -806 619 1686 1837 890 -703 -1677 -1328 -17
6073 -17 1247 1777 1248 -37 -1491 -1765 -618 897 1683 1467 448 -939 -1726 -1259 326 1715 1873
6090 1873 957 -372 -1427 -1504 -379 1152 1898 1438 97 -1235 -1788 -1150 330 1553 1476 410 -896
6107 -896 -1700 -1598 -436 1165 1745 957 -528 -1540 -1565 -790 567 1645 1544 142 -1341 -1841 -1268 55
6125 55 1237 1642 793 -782 -1838 -1712 -612 825 1704 1304 -101 -1500 -1817 -1066 230 1321 1583
6142 1583 571 -1044 -1905 -1452 -195 954 1448 981 -275 -1543 -1806 -717 770 1594 1322 186 -1204
6159 -1204 -1849 -1239 116 1327 1535 621 -795 -1863 -1783 -510 1001 1637 1159 -71 -1275 -1821 -1085
6176 -1085 549 1746 1718 615 -636 -1448 -1248 -86 1290 1917 1273 -167 -1288 -1396 -546 836 1694
6193 1694 1438 253 -1062 -1597 -1052 221 1441 1676 653 -804 -1630 -1420 -396 960 1797 1423 -70
6210 -70 -1398 -1763 -788 557 1577 1722 738 -742 -1707 -1339 -43 1276 1665 1077 -268 -1434 -1562 -667
6228 -667 719 1620 1407 263 -1008 -1615 -1010 346 1454 1602 697 -632 -1627 -1532 -307 1074 1688 1172
6246 1172 -201 -1401 -1705 -969 550 1662 1664 565 -873 -1591 -1277 -57 1274 1735 1091 -328 -1485
6263 -1485 -1670 -734 677 1559 1327 141 -1142 -1650 -1067 284 1476 1710 760 -628 -1501 -1261 -123
6280 -123 1146 1788 1253 -58 -1353 -1629 -825 618 1576 1545 509 -954 -1711 -1286 -11 1324 1730 1053
6298 1053 -337 -1424 -1565 -579 797 1632 1360 126 -1092 -1610 -1011 291 1359 1553 664 -652 -1551
6315 -1551 -1337 -233 1062 1661 1118 -236 -1412 -1668 -910 533 1502 1427 255 -1099 -1732 -1328 -80
6332 -80 1183 1683 926 -450 -1518 -1577 -560 679 1481 1251 36 -1319 -1805 -1180 105 1141 1350 469
6350 469 -847 -1728 -1511 -336 1014 1557 1016 -205 -1368 -1599 -790 566 1493 1335 270 -1035 -1754
6367 -1754 -1315 -53 1143 1525 823 -555 -1603 -1568 -514 880 1668 1268 110 -1158 -1595 -1034 263
6384 263 1345 1448 486 -862 -1647 -1432 -326 919 1553 1082 -241 -1294 -1434 -602 704 1690 1637 582
6402 582 -778 -1383 -915 314 1452 1703 1038 -345 -1324 -1353 -321 957 1714 1362 219 -1044 -1429 -716
6420 -716 553 1539 1650 771 -540 -1344 -1174 -29 1190 1690 1094 -91 -1283 -1482 -641 709 1551 1399
6438 1399 376 -861 -1487 -1062 178 1365 1631 852 -463 -1347 -1375 -454 863 1593 1164 -46 -1127
6455 -1127 -1516 -885 324 1408 1493 512 -780 -1468 -1237 -187 996 1481 897 -391 -1450 -1557 -811 493
6473 493 1388 1253 188 -1090 -1666 -1079 57 1187 1456 736 -576 -1557 -1475 -435 762 1378 1003 -125
6491 -125 -1274 -1658 -963 289 1257 1317 452 -734 -1432 -1185 -42 1119 1585 1031 -167 -1267 -1431 -582
6509 -582 658 1413 1147 144 -1067 -1655 -1178 56 1201 1391 678 -535 -1342 -1283 -299 1072 1651 1254
6527 1254 133 -978 -1368 -768 440 1411 1416 454 -782 -1491 -1291 -291 899 1414 732 -434 -1336 -1413
6545 -1413 -676 539 1355 1194 96 -1047 -1439 -944 119 1166 1392 616 -652 -1486 -1322 -320 900
6562 900 1478 1110 -126 -1262 -1501 -755 401 1288 1353 444 -833 -1526 -1120 -89 932 1333 918 -263
6580 -263 -1312 -1426 -487 704 1323 1140 210 -962 -1460 -878 259 1228 1351 523 -586 -1419 -1255 -147
6598 -147 951 1461 978 -60 -1059 -1394 -653 714 1534 1371 414 -597 -1280 -1092 -7 1207 1577 824
6616 824 -336 -1162 -1292 -528 698 1432 1235 176 -823 -1225 -774 265 1337 1461 601 -492 -1133 -989
6634 -989 -191 896 1507 1026 -226 -1220 -1281 -573 461 1310 1398 458 -858 -1410 -910 135 1093 1481 924
6653 924 -255 -1247 -1244 -381 659 1309 1195 195 -1011 -1453 -798 248 1004 1195 609 -521 -1390 -1191 -92
6672 -92 933 1222 770 -143 -1075 -1393 -607 651 1323 1079 165 -778 -1377 -1048 58 1112 1265 586 -483
6691 -483 -1336 -1465 -617 646 1249 829 -170 -1062 -1427 -1066 70 1134 1165 302 -713 -1259 -1056 -303 793
6710 793 1306 815 -361 -1190 -1204 -590 400 1145 1060 112 -988 -1383 -955 -54 921 1249 553 -661 -1428 -1224
6730 -1224 -311 572 1181 1002 20 -1144 -1413 -677 373 1058 1217 546 -512 -1254 -959 113 992 1275
6748 1275 823 -138 -997 -1169 -402 678 1192 992 199 -795 -1280 -825 335 1184 1223 603 -297 -1059 -1085 -183
6768 -183 980 1434 1003 -9 -841 -1128 -667 383 1283 1216 295 -694 -1203 -965 -74 935 1316 740 -346
6787 -346 -1038 -1097 -489 511 1217 1053 81 -926 -1240 -738 143 983 1238 519 -562 -1242 -1012 -127 805
6806 805 1294 943 -30 -982 -1172 -547 435 1088 1073 310 -747 -1305 -951 30 859 1165 677 -254 -1061 -1119
6826 -1119 -344 709 1255 989 165 -802 -1204 -708 288 1119 1136 452 -487 -1174 -1045 -202 818 1273 869
6845 869 -73 -834 -1038 -456 521 1309 1191 394 -627 -1057 -758 55 903 1194 592 -402 -1117 -1080 -341 577
6865 577 1177 918 37 -897 -1158 -659 265 993 1137 421 -641 -1267 -1020 -227 666 1022 608 -312 -1135 -1358
6885 -1358 -629 291 937 869 157 -775 -1251 -919 9 828 1040 446 -405 -1089 -1127 -338 591 1096 778 -68
6905 -68 -949 -1140 -660 292 1059 1064 323 -635 -1126 -957 -158 706 1120 670 -279 -1106 -1160 -631 315 1019 934 120
6927 120 -707 -1080 -730 79 937 1148 607 -341 -1014 -892 -203 635 1018 787 -47 -871 -1096 -568 305 964
6947 964 1002 417 -513 -1041 -743 103 1003 1288 827 -34 -865 -979 -323 542 1084 911 158 -756 -1171 -874
6967 -874 24 813 985 427 -393 -957 -910 -238 654 1092 796 65 -766 -935 -463 394 1051 971 292 -577 -959
6988 -959 -788 25 853 1156 648 -214 -873 -874 -265 528 1150 959 196 -704 -1013 -608 155 845 1003 478 -397
7009 -397 -1000 -844 -147 588 1042 775 -50 -798 -942 -450 294 937 877 278 -611 -1017 -769 5 765 939
7029 939 579 -232 -914 -957 -275 567 1042 861 86 -678 -1067 -696 90 776 884 297 -515 -1100 -1059 -302 523
7050 523 872 569 -185 -821 -974 -503 312 969 899 289 -474 -906 -667 45 800 992 475 -354 -924 -959 -365
7071 -365 435 902 755 -23 -770 -1014 -562 169 832 977 424 -386 -941 -748 -118 592 914 684 -110 -819
7091 -819 -978 -407 361 846 757 170 -560 -964 -692 45 703 857 471 -296 -903 -880 -318 464 867 639 -36
7112 -36 -713 -1035 -601 147 781 837 305 -461 -925 -822 -168 586 884 566 -164 -817 -953 -505 256 829 723
7133 723 126 -609 -955 -735 -18 671 843 373 -358 -882 -822 -331 417 818 615 -63 -698 -889 -516 154
7153 154 766 851 361 -400 -833 -603 38 684 994 704 -1 -599 -764 -218 477 962 846 256 -443 -763
7173 -763 -474 169 756 943 564 -165 -743 -655 -75 604 943 717 59 -546 -772 -345 350 853 854 334 -308
7194 -308 -783 -655 -11 681 947 568 -130 -662 -802 -362 396 797 685 111 -546 -795 -564 38 695 815
7214 815 339 -272 -730 -714 -207 473 850 626 -79 -697 -852 -463 102 659 694 147 -572 -915 -686 -230 399
7235 399 675 387 -293 -863 -853 -386 199 649 637 30 -646 -909 -528 81 582 701 347 -331 -779 -669 -84
7256 -84 504 708 575 -16 -659 -810 -390 270 695 641 160 -404 -880 -655 4 604 777 404 -144 -690 -761
7277 -761 -304 410 818 660 61 -494 -839 -583 50 611 688 203 -397 -759 -729 -192 423 835 564 -83 -558
7298 -558 -608 -305 336 814 786 215 -453 -709 -464 41 586 771 410 -296 -749 -729 -242 285 722 631 63
7319 63 -587 -758 -432 163 570 748 402 -292 -743 -614 -42 444 701 481 -54 -608 -687 -256 328 670 573
7340 573 193 -328 -714 -505 107 636 696 354 -149 -690 -714 -217 472 804 518 45 -407 -673 -464 188 740
7361 740 711 233 -305 -633 -593 -169 453 711 391 -151 -605 -671 -373 176 661 585 90 -500 -676 -439 62
7382 62 556 676 318 -292 -652 -555 -184 354 637 479 -7 -600 -700 -336 181 650 707 388 -231 -580 -400
7403 -400 133 595 829 601 95 -496 -576 -121 323 641 501 175 -430 -689 -504 82 545 570 225 -230 -542
7424 -542 -604 -114 463 690 457 -7 -433 -606 -341 208 663 588 133 -364 -688 -540 -76 487 677 329 -215
7445 -215 -589 -622 -308 217 589 540 17 -521 -705 -440 -8 402 529 179 -350 -675 -573 -187 333 550 381
7466 381 -145 -618 -705 -387 56 420 411 -27 -564 -832 -643 -132 302 489 275 -207 -632 -655 -202 346 628
7487 628 454 97 -336 -594 -380 144 590 568 223 -301 -555 -491 -130 419 632 421 -33 -440 -487 -239 317
7508 317 689 618 193 -252 -457 -375 87 586 652 347 -143 -507 -409 -94 368 632 586 100 -395 -496 -246 223
7530 223 601 639 290 -190 -513 -398 0 400 590 382 -97 -476 -589 -207 264 527 479 145 -305 -602 -355
7551 -355 150 500 552 298 -103 -504 -576 -134 360 572 380 5 -467 -594 -303 170 511 499 135 -285 -538
7572 -538 -458 -41 414 564 298 -164 -460 -517 -291 232 582 467 10 -381 -509 -355 47 487 576 273 -194
7593 -194 -536 -485 -163 273 497 352 -95 -505 -568 -304 123 401 443 139 -341 -534 -346 53 360 507 366
7614 366 -98 -473 -499 -166 272 505 408 69 -383 -554 -370 68 428 438 199 -231 -551 -492 -142 302 444
7635 444 328 -33 -458 -557 -299 140 411 406 59 -322 -524 -390 -21 398 483 227 -170 -445 -414 -153 294 536
7657 536 404 -10 -348 -507 -321 109 459 516 181 -219 -485 -402 -57 328 561 357 -55 -369 -448 -188 235
7678 235 480 430 57 -292 -479 -293 46 326 460 199 -216 -525 -487 -155 166 371 286 -59 -469 -572 -295
7699 -295 118 393 393 122 -234 -494 -368 17 347 485 310 -58 -405 -458 -176 202 463 373 69 -262 -479
7720 -479 -330 104 382 420 219 -134 -418 -354 -76 279 464 348 -11 -386 -445 -226 155 434 410 95 -306
7741 -306 -446 -362 -4 346 503 321 -52 -339 -340 -113 302 577 480 168 -219 -326 -181 179 442 487 237 -111
7763 -111 -382 -293 -1 292 413 337 -76 -348 -409 -207 191 394 351 84 -265 -482 -294 28 305 412 178
7784 178 -192 -450 -417 -142 185 420 260 -66 -364 -471 -278 54 286 351 67 -277 -439 -393 -69 246 353
7805 353 173 -81 -401 -421 -137 155 358 257 17 -304 -429 -324 -17 285 337 123 -230 -442 -369 -86 181
7826 181 359 277 -14 -313 -373 -206 139 355 351 134 -248 -406 -288 -9 236 371 148 -160 -408 -397 -144 165
7848 165 327 300 67 -247 -324 -198 139 428 394 192 -111 -310 -323 -38 280 390 258 -63 -325 -392 -204 105
7870 105 338 303 36 -205 -367 -286 -44 292 374 169 -156 -320 -408 -189 188 368 237 -28 -315 -357 -217 56
7892 56 305 280 112 -160 -370 -237 -9 287 398 229 -55 -324 -308 -125 167 367 337 72 -245 -351 -199
7913 -199 72 307 385 220 -107 -322 -314 -63 269 330 209 -3 -257 -388 -168 112 340 281 119 -136 -281 -250
7935 -250 1 292 366 194 -39 -257 -289 -114 183 309 234 -41 -201 -295 -223 8 330 350 113 -126 -254 -195
7957 -195 -32 234 357 228 -20 -265 -300 -120 113 252 244 -7 -273 -370 -249 -6 222 303 146 -137 -315 -303
7979 -303 -81 193 307 267 70 -251 -335 -151 104 261 270 120 -115 -343 -265 -30 192 278 167 -63 -260 -325
8001 -325 -101 114 234 167 -12 -235 -352 -247 8 250 209 63 -161 -357 -310 -100 199 317 200 -48 -228
8022 -228 -267 -156 57 262 261 13 -194 -288 -270 -102 163 252 81 -182 -338 -267 -133 103 218 234 26 -246 -301
8045 -301 -135 44 222 265 65 -201 -333 -248 -29 157 251 202 -47 -274 -281 -98 167 297 258 38 -165 -244 -175
8068 -175 85 270 289 153 -64 -236 -206 -40 201 277 196 21 -158 -264 -116 125 325 233 131 -123 -237 -209
8090 -209 45 261 258 148 -122 -284 -233 -71 154 316 239 20 -195 -230 -122 66 238 342 127 -108 -287 -198
8112 -198 0 180 231 215 -19 -246 -253 -58 117 293 252 46 -158 -299 -143 94 238 238 111 -120 -287 -211 -92
8135 -92 119 235 117 -66 -259 -322 -187 84 237 184 51 -130 -287 -228 -35 216 226 81 -123 -254 -245 -150 108
8158 108 287 186 -4 -198 -274 -174 31 269 290 154 -143 -237 -147 62 222 316 230 -34 -181 -247 -70 125
8180 125 275 251 33 -166 -305 -231 -13 151 203 81 -141
8191a41
$$ Imaginary data points
##PAGE= N=2
##DATA TABLE= (X++(I..I)), XYDATA
0 0 0 0 0 0 0 0 0 0 0 0 16 -16 17 -17 32 -48 48 -64 80 -97 113 -129 157 -188 211 -258 292 -339 393 -453 518
31 518 -592 674 -763 865 -969 1093 -1228 1369 -1527 1703 -1891 2099 -2325 2575 -2847 3139
47 3139 -3461 3819 -4204 4632 -5105 5623 -6207 6852 -7583 8413 -9362 10463 -11752
60 -11752 13291 -15174 17525 -20561 24663 -30527 39652 -55950 94050 -376420 160048 618030
72 618030 -547160 -760237 -225959 -369901 -1286265 -1022727 252147 834769 231305 -103678
82 -103678 176036 293236 36137 155836 570220 684958 410329 176519 3170 -55734
92 -55734 172166 462984 240727 -260066 -361110 -152763 -236552 -319120 169524 682504 306619
103 306619 -464930 -556758 -137724 -34407 -31439 428357 800944 347241 -354788 -415593 -115631
114 -115631 -44609 108874 590142 709242 122324 -333418 -125832 99642 -36700 71404
124 71404 533023 484281 -201190 -475431 -5356 267315 -42347 -173178 110670 62097
134 62097 -433700 -514262 31969 380465 168395 -68952 -81064 -183960 -340776 -157660
144 -157660 263775 458927 370406 197679 -89037 -406805 -341395 132099 428171 307481
154 307481 193010 208053 -46107 -460212 -357350 233179 470132 130715 -103948 5626
164 5626 -63659 -379643 -336941 112443 262634 -96532 -375956 -285429 -173892 -181612 -45332
175 -45332 194992 176624 -87679 -226797 -135301 25470 231470 460124 464965 164377 -109482
186 -109482 -123608 -53919 -12050 158449 370194 239218 -212680 -476492 -364807 -215637
196 -215637 -174721 -27098 167055 53288 -297509 -399495 -150047 80099 148222 235999
206 235999 302978 139874 -97646 -57191 197237 317970 262235 209446 114374 -122994 -285574
217 -285574 -145406 97748 128764 -4441 -110282 -226180 -395259 -409867 -149566 129647
227 129647 159066 20372 -95992 -177346 -220291 -104697 159258 337730 286535 117580 -24412
238 -24412 -104357 -84209 67023 230079 232701 84422 -72603 -172888 -207027 -119952 66415
249 66415 166426 60409 -124923 -217071 -210528 -145843 4384 182364 201142 12727 -181526
260 -181526 -210791 -120883 -667 140338 237084 159759 -59125 -205793 -166769 -35133 88848
271 88848 188530 207507 72236 -129658 -203144 -102845 37754 120515 142228 78930 -85399
282 -85399 -235862 -220434 -62200 74895 101111 44995 -59965 -180584 -220876 -107132 82442
293 82442 190238 156427 41926 -76264 -141939 -101492 44887 196392 231529 128190 -31834
304 -31834 -147551 -156552 -54019 95903 188633 154814 17860 -127415 -182508 -110187 37132
315 37132 154111 163231 67357 -67580 -158330 -143084 -23911 114955 166621 98846 -26068
326 -26068 -121889 -134267 -48104 100011 214214 205527 85706 -41514 -84947 -28268 91990
337 91990 210841 245074 149394 -18388 -135327 -130097 -33116 78057 136854 100280 -26227
348 -26227 -162804 -202642 -114331 30860 136252 153071 84590 -27308 -105532 -77660 49869
359 49869 181810 220314 147498 18631 -92313 -125781 -59249 62784 141570 104699 -23953
370 -23953 -150982 -197797 -146750 -31226 82045 116856 40665 -91642 -176230 -152476 -46042
381 -46042 70408 131078 98679 -16166 -140614 -179987 -102530 27799 115009 109928 24906
392 24906 -89924 -163376 -134782 -12727 112568 146079 73779 -42687 -131230 -146026 -74416
403 -74416 44106 121269 88212 -31801 -147395 -186230 -136899 -30552 74910 107645 34293
414 34293 -89653 -161542 -128291 -21043 92638 153616 124271 14849 -98074 -124383 -46391
425 -46391 68753 139983 128423 40579 -77812 -151018 -122639 -14093 89965 117125 57061
436 57061 -48086 -132757 -138154 -53118 66613 137714 115172 20276 -80769 -118033 -61824 50959
448 50959 141554 149903 74191 -36430 -111738 -97384 337 107696 144580 91178 -12109 -107015
460 -107015 -138756 -76564 44163 128433 109979 15310 -82127 -132589 -112337 -17715 98752
471 98752 140821 69856 -44716 -112780 -109383 -49804 45975 123775 108287 625 -101008 -117272
483 -117272 -61679 18963 95573 123312 57371 -61095 -121834 -78011 12396 86443 123306 96539
495 96539 -8415 -119643 -130373 -36364 66571 114357 106841 42057 -68021 -139980 -92883
506 -92883 32341 123861 136135 91848 7137 -86847 -109674 -24390 87256 126310 90144 21473
518 21473 -63396 -126495 -96029 18234 99584 78496 9832 -45239 -88542 -97649 -18564 106511
530 106511 147196 67377 -30884 -71859 -72470 -37595 52895 139867 119654 1348 -101019 -124415
542 -124415 -86877 -4246 98014 138028 68768 -36168 -85664 -77537 -29405 71748 171321
553 171321 150818 17312 -75256 -59963 -26513 -12683 48517 120109 59901 -104793 -168187
564 -168187 -73935 14105 17757 33095 69769 8508 -124462 -139795 -2918 107637 99914 59847
576 59847 26513 -54701 -140596 -109168 18260 96369 77656 23381 -47691 -132666 -148158 -44397
588 -44397 76251 104655 71836 33341 -33612 -106544 -77244 52230 126715 77991 6522 -30813
600 -30813 -83603 -124473 -57460 63083 76303 -16830 -77072 -82595 -102188 -84999 40821 150843
612 150843 92622 -38452 -68511 -39332 -55168 -31335 105590 180726 46002 -127757 -133176
623 -133176 -60381 -60931 -49355 63158 116646 -16911 -163444 -134241 -24242 13605 26425
634 26425 77384 73174 -31815 -105174 -59598 19326 57822 76865 58067 -36502 -119160 -80459
646 -80459 13381 46766 57931 97113 62020 -84747 -150884 -19043 125727 115484 66944
657 66944 90283 54582 -100930 -162449 -11881 133610 97217 14396 13771 -13843 -118207 -127587
669 -127587 18936 122702 71958 3455 2561 -18266 -61382 -7464 109296 117705 18910 -31922
681 -31922 -19648 -37523 -41854 51925 133866 62122 -68116 -93740 -55417 -47077 -3206 115968
693 115968 159452 40358 -84098 -83843 -44102 -28427 45443 157417 137317 -18437 -105668
704 -105668 -64508 -36560 -42297 34000 132224 73970 -79219 -102709 -5620 23014 -10188 35361
716 35361 98362 23488 -98827 -71422 49642 75189 21766 12753 5680 -80264 -138586 -55375
728 -55375 63449 78069 32167 -346 -62489 -147293 -127675 9976 105624 90089 57934 33522
740 33522 -53132 -139531 -80260 71004 124204 68877 38741 28784 -48657 -114706 -40577 82636
752 82636 83114 2583 -18824 -7290 -43979 -56456 26646 89770 27897 -56606 -51069 -18525 -20390
765 -20390 15945 101375 101423 -17500 -101553 -72705 -27710 -8596 56256 133988 88157 -59002
777 -59002 -132507 -87322 -33450 674 70825 121952 50363 -79166 -116154 -62657 -20138 8865
789 8865 62723 76897 -3498 -84233 -67574 -10924 4603 12967 41735 23700 -52156 -75263
801 -75263 -3266 59654 49923 27166 17252 -31244 -92570 -64285 40885 95107 59255 8182
813 8182 -34182 -97331 -131208 -61992 51251 87051 42716 -4970 -48105 -102939 -107037 -16233
825 -16233 82149 90053 39097 305 -33902 -72137 -56294 24531 75675 40391 -17852 -39452
837 -39452 -46853 -49575 -10778 48930 49454 -13121 -54958 -42163 -15635 13880 65837 99012 53405
850 53405 -32409 -66146 -35719 6493 46973 90240 89932 12815 -77233 -95534 -47925 9105
862 9105 55796 84148 59879 -15822 -73162 -60604 -6999 40485 71237 73942 28729 -36788
874 -36788 -57847 -21146 23037 42368 44413 25064 -24512 -65564 -45564 19186 62671 58975
886 58975 31178 -5426 -43339 -49229 932 69536 95155 64527 9186 -41221 -64284 -39397
898 -39397 22229 71558 71829 31723 -21358 -64133 -68457 -19282 48935 77128 50254 3110 -34780
911 -34780 -54761 -41796 10359 61907 59047 4320 -47811 -61649 -43999 -9269 31849 53174
923 53174 28456 -26628 -63348 -51969 -5592 43320 67203 51794 4281 -45379 -64460 -41048
935 -41048 9444 53182 56325 11434 -49959 -83283 -69769 -24849 23640 50402 37018 -11589
947 -11589 -58934 -64944 -25340 27408 58394 53188 17094 -29377 -56868 -44973 -2211 39245
959 39245 48236 16773 -34856 -71589 -68312 -29126 18114 44332 34246 -7769 -55090 -70486
971 -70486 -37643 18983 57242 55061 20634 -24189 -55103 -50048 -7375 42778 61055 35371
983 35371 -12220 -49968 -57305 -29869 17110 52523 49530 9688 -37428 -58545 -39391 7126
995 7126 49631 58988 29717 -16530 -48593 -45271 -7431 40659 65213 47643 2076 -38393 -49118
1008 -49118 -25869 17304 53825 56284 19674 -29774 -57022 -46443 -7925 34719 54332 34267
1020 34267 -13060 -51902 -54104 -21698 22312 52150 48451 9861 -37028 -55106 -32346 9447
1032 9447 42071 49495 26422 -18148 -53790 -49641 -8853 34311 51766 38558 2647 -38378
1044 -38378 -55056 -28976 20528 53224 48292 14580 -27439 -54962 -46871 -4416 39248 49865
1056 49865 24893 -14067 -45217 -50725 -20976 27377 56279 44321 7137 -27621 -43810 -31888
1068 -31888 7919 49680 56042 21089 -23309 -47076 -43001 -13925 28835 55684 39613 -6573
1080 -6573 -41738 -42929 -17383 20014 52995 57349 22770 -23481 -43214 -27661 5478 38662
1092 38662 55237 37561 -8047 -44365 -41948 -9572 27064 51793 51634 18066 -27930 -44321
1104 -44321 -17395 23132 47531 50226 29690 -12628 -49577 -44832 -3300 32702 38631 22966
1116 22966 -5120 -39803 -55285 -27004 24380 52630 42513 14108 -16258 -39581 -35209 5418
1128 5418 49254 54287 20975 -19141 -46727 -54509 -32717 10478 37929 23262 -15734 -45862
1140 -45862 -54564 -40639 -4182 35822 44849 15546 -20892 -37346 -32193 -9326 26038 48200
1152 48200 29458 -16277 -46352 -43763 -23401 3627 31499 35645 -444 -46322 -55849 -27696
1164 -27696 5345 28079 40360 27102 -17468 -57264 -51772 -12291 20249 30812 24764 -1816
1176 -1816 -44097 -66855 -43643 2444 31503 33108 16200 -13874 -41468 -37999 -811 35355
1188 35355 43463 29152 4027 -26017 -40757 -18667 21383 36729 18827 -6128 -25952 -42990
1200 -42990 -39427 373 44523 46001 10561 -18698 -27578 -26202 -6770 37303 69927 51821 2366
1213 2366 -28970 -30066 -16799 9383 44913 56639 23627 -22260 -39535 -29013 -9330 17519
1225 17519 42506 36269 -3910 -36175 -32348 -10430 8381 25952 33720 10450 -29917 -42163
1237 -42163 -15279 16375 30914 34748 23920 -9493 -38623 -26467 15072 43684 47693 38744
1249 38744 12440 -29284 -47681 -16852 27776 41751 31324 16754 -11809 -51007 -55906 -9616
1261 -9616 35434 35098 12542 -1158 -17637 -39207 -29564 17381 48562 31537 -594 -14405 -19401
1274 -19401 -20427 255 33111 37235 5856 -24293 -33583 -30538 -13114 21565 41879 18454 -23155
1287 -23155 -40436 -35399 -25712 -488 39810 49777 6688 -39914 -42205 -20285 -5602 14703 44640
1300 44640 43174 -3266 -41122 -30385 -185 16013 28095 38975 21866 -18293 -34365 -10937
1312 -10937 16005 25576 29222 21529 -12104 -43842 -32423 5906 23666 18219 12519 -3502 -41106
1325 -41106 -60566 -27040 21602 32463 15322 2725 -13385 -40792 -42857 169 43374 44433
1337 44433 21649 3899 -14386 -30444 -15900 24286 43059 23858 -787 -14751 -30369 -35320
1349 -35320 -6335 29899 24620 -11657 -30451 -27190 -27181 -18861 17433 46675 25148 -20160 -34910
1362 -34910 -20408 -7647 8201 37499 47265 11607 -33137 -42236 -24859 -7370 12599 32454
1374 32454 22983 -17536 -45561 -37097 -16400 -1804 15427 25757 4407 -32300 -39115 -13141
1386 -13141 7879 13057 18061 14725 -12691 -37481 -23261 13671 32046 28629 20701 2506 -27414
1399 -27414 -35676 -3653 33468 40186 27412 11571 -15874 -46314 -41227 1923 33532 26828 8109
1412 8109 -4312 -24435 -43967 -28179 16706 39996 24074 2686 -4507 -10930 -14442 4335 33253
1425 33253 35851 10415 -11077 -14949 -10158 2944 24776 34051 14267 -14820 -26054 -19523 -4228
1438 -4228 21320 45761 40217 3371 -27567 -28796 -13605 4770 29375 46820 30317 -11739
1450 -11739 -38151 -31216 -10613 9127 28969 36349 15471 -16314 -25220 -9177 9036 21417
1462 21417 30337 24358 -1529 -21539 -12604 9376 17482 13183 6632 -8644 -31892 -36853 -10661
1475 -10661 19341 24053 8896 -8552 -25438 -36649 -24986 9553 38471 39003 17339 -9327
1487 -9327 -29621 -31993 -10345 20194 34946 26413 4938 -19539 -36655 -31414 -4268 19306 18596
1500 18596 2121 -12363 -22365 -26884 -15897 8038 20109 6123 -16234 -24598 -18644 -7070
1512 -7070 8565 22327 18618 -4645 -26665 -28318 -11327 11932 30149 31628 11331 -17709 -33691
1525 -33691 -28039 -7843 15819 31132 24254 -4007 -31615 -37175 -22232 -1150 16911 25200 14889
1538 14889 -9909 -27241 -21339 -587 17130 23918 18909 3319 -13709 -16918 -2439 15981 23812
1551 23812 17411 717 -17777 -24876 -12587 9493 23384 20622 5217 -15177 -30115 -26864 -3685
1564 -3685 21920 30137 18034 -3212 -22182 -29087 -16883 8906 29178 28633 10631 -10968 -23902
1577 -23902 -20936 -2765 18185 25616 15050 -3620 -18382 -21957 -11049 8692 21554 15680 -2815
1590 -2815 -18374 -22411 -14542 2343 19476 22101 5324 -16940 -26932 -19906 -2892 15539 25121
1603 25121 16633 -5826 -24498 -25582 -10664 9770 25568 26777 10303 -12037 -22145 -14095 3477
1616 3477 20006 27597 19512 -2256 -21295 -21835 -6340 10204 18321 15367 613 -18864 -27071
1629 -27071 -15056 6241 19924 19985 9153 -7186 -19209 -14780 5028 23997 28901 19702 2702
1642 2702 -14557 -20247 -7056 14715 26067 20308 5030 -11627 -23088 -19133 1717 22694 25255
1655 25255 11169 -5096 -15481 -17103 -5247 16012 28556 20086 672 -13099 -16391 -10223 5657
1668 5657 22979 24750 7681 -11629 -18700 -14039 -1708 15206 25328 15631 -7366 -22800 -21236
1681 -21236 -10075 3625 15904 16224 -1464 -23224 -28845 -17297 -1712 11040 17948 11379 -8263
1694 -8263 -22840 -17606 -259 13979 20818 19003 3987 -17056 -24379 -11060 6643 14258 12468
1707 12468 3236 -14449 -29586 -24813 -3176 13374 14366 7024 -3918 -17848 -23746 -9898 12632
1720 12632 21720 13591 382 -12281 -22743 -20923 -2585 15295 14622 -77 -13933 -22593 -24366
1733 -24366 -12268 9502 20526 10544 -6227 -15099 -16772 -11648 4342 22055 21633 2663 -14027
1746 -14027 -17202 -13211 -4634 10985 21938 12421 -9591 -20966 -15680 -4849 7014 19900 22269
1759 22269 5799 -14251 -17392 -5340 7537 17194 22454 14582 -5780 -19443 -13311 1984 12440
1772 12440 17439 16263 2787 -16155 -20479 -5695 10410 15984 14994 8182 -7916 -22103 -16630
1785 -16630 3962 17427 15808 8349 -1456 -14502 -19492 -5090 16690 24201 15827 4584 -5096
1798 -5096 -12930 -9731 8202 24404 22652 8601 -4144 -12525 -15356 -5462 13074 21254 10897
1811 10897 -4637 -13148 -15417 -10984 3886 19675 18536 1737 -11661 -12992 -8723 -804 12452
1824 12452 20214 9569 -10531 -19844 -14789 -5974 3404 13155 12946 -3601 -21740 -23138 -10753 1942
1838 1942 11307 16427 9509 -9141 -21462 -14448 2098 13163 17094 15008 3447 -12893 -18084
1851 -18084 -6306 8834 14684 12211 4556 -7770 -17561 -13759 1046 12296 12514 5576 -4697
1864 -4697 -14701 -15245 -1831 13997 17809 10121 -223 -9856 -15821 -9485 8648 21331 15934 1088
1878 1088 -9861 -15775 -16990 -7078 11330 20302 9911 -7030 -15411 -14998 -9801 2135 16655 19580
1892 19580 6583 -8237 -11970 -6543 2211 11806 16861 10197 -4124 -12678 -9827 -1538 6471 11604
1906 11604 8542 -4634 -17397 -17320 -6416 4392 10195 10602 2253 -13553 -23269 -15970 750 12193
1920 12193 13956 8490 -3498 -17461 -21271 -9429 7288 15376 12882 3944 -8095 -17122 -14569
1933 -14569 -1715 9455 10644 4739 -4059 -13335 -16445 -7900 5215 9423 2997 -5084 -10229 -12667
1947 -12667 -8304 5073 16466 13115 -572 -10148 -10896 -6904 1897 14552 20193 9878 -7724
1960 -7724 -16857 -14145 -5854 4963 15317 15975 3180 -12143 -16665 -9781 1077 11561 17361 12691
1974 12691 -523 -10328 -8830 -158 8227 13007 11436 2042 -8726 -10396 -2506 6612 10943 10419
1988 10419 3919 -6698 -12140 -5434 7576 15504 15356 9679 -872 -12160 -13562 -1228 13021
2001 13021 16699 11023 2027 -8631 -17018 -13568 1886 14686 14076 5443 -2385 -8371 -11136 -4597
2015 -4597 9224 16903 11304 547 -5801 -7124 -4492 3344 11924 11786 1712 -8719 -11528 -7273
2029 -7273 1200 10055 12663 5103 -6739 -13131 -11147 -3275 7180 14580 11472 -1219 -12514 -14052
2043 -14052 -8160 195 9107 13552 6942 -6935 -14843 -10884 -1850 5294 9833 9448 527 -11148
2057 -11148 -13603 -5074 4343 7548 5951 449 -8635 -15003 -10862 666 8541 8056 2487 -5305 -12607
2072 -12607 -12996 -3420 8929 13510 9052 443 -8225 -13075 -9153 2392 11625 10939 2877 -6208 -12457
2087 -12457 -12822 -5326 5071 9036 4005 -4229 -9916 -11275 -6825 2679 9704 7470 -1283 -8011 -9255
2102 -9255 -6048 1554 10547 12931 4684 -6659 -11183 -7697 -377 8021 14002 11516 148 -10473
2116 -10473 -11668 -4843 3975 10812 12616 6431 -4534 -11183 -8922 -1228 6217 10023 7798 -487
2130 -487 -8596 -9414 -3134 4112 7857 7196 1522 -6642 -10108 -4603 4878 9964 8643 3168 -4510 -10457
2146 -10457 -9161 272 9994 12173 6747 -2120 -10150 -13112 -7607 3369 11084 10272 3078 -5745 -11665
2161 -11665 -10575 -1814 8183 11502 7357 371 -5561 -7769 -3800 4741 10333 7771 214 -5538 -7112
2176 -7112 -5052 661 7018 7566 502 -8016 -10826 -7458 -663 6700 10300 6239 -3400 -10551 -10092
2191 -10092 -3367 5601 12370 12352 4333 -5758 -9990 -6478 1225 8903 13076 10053 848 -6989 -7215
2206 -7215 -1346 5278 9470 9397 3899 -4350 -7997 -4138 2852 6987 6691 2533 -4164 -8709 -6417 1563
2222 1563 8269 9225 5442 -1185 -7395 -8223 -1268 7984 11774 8751 1858 -5917 -11211 -9336 -327
2237 -327 7912 8328 2498 -4727 -10321 -11955 -6757 2954 8765 6256 -383 -5702 -7703 -5549 1027
2252 1027 7736 8159 2046 -4681 -7604 -6466 -1860 4626 7428 2756 -5236 -9554 -8412 -3905 2614
2267 2614 8305 7552 -502 -8585 -9864 -5473 545 6233 8624 4107 -5526 -11858 -10015 -3769 2159
2282 2159 5788 5293 -1217 -9090 -10820 -5364 1465 5723 6864 3666 -3588 -8602 -5838 1670 6698
2297 6698 7212 4929 -393 -6931 -8233 -1644 6335 8500 5606 1088 -4384 -8277 -5651 3119 9517
2312 9517 8211 2829 -2668 -7071 -7891 -2234 6267 9261 4919 -1313 -5631 -7563 -5179 2476 9067
2327 9067 7850 1282 -4036 -5828 -5248 -745 6391 9140 3760 -4075 -7355 -6224 -3275 2093 7469
2342 7469 6519 -1137 -7460 -7041 -2893 1876 7072 9795 5569 -2803 -6552 -3189 2160 6225 8965
2357 8965 8002 898 -6790 -7172 -1557 3513 5767 6178 2707 -4732 -9074 -5396 1867 5784 6020 4239
2373 4239 -619 -6747 -7295 -617 6057 7096 4677 1132 -4209 -8078 -5049 3014 7548 5516 1258
2388 1258 -2639 -6516 -7144 -1108 6612 7991 3405 -1284 -4250 -6029 -3637 3619 8855 6414 102
2403 102 -3863 -5194 -4787 -539 6123 7907 2230 -4393 -6298 -5130 -2735 2276 7127 5499 -1858
2418 -1858 -6997 -5939 -2539 1089 5348 7281 2729 -4682 -7188 -3808 618 3877 6210 4898 -1645
2433 -1645 -7502 -6704 -1673 2488 4561 4852 1109 -5532 -8234 -4164 1803 4538 4686 3078 -1860 -7097
2449 -7097 -6343 48 5110 5303 3411 492 -4257 -7109 -3385 3804 6787 4425 928 -2350 -5794
2464 -5794 -5827 -211 6045 6113 1449 -2762 -5234 -6481 -4088 2045 6019 3429 -2070 -5385 -6071 -4773
2480 -4773 -514 4819 5793 1187 -3742 -5293 -4198 -1379 3206 6240 3759 -2359 -5874 -5123 -2661
2495 -2661 625 4415 5001 -73 -6047 -6940 -3558 125 3086 5160 3550 -2378 -6943 -5387 -355
2510 -355 3342 4859 4683 1267 -4153 -6291 -2731 2573 5226 5250 3180 -949 -4595 -3622 1401 5469
2526 5469 5766 3790 575 -3236 -4633 -1162 4008 5722 3558 204 -2895 -4969 -3512 1764 6389
2541 6389 6094 2305 -1375 -3565 -3564 -36 5652 8153 5337 375 -2975 -4064 -2734 1423 5856 5975
2557 5975 1464 -3147 -4542 -3508 -977 2866 5444 3855 -811 -3793 -2939 -113 2784 4839 4367
2572 4367 737 -3489 -4488 -1980 1626 4070 4049 804 -3987 -6392 -4550 -363 3150 4718 3412 -1061
2588 -1061 -5825 -6515 -2467 2172 4288 3952 1604 -2853 -6546 -5937 -1273 2849 3346 1286 -1520 -4201
2604 -4201 -5257 -2870 1372 3807 2718 -220 -2695 -3301 -1512 2038 4562 3971 933 -2265 -3839
2619 -3839 -2937 543 4517 5344 2093 -2472 -5141 -5035 -2550 1624 5034 4653 274 -4501 -6057 -4219
2635 -4219 -617 3135 4879 3176 -811 -4012 -4101 -1498 1918 4234 3871 895 -2218 -3003 -1381 1096
2651 1096 2837 3038 865 -2784 -4611 -2910 680 2923 2688 737 -2253 -4951 -4917 -1234 3414 5317
2667 5317 3698 202 -3044 -4438 -2786 1255 4959 5672 3067 -1100 -4270 -4597 -1960 1634 3330
2682 3330 2281 -450 -3312 -4826 -3756 -398 2461 2260 -198 -2343 -2835 -1900 356 3052 4200 2189
2698 2189 -1277 -3142 -2169 485 3186 4446 3307 -196 -3719 -4731 -2691 938 3854 4221 1576
2713 1576 -2310 -4535 -3745 -842 2426 4374 3819 686 -2743 -3550 -1484 1308 3021 3120 1513 -1323
2729 -1323 -3215 -2510 385 2748 2962 1414 -966 -2722 -2500 8 2932 4112 2792 17 -2606 -3414
2745 -3414 -1607 1742 3984 3494 1036 -1900 -3750 -3493 -686 2819 4211 2686 -135 -2240 -2719 -1240
2761 -1240 1667 4103 4057 1583 -1101 -2118 -1255 843 3000 3602 1828 -933 -2684 -2196 -219 2107
2777 2107 3336 2278 -507 -2903 -3137 -1425 1037 2864 3052 874 -2321 -3820 -2727 -145 2066
2792 2066 3031 2108 -452 -2890 -3025 -903 1593 2906 2581 691 -1827 -3053 -1969 335 1902 1798
2808 1798 290 -2074 -3831 -3588 -1195 1246 1848 682 -1340 -3203 -3710 -1916 1135 2970 2422 278
2824 278 -1858 -3151 -2720 -456 2010 2517 848 -1590 -3283 -3512 -2211 174 1782 1234 -875 -2562
2840 -2562 -2947 -1971 81 1999 2229 424 -1681 -2442 -1714 -29 1920 2774 1511 -1057 -2741 -2332 -542
2857 -542 1467 2998 2881 850 -1755 -2517 -1158 1031 2744 3354 2300 -257 -2300 -2150 -327 1541
2873 1541 2392 2074 412 -1730 -2400 -1007 1101 2254 2183 1131 -534 -1704 -1037 1184 2800 2787 1571
2890 1571 -69 -1669 -1910 -238 2048 2849 1780 -151 -1833 -2759 -1979 441 2517 2375 656 -1115
2906 -1115 -2276 -2271 -794 1588 2777 1803 -201 -1452 -1716 -1003 691 2360 2362 626 -1115 -1590 -1022 256
2924 256 1691 2254 902 -1213 -2303 -1819 -573 817 1864 1337 -766 -2698 -2668 -1267 312 1554
2940 1554 2085 898 -1401 -2629 -1644 254 1609 2203 1909 309 -1693 -2082 -477 1310 1911 1667 669
2957 669 -981 -2142 -1388 534 1690 1560 688 -519 -1623 -1685 -147 1724 2098 1138 -94 -1211 -1778
2974 -1778 -945 1022 2350 1828 228 -1041 -1777 -1658 -222 1710 2155 819 -753 -1547 -1657 -994 630
2991 630 2008 1519 -217 -1477 -1580 -1119 -118 1241 1770 518 -1356 -1987 -1348 -386 632 1504 1142
3008 1142 -565 -1948 -1683 -434 684 1526 1702 621 -1159 -1788 -793 481 1214 1528 1042 -525 -2054
3025 -2054 -1940 -482 688 810 559 -293 -1657 -2408 -1432 279 1091 769 81 -774 -1704 -1517 -52 1371
3043 1371 1418 542 -373 -1242 -1677 -782 805 1533 853 -333 -1113 -1579 -1427 -106 1415 1484 253 -836
3061 -836 -1238 -1150 -417 927 1827 1173 -317 -1068 -920 -389 499 1574 1774 554 -802 -1043 -406 339 1094
3080 1094 1665 1030 -484 -1403 -978 -6 647 1152 1114 42 -1315 -1499 -431 699 1221 1266 854 -302
3098 -302 -1175 -600 685 1557 1576 1207 334 -705 -974 5 1199 1512 1134 476 -376 -1082 -648 719 1562
3117 1562 1308 556 -79 -687 -797 83 1291 1589 703 -265 -803 -995 -696 311 1192 837 -324 -1116 -1261
3136 -1261 -1057 -284 822 1166 356 -776 -1144 -860 -337 468 1207 960 -279 -1240 -1169 -573 59 595 782
3155 782 34 -1081 -1561 -997 -135 438 715 444 -526 -1338 -1186 -183 637 895 762 76 -984 -1329 -628
3174 -628 424 830 670 175 -631 -1376 -1279 -226 659 730 221 -391 -1007 -1277 -664 461 1030 642 -28 -597
3194 -597 -891 -634 221 1132 1114 316 -390 -704 -637 -41 840 1312 694 -283 -856 -803 -430 332 1067 997 22
3215 22 -938 -1122 -727 -54 698 1040 573 -397 -970 -758 -127 545 998 925 180 -713 -812 -230 396 776 784 260
3237 260 -603 -1112 -758 120 623 623 251 -480 -1067 -1064 -303 649 959 691 1 -743 -1090 -647 302 959 905 353
3259 353 -398 -958 -934 -236 680 969 536 -13 -536 -696 -325 399 952 809 204 -415 -544 -283 230 753
3279 753 836 222 -529 -843 -613 -6 630 992 565 -262 -823 -769 -192 612 1222 1139 483 -442 -808 -429 246
3300 246 819 1058 743 -55 -778 -799 -289 354 632 578 111 -520 -689 -340 306 721 637 185 -328 -593 -354
3321 -354 289 841 821 331 -294 -746 -690 -66 718 1071 716 -36 -670 -902 -532 224 893 897 356 -424 -896
3342 -896 -912 -341 288 638 355 -265 -748 -849 -534 69 427 435 -78 -566 -683 -310 171 509 505 48 -582 -924
3364 -924 -663 -13 565 597 223 -507 -1038 -1028 -440 342 770 655 23 -705 -1009 -723 27 627 760 397 -273
3385 -273 -808 -901 -366 282 602 355 -147 -533 -740 -429 179 579 485 -51 -560 -741 -452 135 604 635 136
3406 136 -515 -880 -720 -107 673 933 585 -124 -674 -700 -303 426 999 1065 496 -322 -672 -461 122 742 940
3427 940 641 -112 -619 -637 -195 470 725 535 63 -570 -694 -264 302 800 740 243 -399 -781 -466 198 778
3448 778 891 456 -243 -819 -789 -192 592 1011 744 49 -604 -913 -583 207 804 933 360 -360 -810 -763 -151
3469 -151 572 892 553 -121 -694 -809 -401 369 882 686 49 -612 -791 -514 143 798 929 348 -443 -925
3489 -925 -774 -165 572 911 674 -172 -892 -991 -528 279 810 788 151 -652 -1017 -728 12 685 865 494 -258
3510 -258 -825 -737 -182 612 975 757 115 -670 -872 -473 354 918 882 333 -523 -1037 -787 -25 715 1011 549
3531 549 -216 -890 -1009 -448 448 995 778 100 -681 -989 -704 115 822 940 360 -413 -905 -857 -227 567
3551 567 932 625 -232 -919 -1032 -504 263 905 848 83 -812 -1132 -777 -30 771 972 478 -434 -1083 -984 -312
3572 -312 520 1041 836 19 -809 -1100 -591 225 821 908 336 -560 -1098 -879 -112 658 893 552 -237 -998
3592 -998 -1066 -442 516 1013 807 68 -761 -1125 -702 204 980 1065 468 -431 -1056 -954 -164 802 1170 821 -52
3613 -52 -799 -1006 -483 468 1196 1056 269 -526 -907 -693 53 920 1200 633 -310 -941 -874 -265 616 1225 880
3634 880 10 -803 -1042 -515 362 1134 1253 491 -535 -1095 -760 17 824 1255 857 -151 -1066 -1119 -416 458
3654 458 1046 1018 179 -808 -1288 -798 175 923 1076 567 -384 -1171 -1044 -199 706 1136 758 -30 -950 -1239
3674 -1239 -606 418 1110 999 290 -704 -1261 -1032 -23 972 1230 608 -356 -1064 -1204 -473 638 1177 893
3693 893 -16 -893 -1216 -856 96 1020 1117 323 -712 -1225 -1081 -339 678 1219 794 -322 -1151 -1171 -562 385
3713 385 1195 1122 207 -919 -1330 -877 112 997 1267 672 -471 -1232 -1051 -247 764 1333 1103 67 -1033
3732 -1033 -1312 -666 362 1107 1176 504 -676 -1371 -1025 30 932 1253 801 -185 -1148 -1262 -402 753 1260
3751 1260 1035 145 -850 -1426 -936 265 1175 1191 424 -603 -1311 -1288 -349 915 1454 929 -153 -1020 -1259
3770 -1259 -635 493 1429 1346 369 -732 -1272 -970 -17 1054 1407 674 -474 -1257 -1243 -501 654 1430 1120
3789 1120 -30 -1027 -1272 -731 270 1277 1442 552 -745 -1418 -1082 -81 849 1394 975 -232 -1295
3806 -1295 -1436 -539 619 1345 1294 432 -881 -1496 -1010 215 1163 1342 789 -353 -1373 -1387 -394 866
3824 866 1413 1068 42 -1025 -1436 -779 455 1422 1394 596 -600 -1320 -1126 2 1197 1473 848 -249
3842 -249 -1204 -1467 -655 691 1500 1163 71 -1001 -1442 -1118 3 1291 1577 659 -645 -1404 -1270 -352
3860 -352 768 1488 1182 -63 -1174 -1446 -764 392 1360 1431 487 -805 -1400 -1060 -64 1021 1478 917
3878 917 -468 -1548 -1591 -609 497 1218 1073 31 -1233 -1821 -1205 112 1177 1330 644 -582 -1458 -1275
3896 -1275 -201 1009 1558 1211 79 -1194 -1536 -776 577 1350 1199 346 -823 -1651 -1385 -125 1186
3913 1186 1435 614 -607 -1462 -1507 -630 678 1555 1252 65 -1198 -1664 -992 294 1383 1502 665 -544
3931 -544 -1381 -1389 -312 1072 1767 1121 -187 -1170 -1313 -711 471 1469 1524 392 -960 -1476 -955 209 1237
3950 1237 1593 927 -349 -1389 -1334 -274 1124 1812 1388 133 -1110 -1518 -841 433 1519 1743 818
3967 818 -720 -1727 -1403 -155 1046 1557 1201 -39 -1226 -1691 -870 568 1517 1310 278 -843 -1423
3984 -1423 -1106 59 1256 1540 823 -547 -1489 -1354 -142 1090 1645 1145 -16 -1222 -1718 -924 648
4001 648 1717 1629 417 -1047 -1720 -1518 -365 1104 1815 1182 -401 -1639 -1730 -827 473 1429 1391 390
4019 390 -940 -1624 -1228 106 1258 1460 680 -607 -1376 -1240 -273 946 1553 1090 -266 -1510 -1678 -698
4037 -698 677 1527 1487 349 -1121 -1956 -1482 60 1507 1929 1169 -334 -1501 -1705 -693 865 1878
4054 1878 1707 491 -981 -1707 -1198 59 1221 1476 692 -566 -1590 -1594 -507 854 1433 884 -381
4071 -381 -1392 -1567 -786 636 1679 1484 241 -1205 -1780 -1178 235 1472 1860 980 -610 -1834 -1856
4088 -1856 -690 921 1870 1558 141 -1297 -1921 -1326 39 1378 1736 792 -739 -1725 -1554 -449 877
4105 877 1540 1073 -158 -1390 -1633 -685 792 1599 1389 287 -1031 -1709 -1150 313 1629 1826 880 -734
4123 -734 -1821 -1778 -501 1079 1959 1502 18 -1442 -2013 -1185 440 1791 1947 913 -579 -1609 -1456
4140 -1456 -190 1312 2003 1408 -26 -1245 -1502 -681 767 1745 1569 326 -1105 -1714 -1146 294 1566
4157 1566 1806 816 -781 -1831 -1653 -345 1124 1904 1444 -95 -1567 -1985 -1030 583 1844 2025 897
4174 897 -733 -1771 -1388 20 1512 2090 1424 -76 -1475 -1745 -724 781 1692 1483 158 -1309 -2008
4191 -2008 -1314 89 1439 1677 732 -761 -1804 -1716 -357 1252 1953 1358 -113 -1509 -1988 -1128 532
4208 532 1759 1760 401 -1157 -2004 -1706 -234 1317 1949 1144 -462 -1706 -1792 -817 753 1827 1547 126
4226 126 -1464 -2042 -1398 61 1399 1691 646 -1058 -2069 -1790 -450 1083 1965 1479 -163 -1632 -1931
4243 -1931 -878 683 1822 1807 552 -1171 -2122 -1644 -118 1288 1703 996 -593 -1993 -2105 -801 884
4260 884 1826 1550 161 -1354 -1976 -1203 508 1894 1995 851 -719 -1789 -1605 -166 1488 2166 1516
4277 1516 -91 -1513 -1950 -974 865 2051 1839 462 -1089 -1993 -1569 -46 1572 2077 1046 -630
4293 -630 -1784 -1729 -586 1086 2166 1775 158 -1339 -1725 -994 577 1927 2130 901 -1010 -2061 -1656
4310 -1656 -280 1227 1933 1310 -453 -1976 -2223 -993 692 1901 1818 546 -1171 -1976 -1326 279 1743
4327 1743 2196 1285 -498 -1891 -1858 -499 1024 1861 1502 16 -1765 -2435 -1385 506 1718 1724 658
4344 658 -929 -2050 -1792 -85 1720 2266 1342 -204 -1576 -1934 -880 1050 2285 1936 393 -1188
4360 -1188 -1917 -1395 242 1905 2350 1217 -533 -1707 -1634 -397 1308 2338 1724 4 -1572 -1956 -1055
4377 -1055 556 1909 2018 637 -1181 -2127 -1664 -165 1468 2259 1410 -490 -1940 -1931 -722 927 2130
4394 2130 2064 447 -1536 -2223 -1293 321 1665 2100 1229 -655 -2169 -1981 -357 1281 1894 1407 -97
4411 -97 -1818 -2424 -1424 417 1699 1546 253 -1454 -2430 -1975 -246 1442 1952 1076 -593 -2036 -2210
4428 -2210 -866 1034 2104 1613 66 -1591 -2427 -1826 19 1676 1850 556 -1224 -2288 -2233 -882
4444 -882 1160 2229 1508 -293 -1693 -1961 -1041 740 2237 2234 738 -1142 -1951 -1382 94 1709 2335
4461 2335 1338 -684 -2071 -2021 -702 980 2103 1836 111 -1769 -2382 -1349 443 1927 2177 1002
4477 1002 -915 -2195 -1840 -168 1607 2416 1803 43 -1640 -1990 -778 1059 2244 2176 871 -1017
4493 -1017 -2211 -1601 214 1852 2119 1143 -510 -1897 -2103 -706 1299 2384 1699 76 -1471 -2038
4509 -2038 -1188 670 2242 2363 950 -926 -2071 -1742 -63 1747 2502 1575 -242 -1803 -2168 -1048
4525 -1048 924 2351 2142 439 -1379 -2221 -1608 30 1665 2234 1180 -800 -2161 -2028 -654 1077
4541 1077 2149 1735 31 -1700 -2196 -1187 639 2005 2147 790 -1144 -2313 -1790 -101 1558 2152
4557 2152 1369 -493 -2199 -2463 -1097 905 2075 1754 296 -1570 -2539 -1868 20 1815 2156 1025
4573 1025 -808 -2177 -2171 -701 1175 2207 1659 -91 -1743 -2315 -1286 585 2077 2042 627 -1213 -2219
4590 -2219 -1848 -202 1603 2294 1262 -649 -2143 -2315 -1019 870 2213 1959 246 -1583 -2314 -1460
4606 -1460 372 1993 2461 1289 -663 -2003 -1794 -274 1506 2387 1856 -14 -1716 -2209 -1067 686
4622 686 2042 2058 644 -1330 -2379 -1792 36 1767 2260 1338 -505 -2134 -2235 -841 1181 2270 1869
4639 1869 261 -1584 -2456 -1674 257 1877 2150 865 -999 -2244 -2191 -694 1231 2039 1282 -503 -2133
4656 -2133 -2519 -1451 479 1851 1741 149 -1621 -2425 -1808 31 1837 2445 1343 -647 -1964 -1950 -542
4673 -542 1387 2677 2256 335 -1648 -2309 -1487 301 1929 2229 948 -1110 -2391 -2105 -554 1249
4689 1249 2142 1584 -158 -1829 -2031 -762 1083 2292 2195 764 -1068 -1972 -1160 650 2184 2575 1478
4706 1478 -488 -2038 -1928 -251 1739 2668 2138 345 -1626 -2405 -1381 745 2372 2454 1169 -753
4722 -753 -2115 -1966 -351 1650 2514 1763 10 -1534 -1882 -939 920 2213 2017 474 -1279 -2101 -1470
4739 -1470 205 1746 2024 805 -1120 -2395 -2242 -678 1271 2266 1547 -381 -2112 -2498 -1439 471
4755 471 2144 2403 895 -1347 -2585 -2215 -517 1340 2208 1551 -339 -2109 -2470 -1242 618 1866
4771 1866 1799 442 -1307 -2189 -1523 193 1704 2043 914 -939 -2209 -2036 -492 1249 2035 1373 -474
4788 -474 -2276 -2692 -1469 677 2139 2063 617 -1307 -2523 -2033 -165 1839 2534 1651 -295 -2002 -2368
4805 -2368 -1192 831 2125 1855 290 -1450 -2347 -1747 -49 1651 2017 819 -980 -2033 -1817 -335
4821 -335 1441 2334 1638 -259 -1828 -2020 -881 1023 2356 2262 692 -1382 -2360 -1806 94 1908 2537
4838 2537 1455 -573 -2240 -2397 -1044 884 2222 2052 352 -1586 -2392 -1508 318 1887 2276 1341
4854 1341 -481 -1879 -1678 -20 1779 2454 1752 119 -1465 -2067 -989 958 2298 2068 457 -1454
4870 -1454 -2387 -1821 8 1810 2452 1395 -533 -2078 -2152 -726 1346 2485 2118 448 -1376 -2250 -1599
4887 -1599 274 1994 2233 857 -1025 -2187 -2051 -688 1145 2178 1549 -379 -1906 -2182 -981 808
4903 808 2113 2090 594 -1295 -2265 -1585 143 1795 2317 1275 -745 -2250 -2216 -758 1092 2166 1867
4920 1867 197 -1730 -2476 -1482 448 1961 2104 996 -815 -2107 -1979 -344 1586 2364 1601 -133
4936 -133 -1713 -2011 -942 905 2215 2111 618 -1213 -2240 -1692 189 1895 2236 1216 -550 -1932
4952 -1932 -2120 -785 1344 2452 1843 81 -1458 -2080 -1332 381 2071 2348 914 -1115 -2251 -1907
4968 -1907 -453 1264 2051 1410 -461 -2100 -2446 -1251 618 1993 1899 339 -1519 -2335 -1673 -68 1600
4985 1600 2223 1238 -793 -2283 -2249 -809 934 1883 1559 -89 -1949 -2659 -1633 209 1638 1810 587
5002 587 -1173 -2475 -2120 -409 1371 2055 1284 -358 -1964 -2328 -1050 935 2120 1853 465 -1233
5018 -1233 -2223 -1667 155 1891 2329 1194 -607 -1937 -1990 -693 1225 2327 1797 100 -1558 -2135 -1306
5035 -1306 541 2102 2234 880 -902 -1912 -1633 -156 1692 2504 1681 -225 -1741 -1877 -774 1007
5051 1007 2338 2161 591 -1330 -2186 -1391 266 1857 2337 1292 -627 -2027 -1929 -521 1271 2253 1788
5068 1788 168 -1587 -2154 -1187 603 2003 2165 950 -919 -1996 -1687 -49 1644 2241 1467 -248
5084 -248 -1821 -2147 -913 958 2048 1717 265 -1522 -2377 -1698 81 1729 2068 931 -749 -2077
5100 -2077 -2044 -579 1344 2337 1753 71 -1571 -2107 -1232 538 2048 2109 785 -1062 -2124 -1776 -254
5117 -254 1478 2170 1440 -315 -1801 -1975 -795 1038 2168 1966 426 -1301 -2047 -1345 250 1784 2125
5134 2125 1004 -888 -2159 -2038 -576 1135 2026 1499 -159 -1823 -2390 -1373 516 1856 1863 554 -1215
5151 -1215 -2301 -2003 -417 1313 2010 1163 -572 -2068 -2241 -1081 765 1899 1678 251 -1396 -2101
5167 -2101 -1449 270 1858 2117 1000 -705 -1850 -1793 -390 1326 2274 1625 -126 -1757 -2148 -1140 558
5184 558 1880 1905 512 -1434 -2461 -1968 -352 1326 1969 1105 -710 -2115 -2216 -939 811 2047 1885
5201 1885 435 -1276 -2026 -1187 464 1832 2163 1168 -557 -1901 -1851 -330 1302 1969 1278 -303 -1779
5218 -1779 -2234 -1191 639 1944 1888 534 -1116 -2075 -1512 248 1893 2356 1474 -213 -1696 -1955 -746
5235 -746 1134 2204 1733 94 -1482 -2259 -1691 -29 1573 1897 765 -957 -2045 -1800 -462 1224
5251 1224 2110 1556 -35 -1420 -1737 -787 906 2172 2088 671 -1089 -1841 -1300 166 1729 2322 1386
5268 1386 -552 -1905 -1798 -467 1197 2228 1988 449 -1355 -2072 -1128 554 1931 2197 1199 -584
5284 -584 -1850 -1647 -157 1434 2173 1590 20 -1572 -1947 -850 806 1868 1791 466 -1221 -2162 -1650
5301 -1650 42 1567 1836 922 -679 -2012 -2179 -796 1081 1979 1470 27 -1474 -2199 -1520 231 1742
5318 1742 1839 577 -1050 -2081 -1914 -596 1136 2027 1267 -339 -1662 -1970 -1019 618 1882 1797 347
5335 347 -1310 -2123 -1636 -156 1384 1857 816 -985 -2142 -2181 -998 731 1900 1541 -125 -1673 -2140
5352 -2140 -1216 315 1704 2047 984 -854 -1981 -1565 -142 1307 1995 1432 -139 -1740 -2052 -848
5368 -848 778 1867 1739 470 -1198 -2015 -1369 312 1781 2096 1228 -399 -1772 -1819 -418 1341 2152
5385 2152 1739 306 -1328 -2036 -1262 495 1855 1944 821 -764 -1927 -1805 -316 1282 1840 1130 -302
5402 -302 -1644 -2045 -1077 626 1787 1494 65 -1330 -1959 -1483 49 1647 2098 982 -863 -1941 -1790
5419 -1790 -561 1114 2118 1676 1 -1616 -2141 -1288 360 1788 1957 805 -883 -1878 -1577 -257
5435 -257 1297 2101 1530 -96 -1533 -1616 -619 809 1847 1851 527 -1166 -1921 -1229 379 1595 1853 926
5453 926 -734 -1954 -1800 -397 1308 2081 1529 -7 -1540 -2058 -1050 635 1896 2033 929 -742
5469 -742 -1882 -1656 -99 1489 2112 1484 25 -1350 -1731 -797 907 1962 1732 461 -988 -1679 -1241
5486 -1241 231 1652 1901 845 -709 -1716 -1654 -395 1278 2032 1471 -170 -1609 -2002 -1175 454 1856
5503 1856 1916 618 -1196 -2123 -1740 -358 1230 1932 1287 -405 -1768 -1959 -922 589 1712 1607 362
5520 362 -1180 -1867 -1323 145 1448 1813 912 -731 -1922 -1752 -402 1067 1724 1212 -228 -1735 -2191
5537 -2191 -1213 518 1702 1631 457 -1125 -2116 -1762 -237 1347 1922 1170 -410 -1798 -2097 -1061 638
5554 638 1725 1508 154 -1426 -2126 -1636 -128 1318 1632 645 -910 -1880 -1784 -613 963 1835 1306 -160
5572 -160 -1518 -1897 -972 635 1841 1880 667 -995 -1902 -1488 -77 1531 2119 1345 -341 -1730 -1841
5589 -1841 -716 836 1861 1730 460 -1198 -1920 -1256 300 1643 1877 1053 -449 -1634 -1569 -248 1339
5606 1339 2111 1602 186 -1321 -1668 -812 771 1928 1944 759 -903 -1796 -1428 109 1598 2033 1282
5623 1282 -259 -1494 -1773 -674 1032 2171 1877 465 -1072 -1710 -1116 318 1699 2049 1067 -619
5639 -619 -1713 -1618 -382 1109 1833 1323 -148 -1616 -2045 -1177 381 1595 1615 403 -1187 -2035 -1648 -250
5657 -250 1255 1830 1120 -497 -1832 -1945 -741 899 1828 1622 262 -1246 -2005 -1306 238 1634 1871
5674 1871 917 -633 -1784 -1699 -434 1128 1841 1337 -114 -1533 -2018 -1099 463 1714 1640 438 -1129
5691 -1129 -1991 -1617 -123 1362 1926 1069 -477 -1683 -1797 -635 921 2013 1717 372 -1141 -1801 -1139
5708 -1139 372 1700 1931 970 -649 -1815 -1633 -390 1165 1922 1343 -155 -1555 -1903 -997 605 1748
5725 1748 1722 520 -1042 -1895 -1461 -19 1410 1916 1193 -404 -1745 -1914 -759 866 1740 1450 85
5742 85 -1437 -2125 -1473 71 1419 1600 536 -968 -1987 -1817 -571 1021 1826 1221 -286 -1599 -1912
5759 -1912 -1015 591 1804 1795 543 -1069 -1863 -1431 -98 1393 1873 981 -631 -1878 -1927 -842 667
5776 667 1679 1428 58 -1461 -2002 -1257 247 1564 1824 885 -701 -1711 -1412 -187 1288 2003 1492
5793 1492 -10 -1470 -1769 -765 728 1709 1673 560 -1039 -1965 -1423 119 1488 1870 1035 -418 -1658
5810 -1658 -1790 -562 1066 1957 1605 268 -1185 -1764 -1112 496 1804 2052 1013 -475 -1533 -1387 -65
5827 -65 1481 2133 1488 68 -1234 -1642 -797 698 1894 1683 411 -1046 -1717 -1340 41 1471 2031
5844 2031 1097 -518 -1577 -1536 -463 1063 2060 1723 202 -1344 -1818 -1028 356 1574 1837 761 -913
5861 -913 -1963 -1654 -421 994 1748 1263 -198 -1620 -1880 -928 559 1590 1576 456 -1134 -1942 -1371
5878 -1371 43 1307 1680 957 -572 -1765 -1709 -455 995 1729 1357 89 -1365 -2022 -1229 353 1605
5895 1605 1599 542 -993 -2125 -1975 -613 1037 1612 994 -445 -1722 -2137 -1212 411 1624 1472 284
5912 284 -1121 -1836 -1509 -110 1319 1726 869 -570 -1609 -1687 -609 917 1813 1352 -52 -1325 -1702
5929 -1702 -950 495 1773 1901 749 -877 -1714 -1356 -142 1294 2087 1400 -237 -1529 -1720 -801 717
5946 717 1846 1846 562 -1043 -1824 -1261 49 1266 1784 1015 -571 -1810 -1753 -571 779 1481 1194 -60
5964 -60 -1487 -1968 -1016 478 1552 1636 746 -717 -1716 -1333 153 1592 2037 1411 -13 -1400 -1720 -637
5982 -637 1010 1894 1608 438 -1054 -1952 -1500 53 1453 1733 809 -552 -1552 -1735 -666 931 1764
5999 1764 1253 -47 -1309 -1775 -1132 332 1609 1618 402 -978 -1744 -1443 -210 1284 1921 1117 -410
6016 -410 -1504 -1546 -678 710 1907 1805 348 -1176 -1768 -1072 221 1505 1975 1100 -498 -1575 -1386
6033 -1386 -242 1111 1994 1627 216 -1206 -1546 -698 657 1630 1753 734 -895 -1840 -1365 -49 1132
6050 1132 1640 1039 -285 -1672 -1867 -686 835 1682 1419 301 -1093 -1836 -1277 266 1506 1741 851
6067 851 -537 -1621 -1618 -376 1148 1760 1253 31 -1235 -1779 -1069 553 1690 1539 364 -940 -1692
6084 -1692 -1570 -317 1213 1798 899 -624 -1644 -1757 -867 607 1656 1452 127 -1276 -1836 -1327 23
6101 23 1328 1655 678 -901 -1819 -1680 -684 678 1553 1117 -416 -1774 -1906 -995 296 1303 1496 475
6119 475 -1071 -1902 -1372 45 1250 1721 1059 -354 -1572 -1708 -583 865 1750 1582 324 -1162 -1876
6136 -1876 -1130 308 1405 1712 898 -493 -1687 -1664 -344 1078 1580 1063 -85 -1237 -1758 -1029 493
6153 493 1643 1522 391 -848 -1521 -1152 125 1510 1908 1157 -223 -1386 -1450 -414 1114 1971 1565
6170 1565 260 -1047 -1597 -1103 221 1580 1908 843 -665 -1536 -1348 -306 953 1763 1378 -11 -1285
6187 -1285 -1565 -756 569 1579 1554 461 -851 -1574 -1208 77 1333 1760 993 -475 -1614 -1508 -544
6204 -544 841 1590 1410 210 -1305 -1878 -1136 408 1459 1631 798 -595 -1618 -1580 -306 1148 1786
6221 1786 1239 -48 -1289 -1630 -917 472 1489 1469 401 -987 -1720 -1354 -44 1197 1543 785 -524
6238 -524 -1534 -1595 -546 913 1696 1355 -3 -1279 -1697 -1075 322 1465 1675 736 -760 -1673 -1461 -266
6256 -266 1102 1845 1337 -33 -1234 -1554 -772 570 1563 1579 402 -965 -1696 -1274 -56 1151 1495 821
6274 821 -584 -1591 -1540 -484 906 1604 1233 57 -1198 -1664 -977 409 1533 1584 610 -815 -1671 -1532
6292 -1532 -303 1061 1694 1087 -259 -1438 -1677 -840 506 1504 1422 321 -1077 -1667 -1221 -84 1149
6309 1149 1503 803 -548 -1582 -1558 -542 816 1521 1244 1 -1306 -1701 -1032 341 1386 1498 523
6326 523 -917 -1776 -1506 -339 998 1562 1028 -300 -1507 -1750 -784 594 1508 1461 420 -878 -1654 -1153
6344 -1153 133 1289 1589 862 -435 -1526 -1512 -527 832 1602 1147 -79 -1194 -1547 -854 467 1527
6361 1527 1637 681 -687 -1470 -1195 -46 1207 1717 1122 -221 -1389 -1587 -702 681 1593 1475 355
6378 355 -888 -1439 -933 291 1509 1822 1059 -305 -1218 -1142 -186 1072 1717 1402 148 -1132 -1479 -744
6396 -744 503 1482 1515 640 -647 -1512 -1193 22 1226 1712 1069 -218 -1265 -1488 -617 702 1527 1326
6414 1326 187 -1036 -1638 -1151 82 1217 1508 744 -570 -1460 -1450 -441 901 1540 1170 -41 -1186
6431 -1186 -1561 -887 433 1428 1431 398 -836 -1541 -1227 -189 1081 1600 918 -367 -1441 -1501 -722 478
6449 478 1374 1193 38 -1294 -1829 -1331 -132 934 1195 466 -880 -1745 -1590 -497 700 1375 1080 -144
6467 -144 -1324 -1561 -791 499 1441 1458 523 -749 -1522 -1213 -22 1137 1588 1009 -205 -1288 -1447 -486
6485 -486 845 1626 1396 269 -829 -1483 -981 226 1298 1455 642 -566 -1463 -1411 -425 866 1402 967
6503 967 -179 -1210 -1518 -828 526 1469 1374 448 -812 -1400 -1153 -47 1172 1592 857 -382 -1284 -1388
6521 -1388 -566 625 1499 1300 204 -1007 -1398 -889 288 1292 1618 764 -514 -1378 -1195 -257 881
6538 881 1492 1040 -113 -1247 -1427 -721 404 1256 1281 383 -907 -1516 -1093 65 1024 1364 813 -398
6556 -398 -1447 -1511 -553 663 1303 1108 109 -1084 -1516 -900 351 1337 1461 792 -424 -1275 -1114 -7
6574 -7 1135 1609 1161 77 -915 -1293 -600 634 1433 1319 383 -714 -1290 -1015 92 1224 1478 747 -322
6593 -322 -1154 -1199 -366 887 1526 1102 10 -960 -1332 -842 259 1327 1408 496 -735 -1379 -1215 -285 842
6612 842 1525 1070 -247 -1238 -1337 -622 466 1311 1348 395 -776 -1297 -860 92 1052 1411 861 -347 -1257
6631 -1257 -1075 -253 684 1377 1126 41 -1165 -1503 -777 312 1042 1108 430 -808 -1599 -1328 -202 885
6649 885 1249 839 -210 -1279 -1479 -675 512 1246 1108 264 -821 -1488 -1102 34 968 1129 555 -368
6667 -368 -1225 -1390 -511 738 1271 813 -144 -986 -1299 -833 285 1231 1202 267 -794 -1328 -1081 -178 923
6686 923 1359 774 -416 -1227 -1382 -716 405 1299 1158 60 -981 -1382 -970 -92 948 1318 656 -574
6704 -574 -1301 -1038 -271 637 1267 1055 63 -1006 -1238 -516 510 1205 1270 522 -652 -1228 -852 149 1044
6723 1044 1386 957 -130 -1124 -1219 -309 768 1286 1118 336 -777 -1347 -890 282 1172 1207 566 -334 -1154
6742 -1154 -1159 -256 980 1396 1001 55 -796 -1111 -548 590 1349 1217 333 -596 -1157 -987 14 1046 1337
6761 1337 638 -383 -1102 -1139 -489 586 1338 1094 45 -890 -1211 -696 164 1059 1285 509 -598 -1238 -1062
6780 -1062 -256 686 1204 838 -226 -1118 -1211 -548 381 1114 1125 338 -707 -1314 -854 125 954 1164 661 -392
6800 -392 -1261 -1259 -373 608 1098 864 40 -874 -1263 -714 371 1111 1179 519 -414 -1041 -933 -31 981 1280
6820 1280 789 -93 -971 -1176 -601 448 1133 988 138 -807 -1191 -880 60 1015 1194 585 -425 -1088 -1073
6839 -1073 -342 674 1214 945 20 -954 -1190 -743 199 992 1061 440 -580 -1226 -946 -161 702 1061 633
6858 633 -266 -1144 -1279 -571 353 980 845 59 -917 -1305 -860 104 902 1076 531 -400 -1142 -1109 -303 650
6878 650 1095 791 -115 -1023 -1334 -776 145 924 954 231 -603 -1091 -911 -40 863 1257 811 -91 -788 -925
6898 -925 -326 607 1208 970 130 -785 -1130 -786 56 878 1071 425 -568 -1158 -1052 -183 697 1223 931 70
6918 70 -793 -1029 -455 441 1165 1198 485 -498 -1002 -793 1 807 1117 734 -155 -945 -971 -274 599 1119 971
6939 971 275 -578 -1002 -545 310 1082 1120 487 -388 -1054 -938 -224 699 1091 714 -148 -961 -1196 -677 290
6959 290 1010 939 226 -623 -1114 -894 -132 776 1097 630 -277 -895 -923 -313 487 1123 996 174 -638 -937 -529
6980 -529 262 981 1065 477 -447 -1042 -878 -170 663 1085 691 -173 -936 -1094 -458 365 961 973 280 -598 -1063
7001 -1063 -795 8 768 956 541 -341 -1092 -1158 -536 355 796 584 -44 -843 -1161 -696 133 850 911 421
7021 421 -370 -980 -819 -86 744 1064 696 -154 -832 -1041 -507 334 952 875 139 -694 -1071 -752 -13 761
7041 761 1006 529 -283 -906 -958 -349 512 964 723 7 -794 -1020 -668 98 770 841 286 -553 -995 -776 -111
7062 -111 621 952 666 -120 -812 -922 -368 463 1006 910 239 -523 -936 -597 145 805 1049 565 -253 -841
7082 -841 -878 -183 591 1033 753 6 -723 -991 -558 180 780 846 262 -488 -965 -794 -125 617 895 556 -178
7103 -178 -772 -948 -423 349 858 749 74 -676 -978 -737 33 677 818 316 -413 -927 -889 -258 528 949
7123 949 726 96 -653 -785 -446 347 958 962 421 -377 -815 -595 26 705 1005 662 -96 -699 -758 -243 445
7144 445 918 875 197 -538 -805 -483 193 762 902 471 -241 -820 -714 -112 545 943 685 86 -603 -769
7164 -769 -370 387 873 902 358 -353 -770 -633 18 714 913 552 -139 -730 -830 -351 396 812 665 44
7184 44 -615 -887 -640 72 726 759 297 -406 -844 -837 -230 422 812 539 -159 -784 -883 -526 136 673 649 120
7206 120 -631 -960 -750 -168 461 712 356 -348 -876 -863 -375 278 757 639 -56 -686 -885 -523 82 599
7226 599 753 317 -420 -896 -749 -173 454 744 569 -53 -686 -834 -371 307 758 739 297 -363 -785 -577
7246 -577 52 665 788 450 -155 -656 -742 -227 442 743 532 48 -519 -788 -529 128 753 774 271 -288 -694
7267 -694 -616 -90 603 878 524 -81 -547 -697 -361 265 841 748 171 -458 -726 -537 1 593 846 449 -232
7288 -232 -697 -592 -188 377 776 661 60 -572 -698 -328 197 664 797 368 -355 -724 -506 10 516 727
7308 727 514 -104 -719 -823 -287 299 681 649 203 -450 -727 -534 146 672 769 454 -121 -601 -662 -205 452
7329 452 692 475 13 -552 -776 -523 137 606 562 123 -330 -657 -547 -49 591 818 444 -102 -525 -544 -273
7350 -273 365 790 603 49 -545 -767 -562 -27 479 657 261 -355 -773 -627 -235 353 685 611 7 -536
7370 -536 -613 -336 197 591 690 255 -320 -644 -510 3 455 613 445 -107 -622 -633 -225 382 713 619 164
7391 164 -426 -718 -410 189 621 718 359 -197 -583 -594 -90 499 705 541 31 -465 -664 -381 208 670 537
7412 537 116 -358 -665 -642 -140 387 572 216 -273 -597 -649 -330 206 623 490 1 -523 -652 -430 34 521
7433 521 585 172 -381 -751 -617 -222 295 609 395 -176 -597 -694 -347 177 550 556 169 -384 -688 -475 -1
$$ [...]
8191b79
##END NTUPLES=NMR FID
##END=
