##TITLE=1H ikalashn
AM_NV 170
14.11.2024
##JCAMPDX= 6.0         $$ Bruker NMR JCAMP-DX V2.0
##DATA TYPE= NMR FID
##DATA CLASS= NTUPLES
##ORIGIN= UXNMR, Bruker Analytische Messtechnik GmbH
##OWNER= root
$$ TOPSPIN		Version 1.3
$$ 2024-11-14 14:30:36.953 +0400  Irina@DPX200
$$ Compression mode = diff/dup
##.OBSERVE FREQUENCY= 200.131300845
##.OBSERVE NUCLEUS= ^1H
##.DELAY= (6, 6)
##.ACQUISITION MODE= SIMULTANEOUS
##.ACQUISITION SCHEME= undefined
##.AVERAGES= 16
##.DIGITISER RES= 18
##SPECTROMETER/DATA SYSTEM= spect
##.PULSE SEQUENCE= zg
##.SOLVENT NAME= CDCl3
##.SHIFT REFERENCE= INTERNAL, CDCl3, 1, 17.49637
##AUDIT TRAIL= $$ (NUMBER, WHEN, WHO, WHERE, WHAT)
$$ ##TITLE= Audit trail, TOPSPIN		Version 1.3
$$ ##JCAMPDX= 5.01
$$ ##ORIGIN= Bruker BioSpin GmbH
$$ ##OWNER= Irina
$$ $$ F:/spectra/data/iren/nmr/1H/4/audita.txt
$$ ##AUDIT TRAIL=  $$ (NUMBER, WHEN, WHO, WHERE, VERSION, WHAT)
(   1,<2024-11-14 14:30:24.562 +0400>,<Irina>,<DPX200>,<TOPSPIN 1.3>,
      <created by zg
	started at 2024-11-14 14:29:16.656 +0400,
	POWCHK disabled, PULCHK disabled
       configuration hash MD5:
       BE 6D 3F 07 2A EA 11 49 91 17 2B D3 AF B3 58 0D
       data hash MD5: 16K
       C1 EB 50 48 3C 3F 22 10 D4 F6 C1 E3 AE CC 25 7D>)
$$ ##END=
$$ 
$$ $$ hash MD5
$$ $$ 6B 4E 45 47 EB 58 2F 34 62 A6 E5 14 47 A9 05 A0
##$RELAX= 
##$RELAX= 
##$RELAX= 
##$RELAX= 
##$RELAX= 
##$RELAX= 
##$RELAX= 
##$RELAX= 
##$RELAX= 
$$ Bruker specific parameters
$$ --------------------------
##$DU= <F:/spectra>
##$EXPNO= 4
##$NAME= <1H>
##$PROCNO= 1
##$TYPE= <nmr>
##$USER= <iren>
##$AMP= (0..31)
100 100 100 100 100 100 100 100 100 100 100 100 100 100 100 100 100 100 
100 100 100 100 100 100 100 100 100 100 100 100 100 100 
##$ANAVPT= -1
##$AQSEQ= 0
##$AQ_mod= 1
##$AUNM= <au_zg>
##$AUTOPOS= <>
##$BF1= 200.13
##$BF2= 200.13
##$BF3= 200.13
##$BF4= 200.13
##$BF5= 200.13
##$BF6= 200.13
##$BF7= 200.13
##$BF8= 200.13
##$BYTORDA= 1
##$CFDGTYP= 0
##$CFRGTYP= 5
##$CHEMSTR= <none>
##$CNST= (0..63)
1 1 145 1 1 1 1 1 1 1 1 1 1 1 1 1 1 1 1 1 1 1 1 1 1 1 1 1 1 1 1 1 1 1 
1 1 1 1 1 1 1 1 1 1 1 1 1 1 1 1 1 1 1 1 1 1 1 1 1 1 1 1 1 1 
##$CPDPRG= <>
##$CPDPRG1= <>
##$CPDPRG2= <>
##$CPDPRG3= <>
##$CPDPRG4= <mlev>
##$CPDPRG5= <mlev>
##$CPDPRG6= <mlev>
##$CPDPRG7= <mlev>
##$CPDPRG8= <mlev>
##$CPDPRGB= <>
##$CPDPRGT= <>
##$D= (0..63)
0 2 0 0 0 0 0 0 0 0.06 0 0.03 0 0 0 0 0.0002 0 0 0 0 0 0 0 0 0 0 0 0 0 
0 0 0 0 0 0 0 0 0 0 0 0 0 0 0 0 0 0 0 0 0 0 0 0 0 0 0 0 0 0 0 0 0 0 
##$DATE= 1731580221
##$DBL= (0..7)
120 120 120 120 120 120 120 120 
##$DBP= (0..7)
150 150 150 150 150 150 150 150 
##$DBP07= 0
##$DBPNAM0= <>
##$DBPNAM1= <>
##$DBPNAM2= <>
##$DBPNAM3= <>
##$DBPNAM4= <>
##$DBPNAM5= <>
##$DBPNAM6= <>
##$DBPNAM7= <>
##$DBPOAL= (0..7)
0.5 0.5 0.5 0.5 0.5 0.5 0.5 0.5 
##$DBPOFFS= (0..7)
0 0 0 0 0 0 0 0 
##$DE= 6
##$DECBNUC= <off>
##$DECIM= 32
##$DECNUC= <off>
##$DECSTAT= 4
##$DIGMOD= 1
##$DIGTYP= 9
##$DL= (0..7)
0 120 120 120 120 120 120 120 
##$DP= (0..7)
150 150 150 150 150 150 150 150 
##$DP07= 0
##$DPNAME0= <>
$$ [...]
##$SW= 21.9926040160658
##$SWIBOX= (0..15)
0 0 2 0 0 0 0 0 0 0 0 0 0 0 0 0 
##$SW_h= 4401.40845070422
##$TD= 16384
##$TD0= 1
##$TE= 300
##$TE2= 300
##$TE3= 300
##$TEG= 300
##$TL= (0..7)
0 120 120 120 120 120 120 120 
##$TP= (0..7)
150 150 150 150 150 150 150 150 
##$TP07= 0
##$TPNAME0= <>
##$TPNAME1= <>
##$TPNAME2= <>
##$TPNAME3= <>
##$TPNAME4= <>
##$TPNAME5= <>
##$TPNAME6= <>
##$TPNAME7= <>
##$TPOAL= (0..7)
0.5 0.5 0.5 0.5 0.5 0.5 0.5 0.5 
##$TPOFFS= (0..7)
0 0 0 0 0 0 0 0 
##$TUNHIN= 0
##$TUNHOUT= 0
##$TUNXOUT= 0
##$USERA1= <user>
##$USERA2= <user>
##$USERA3= <user>
##$USERA4= <user>
##$USERA5= <user>
##$V9= 5
##$VALIST= <valist>
##$VCLIST= <CCCCCCCCCCCCCCC>
##$VD= 0
##$VDLIST= <DDDDDDDDDDDDDDD>
##$VPLIST= <PPPPPPPPPPPPPPP>
##$VTLIST= <TTTTTTTTTTTTTTT>
##$WBST= 1024
##$WBSW= 25
##$XGAIN= (0..3)
0 0 0 0 
##$XL= 0
##$YL= 0
##$YMAX_a= 905590
##$YMIN_a= -703800
##$ZGOPTNS= <>
##$ZL1= 120
##$ZL2= 120
##$ZL3= 120
##$ZL4= 120
##$ABSF1= 10
##$ABSF2= 0
##$ABSG= 5
##$ABSL= 3
##$ALPHA= 0
##$AQORDER= 0
##$ASSFAC= 0
##$ASSFACI= 0
##$ASSFACX= 0
##$ASSWID= 0
##$AUNMP= <proc_1d>
##$AXLEFT= 0
##$AXRIGHT= 0
##$AXTYPE= 0
##$AXUNIT= <>
##$AZFE= 0.1
##$AZFW= 0.1
##$BCFW= 1
##$BC_mod= 2
##$BYTORDP= 1
##$COROFFS= 0
##$CY= 7568.61572265625
##$DATMOD= 1
##$DC= 2
##$DFILT= <>
##$DTYPP= 0
##$F1P= 17.9538593292236
##$F2P= -4.03888763876832
##$FCOR= 0.5
##$FTSIZE= 32768
##$FT_mod= 4
##$GAMMA= 1
##$GB= 1
##$INTBC= 1
##$INTSCL= 1
##$ISEN= 128
##$LB= 0.02
##$LEV0= 0
##$LPBIN= 0
##$MAXI= 945.577
##$MC2= 0
##$MEAN= 0
##$ME_mod= 0
##$MI= -402.1523
##$NCOEF= 0
##$NC_proc= 0
##$NLEV= 6
##$NOISF1= 8.587773
##$NOISF2= 6.764455
##$NSP= 1
##$NTH_PI= 0
##$NZP= 0
##$OFFSET= 17.49637
##$PC= 1
##$PHC0= 118.1966
##$PHC1= 8.07123
##$PH_mod= 0
##$PKNL= yes
##$PPARMOD= 0
##$PPDIAG= 0
##$PPIPTYP= 0
##$PPMPNUM= 100
##$PPRESOL= 1
##$PSCAL= 0
##$PSIGN= 0
##$REVERSE= no
##$SF= 200.13
##$SI= 32768
##$SIGF1= 18.5376
##$SIGF2= -6.396296
##$SINO= 400
##$SIOLD= 32768
##$SREGLST= <1H.CDCl3>
##$SSB= 3
##$STSI= 0
##$STSR= 0
##$SW_p= 4401.40845070422
##$SYMM= 0
##$S_DEV= 0
##$TDeff= 0
##$TDoff= 0
##$TI= <>
##$TILT= no
##$TM1= 0
##$TM2= 0
##$TOPLEV= 0
##$USERP1= <user>
##$USERP2= <user>
##$USERP3= <user>
##$USERP4= <user>
##$USERP5= <user>
##$WDW= 1
##$XDIM= 8192
##$YMAX_p= 0
##$YMIN_p= 0
$$ End of Bruker specific parameters
$$ ---------------------------------
##NTUPLES= NMR FID
##VAR_NAME=  TIME,          FID/REAL,        FID/IMAG
##SYMBOL=    X,             R,               I
##VAR_TYPE=  INDEPENDENT,   DEPENDENT,       DEPENDENT
##VAR_FORM=  AFFN,          ASDF,            ASDF
##VAR_DIM=   8192,          8192,            8192
##UNITS=     SECONDS,       ARBITRARY UNITS, ARBITRARY UNITS
##FACTOR=    0.0002272,     1,               1
##FIRST=     0,             0,               0
##LAST=      1.8609952,     -66,             -74
##MIN=       0,             -703800,         -703800
##MAX=       1.8609952,     905590,          905590
$$ Real data points
##PAGE= N=1
##DATA TABLE= (X++(R..R)), XYDATA
$$ plain form
0 0 0 0 0 0 0 0 0 0 0 0 1 -16 16 -16 16 -17 32 -33 48 -49 65 -81 90 -106 128 -146 164 -195 227 -260 293 -339
32 -339 385 -434 493 -554 623 -697 780 -872 969 -1078 1196 -1326 1468 -1623 1787 -1976
48 -1976 2176 -2395 2641 -2910 3206 -3535 3905 -4322 4795 -5335 5961 -6700 7581 -8652
62 -8652 9998 -11739 14091 -17459 22719 -32171 54508 -225323 11213 177284 -578555 -665291
74 -665291 -68913 175318 -394288 -620039 -96109 388313 215477 44806 302177 562600
84 562600 367018 76665 2970 15624 -51918 -40191 12142 -51795 -142881 -52622 -3779 -229401
96 -229401 -435212 -238975 51676 -6827 -168608 40971 352486 232535 -120241 -127373 102521
107 102521 64509 -151970 -73537 194514 184291 -34905 -45171 67613 -60852 -276504 -182161
$$ packed form
0@%%%%%%%%%%Jj7L2l2L2l3M9o5Q1r7J14j46J71j96K34k74L10l59M22m87N53o32
32c39P24q19R27j047J177j320J477j652J841k047K274k522K794l091L410l763
48a976M152m571N036n551O116o741P440q227R117j0130J1296j2661J4281j6233
62h652J8650k1737K5830l1550M0178n4890Q6679k79831K36536J66071p55839q6736
74f65291N96378K44231n69606k25751N23930M84422j72836j70671K57371K60423
84E62600j95582k90353p3695J2654o7542J1727N2333o3937r1086R0259M8843k25622
96b29401k05811J96237K90651n8503j61781K09579L11515j19951l52776p132K29894
107A02521l8012k16479P8433K68051j0223k19196j0266J12784j28465k15652R4343
$$ plain form
118 -182161 52914 11006 -144847 -7239 215027 60690 -258184 -203585 85974 69714
128 69714 -161900 -77220 262360 300049 8385 -100203 69809 95642 -117302 -192168 -17237
139 -17237 90965 8378 -52088 -25902 -65126 -148582 -123104 -57044 -91227 -92755 83572 216780
151 216780 83688 -73269 35563 177032 22299 -186158 -44771 240309 193794 -65882
161 -65882 -57182 168830 141525 -142193 -213139 12888 117427 -41236 -123696 18458 96569
172 96569 -45271 -172353 -119923 -42182 -58025 -55621 28758 84567 72850 81400 104728 56730
184 56730 -8223 29561 102019 63970 -14245 20288 85104 811 -149173 -154520 -61977 -73691
196 -73691 -150261 -96955 45286 70427 -3127 11570 98767 87356 5825 25279 115507 102411
$$ packed form
118a82161K35075m1908j55853J37608K22266j54337l18874N4599K89559j6260
128F9714k31614Q4680L39580L7689k91664j08588J70012K5833k12944p4866J74931
139a7237J08202q2587o0466K6186l9224q3456K5478O6060l4183j528J76327J33208
151B16780j33092j56957J08832J41469j54733k08457J41387K85080m6515k59676
161f5882Q700K26012k7305k83718p0946K26027J04539j58663q2460J42154P8111
172I6569j41840j27082N2430P7741j5843K404Q4379N5809j1717Q550K3328m7998
184E6730o4953L7784P2458l8049p8215L4533O4816q4293j49984n347R2543j1714
196g3691p6570N3306J42241K5141p3554J4697Q7197j1411q1531J9454R0228j3096
$$ plain form
208 102411 13306 12998 62566 -4508 -136446 -143365 -60713 -77582 -161308 -120749 12474 31196
220 31196 -57457 -50187 62465 88642 8028 6229 112928 152057 74447 31593 74183 69462
232 69462 -23371 -78928 -48081 -35369 -81871 -96855 -53526 -40518 -79012 -84505 -39658 -22946
244 -22946 -41067 -16055 52257 76343 49124 50113 84782 75038 18471 -2155 22624 18996 -25451
257 -25451 -42362 -21475 -25098 -62542 -76300 -55704 -48438 -56719 -37540 1959 16767 11514 25267
270 25267 45347 32585 7598 13646 29852 11251 -17432 -8870 10566 -10849 -48519 -46166 -21706
283 -21706 -29744 -52616 -35221 5017 7075 -17369 -12321 16182 12729 -18146 -20632 6311 11993
296 11993 -7926 -6964 19047 23314 -1580 -9608 10878 19648 1589 -7583 6376 11839 -8512
$$ packed form
208A02411q9105l08M9568o7074j31938o919Q2652j6869q3726M0559J33223J8722
220C1196q8653P270J12652K6177q0614j799J06699L9129p7610m2854M2590m721
232F9462r2833n5557L0847J2712m6502j4984M3329J3008l8494n493M4847J6712
244b2946j8121K5012O8312K4086k7219R89L4669r744n6567k0626K4779l628m4447
257b5451j6911K0887l623l7444j3758K0596P266q281J9179L9499J4808n253J3753
270B5267K0080j2762k4987O048J6206j8601k8683Q562J9436k1415l7670K353K4460
283b1706q038k2872J7395M0238K058k4444N048K8503l453l0875k486K6943N682
296A1993j9919R62K6011M267k4894q028K0486Q770j8059r172J3959N463k0351
$$ plain form
309 -8512 -26313 -21964 -19397 -37384 -51584 -40003 -19973 -16273 -19255 -8368 9356 14331 9680
322 9680 13046 24469 26506 15971 8941 11124 9875 -4177 -21530 -27797 -26608 -28942 -32792 -27734
336 -27734 -14946 -7557 -8602 -6123 5898 15087 12178 6504 11122 18912 16782 7407 4379 5980
350 5980 -79 -11026 -12321 -3479 -878 -8634 -12738 -5968 -575 -5884 -12243 -9063 -4632 -8473 -12503
365 -12503 -4844 6696 7334 1926 5914 18355 23687 18270 15925 20078 18775 7102 -2855 -4006
379 -4006 -7983 -22493 -37118 -38143 -33010 -33081 -35534 -29757 -17080 -8954 -4692 4768 18160 24262 20584
394 20584 18273 22250 22963 13582 1359 -5130 -8697 -15892 -23587 -23628 -18980 -18035 -20358 -15926 -3049
409 -3049 6266 6311 5799 11764 17587 14968 8579 8624 10516 3044 -9005 -10834 -4425 -5841 -16618 -19612
$$ packed form
309h512j7801M349K567j7987j4200J1581K0030L700k982J0887J7724M975m651
322I680L366J1423K037j0535p030K183j249j4052j7353o267J189k334l850N058
336b7734J2788P389j045K479J2021R189k909n674M618P790k130r375l028J601
350E980o059j0947j295Q842K601p756m104O770N393n309o359L180M431l841m030
365a2503P659J1540O38n408L988J2441N332n417k345M153j303j1673r957j151
379d006l977j4510j4625j025N133p1k453N777J2677Q126M262R460J3392O102l678
394B0584k311L977P13r381j2223o489l567p195p695m1M648R45k323M432J2877
409c049R315M5n12N965N823k619o389M5J892p472j2049j829O409j416j0777k994
$$ plain form
425 -19612 -9710 -4656 -10293 -12226 -2820 1851 -6569 -11598 14 10912 4692 -4267 2982 14273
439 14273 10162 1073 6694 17224 11751 -147 2235 10949 3453 -15801 -21093 -14545 -17458 -28977
453 -28977 -28264 -15709 -13736 -23071 -21679 -6293 322 -6500 -5360 8538 15935 9779 6270 11619
467 11619 10182 -2766 -9935 -3862 30 -4262 -5591 148 2001 -3620 -5447 -1868 -3202 -8304 -6064
482 -6064 2136 2675 -3945 -5334 -4326 -12250 -21738 -17779 -6956 -5667 -7915 1079 12256 8435 -2352
497 -2352 -304 7612 2987 -3958 8086 25435 20909 5986 8807 19254 9493 -8791 -535 22942
511 22942 23185 5332 7591 25288 17699 -14581 -24808 -6784 -663 -16834 -18013 6316 16465
524 16465 -2655 -14643 -2317 6432 -3300 -4809 14252 26934 19608 13750 17711 9410 -11169
$$ packed form
425a9612R902N054n637j933R406M671q420n029J1612J0898o220q959P249J1291
439A4273m111r089N621J0530n473j1898K382Q714p496j9254n292O548k913j1519
453b8977P13J2555J973r335J392J5386O615o822J140J3898P397o156l509N349
467A1619j437j2948p169O073L892m292j329N739J853n621j827L579j334n102K240
482f064Q200N39o620j389J008p924r488L959J0823J289k248Q994J1177l821j0787
497b352K048P916m625o945J2044J7349m526j4923K821J0447r761j8284Q256K3477
511B2942K43j7853K259J7697p589l2280j0227J8024O121j6171j179K4329J0149
524A6465j9120j1988J2326Q749r732j509J9061J2682p326n858L961q301k0579
$$ plain form
537 -11169 -15183 666 5304 -2994 6772 32838 33023 4324 -4963 16116 20130 -5519 -12017 19152
551 19152 36198 8884 -18418 -8800 2150 -20271 -42043 -22023 13666 21199 13484 22446 37861
564 37861 32539 15967 13168 20713 23775 27704 36061 34590 20590 12501 12817 1747 -17020 -11159
578 -11159 18721 33794 23976 24910 42971 41171 10484 -6572 7410 14963 199 -2305 17535
591 17535 21453 -3530 -16331 -3154 -2997 -22632 -13224 32185 51230 25259 17628 51180 56612
604 56612 3428 -28214 11115 46498 13645 -21977 13117 58924 27475 -34945 -28391 25911
616 25911 32361 -7688 -6858 44502 64969 25552 -10285 -2966 11802 -808 -20934 -18951 4010
629 4010 27235 29265 7559 -9250 6904 32340 21587 -7474 9309 64732 73193 19636 -6200
$$ packed form
537a1169m014J5849M638q298R766K6066J85k8699r287K1079M014k5649o498L1169
551A9152J7046k7314k7302R618J0950k2421k1772K0020L5689P533p715Q962J5415
564C7861n322j6572k799P545L062L929Q357j471j4000q089L16j1070j8767N861
578a1159K9880J5073r818R34J8061j800l0687j7056J3982P553j4764k504J9840
591A7535L918k4983j2801J3177J57j9635R408M5409J9045k5971p631L3552N432
604E6612n3184l1642L9329L5383l2853l5622L5094M5807l1449o2420O554N4302
616B5911O450m0049Q30N1360K0467l9417l5837P319J4768j2610k0126J983K2961
629D010K3225K030k1706j6809J6154K5436j0753k9061J6783N5423Q461n3557k5836
$$ plain form
642 -6200 33384 51712 -4617 -48409 -5254 51938 31013 -17018 -864 44921 29378 -24416
654 -24416 -26976 13914 22053 -5113 -4985 23014 23984 -2661 -11188 -2024 -7265 -15144 7231 36257
668 36257 31803 17714 33459 50504 25739 -8139 858 26469 15148 -11124 -1420 23725 12189
681 12189 -20429 -24304 -7648 -9994 -16421 3537 25488 19580 14160 34948 39877 3241 -20186
694 -20186 9063 30275 -5298 -32536 8345 47401 6039 -50783 -25687 30823 14258 -41142
706 -41142 -23169 48172 58050 2676 -12628 30407 41831 -6519 -34710 -3248 26637 13010
718 13010 -6001 926 10619 3717 -7029 -12810 -17671 -11499 10163 20064 2392 -5678 16235 22670
732 22670 -14930 -42330 -11735 24476 5994 -21934 4396 45279 26853 -19491 -15651 19215
$$ packed form
642f200L9584J8328n6329m3792M3155N7192k0925m8031J6154M5785j5543n3794
654b4416k560M0890Q139k7166J28K7999R70k6645q527R164n241p879K2375K9026
668C6257m454j4089J5745J7045k4765l3878Q997K5611j1321k6272R704K5145j1536
681A2189l2618l875J6656k346o427J9958K1951n908n420K0788M929l6636k3427
694b0186K9249K1212l5573k7238M0881L9056m1362n6822K5096N6510j6565n5400
706d1142J7973P1341R878n5374j5304M3035J1424m8350k8191L1462K9885j3627
718A3010j9011O927R693o902j0746n781m861O172K1662R901j7672q070K1913O435
732B2670l7600k7400L0595L6211j8482k7928K6330M0883j8426m6344L840L4866
$$ plain form
744 19215 13707 -18559 -9098 30360 31075 -2942 -10777 6051 -4622 -33430 -27237 2440 3494
757 3494 -13595 641 28072 13692 -22456 -19043 9560 4558 -19530 -3623 37174 34772 -2879
770 -2879 -9715 12956 6733 -27113 -26935 6972 18830 1008 21 17929 9880 -21041 -26739 -6805
784 -6805 -2754 -12754 -79 25804 21220 -5063 -8815 3793 -7045 -30312 -20424 11978 17705
797 17705 -919 -255 14624 2731 -26951 -29456 -5816 644 -9253 311 22825 18228 -7464
810 -7464 -14327 -5395 -12516 -27312 -14178 14113 16871 211 1261 12204 -1881 -27793 -24121
823 -24121 1289 5791 -5197 4554 25421 16465 -13234 -20248 -6450 -7837 -19930 -7148 21660
836 21660 25305 5985 717 9963 727 -21696 -20855 2067 9407 -1534 -947 10841 2340 -23651
$$ packed form
744A9215n508l2266R461L9458P15l4017p835J6828j0673k8808O193K9677J054
757C494j7089J4236K7431j4380l6148L413K8603n002k4088J5907M0797k402l7651
770b879o836K2671o223l3846J78L3907J1858j7822r87J7908q049l0921n698J9934
784f805M051j0000J2675K5883m584k6283l752J2608j0838k3267R888L2402N727
797A7705j8624O64J4879j1893k9682k505K3640O460r897R564K2514m597k5692
810g464o863Q932p121j4796J3134K8291K758j6660J050J0943j4085k5912L672
823b4121K5410M502j0988R751K0867q956k9699p014J3798j387j2093J2782K8808
836B1660L645j9320n268R246r236k2423Q41K2922P340j0941N87J1788q501k5991
$$ plain form
850 -23651 -31886 -18528 -12109 -16039 -5342 16551 20892 6631 -438 3215 -3139 -16809 -13242 3837
864 3837 8382 -822 -3350 1068 -9140 -28825 -33253 -20083 -11959 -12048 -3247 12491 14751 2142
878 2142 -6570 -5036 -6752 -12892 -9477 2009 6702 2310 -1716 -4106 -12936 -22117 -19782 -10176 -4886
893 -4886 -1295 9147 17012 10239 -2515 -5224 -2223 -6696 -12635 -5556 7532 8569 -1346 -5129
907 -5129 -2869 -7851 -16933 -15481 -3729 3565 2630 3036 5843 1761 -9160 -14980 -13437 -12595 -13249 -8035
923 -8035 781 3036 -2497 -5710 -4344 -5581 -9204 -7227 1778 7023 4463 1027 1013 -1484 -9589 -16176
939 -16176 -15624 -10413 -7266 -5428 -2318 30 -1091 -4788 -7911 -7597 -5270 -2835 -1865 -931 -560 -1018
955 -1018 -4011 -9334 -12276 -11486 -8603 -5741 -1514 2978 5353 4334 2137 1954 1222 -149 -1139 -30
$$ packed form
850b3651q235J3358O419l930J0697K1893M341j4261p069L653o354j3670L567J7079
864C837M545r204k528M418j0208j9685m428J3170Q124q9Q801J5738K260j2609
878B142q712J534j716o140L415J1486M693m392m026k390q830r181K335R606N290
893d886L591J0442P865o773j2754k709L001m473n939P079J3088J037r915l783
907e129K260m982r082J452J1752P294r35M06K807m082j0921n820J543Q42o54N214
923h035Q816K255n533l213J366j237l623J977R005N245k560l436j4k497q105o587
939a6176N52N211L147J838L110K348j121l697l123L14K327K435R70R34L71m58
955a018k993n323k942P90K883K862M227M492K375j019k197j83p32j371r90J109
$$ plain form
971 -30 505 -825 -2354 -2929 -5686 -9855 -11444 -7848 -3911 -3098 -1630 2877 5351 2444 -466 865
987 865 2748 -800 -4178 -2145 2097 1413 -2721 -3413 -1280 -1895 -4028 -1849 2668 4225 2755 2597
1003 2597 4247 3741 350 -2157 -2330 -3637 -5246 -4077 -2418 -3691 -5374 -4604 -2934 -2866 -2554 379
1019 379 2650 1337 708 3031 4748 2061 -1367 -829 -347 -2745 -4069 -1949 -896 -4111 -5810 -2102
1035 -2102 599 -2032 -3495 1127 4010 680 145 6242 9047 3059 -813 4353 8666 2916 -2303
1050 -2303 2603 6504 123 -6179 -673 5167 -1092 -8551 -2904 5604 2082 -4252 1432 9622 5428
1065 5428 -1900 3496 11402 6574 -2706 -89 7350 2430 -6506 -4145 2332 -2490 -9803 -5411 3702
1080 3702 974 -5796 -928 7842 4644 -2254 2652 9758 4092 -4601 172 7380 983 -8448 -4197
$$ packed form
971c0N35j330j529n75k757m169j589L596L937Q13J468M507K474k907k910J331
987H65J883l548l378K033M242o84m134o92K133o15k133K179M517J557j470j58
1003B597J650n06l391k507j73j307j609J169J659j273j683P70J670O8L12K933
1019C79K271j313o29K323J717k687l428N38M82k398j324K120J053l215j699L708
1035b102K701k631j463M622K883l330n35O097K805n988l872N166M313n750n219
1050b303M906L901o381o302N506N840o259p459N647Q508l522o334N684Q190m194
1065E428p328N396P906m828r280K617P439m920q936K361O477m822p313M392R113
1080C702k728o770M868Q770l198o898M906P106n666q693M773P208o397r431M251
$$ plain form
1095 -4197 3181 -2934 -10089 -3385 6106 361 -7904 -822 9167 2828 -6975 -634 9290 2355 -7926
1110 -7926 -221 10251 2252 -8632 -1215 10391 3921 -6502 1254 12170 4193 -7433 -457
1123 -457 9726 467 -12782 -5498 5687 -2534 -14002 -4376 7952 -804 -12598 -1033 13449
1136 13449 4273 -9273 1288 15958 5525 -11372 -3931 10393 -1085 -19346 -11231 6619
1148 6619 145 -16411 -8292 10411 5681 -9869 -3415 13771 10327 -4243 669 14639 8835
1161 8835 -6521 -4349 5603 -2803 -15559 -8562 3704 -4249 -15259 -4784 8082 -2689 -15975
1174 -15975 -3768 11613 592 -13834 -49 17447 5082 -14150 -4124 14254 3306 -15926
1186 -15926 -5106 16136 8957 -10296 -3635 13671 4380 -16158 -11251 5308 -903 -16755 -8879
$$ packed form
1095d197P378o115p155O704R491n745q265P082R989o339r803O341R924o935j0281
1110g926P705J0472p999j0884P417J1606o470j0423P756J0916p977j1626O976
1123d57J0183r259j3249P284J1185q221j1468R626J2328q756j1794J1565J4482
1136A3449r176j3546J0561J4670j0433j6897P441J4324j1478j8261Q115J7850
1148F619o474j6556Q119J8703m730j5550O454J7186l444j4570M912J3970n804
1161H835j5356K172R952q406j2756O997J2266p953j1010J0475J2866j0771j3286
1174a5975J2207J5381j1021j4426J3785J7496j2365j9232J0026J8378j0948j9232
1186a5926J0820K1242p179j9253O661J7306r291k0538M907J6559o211j5852P876
$$ plain form
1199 -8879 7055 -1004 -17740 -10188 5761 -1974 -14745 -1959 17072 9122 -6829 1634 15314
1212 15314 2485 -17293 -8646 8575 139 -15471 -4937 11526 238 -18006 -9072 8209
1224 8209 -232 -14109 513 20857 10461 -9116 -76 15643 499 -22666 -12088 11610
1236 11610 4219 -16599 -7601 14434 5516 -20232 -17144 6377 6659 -10868 -6366 15586 16111 -2578
1250 -2578 -6504 3965 1044 -11205 -6652 7059 6954 574 6345 11411 -2350 -14649 -4138 6166
1264 6166 -5665 -14127 4236 19362 1079 -19967 -9215 6396 -8904 -27185 -9277 18975
1276 18975 13444 -7964 -1374 17536 7414 -16632 -12443 9232 9189 -5028 686 15885 7281
1289 7281 -15062 -16244 -3928 -8017 -18436 -6436 14149 11571 -3536 12 11861 3091 -14428
$$ packed form
1199h879J5934q059j6736P552J5949p735j2771J2786J9031p950j5951Q463J3680
1212A5314j2829j9778Q647J7221q436j5610J0534J6463j1288j8244Q934J7281
1224H209q441j3877J4622K0344j0396j9577R040J5719j5144k3165J0578K3698
1236A1610p391k0818Q998K2035q918k5748L088K3521K82j7527M502K1952N25j8689
1250b578l926J0469k921j2249M553J3711j05o380N771N066j3761j2299J0511J0304
1264F166j1831q462J8363J5126j8283k1046J0752J5611j5300j8281J7908K8252
1276A8975n531k1408O590J8910j0122k4046M189K1675m3j4217N714J5199q604
1289G281k2343j182J2316m089j0419J2000K0585k578j5107L548J1849q770j7519
$$ plain form
1302 -14428 -7824 13221 14223 2769 6506 17651 7883 -13591 -16360 -5266 -5581 -11990 -2719 12125
1316 12125 8910 -2539 -577 5292 -4054 -12799 973 20017 17668 8216 15413 23187 6532 -15838
1330 -15838 -11962 3104 -861 -12645 -3548 14216 8246 -12473 -15905 -5441 -7352 -16352 -6916
1343 -6916 13856 17844 8189 7424 12118 3481 -10611 -8413 3397 4587 -10 7294 16900 7726
1357 7726 -9993 -11992 -4572 -7109 -12833 -2602 14246 14403 3250 1406 5540 -1234 -12536 -8044
1371 -8044 6205 11425 8892 14385 19911 10481 -4400 -5323 2187 489 -3538 5933 18449 13616
1385 13616 -1024 -3074 1443 -5539 -16146 -8962 9389 15608 9038 8844 15477 10288 -3787 -7238
1399 -7238 1911 7489 5013 7191 13895 12385 1747 -5940 -6387 -8249 -10148 -3675 7158 10843 8179
$$ packed form
1302a4428O604K1045J002j1454L737J1145r768k1474k769J1094l15o409R271J4844
1316A2125l215j1449J962N869r346q745J3772J9044k349r452P197P774j6655k2370
1330a5838L876J5066l965j1784R097J7764n970k0719l432J0464j911r000R436
1343f916K0772L988r655p65M694q637j4092K198J1810J190m597P304R606r174
1357G726j7719j999P420k537n724J0231J6848J57j1153j844M134o774j1302M492
1371h044J4249N220k533N493N526r430j4881r23P510j698m027R471J2516m833
1385A3616j4640k050M517o982j0607P184J8351O219o570j94O633n189j4075l451
1399g238R149N578k476K178O704j510j0638p687m47j862j899O473J0833L685k664
$$ plain form
1414 8179 6913 6717 730 -6980 -5640 1531 4897 5542 10684 14918 9803 459 -2161 -876 -2662
1429 -2662 -3111 4961 13802 12230 5429 4446 4751 -2893 -11475 -8094 2954 5894 3132 6743 13726
1444 13726 11116 274 -3083 4344 8628 6534 7429 14523 16693 8713 -96 -2625 -4307 -8222 -8738
1459 -8738 -3515 2590 4845 5478 5895 4154 1282 1914 5660 7932 9341 12537 15920 13193 6309 1180
1475 1180 -935 -3685 -7553 -6459 -1020 3013 2681 1893 2380 1809 21 99 3017 6145 8337 10807
1491 10807 11593 9137 4363 1348 -84 -2206 -3776 -1527 2693 4060 1689 635 1588 267 -3006
1506 -3006 -3456 286 3832 4569 5041 6090 6404 3773 1172 566 1313 2413 3873 5793 6044 4699 3632
1523 3632 2754 -328 -3487 -3294 -733 353 -995 -195 2846 3730 212 -1950 48 3447 3706 3057
$$ packed form
1414H179j266j96n987p710J340P171L366O45N142M234n115r344k620J285j786
1429b662m49Q072Q841j572o801r83L05p644q582L381J1048K940k762L611O983
1444A3726k610j0842l357P427M284k094Q95P094K170p980q809k529j682l915n16
1459h738N223O105K255O33M17j741k872O32L746K272J409L196L383k727o884n129
1475A180k115k750l868J094N439M033l32p88M87n71j788P8K918L128K192K470
1491A0807P86k456m774l015j432k122j570K249M220J367k371j054R53j321l273
1506c006m50L742L546P37M72J049L14k631k601o06P47J100J460J920K51j345j067
1523C632q78l082l159J93K561J086j348Q00L041Q84l518k162J998L399K59o49
$$ plain form
1539 3057 5242 8633 7880 4386 1748 1584 1053 -1204 -2145 -672 1134 1343 452 -1245 -1754 -1649 -1445
1556 -1445 -1596 -1106 816 3324 3497 2128 1455 1667 1408 -255 -1249 343 2666 3159 2483 1459 1305
1573 1305 568 -945 -2461 -2209 -1384 -238 -61 -563 -249 141 -115 -2059 -2795 -986 2012 2705 1727 2359
1591 2359 4396 3407 -266 -1790 -402 632 -1179 -2217 -280 1529 -522 -3381 -3870 -2719 -2654 -3269
1607 -3269 -2231 -391 469 14 222 -35 -778 -1339 -1004 -956 -860 -152 1414 1158 -1236 -2701 -2311 -2109 -3448
1626 -3448 -3789 -2414 -493 -764 -1803 -498 767 -41 -1286 -196 1654 2284 2344 2256 1686 134 -1229
1643 -1229 -2307 -3447 -4779 -5001 -3868 -3254 -4254 -3480 -1632 -1633 -2850 -2221 1033 3073 1878 1235 2495
1660 2495 3226 321 -2041 -1764 -1649 -3964 -5849 -4464 -3216 -4111 -5535 -4176 -3143 -3894 -4031 -1297
$$ packed form
1539C057K185L391p53l494k638j64n31k257r41J473J806K09q91j697n09J05K04
1556a445j51M90J922K508J73j369o73K12k59j663r94J592K323M93o76j024j54
1573A305p37j513j516K52Q25J146J77n02L14L90k56j944p36J809K998O93r78O32
1591B359K037r89l673j524J388J034j811j038J937J809k051k859m89J151O5o15
1607c269J038J840Q60m55K08k57p43n61L35M8R6P08J566k56k394j465L90K02j339
1626c448l41J375J921k71j039J305J265q08j245J090J850O30O0q8n70j552j363
1643a229j078j140j332k22J133O14j000P74J848jj217O29L254K040j195o43J260
1660B495P31k905k362K77J15k315j885J385J248q95j424J359J033p51j37K734
$$ plain form
1676 -1297 332 -1344 -2302 -162 758 -2342 -4046 -2516 -1748 -4309 -5829 -2954 -411 -3077 -5418 -2946
1692 -2946 359 -1529 -4287 -2082 968 -462 -2996 -1464 828 -780 -3921 -2611 -114 -1023 -2737
1707 -2737 -1040 744 -1043 -2935 -1747 -361 -3455 -5460 -3885 -2009 -4608 -6656 -3599 -1328 -3789
1722 -3789 -5806 -2073 1669 -366 -2523 819 3917 1677 -2194 491 2789 -1056 -5447 -3223 71
1737 71 -2961 -6286 -3965 -833 -3265 -6285 -2775 497 -2082 -5424 -2315 1363 -2099 -5920 -3364
1752 -3364 -530 -4220 -7584 -3794 707 -2513 -6113 -1678 2974 -316 -4093 -72 5019 1187 -3796
1767 -3796 -342 3823 -562 -7116 -4674 248 -3331 -8416 -5109 725 -1603 -6833 -3581 2528 543
1782 543 -4810 -1810 4157 2079 -3200 -1281 3214 109 -5514 -3144 1802 18 -3851 -864 4178
$$ packed form
1676a297J629j676r58K140R20l100j704J530P68k561j520K875K543k666k341K472
1692b946L305j888k758K205L050j430k534J532K292j608l141J310K497r09j714
1707b737J697J784j787j892J188J386l094k005J575J876k599k048L057K271k461
1722c789k017L733L742k035k157L342L098k240l871K685K298l845m391K224L294
1737G1l032l325K321L132k432l020L510L272k579l342L109L678l462l821K556
1752c364K834l690l364L790M501l220l600M435M652l290l777M021N091l832m983
1767c796L454M165m385o554K442M922l579n085L307N834k328n230L252O109j985
1782E43n353L000N967k078n279J919M495l105n623K370M946j784l869K987N042
$$ plain form
1797 4178 1592 -2828 657 4928 1606 -2418 1846 6153 1722 -3420 297 3751 -2374 -8124 -3239
1812 -3239 3401 -1629 -7594 -2569 4580 -514 -8082 -3629 4286 1157 -5796 -1569 6706 3422 -4544
1827 -4544 -2810 3932 1276 -5603 -2711 4220 2209 -3481 -1082 3984 222 -5675 -2419 3594 442
1842 442 -3593 1102 6731 1658 -4717 -892 4784 -309 -6476 -736 6744 2429 -4965 -1109 5684
1857 5684 866 -6954 -2516 6303 4234 -2265 1883 9030 5398 -2990 -525 6446 3481 -2959 799
1872 799 7832 4335 -3411 -1315 3804 -339 -7735 -3797 4200 2214 -3774 -643 5474 1130 -6303
1887 -6303 -3280 3768 1447 -3770 224 7003 3326 -3629 -960 4122 -387 -6143 -1032 6107 2327
1902 2327 -3465 914 6579 705 -6829 -2274 5710 1810 -4634 598 8404 4095 -4943 -2558 4055
$$ packed form
1797D178k586m420L485M271l322m024M264M307m431n142L717L454o125n750M885
1812c239O640n030n965N025P149n094p568M453P915l129o953M227Q275l284p966
1827d544J734O742k656o879K892O931k011n690K399N066l762n897L256O013l152
1842D42m035M695N629n073o375L825N676n093o167N740P480m315p394L856O793
1857E684m818p820M438Q819k069o499M148P147l632q388K465O971k965o440L758
1872G99P033l497p746K096N119m143p396L938P997j986n988L131O117m344p433
1887f303L023P048k321n217L994O779l677o955K669N082m509n756N111P139l780
1902B327n792M379N665n874p534M555P984l900o444N232P806m309r038K385O613
$$ plain form
1917 4055 259 -6817 -2943 5327 2683 -4219 -2265 3926 687 -6194 -2654 4966 3562 -1600 2574
1932 2574 9025 5065 -2802 -1201 4628 1284 -5475 -2157 4874 1808 -5721 -3987 2010 -692 -7340
1947 -7340 -4532 3220 2944 -1472 1031 6827 4169 -2416 -1236 2789 502 -3862 -1000 3465 177
1962 177 -4297 -1636 2101 -2479 -7338 -2466 3918 872 -3484 1370 6813 1692 -6019 -2366 3861
1977 3861 -172 -6524 -2124 5819 3474 -3936 -2072 3697 935 -5804 -3347 3774 3478 -2066 -1151
1992 -1151 3518 1001 -5192 -5165 -914 -1671 -5000 -2165 3505 2670 -1448 -374 2962 430 -3241 -385
2008 -385 4223 2769 -932 1307 4270 303 -5884 -4193 -283 -2402 -5138 -1015 4670 2561 -2661
2023 -2661 -1401 2338 -367 -5104 -2347 3579 3224 -779 778 4384 899 -4995 -4488 -254 91 -2554
$$ packed form
1917D055l796p076L874Q270k644o902J954O191l239o881L540P620j404n162M174
1932B574O451l960p867J601N829l344o759L318P031l066p529J734N997k702o648
1947g340K808P752k76m416K503N796k658o585J180M025k287m364K862M465l288
1962A77m474K661L737m580m859M872O384l046m356M854N443n121p711L653O227
1977C861m033o352M400P943k345p410J864N769k762o739K457P121k96n544R15
1992a151M669k517o193K7M251p57l329K835N670q35m118J074L336k532l671K856
2008c85M608j454l701K239K963l967o187J691L910k119k736M123N685k109n222
2023b661J260L739k705m737K757N926l55m003J557L606l485n894N07M234L45k645
$$ plain form
2039 -2554 73 4363 2963 -1968 -2537 -473 -2257 -4899 -2303 2468 3112 1465 2437 3900 601 -2932
2055 -2932 -1048 2160 1829 812 3409 6319 2599 -2344 -2389 -1182 -4008 -7252 -3021 2553 2355 -845
2071 -845 -381 2412 -188 -4445 -2979 2362 3967 2473 3735 6151 4285 -1310 -3321 -2494 -2826 -3702
2087 -3702 -1273 2566 2714 117 -575 -396 -2705 -4686 -2476 1596 2644 2299 4017 4889 1699 -2952
2103 -2952 -3744 -1998 -1784 -1779 820 4079 3279 291 -853 -773 -2414 -3857 -938 2671 4312 4136 5385
2120 5385 5398 1952 -1422 -1154 930 1181 1131 3821 5875 3527 -574 -2468 -2452 -3990 -5104 -2669 1650
2137 1650 2701 1400 1459 1387 -617 -3166 -2556 353 2167 2867 4479 5385 3650 -165 -1531 -1751 -2514
2154 -2514 -2385 349 3206 3070 1192 443 -393 -2801 -4771 -3542 -214 926 1139 2189 2538 868
$$ packed form
2039b554K627M290j400m931n69K064j784k642K596M771O44j647R72J463l299l533
2055b932J884L208l31j017K597K910l720m943m5J207k826l244M231N574j98l200
2071h45M64K793k600m257J466N341J605j494J262K416j866n595k011Q27l32q76
2087c702K429L839J48k597o92J79k309j981K210M072J048l45J718Q72l190m651
2103b952p92J746K14NK599L259q00k988j144Q0j641j443K919L609J641j76J249
2120E385J3l446l374K68K084K51n0K690K054k348m101j894J6j538j114K435M319
2137A650J051j301N9p2k004k549O10K909J814P00J612R06j735l815j366k20p63
2154b514J29K734K857j36j878p49q36k408j970J229L328J140K13J050L49j670
$$ plain form
2170 868 -1936 -3025 -2011 -1100 106 2432 4629 4395 2860 1670 500 -1553 -2091 -339 1660 2349
2186 2349 2571 3250 2818 147 -2189 -1449 -261 183 823 3563 5197 3558 1257 120 -207 -1584 -2311
2203 -2311 -735 1390 1884 1163 1296 985 -1178 -2379 -1777 5 723 1494 3584 4463 2735 503 398
2220 398 835 -167 -514 1699 3751 3368 1864 1819 1594 -380 -2394 -1861 366 557 -11 642 872 -76
2238 -76 -1602 -1785 -786 -552 183 2360 3921 3553 3071 3247 2711 781 534 1831 2520 1829 1101 2287
2256 2287 2010 -135 -1583 -390 883 544 857 2752 4247 3306 1838 1954 2129 937 -15 1131 1956
2273 1956 955 179 1338 1242 94 -891 770 2279 1957 2334 4390 5543 4007 2463 3290 3854 2179
2290 2179 768 1577 2554 1446 -16 586 1363 -120 -1459 -307 1420 1049 704 1938 2867 1569 724
$$ packed form
2170H68k804j089J014R11J206K326K197k34j535j190j170k053n38J752J999O89
2186B349K22O79m32k671k336P40J188M44O40K740J634j639k301j137l27j377p27
2203b311J576K125M94p21J33l11k163j201O02J782P18P71K090Q79j728k232j05
2220C98M37j002l47K213K052l83j504m5k25j974k014N33K227J91n68O53K30r48
2238g6j526j83R99K34P35K177J561l68m82J76n36j930k47J297O89o91p28J186
2256B287k77k145j448J193J273l39L13J895J495r41j468J16J75j192r52J146Q25
2273A956j001p76J159r6j148r85J661J509l22L77K056J153j536j544Q27N64j675
2290B179j411Q09R77j108j462O02P77j483j339J152J727l71l45J234R29j298q45
$$ plain form
2307 724 1487 2148 889 79 1529 2497 1301 435 1719 2279 1025 28 1362 2756 1815 1096 2039 2693
2325 2693 1588 182 1289 1741 844 106 985 2239 1333 281 1263 2348 1336 349 1570 2637 1188
2342 1188 511 1739 2986 1512 163 1436 2536 1071 -172 1533 2799 1388 -104 1485 2232
2357 2232 891 -540 772 1973 456 -769 910 1750 338 -1128 1 1478 345 -781 188
2372 188 1525 356 -793 -164 1291 -105 -1574 -302 1095 163 -956 239 1653 715 -650 366
2388 366 2014 1005 -274 501 1562 827 -758 -291 996 -48 -1697 -873 254 -394 -1695 -577
2404 -577 620 -393 -1222 -681 722 -3 -1084 -96 1084 297 -834 -145 636 -515 -1660 -370 811
2421 811 -589 -1695 -534 770 -404 -2226 -721 721 -457 -2233 -862 484 -458 -2358 -1610 292
$$ packed form
2307G24P63O61j259q10J450R68j196q66J284N60j254r97J334J394r41p19R43O54
2325B693j105j406J107M52q97p38Q79J254r06j052R82J085j012r87J221J067j449
2342A188o77J228J247j474j349J273J100j465j243J705J266j411j492J589P47
2357B232j341j431J312J201j517j225J679Q40j412j466J129J477j133j126R69
2372A88J337j169j149O29J455j396j469J272J397r32j119J195J414r38j365J016
2388C66J648j009j279P75J061p35j585M67J287j044j649Q24J127o48j301J118
2404e77J197j013q29N41J403p25j081R88J180p87j131O89P81j151j145J290J181
2421H11j400j106J161J304j174j822J505J442j178j776J371J346r42j900P48J902
$$ plain form
2437 292 -514 -2153 -1710 -82 -556 -1593 -1122 162 3 -1034 -933 572 308 -777 -282 537 -182 -1623
2455 -1623 -1250 -437 -1366 -2536 -1916 -873 -1355 -2457 -1750 -187 -525 -2108 -1187 384 422 -539 -566 1146
2473 1146 503 -1211 -1454 -531 -1070 -2024 -1976 -815 -836 -1989 -2015 -767 -745 -2021 -1490 -156 132 -632 -794
2492 -794 98 -157 -1695 -1798 -851 -1084 -1735 -1465 -510 -566 -1319 -1314 -433 -856 -1663 -635 694 473 -641 -457
2512 -457 638 -466 -2201 -1907 -566 -504 -1713 -1280 474 366 -1226 -1928 -749 -211 -1359 -1625 -44
2529 -44 716 -351 -1305 -1035 -793 -1566 -1748 -935 84 134 604 1297 1157 22 -552 81 -293 -726 -437 435
2549 435 376 -1076 -1727 -1272 -1669 -3234 -3083 -963 -80 -420 -532 584 528 -1220 -2008 -1061 -70 -602 -715
2568 -715 457 1171 -352 -1772 -1696 -1624 -2316 -2097 -654 517 543 -381 -348 -446 -1747 -2324 -1739 -418 90
$$ packed form
2437B92q06j639M43J628m74j037M71J284j59j037J01J505k64j085M95Q19p19j441
2455a623L73Q13r29j170O20J043m82j102P07J563l38j583R21J571L8r61k7J712
2473A146o43j714k43R23n39r54M8J161k1j153k6J248K2j276N31J334K88p64j62
2492g94Q92k55j538j03R47k33o51K70R55n6p53NQ81m23q07J028J329k21j114J84
2512d57J095j104j735K94J341O2j209M33J754j08j592p02J179N38j148k66J581
2529d4P60j067r54K70K42p73j82Q13J019N0M70O93j40j135n74O33l74m33K89Q72
2549D35n9j452o51M55l97j565J51K120Q83l40j12J116n6j748p88R47R91n32j13
2568g15J172P14j523j420P6P2o92K19J443J171K6r24L3r8j301n77N85J321N08
$$ plain form
2587 90 565 790 1223 -433 -1228 -1191 -1232 -1629 -853 675 812 130 -835 -986 -1632 -3013 -3125 -877 369
2606 369 168 706 1934 2259 169 -1255 -175 1074 776 1 1418 2225 898 -1954 -2612 -2741 -3322
2623 -3322 -3858 -3093 -736 7 -541 -700 -777 -1727 -2457 -1874 -792 -21 494 1407 1935 286 -1236 -1578 -1591
2642 -1591 -2166 -1992 -271 1255 1105 -182 -293 -975 -2373 -3065 -2230 -777 -90 3 856 919 -238 -1787
2660 -1787 -1761 -1139 -1250 -466 1454 2695 1664 447 109 -315 -1704 -2384 -1680 644 756 176 632 710
2678 710 -241 -2188 -2131 -686 226 709 1710 2393 1626 169 -731 -1240 -1983 -2071 -877 185 501 -151 -255
2697 -255 -570 -2029 -3550 -2536 -912 -366 -75 816 2049 1037 -505 -938 -674 -30 -397 562 1798
2714 1798 2061 1415 468 -211 -1277 -2144 -1685 -955 -478 -153 427 890 -416 -1336 -1002 -616 -449 294 1786
$$ packed form
2587I0M75K25M33j656p95L7m1l97P76J528J37o82r65j51o46j381j12K248J246
2606C69k01N38J228L25k090j424J080J249k98p75J417Q07j327k852o58j29n81
2623c322n36P65K357P43n48j59p7r50p30N83J082P71N15R13N28j649j522l42j3
2642a591n75J74J721J526j50j287j11o82j398o92Q35J453O87R3Q53O3j157j549
2660a787K6O22j11P84J920J241j031j217l38m24j389o80P04K324J12n80M56P8
2678G10r51j947N7J445R12M83J001O83p67j457r00n09p43q8J194J062L16o52j04
2697b55l15j459j521J014J624N46K91Q91J233j012j542m33K64O44l67R59J236
2714A798K63o46r47o79j066q67M59P30M77L25N80M63j306r20L34L86J67P43J492
$$ plain form
2733 1786 2762 2508 1250 626 207 -633 -1559 -1198 -14 411 -96 522 425 -280 -1160 -738 -350 317 930
2752 930 2134 2899 2020 1200 649 469 -306 -853 21 721 589 -321 118 245 -837 -1750 -1481 -184 51
2771 51 68 665 1626 1170 402 188 28 32 -263 312 1416 1157 1107 943 439 24 -926 -550 -283 -570 -580 230
2793 230 468 -207 -1171 -851 -291 -901 -1005 -80 1210 1186 1072 944 1173 558 -199 -96 317 -23 -195 104
2813 104 367 -341 -1054 -751 -736 -1151 -976 -151 866 409 258 716 1033 236 -384 -88 830 477 61 434
2833 434 833 313 -444 -482 -221 -690 -1445 -868 -63 -300 -936 -894 -533 -1365 -1538 -929 -474 -319 -171 510 1179
2854 1179 514 -101 393 777 87 -324 310 539 168 -595 -555 -334 -1480 -2020 -1459 -607 -737 -677 140 585
2874 585 -52 -415 70 351 -221 -427 195 673 116 -584 -434 -458 -1638 -2200 -1261 -399 -734 -1071 230 515
$$ packed form
2733A786R76k54j258o24m19q40r26L61J184M25n07O18r7p05q80M22L88O67O13
2752I30J204P65q79q20n51j80p75n47Q74P00j32r10M39J27j082r13K69J297K35
2771E1J7N97R61m56p68k14j60Mk95N75J104k59n0j64n04m15r50L76K67k87j0Q10
2793B30K38o75r64L20N60o10j04R25J290k4j14j28K29o15p57J03M13l40j72K99
2813A04K63p08p13L03J5m15J75Q25J017m57j51M58L17p97o20K96R18l53m16L73
2833D34L99n20p57l8K61m69p55N77Q05k37o36M2L61q32j73O09M55J55J48O81O69
2854A179o65o15M94L84o90m11O34K29l71p63M0K21j146n40N61Q52j30O0Q17M45
2874E85o37l63M85K81n72k06O22M78n57p00J50k4j180n62R39Q62l35l37J301K85
$$ plain form
2894 515 -322 -813 -302 179 -56 -488 349 763 129 -422 -128 -167 -1246 -1795 -832 -207 -548 -1115 -230 -61
2914 -61 -627 -1339 -716 -117 -725 -677 291 970 217 -488 49 389 -295 -517 -23 916 402 141 137 595 -362
2935 -362 -674 -582 53 -462 -509 302 837 -328 -753 38 23 -718 -1052 50 635 -24 -623 122 775 -241
2955 -241 -1250 -278 296 -364 -606 293 655 -38 -656 -96 374 -281 -250 579 1264 705 -54 616 855 -96
2975 -96 -592 -79 615 54 -484 267 512 -382 -953 -136 168 -349 -857 -114 823 173 118 753 1309 387 -55
2996 -55 965 1680 786 281 1073 1627 882 -189 489 926 44 -670 335 1010 -194 -561 -76 432 -252
3015 -252 -821 28 636 475 75 689 1115 526 50 476 1368 846 49 994 1573 487 -501 238 863 42
3035 42 -702 183 643 139 -169 336 1012 622 -80 506 989 679 -431 386 981 -267 -645 -315 388 -350
$$ packed form
2894E15q37m91N11M81k35m32Q37M14o34n51K94l9j079n49R63O25l41n67Q85J69
2914f1n66p12O23N99o08M8R68O79p53p05N37L40o84k22M94R39n14k61mM58r57
2935c62l12R2O35n15m7Q11N35j165m25P91j5p41l34J102N85o59n99P45O53j016
2955b41j009R72N74o60k42Q99L62o93o18N60M70o55L1Q29O85n59p59O70K39r51
2975i6m96N13O94n61n38P51K45q94n71Q17L04n17n08P43R37o50n5O35N56r22m42
2996e5J020P15q94n05P92N54p45j071O78M37q82p14J005O75j204l67M85N08o84
3015b52n69Q49O08j61m00O14M26n89m76M26Q92n22p97R45N79j086r88P39O25q21
3035D2p44Q85M60n04l08N05O76l90p02N86M83l10j110Q17N95j248l78L30P03p38
$$ plain form
3055 -350 -1018 -245 552 57 -543 622 1049 504 -142 562 1764 797 108 960 1718 974 -205 576 988
3074 988 244 -409 309 1009 709 -227 472 986 102 -460 400 688 290 -371 203 747 86 -243 322 898
3094 898 549 -229 606 1347 735 111 731 1485 597 -348 414 782 72 -440 76 769 -30 -701 -115 489
3114 489 -115 -460 372 724 142 -461 8 522 -242 -524 -234 706 344 -484 180 653 160 -494 375 1252
3134 1252 695 -121 624 1274 634 -217 453 1002 588 -232 297 1139 664 30 209 941 289 -211 102 925
3154 925 231 -407 -52 368 57 -780 -323 271 147 -278 427 1141 935 345 724 1137 414 245 492 1218
3174 1218 604 -338 -154 200 -281 -1100 -491 177 -255 -830 115 776 496 -326 123 606 266 92 252 960
3194 960 501 -366 69 78 -216 -1018 -296 364 -105 -248 388 812 227 -292 227 629 187 184 483 1003 262
$$ packed form
3055c50o68P73P97m95o00J165M27n45o46P04J202r67o89Q52P58p44j179P81M12
3074I88p44o53P18P00l00r36O99N14q84n62Q60K88l98o61N74N44o61l29N65N76
3094H98l49p78Q35P41o12o24O20P54q88r45P62L68p10n12N16O93p99o71N86O04
3114D89o04l45Q32L52n82o03M69N14p64k82K90R40l62q28O64M73m93o54Q69Q77
3134A252n57q16P45O50o40q51O70N49m14q20N29Q42m75o34J79P32o52n00L13Q23
3154I25o94o38L55M20l11q37M57N94j24m25P05P14k06n90L79M13p23j69K47P26
3174A218o14r42J84L54m81q19O09O68m32n75R45O61k80q22M49M83l40j74J60P08
3194I60m59q67M35Rk94q02P22O60m69j43O36M24n85n19N19M02m42lK99N20p41
$$ plain form
3215 262 -274 184 674 -74 -325 15 469 -96 -396 239 490 -231 -777 -238 -55 -471 -766 145 366 311
3235 311 -204 -180 277 193 -378 25 795 624 69 237 593 180 -434 -218 18 16 -109 -61 220 -150 -313 -300
3257 -300 -241 -757 -761 -395 166 67 -497 10 151 -138 -720 -437 254 -10 -256 213 427 42 -543 -496 -132 -529
3279 -529 -855 -474 -41 -327 -464 -305 -61 -430 -943 -475 132 -237 -258 359 704 171 -848 -680 -36 -627
3299 -627 -1008 -736 -212 -396 -603 -550 -511 -737 -772 -985 -514 -44 102 397 327 -19 -368 -210 -452 -864 -946 -294
3321 -294 -95 -318 -455 -549 -317 -671 -1163 -782 -298 -2 -62 90 33 68 -481 -815 -733 -876 -640 -48 59 31
3343 31 -186 -269 -646 -1063 -1209 -577 -104 -227 -114 176 446 -303 -788 -851 -433 -331 -436 19 387 269 -122
3364 -122 -945 -1284 -1046 -844 -933 -658 -201 -56 25 -677 -1012 -1231 -699 -733 -718 -344 307 764 305 -569 -405
$$ packed form
3215B62n36M58M90p48k51L40M54n65l00O35K51p21n46N39J83m16k95R11K21n5
3235C11n15K4M57q4n71M03P70j71n55J68L56m13o14K16K36kj25M8K81l70j63J3
3257c00N9n16mL66N61r9n64N07J41k89n82K83O91k64k46M69K14l85n85M7L64l97
3279e29l26L81M33k86j37J59K44l69n13M68O07l69k1O17L45n33j019J68O44n91
3299f27l81K72N24j84k07N3L9k26l5k13M71M70J46K95p0l46l49J58k42m12q2O52
3321b94J99k23j37r4K32l54m92L81M84K96o0J52n7L5n49l34Q2j43K36N92J07k8
3343C1k17q3l77m17j46O32M73j23J13K90K70p49m85o3M18J02j05M55L68j18l91
3364a22q23l39K38K02q9K75M57J45Q1p02l35k19N32l4J5L74O51M57m59q74J64
$$ plain form
3385 -405 -676 -676 -809 -719 378 522 298 -287 -475 -819 -957 -946 -1035 -13 86 240 171 -122 -350 -591 -895 -717
3407 -717 -571 -27 690 621 207 -62 -248 -400 -992 -657 -222 397 187 254 200 -279 -781 -1099 -739 -515 -176
3428 -176 -10 284 447 216 -55 -96 -492 -461 -276 -46 -19 232 418 -34 -496 -986 -1261 -821 -488 -238 95
3449 95 597 424 -84 -335 -579 -413 -293 60 378 691 572 409 -72 -218 -798 -514 -252 58 226 449
3469 449 84 -149 -371 -501 -483 -655 -507 45 385 444 184 29 -196 -399 -329 -310 125 506 709 637 558 19
3491 19 -419 -453 -469 -277 -138 219 372 144 20 -115 -186 -438 -317 -197 55 238 63 391 160 -70 -400
3512 -400 -600 -43 27 -255 170 178 267 -196 -459 -381 -354 -246 -345 328 472 210 153 98 -93 -104 -317 -101 116
3535 116 219 455 85 45 -260 -175 -196 -137 -153 -303 454 267 326 281 42 59 -195 -115 218 273 275 -27 60 124 -155
$$ packed form
3385d05k71%j33R0J097J44k24n85j88l44j38J1q9J022R9J54o9k93k28k41l04J78
3407g17J46N44P17o9m14k69j86j52n92L35M35O19k10O7n4m79n02l18L60K24L39
3428a76J66K94J63k31k71m1l96L1J85K30K7K51J86m52m62m90k75M40L33K50L33
3449I5N02j73n08k51k44J66J20L53L18L13j19j63m81j46n80K84K62L10J68K23
3469D49l65k33k22j30J8j72J48N52L40N9k60j55k25k03P0J9M35L81K03p2p9n39
3491A9m38l4j6J92J39L57J53k28j24j35p1k52J21J20K52J83j75L28k31k30l30
3512d00k00N57P0k82M25QQ9m63k63P8K7J08r9O73J44k62n7n5j91j1k13K16K17
3535A16J03K36l70m0l05Q5k1N9j6j50P57j87N9m5k39J7k54Q0L33N5Kl02Q7O4k79
$$ plain form
3560 -155 -255 -249 -64 -23 164 443 159 311 249 169 275 -261 -13 308 331 242 175 311 44 -237 21 -156 -54
3583 -54 63 74 35 51 -14 -353 154 -292 -129 -37 -30 -164 250 364 293 129 -2 -157 301 -10 -94 16 216
3606 216 141 37 -384 -135 -150 -356 -189 51 500 -149 9 -19 371 229 36 -1 282 213 164 41 39 428 81
3629 81 91 -35 -101 249 175 134 159 17 33 3 -160 73 31 92 -177 -103 31 83 -155 -276 -73 -40 -16 -8 205
3654 205 184 178 217 151 78 -95 -246 -245 21 -175 -293 -132 -19 -353 -157 -23 -1 -7 -6 53 185 133 442 183 158
3679 158 124 -110 47 -30 -38 -168 -251 22 96 -71 115 -11 58 -31 211 366 21 -349 121 126 -122 -119 -212 94
3703 94 -2 -213 -29 172 -33 -84 -70 113 32 2 -153 -107 267 -1 19 -206 -58 -156 -89 -248 -175 16 -121 49
3727 49 -107 45 127 47 -119 -100 19 -184 -248 9 102 114 -120 -118 -15 -23 43 78 456 161 -273 -35 152 160 -103
$$ packed form
3560a55j00OJ85M1J87K79k84J52o2q0J06n36K48L21K3q9o7J36k67k81K58j77J02
3583e4J17J1l9J6o5l39N07m46J63R2Pj34M14J14p1j64j31j55M58l11q4J10K00
3606B16p5j04m21K49j5k06J67K40M49o49J58k8L90j42j93l7K83o9m9j23kL89l47
3629H1J0j26o6L50p4m1K5j42J6l0j63K33m2O1k69P4J34N2k38j21K03L3K4QK13
3654B05k1oL9o6p3j73j51JK66j96j18J61J13l34J96J34K2oJN9J32n2L09k59k5
3679A58l4k34J57p7qj30q3K73P4j67J86j26O9q9K42J55l45l70M70Nk48Lr3L06
3703I4r6k11J84K01k05n1J4J83q1l0j55M6L74k68K0k25J48r8O7j59P3J91j37J70
3727D9j56J52Q2q0j66J9J19k03o4K57R3J2k34KJ03qO6L5L78k95m34K38J87Qk63
$$ plain form
3752 -103 -421 -53 194 224 57 -224 420 -40 48 28 335 111 -242 -78 167 -73 -225 -172 37 -189 -243 -143
3774 -143 97 54 -88 4 283 60 133 -86 298 36 291 215 -72 -119 -276 -56 19 138 -197 -135 195 11
3796 11 -134 10 141 15 -49 389 153 292 -44 193 110 31 -300 -124 136 -66 90 122 386 259 -84 -42
3818 -42 218 77 -227 19 26 115 330 -100 79 -207 -33 4 153 -8 267 315 -120 61 -34 143 308 80
3840 80 -92 118 373 114 -353 35 192 -106 -12 -56 395 195 51 -109 230 -39 -156 -74 400 62 -6 180
3862 180 327 64 -312 -118 58 -196 -153 105 148 147 42 -113 178 164 -166 405 338 490 362 194 559 325
3884 325 -106 48 -61 -131 297 89 132 251 12 84 -118 -29 16 383 480 598 64 273 720 362 -141 361
3906 361 58 467 123 32 371 91 -217 -130 -123 -63 60 18 327 127 179 399 7 -127 -128 170 36 183 231
$$ packed form
3752a03l18L68K47L0j67k81O44m60Q8k0L07k24l53J64K45k40j52N3K09k26n4J00
3774a43K40m3j42R2K79k23P3k19L84k62K55p6k87m7j57K20P5J19l35O2L30j84
3796A1j45J44J31j26o4M38k36J39l36K37q3p9l31J76K60k02J56L2K64j27l43M2
3818d2K60j41l04K46PQ9K15m30J79k86J74L7J49j61K75M8m35J81r5J77J65k28
3840H0j72K10K55k59m67L88J57k98R4m4M51k00j44j60L39k69j17Q2M74l38o8J86
3862A80J47k63l76J94J76k54M3K58M3jj05j55K91j4l30N71o7J52j28j68L65k34
3884C25m31J54j09p0M28k08M3J19k39P2k02Q9M5L67R7J18n34K09M47l58n03N02
3906C61l03M09l44r1L39k80l08Q7PO0J23m2L09k00N2K20l92j34jK98j34J47M8
$$ plain form
3929 231 300 327 68 -428 -334 -159 122 -186 -54 187 140 -15 -395 -297 206 81 77 487 372 382 490 15 11
3952 11 110 136 112 -11 143 158 702 139 129 47 189 -105 -269 165 324 412 174 -82 278 325 -152 -73 294
3975 294 229 221 350 168 10 -36 -179 111 -308 -194 -44 226 -34 56 192 205 -17 -38 199 337 23 30 -33
3998 -33 251 -56 -195 -11 75 466 349 -138 303 418 215 12 -151 -67 -29 8 32 65 -216 379 283 150 -393
4021 -393 -304 144 5 131 136 -40 120 -147 -280 204 -144 133 133 164 157 93 -11 -64 -72 209 16 -59 -46 31 179
4046 179 51 212 -23 6 24 -84 -176 -191 86 222 55 28 195 -53 -42 -131 -132 -70 231 130 241 27 -106
4069 -106 -70 35 203 230 -46 52 165 -297 34 120 -302 -392 -382 50 128 -20 -114 196 73 -246 -111 147 139
4092 139 -167 126 133 137 38 -325 -169 114 -227 -12 -160 -186 -129 -238 30 -2 -15 62 -29 21 4 192 83 -41
$$ packed form
3929B31O9K7k59m96R4J75K81l08J32K41m7j55l80R8N03j25mM10j15J0J08m75m
3952A1R9K6k4j23J54J5N44n63j0q2J42k94j64M34J59Q8k38k56L60M7m77P9L67
3975B94o5qJ29j82j58m6j43K90m19J14J50K70k60R0J36J3k22k1K37J38l14Po3
3998c3K84l07j39J84Q6L91j17m87M41J15k03k03j63Q4L8L7K4L3k81N95r6j33n43
4021c93Q9M48j39J26Nj76J60k67j33M84l48K77%L1po4j04n3qK81j93p5J3P7J48
4046A79j28J61k35K9J8j08r2j5K77J36j67k7J67k48J1q9jO2L01j01J11k14j33
4069a06L6J05J68K7k76R8J13m62L31Q6m22r0J0M32P8j48r4L10j23l19J35K58q
4092A39l06K93PMr9l63J56K83l41K15j48k6N7j09K68l2j3P7r1N0j7J88j09j24
$$ plain form
4116 -41 -130 0 2 -19 -97 -223 -4 -307 140 -159 -64 -36 -186 -359 -395 8 -207 -379 -126 -91 -48 72 -117 -252
4140 -252 13 -136 -62 45 -118 28 -191 5 -25 -217 -137 88 -221 -240 -141 -144 8 -41 -38 -113 -113 -54 32 -149 78
4165 78 -110 -28 199 -153 -352 -276 -94 75 -143 91 -190 -64 -7 -71 -282 -164 -135 -72 42 42 130 1 -42 -238
4189 -238 -193 -226 191 -132 -11 -12 71 -337 -387 -177 -113 -312 -166 -155 -123 -219 -94 -160 36 -283 -228 -104 -163 -15
4213 -15 -69 -126 -89 -89 -116 8 -88 -157 -205 -104 -47 -265 99 60 52 -134 -174 81 -166 265 2 -71 38 -373 -93
4238 -93 -436 -279 -198 -341 -97 -165 -236 -157 -163 30 -255 -33 157 -53 18 -3 83 -291 15 -56 -149 -191 99 -49
4262 -49 82 -90 13 -259 -8 19 -12 -94 114 90 -303 -88 -193 -232 -230 -291 -84 -76 -215 114 273 94 19 150
4286 150 -141 -51 -155 46 -233 -145 -140 -167 -84 -75 -30 -100 -63 -157 -69 -32 76 213 -22 35 35 117 26 -25 -22 396 -252
$$ packed form
4116d1q9J30Kk1p8j26K19l03M47k99R5K8j50j73l6M03k15j72K53L5M3J20j89j35
4140b52K65j49P4J07j63J46k19J96l0j92Q0K25l09j9R9lJ52m9Lp5%N9Q6j81K27
4165G8j88Q2K27l52j99P6J82J69k18K34k81J26N7o4k11J18K9O3J14%Q8j29m3j96
4189b38M5l3M17l23J21jQ3m08n0K10O4j99J46J1L2r6J25o6J96l19N5J24n9J48
4213a5n4n7L7%k7J24r6o9m8J01N7k18L64l9qj86m0K55k47M31k63p3J09m11K80
4238i3l43J57Q1j43K44o8p1P9oJ93k85K22J90k10P1k1Q6l74L06p1r3m2K90j48
4262d9J31j72J03k72K51K7l1q2K08k4l93K15j05l9Ko1K07Qj39L29J59j79p5J31
4286A50k91R0j04K01k79Q8Nk7Q3RM5p0L7r4Q8L7J08J37k35N7%Q2r1n1LM18o48
$$ plain form
4313 -252 1 99 52 -127 -22 9 216 -59 -246 -1 205 -115 -77 64 118 11 -129 78 -2 61 -304 -105
4335 -105 -79 59 -122 -35 2 -127 -73 -284 -21 -46 27 -110 -169 2 -138 -144 97 -98 85 -148 169 -176 -140
4358 -140 14 6 218 -57 26 -92 -80 -80 -20 -223 -97 16 22 122 -11 23 176 22 -184 155 -78 40 142
4381 142 -186 -17 56 -71 58 263 -18 146 -31 -34 -274 -90 17 -67 79 0 142 -43 -160 137 60 -102
4403 -102 83 -104 -81 -244 102 -117 191 325 -62 -19 -59 -27 -321 -147 61 145 91 -36 -8 -48 147 59 113
4426 113 253 183 -138 25 106 28 90 -130 -49 81 133 -58 -41 70 -18 -154 146 123 114 194 -58 279 127 89
4450 89 88 174 76 135 71 65 112 2 -153 335 -225 -76 144 -82 89 49 71 -131 117 -123 -50 -31 -192 -213 291
4475 291 -1 246 89 223 99 21 34 -58 -205 -66 57 -92 119 38 -163 -166 97 -37 54 -152 -51 113
$$ packed form
4313b52K53R8m7j79J05L1K07k75j87K45K06l20L8J41N4j07j40K07q0O3l65J99
4335a05K6J38j81Q7L7j29N4k11K63k5P3j37n9J71j40oK41j95J83k33L17l45L6
4358a40J54qK12k75Q3j18J2%O0k03J26J13OJ00j33L4J53j54k06L39k33J18J02
4381A42l28J69P3j27J29K05k81J64j77lk40J84J07q4J46p9J42j85j17K97p7j62
4403a02J85j87K3j63L46k19L08J34l87M3m0L2k94J74K08Q4n4j27K8m0J95q8N4
4426A13J40p0l21J63Q1p8O2k20Q1J30N2j91J7J11q8j36L00k3rQ0k52L37j52l8
4450H9jQ6r8N9o4oM7j10j55M88n60J49K20k26J71m0K2k02K48k40P3J9j61k1N04
4475B91k92K47j57J34j24p8J3r2j47J39J23j49K11q1k01lK63j34R1k06J01J64
$$ plain form
4497 113 -22 -13 4 -180 61 -20 122 202 46 217 -88 10 23 -105 -44 -14 -1 79 -104 -105 -96 184 34 -104 66
4522 66 246 203 -130 136 -7 137 -6 150 50 -153 324 -259 7 48 32 -36 -140 -133 57 -71 15 74 -138
4545 -138 -1 77 59 -53 -37 -47 -158 -192 181 145 -72 -159 -13 7 -169 -26 20 18 -16 58 102 -118 -234 -135 56
4570 56 87 79 -77 -107 227 106 -49 -66 -49 -168 16 -3 -92 235 55 -23 -73 -38 65 -219 -83 113 69 -186
4594 -186 50 -87 133 30 84 5 -309 -6 -68 -323 -144 -234 -96 -232 15 217 -114 113 235 -71 -165 169
4616 169 -93 -29 -91 -8 216 70 -141 101 -115 -97 62 -43 -116 168 10 27 -65 -69 -85 102 43 143 -97 34
4640 34 29 -200 -222 75 193 -118 37 -101 148 -303 -288 -44 92 -37 124 33 -166 49 59 -181 -113 -10 140
4663 140 140 140 -17 154 -173 -42 -127 16 -157 -45 -111 -129 -139 -210 -173 -173 160 -35 140 32 -50 106 120 87 92 0
$$ packed form
4497A13j35RJ7j84K41q1J42Q0j56J71l05R8J3j28O1L0J3Q0j83jRK80j50j38J70
4522F6J80m3l33K66j43J44j43J56j00k03M77n83K66M1j6o8j04PJ90j28Q6N9k12
4545a38J37P8j8j12J6j0j11l4L73l6k17q7J46K0j76J43M6kl4P4M4k20j16R9J91
4570E6L1qj56l0L34j21j55j7J7j19J84j9q9L27j80p8n0L5J03k84J36J96m4k55
4594a86K36j37K20j03N4p9l14L03o2k55J79r0J38j36K47K02l31K27J22l06r4L34
4616A69k62O4o2Q3K24j46k11K42k16J8J59j05p3K84j58J7r2mj6J87n9J00k40J31
4640C4nk29k2K97J18l11J55j38K49m51J5K44J36j29J61r1j99K15J0k40O8J03J50
4663A40%%j57J71l27J31q5J43j73J12o6j8j0p1L7%L33j95J75j08q2J56J4l3Nr2
$$ plain form
4689 0 -93 -215 48 168 228 71 -17 61 135 78 203 -107 169 -101 34 138 -105 -270 -129 129 -22 153 -193
4712 -193 47 -189 -144 -39 25 78 275 3 -22 -41 -154 -43 -80 39 -4 -76 -46 147 76 190 -161 41 160
4735 160 194 -197 -279 -127 -186 -127 -115 101 -106 206 -26 -192 -184 172 -7 -125 -46 -10 -59 215 -227 -177 -97 41
4759 41 39 -38 86 20 196 -13 30 53 -155 -109 -13 -134 51 135 -135 -187 32 -63 -57 -17 121 -103 172 -59 34
4784 34 -231 120 216 -232 -101 291 62 146 76 -72 -133 102 -19 -53 102 -64 -19 1 -167 117 65 216 132
4807 132 -155 63 31 -99 -110 -312 -388 -315 -10 -131 42 -50 -1 260 91 131 129 -24 40 -17 128 239 -114 -9
4831 -9 24 -93 93 4 51 225 1 -185 -50 -241 -304 -100 -198 -30 -1 -5 59 63 98 83 11 -140 -197 -6 -4 60 -29
4858 -29 -50 95 -70 139 279 -79 116 133 -109 81 -55 286 57 -233 26 -46 -75 -89 160 201 -188 95
$$ packed form
4689@r3j22K63J20O0j57q8P8P4n7J25l10K76k70J35J04k43j65J41K58j51J75l46
4712a93K40k36M5J05O4N3J97k72k5j9j13J11l7J19m3p2L0J93p1J14l51K02J19
4735A60L4l91q2J52n9N9J2K16k07L12k32j66QL56j79j18P9L6m9K74m42N0Q0J38
4759D1kp7J24o6J76k09M3K3k08M6R6j21J85Q4k70n2K19r5OM0J38k24K75k31R3
4784C4k65L51R6m48J31L92k29Q4p0j48o1K35j21l4J55j66M5K0j68K84n2J51q4
4807A32k87K18l2j30j1k02p6P3L05j21J73r2M9K61j69M0kj53O4n7J45J11l53J05
4831iL3j17J86q9M7J74k24j86J35j91o3K04r8J68K9mO4ML5j5p2j51n7J91KO4q9
4858b9k1J45j65K09J40l58J95J7k42J90j36L41k29k90K59p2k9j4K49M1l89K83
$$ plain form
4880 95 44 -154 97 -83 -54 -53 78 91 -69 136 -41 230 -237 -39 246 156 52 -96 4 26 -17 -165 110
4903 110 -263 29 126 -55 -83 81 -15 -155 30 166 -53 -57 61 -50 -4 -52 -122 -49 117 57 50 -87 245 -64
4927 -64 109 -58 152 40 -196 254 185 145 -102 -131 297 -189 204 81 11 113 335 269 -187 130 -42 -195
4949 -195 -62 -183 -33 16 -201 97 -65 247 -99 -27 13 243 -10 118 -48 59 -110 198 -141 -42 72
4970 72 -21 -25 166 -66 -51 98 145 4 -50 -378 236 -10 74 -1 -249 205 95 -268 -140 127 -26 99 -26
4993 -26 -15 78 56 202 -99 38 -9 87 6 131 -32 40 -187 -19 -93 249 -12 -128 -19 -40 -80 -70 156 68
5017 68 20 -202 -41 -23 -62 165 162 -19 -33 -48 -168 98 0 62 9 -195 111 129 -111 -185 -59 -88 -187 -40 165
5042 165 21 157 134 39 -111 114 -41 98 -86 66 109 59 38 155 7 -88 146 -20 64 -51 -148 -25 -22
$$ packed form
4880I5n1j98K51j80K9JJ31J3j60K05j77K71m67J98K85r0j04j48J00K2m3j48K75
4903A10l73K92R7j81k8J64r6j40J85J36k19mJ18j11M6m8p0P3J66o0pj37L32l09
4927f4J73j67K10j12k36M50o9m0k47k9M28m86L93j23p0J02K22o6m56L17j72j53
4949a95J33j21J50M9k17K98j62L12l46P2M0K30k53J28j66J07j69L08l39R9J14
4970G2r3mJ91k32J5J49M7j41n4l28O14k46Q4p5k48M54j10l63J28K67j53J25j25
4993b6J1R3k2J46l01J37m7R6q1J25j63P2k27J68p4L42k61j16J09k1m0J0K26q8
5017F8m8k22J61J8l9K27lj81j4j5j20K66r8O2n3k04L06J8k40p4J26k9r9J47K05
5042A65j44J36k3r5j50K25j55J39j84J52M3n0k1J17j48r5K34j66Q4j15r7J23L
$$ plain form
5065 -22 49 134 -48 -93 -33 -40 -119 -103 150 49 269 136 226 173 56 140 56 300 51 -14 124 -133 35 57 -68
5090 -68 -138 -157 -49 -110 -214 -47 183 113 -207 -64 111 -13 35 -85 206 68 -79 -89 -69 3 -72 68 -505
5113 -505 15 -171 -412 -28 -51 106 40 -22 -6 8 -54 167 -192 10 175 15 -32 -118 -132 -46 -200 -156 -142 -75
5137 -75 91 86 -142 -132 24 -171 -18 -141 -18 -197 -54 112 61 -18 151 -74 71 -137 268 -3 -164 -198
5159 -198 -90 -108 -50 -123 -214 -1 -198 142 94 -85 -290 -116 -183 -334 41 -147 -152 -49 -26 -84 182 -18 -208
5182 -208 26 -51 112 -75 -84 -80 15 -204 -89 42 24 -83 -148 104 -76 -107 18 -149 -77 175 198 49 -92 120
5206 120 -262 29 -211 -36 -130 -133 149 -104 -133 -54 -76 -224 346 218 78 86 117 -35 -115 -17 110 -78 -40 -68
5230 -68 -42 -235 -155 59 69 218 152 -91 -56 -114 223 7 -26 -106 4 -15 -214 142 -61 -208 -61 -34 -8 51
$$ packed form
5065b2P1Q5j82m5O0pp9J6K53j01K20j33R0n3j17Q4q4K44k49o5J38k57J68K2j25
5090f8p0j9J08o1j04J67K30p0l20J43J75j24M8j20K91j38j47j0K0P2p5J40n73
5113e05N20j86k41L84k3J57o6o2J6J4o2K21l59K02J65j60m7q6j4Q6j54M4J4O7
5137g5J66nk28J0J56j95J53j23J23j79J43J66n1p9J69k25J45k08M05k71j61l4
5159a98J08j8N8p3r1K13j97L40m8j79k05J74o7j51L75j88nJ03K3n8K66k00j90
5182b08K34p7J63j87rMR5k19J15J31j8j07o5K52j80l1J25j67P2K52K3j49j41K12
5206A20l82K91k40J75r4lK82k53k9P9k2j48N70j28j40QL1j52q0R8J27j88L8k8
5230f8K6j93Q0K14J0J49o6k43L5n8L37k16l3q0J10j9j99L56k03j47J47K7K6N9
$$ plain form
5254 51 122 -58 -61 99 -39 -112 -34 69 65 -124 -55 -118 218 19 38 61 -191 -73 -100 -31 -76 17 67 -132 82 -29
5280 -29 -48 10 -254 -111 -165 0 -188 -382 -334 56 130 27 88 127 123 147 -2 264 -117 -267 -20 -26 89 229
5304 229 28 -12 90 -20 24 -269 -42 48 52 -199 -159 126 -32 -100 61 43 18 -26 26 126 -18 144 -12 48
5328 48 118 -82 4 -148 108 -167 24 82 -236 27 -274 54 -120 127 151 191 55 -24 15 116 64 184 121
5351 121 -132 54 -157 -1 -137 -133 -178 -33 -65 -341 -186 -100 -190 -246 270 -236 44 156 -148 -86 -25 345 -176
5374 -176 217 -16 -166 -22 143 -189 52 -63 -113 -5 93 143 -227 119 -112 -12 -143 -226 25 176 -136
5395 -136 135 178 82 73 10 -46 41 133 -12 21 6 -23 -81 -6 83 -294 27 -147 72 105 -140 137 -50 -13 117
5420 117 176 -133 -24 -91 -81 -153 32 -257 -15 -33 66 81 -67 154 -54 33 38 99 -1 43 152 27 126 82 163
$$ packed form
5254E1P1j80lJ60j38p3P8J03mj89O9o3L36j99J9K3k52J18k7O9m5R3N0j99K14j11
5280b9j9N8k64J43n4J65j88j94M8L90P4j03O1L9mK4j49K66l81j50K47oJ15J40
5304B29k01m0J02j10M4k93K27R0Mk51M0K85j58o8J61j8k5m4N2J00j44J62j56O0
5328D8P0k00Q6j52K56k75J91N8l18K63l01L28j74K47K4M0j36p9L9J01n2J20o3
5351A21k53J86k11J56j36Mm5J45l2k76J55Q6r0n6N16n06K80J12l04O2O1L70n21
5374a76L93k33j50J44J65l32K41j15n0J08R8N0l70L46k31J00j31q3K51J51l12
5395a36K71M3r6ro3n6Q7R2j45L3j5k9n8P5Q9l77L21j74K19L3k45K77j87L7J30
5420A17N9l09J09o7J0p2J85k89K42j8R9J5j48K21k08Q7NO1j00M4J09j25R9m4Q1
$$ plain form
5445 163 11 75 127 87 34 102 -51 -87 -76 36 126 -94 -25 -100 -214 131 6 59 -28 29 47 -84 83 146 124
5470 124 221 -143 -146 204 23 24 123 -37 49 -129 -31 166 52 -3 84 95 78 -57 -169 12 36 -228 -51 91
5494 91 -2 -77 -83 21 -18 2 -135 19 -91 5 -65 58 8 -105 46 -8 69 -77 189 -34 -21 213 111 -103
5518 -103 223 15 -35 19 40 25 -104 27 27 -36 -172 -3 82 -114 -66 -166 43 -104 137 42 34 -27 166 130 -49
5543 -49 197 -12 -45 241 -111 1 39 -125 -186 -266 116 99 -57 -26 -141 54 -94 164 25 -127 -17 -124
5565 -124 -304 -174 246 -174 -101 -11 -71 -200 -192 -91 -87 -105 -51 -124 -104 -160 -50 -284 -207 -47 -28 79 -117 -131 139
5590 139 -102 -120 -211 -255 14 80 20 -162 101 -101 -259 -101 62 -64 37 -236 -39 -54 -262 -101 -149 -90 -29
5613 -29 58 -188 -87 207 -45 -21 175 28 -136 -98 -67 -3 63 175 59 -173 104 -74 -1 -151 219 65 -15
$$ packed form
5445A63j52O4N2m0n3O8j53l6J1J12R0k20O9p5j14L45j25N3q7N7J8j31J67O3k2
5470A24R7l64lL50j81JR9j60Q6j78R8J97j14n5Q7J1j7j35j12J81K4k64J77J42
5494I1r3p5oJ04l9K0j37J54j10R6p0J23n0j13J51n4P7j46K66k23J3K34j02k14
5518a03L26k08n0N4K1j5j29J31%o3j36J69Q5j96M8j00K09j47K41r5qo1J93l6j79
5543d9K46k09l3K86l52J12L8j64o1q0L82j7j56L1j15J95j48K58j39j52J10j07
5565a24j80J30M20m20P3R0o0j29QJ01Mj8N4p3K0n6J10k34P7J60J9J07j96j4K70
5590A39k41j8r1m4K69O6o0j82K63k02j58J58J63j26J01k73J97j5k08J61m8N9O1
5613b9Q7k46J01K94k52K4J96j47j64L8L1O4O6J12j16k32K77j78P3j50L70j54q0
$$ plain form
5636 -15 24 105 36 -100 85 -12 -27 -83 -29 23 -207 -27 160 78 10 -179 -74 -23 -141 161 -48 134 -192 -73
5660 -73 -16 -81 47 -66 63 -67 -200 187 180 -17 -266 145 -55 -352 135 -31 147 174 40 214 -247 8
5682 8 31 0 -42 -215 -66 -75 28 -47 -44 -10 -167 21 155 83 10 -25 -18 -158 161 -75 87 -58 -155 18 57 13
5708 13 -151 43 -8 148 96 133 -16 189 -36 99 167 -63 52 41 102 -107 -203 -200 101 157 178 -37 11 -123
5732 -123 43 180 -88 -63 12 23 -129 118 17 -35 -35 -246 -222 10 68 8 -33 -38 -47 -85 29 100 189 34 212 86
5758 86 46 -5 112 -10 -133 230 35 -192 -65 86 -2 121 -68 46 -176 -162 48 71 174 224 74 59 28
5781 28 138 -4 92 65 -177 -14 46 399 -29 11 -241 3 78 150 -111 93 -241 -23 145 -147 169 177 -3
5804 -3 89 227 -157 50 143 153 -103 220 149 100 49 60 -53 -51 -22 211 -212 145 2 47 -94 29 -143 -29
$$ packed form
5636a5L9Q1o9j36J85r7j5n6N4N2k30J80J87q2o8j89J05N1j18L02k09J82l26J19
5660g3N7o5J28j13J29j30j33L87pj97k49M11k00k97M87j66J78K7j34J74m61K55
5682HK3l1m2j73J49rJ03p5LL4j57J88J34p2p3l5Pj40L19k36J62j45r7J73L9m4
5708A3j64J94n1J56n2L7j49K05k25J35O8k30J15j1O1k09r6LL01N6K1k15M8j34
5732a23J66J37k68K5P5J1j52K47j01n2%k11K4K32N8o0m1nrl8J14P1Q9j55J78j26
5758H6m0n1J17j22j23L63j95k27J27J51q8J23j89J14k22J4K10K3J03N0j50j5l1
5781B8J10j42R6k7k42J63O0L53m28M0k52K44P5P2k61K04l34K18J68k92L16Qj80
5804cR2J38l84K07R3J0k56L23p1m9n1J1j13KK9K33m23L57j43M5j41J23j72J14
$$ plain form
5828 -29 237 62 -54 -117 235 140 -53 -102 147 41 16 81 88 125 -153 126 -21 -45 -82 -146 205 32 -165 -195
5852 -195 54 49 31 60 117 25 53 10 -104 192 158 -15 -270 69 34 -68 -25 -287 29 6 -61 51 293 31
5876 31 39 47 -56 26 178 162 145 35 1 0 93 19 27 -106 -133 128 144 -11 -85 151 -6 35 -57 -69 17 -8 116 167
5904 167 -25 -67 207 -78 -56 137 59 16 -62 193 15 119 -153 122 -14 -74 59 73 -1 183 90 69 -132
5927 -132 151 183 37 70 -118 -14 107 36 -2 -134 -25 -159 59 -131 10 10 137 177 -15 45 -52 -65 30 134
5951 134 98 50 -6 151 -42 65 -15 328 47 -45 -3 -265 -71 45 -151 66 -104 37 50 -35 61 -117 -34
5974 -34 -15 -41 -44 -135 117 79 -117 28 -28 -110 34 -133 -109 -134 -144 23 215 147 -227 -325 104 -58 21 216 -91
5999 -91 199 27 -289 118 -37 -111 -99 -102 284 46 -53 -142 -41 -184 -41 -77 -137 4 73 184 -65 19 31 -49
$$ packed form
5828b9K66j75j16o3L52r5j93m9K49j06k5O5PL7k78K79j47k4l7o4L51j73j97l0
5852a95K49nj8K9N7r2K8m3j14K96l4j73k55L39l5j02M3k62L16k3o7J12K42k62
5876C1QQj03Q2J52j6j7j10l4jR3p4Qj33k7K61J6j55p4K36j57M1r2j2Q6k5J24N1
5904A67j92m2K74k85K2J93p8m3p8K55j78J04k72K75j36o0J33J4p4J84r3k1k01
5927a32K83L2j46L3j88J04J21p1l8j32J09j34K18j90J41%J27M0j92O0r7j3R5J04
5951A34l6m8n6J57j93J07q0L43k81r2M2k62J94J16j96K17j70J41J3q5R6j78Q3
5974c4J9k6lr1K52l8j96J45n6q2J44j67K4k5j0J67J92o8l74r8M29j62P9J95l07
5999i1K90j72l16M07j55p4J2lL86k38r9q9J01j43J43l6o0J41O9J11k49Q4J2q0
$$ plain form
6023 -49 27 16 145 154 -2 52 99 -98 -123 52 -145 -130 -84 116 -164 105 -256 -127 -225 -91 29 -62 109 -46
6047 -46 152 177 -22 16 -274 28 78 45 111 -34 -46 -34 255 -166 -144 64 169 -42 367 6 -39 -98 27 113
6071 113 43 4 205 72 -67 51 105 47 163 -35 -124 45 -222 116 44 -179 32 -34 -160 70 -65 64
6093 64 -86 10 -229 -25 14 -182 80 -112 -12 -135 -272 3 -29 -182 24 52 77 -213 105 115 -59 187
6115 187 -9 -79 18 -41 126 87 -26 91 -16 -65 -124 8 -134 -226 -310 69 -20 -75 117 -94 -91 94 94 88 -35
6140 -35 -99 15 75 -81 -71 -227 -100 96 -69 -74 -3 -73 -272 76 -238 -104 32 -57 -11 -10 -65 43 86 -213 168
6165 168 90 225 117 34 120 -120 -15 21 -5 60 -117 -1 -152 114 -72 -7 -38 141 106 -49 -5 14 27 -17
6189 -17 18 -60 0 -272 60 233 -71 -87 -229 35 -176 66 3 -109 -378 -10 -85 188 -447 103 26 -88 32
$$ packed form
6023d9P6j1J29Rj56N4M7j97k5J75j97J5M6K00k80K69l61J29r8J34J20r1J71j55
6047d6J98K5j99L8k90L02N0l3O6j45j2J2K89m21K2K08J05k11M09l61m5n9J25Q6
6071A13p0l9K01j33j39J18N4n8J16j98q9J69k67L38p2k23K11o6j26K30j35J29
6093F4j50R6k39K04L9j96K62j92J00j23j37K75l2j53K06K8K5k90L18J0j74K46
6115A87j96p0R7n9J67l9j13J17j07m9n9J32j42r2q4L79q9n5J92k11LJ85%oj23
6140c5o4J14O0j56J0j56J27J96j65nP1p0j99L48l14J34J36q9M6Jn5J08M3k99L81
6165A68p8J35j08q3Q6k40J05L6k6O5j77J16j51K66j86O5l1J79l5j55M4J9J3m4
6189a7L5p8O0k72L32J73l04j6j42K64k11K42o3j12k69L68p5K73o35N50p7j14J20
$$ plain form
6212 32 6 121 77 183 25 -36 114 58 -141 -17 173 98 47 -101 -175 -138 -55 157 -76 146 70 83 -28 -24 -25
6237 -25 110 168 -110 51 102 92 183 180 52 98 -93 9 -73 91 -238 -356 38 4 77 31 79 13 35 8 174
6262 174 132 -179 63 -42 86 24 55 23 -79 199 -4 -123 31 -147 154 -53 -349 85 122 24 -50 -177
6284 -177 -134 -35 -166 319 32 -165 125 213 -9 42 16 243 -30 -94 183 109 -94 -147 79 64 -45 76 97
6307 97 -153 -23 20 -190 -45 105 15 -94 45 43 61 122 27 128 -31 -110 169 184 104 182 102 176 -31 -38 -70 14
6333 14 47 -73 -74 153 -85 185 -113 26 226 140 241 -29 -37 -54 -67 101 -37 -232 146 29 -44 287 179
6356 179 -25 62 68 244 -120 46 -56 -141 62 -76 -61 -28 71 208 -78 49 -62 -166 -59 -13 -88 -83 -28 -118
6380 -118 -57 5 21 -114 -23 -54 -106 -97 128 -52 -108 -82 79 -7 -192 -10 -129 -256 -33 -84 379 266 -11 -74
$$ packed form
6212C2k6J15m4J06j58o1J50n6j99J24J90p5n1j48p4L7Q3K12k33K22p6J3j11Mj
6237b5J35N8k78J61N1j0R1lj28M6j91J02q2J64l29j18L94l4P3m6M8o6K2k7J66
6262A74m2l11K42j05J28o2L1l2j02K78k03j19J54j78L01k07k96M34L7r8p4j27
6284a77M3R9j31M85k87j97K90Q8k22N1k6K27k73o4K77p4k03n3K26j5j09J21K1
6307I7k50J30M3k10J45J50r0j09J39kJ8O1r5J01j59p9K79J5q0P8q0P4k07pl2Q4
6333A4L3j20jK27k38K70k98J39K00q6J01k70qj7j3J68j38j95L78j17p3L31j08
6356A79k04Q7OJ76l64J66j02q5K03j38J5L3R9J37k86J27j11j04J07M6p5NN5r0
6380a18O1O2J6j35R1l1n2RK25j80n6K6J61q6j85J82j19j27K23n1M63j13k77o3
$$ plain form
6404 -74 42 82 -21 -42 -91 -149 -25 123 54 79 19 -156 -85 -121 -162 -124 -57 -4 -215 -54 17 -183 60 113 -64
6429 -64 140 193 169 -10 201 221 56 177 -51 -26 151 21 146 -43 -234 25 -164 -31 -185 46 -69 -314
6451 -314 -103 -64 -66 -251 -17 -186 25 35 -213 -50 -29 231 -88 54 153 128 -22 48 118 11 -71 -6 -26 158
6475 158 -28 -262 -258 22 239 139 -136 -246 58 66 -54 33 66 -64 125 -22 -182 -38 -285 -85 -39 -397
6497 -397 -153 -1 71 -131 203 -129 287 101 164 -34 82 41 26 -83 -76 -191 -29 -191 92 -80 -232 -145
6519 -145 15 206 408 125 -31 48 26 -85 68 179 -1 -40 -21 58 133 -215 -59 84 -37 113 -26 -39
6541 -39 -1 -121 175 -54 20 163 67 -158 -77 -276 -215 29 95 93 16 -24 38 118 -127 -334 -54 75 49 -188 243
6566 243 86 45 149 -109 109 -9 49 -24 72 78 47 93 104 -144 56 151 85 -84 82 -41 -32 -110 65 -27 68
$$ packed form
6404g4J16M0j03k1m9n8J24J48o9K5o0j75P1l6m1L8O7N3k11J61P1k00K43N3j77
6429f4K04N3k4j79K11K0j65J21k28K5J77j30J25j89j91K59j89J33j54K31j15k45
6451c14K11L9kj85K34j69K11J0k48J63K1K60l19J42R9k5j50P0P0j07q2O5k0J84
6475A58j86k34MK80K17j00k75j10L04Qj20Q7L3j30J89j47j60J44k47K00M6l58
6497c97K44J52P2k02L34l32M16j86O3j98J16m1j5j09Pj15J62j62K83j72j52Q7
6519a45J60J91K02k83j56P9k2j11J53J11j80l9J9P9P5l48J56J43j21J50j39j3
6541c9L8j20K96k29P4J43r6k25Q1j99O1K44O6kp7m0O2Q0k45k07K80J29k6k37M31
6566B43j57m1J04k58K18j18N8p3R6Ol1M6J1k48K00R5o6j69J66j23Rp8J75r2R5
$$ plain form
6591 68 236 30 -10 57 -202 213 -52 -8 267 -23 78 241 -39 -138 -31 -158 137 94 -9 137 -7 64
6613 64 -41 -226 112 -7 -125 28 280 146 21 27 -40 -23 85 54 178 54 105 7 436 -60 -105 -154 -45
6636 -45 -14 -78 100 180 30 -82 -117 22 17 -50 -23 -158 214 55 -121 78 -207 -3 -58 -30 224 -273 91 -154
6660 -154 130 275 19 -42 69 114 -88 208 99 36 290 21 63 -40 182 96 53 112 -123 -287 149 191 150
6683 150 -76 111 80 22 -88 -315 -182 -1 196 100 47 75 162 62 37 41 -56 77 -291 44 21 247 130 -10
6707 -10 -6 157 20 -405 -35 -110 151 273 236 -316 -34 213 142 124 202 104 407 -95 133 16 208 18 -19
6730 -19 -192 168 -22 49 180 -19 -42 -11 6 223 -50 -113 -64 -1 232 -62 156 -50 28 24 -179 -78 151 63
6754 63 243 152 -102 163 30 -3 -118 -2 58 44 23 -169 305 141 4 -25 89 60 127 85 -31 -226 46
$$ packed form
6591F8J68k06m0O7k59M15k65M4K75k90J01J63k80r9J07j27K95m3j03J46j44P1
6613F4j05j85L38j19j18J53K52j34j25Oo7J7J08l1J24j24N1r8M29m96m5m9J09
6636d5L1o4J78Q0j50j12l5J39no7K7j35L72j59j76J99k85K04n5K8K54m97L64k45
6660a54K84J45k56o1J11M5k02K96j09o3K54k69M2j03K22q6m3N9k35j64M36M2m1
6683A50k26J87l1n8j10k27J33J81J97r6n3K8Q7j00k5Mr7J33l68L35k3K26j17j40
6707a0MJ63j37m25L70p5K61J22l7n52K82K47p1j8P8r8L03n02K28j17J92j90l7
6730a9j73L60j90P1J31j99k3L1J7K17k73o3M9O3K33k94K18k06P8mk03J01K29q8
6754F3J80r1k54K65j33l3j15J16O0j4k1j92M74j64j37k9J14k9O7m2j16j95K72
$$ plain form
6777 46 131 -124 39 -55 96 61 68 -60 -173 -76 83 -45 -19 149 26 235 5 -86 111 4 51 33 91 46
6801 46 -172 137 33 -49 184 -100 -123 -22 -6 -119 -22 139 -92 -34 23 -166 -142 22 -55 46 -31 66 71 165 -10
6826 -10 -4 -109 -143 -276 -165 -48 -119 -56 13 -267 -310 189 -100 -290 240 -190 22 -28 -49 -131 -140 140 -73 -17 -285
6851 -285 52 -100 -104 67 3 -194 -259 57 -129 28 207 71 -271 -32 18 -46 -29 -305 -64 17 189 18 319
6874 319 -224 -398 56 -67 153 -71 -139 -185 17 -76 -112 -36 -145 -149 -325 -77 -161 -270 -152 -97 -2 -236 109
6897 109 269 -105 64 -85 103 192 -244 -47 21 -30 -241 111 323 113 -212 -215 -77 35 -321 -108 25 -147
6919 -147 -300 -59 154 -355 139 93 67 -294 36 75 121 -63 121 -15 -121 -105 -38 26 -86 -250 -163 168 -34
6942 -34 120 -212 -59 -53 -38 -43 96 83 -8 -175 225 -22 -187 -63 -87 60 -98 -56 1 -102 87 -184 -246 -145
$$ packed form
6777D6Q5k55J63r4J51l5Pj28j13R7J59j28K6J68j23K09k30r1J97j07M7j8N8m5
6801D6k18L09j04q2K33k84k3J01J6j13R7J61k31N8N7j89K4J64p7J01p7R7NR4j75
6826a0Oj05l4j33J11J17p1O3O9k80m3M99k89j90N30m30K12n0k1q2rK80k13N6k68
6851b85L37j52mJ71o4j97o5L16j86J57J79j36l42K39N0o4J7k76K41Q1J72j71L01
6874C19n43j74M54j23K20k24o8m6K02r3l6P6j09mj76K48q4j09J18N5R5k34L45
6897A09J60l74J69j49J88Q9m36J97O8n1k11L52K12k10l25lJ38J12l56K13J33j72
6919a47j53K41K13n09M94m6k6l61L30L9M6j84J84j36j06J6O7O4j12j64Q7L31k02
6942c4J54l32J53OJ5nJ39j3r1j67M00k47j65J24k4J47j58M2N7j03J89k71o2J01
$$ plain form
6966 -145 17 56 45 -22 -152 -36 -185 83 -251 94 184 -105 -84 -33 -25 -139 -93 156 296 -163 222 -104 -1
6989 -1 -37 28 10 -10 -28 -309 -245 -338 -274 175 -27 -64 -53 -202 18 -24 158 -77 -120 26 301 6 -88 -103 -55 72
7015 72 -72 -8 -117 38 -124 -4 -229 -78 -139 -101 40 -63 21 -80 -98 -92 -8 -38 215 88 -68 -73 -67 94 -151
7040 -151 9 150 207 337 169 -28 -89 187 -38 152 -160 -36 -33 3 23 145 -9 -89 -143 0 1 121 -44
7063 -44 -199 -141 -106 -287 -146 -158 -6 -58 -66 40 157 8 -266 -32 186 -86 -107 179 89 -57 2 196 -50
7086 -50 82 -24 -54 32 228 -181 -182 178 -157 -11 194 -52 -197 225 -171 45 -74 -178 -1 -88 251 17
7108 17 72 203 61 -53 124 13 8 -44 7 109 -156 -250 36 122 41 -153 -43 -56 -119 -71 -157 -45 -204 80
7132 80 113 130 -73 151 99 -2 37 -226 -194 -98 112 58 232 155 128 73 43 -159 -13 99 1 -1 -58 -117 -81 156
$$ packed form
6966a45J62L9j1o7j30J16j49K68l34L45R0k89K1N1Qj14M6K49J40m59L85l26J03
6989al6O5j8k0j8k81O4r3O4M49k02l7J1j49K20m2J82k35m3J46K75k95r4j5M8J27
7015G2j44O4j09J55j62J20k25J51o1L8J41j03Q4j01j8OQ4l0K53j27j56nOJ61k45
7040a51J60J41N7J30j68j97o1K76k25J90l12J24LL6K0J22j54q0n4J43JJ20j65
7063d4j55N8L5j81J41j2J52n2qJ06J17j49k74K34K18k72k1K86r0j46N9J94k46
7086e0J32j06l0Q6J96m09jL60l35J46K05k46j45M22l96K16j19j04J77q7L39k34
7108A7N5J31j42j14J77j11nn2N1J02k65r4K86Q6q1j94J10j3o3M8q6J12j59K84
7132H0L3J7k03K24n2j01L9k63L2R6K10n4J74p7k7n5l0k02J46J12r8kn7n9L6K37
$$ plain form
7158 156 -38 -32 -378 160 145 -11 -123 -57 -42 133 244 -40 -23 131 -6 -24 50 141 -14 157 117 -74 -229
7181 -229 8 -81 11 -9 -87 38 -136 -269 88 97 55 -32 101 108 153 174 48 -122 -36 78 150 126 -97 -102 227 -172
7207 -172 -56 -63 -314 49 -2 -46 -214 -11 114 -57 19 104 100 3 78 189 45 -23 202 -10 71 -76 -36 284
7231 284 59 173 55 107 221 54 -41 33 -108 -35 -82 57 267 190 -236 86 -81 44 -33 -203 66 84 -63
7254 -63 195 184 -82 -100 95 239 283 125 259 15 127 170 224 238 -50 218 -159 -3 -95 42 37 -171 -80 2
7278 2 -35 -20 -15 18 -53 164 89 54 -177 -41 -179 301 39 217 109 -57 -104 -137 -127 25 27 3 184 -64 -73 -12
7304 -12 111 -359 45 69 -58 156 119 217 96 50 -49 105 -144 199 94 306 -35 27 -172 145 66 13 -38
7327 -38 -133 -303 -198 228 62 156 -67 -40 20 8 157 -63 160 20 -213 -8 -102 -49 -196 1 59 -43 -290
$$ packed form
7158A56j94Ol46N38j5j56j12O6J5J75J11k84J7J54j37j8P4R1j55J71m0j91j55
7181b29K37q9R2k0p8J25j74j33L57Rm2q7J33PM5K1j26j70Q6J14P2k4k23nL29l99
7207a72J16pk51L63n1m4j68K03J25j71P6Q5mr7P5J11j44o8K25k12Q1j47M0L20
7231B84k25J14j18N2J14j67r5P4j41P3m7J39K10p7m26L22j67J25p7j70K69J8j47
7254f3K58j1k66j8J95J44M4j58J34k44J12M3N4J4k88K68l77J56r2J37nk08R1Q2
7278Bl7J5NL3p1K17p5l5k31J36j38M80k62J78j08j66m7l3J0J52Kk4J81k48rO1
7304a2J23m70M04K4j27K14l7R8j21m6r9J54k49L43j05K12l41O2j99L17p9n3n1
7327c8r5j70J05M26j66R4k23K7O0j2J49k20K23j40k33K05r4N3j47J97N8j02k47
$$ plain form
7350 -290 -50 -128 -146 -147 256 -194 -80 -213 44 -193 50 52 124 -238 -176 -21 52 116 69 150 53 85 -48 -213 -35
7375 -35 -78 31 108 162 -47 219 -79 -105 -134 -37 168 -145 -70 -88 -44 26 -46 -399 -238 -186 -18 216 -3 124
7399 124 80 191 133 108 167 170 108 28 33 124 15 58 -43 -47 -68 -132 -107 -139 19 -22 220 -33 53 4 148 73 -79
7426 -79 -118 75 43 -50 33 -118 203 -257 113 -5 -56 112 88 -133 -32 41 -265 -161 27 94 17 202 33
7449 33 41 -68 85 124 -25 7 138 133 552 -145 98 -27 108 29 -102 31 92 -10 -171 13 88 183 123 48
7473 48 73 176 267 17 -7 82 -92 71 213 -32 91 30 97 164 -93 -89 62 -21 107 -124 176 62 141 18
7497 18 23 293 127 -26 110 103 156 196 -178 192 348 126 -154 -199 -137 -42 -40 13 -58 -28 156 -61 -280 49 -120
7522 -120 17 1 49 117 409 130 -165 -17 -8 -266 88 -172 -49 -96 -83 162 -20 -91 203 237 16 305 91
$$ packed form
7350b90K40p8j8jM03m50J14j33K57k37K43KP2l62O2J55P3O4m7Q1r7L2j33j65J78
7375c5m3J09P7N4k09K66k98k6k9R7K05l13P5j8M4P0p2l53J61N2J68K34k19J27
7399A24m4J11n8k5N9Lo2q0NR1j09M3j01mk1o4K5l2J58m1K42k53Q6m9J44p5j52
7426g9l9J93l2r3Q3j51L21m60L70j18n1J68k4k21J01P3l06J04J88O7p7J85j69
7449C3Qj09J53L9j49L2J31nM19o97K43j25J35p9j31J33O1j02j61J84P5R5o0p5
7473D8K5J03R1k50k4Q9j74J63J42k45J23o1O7O7k57MJ51q3J28k31L00j14P9j23
7497A8NK70j66j53J36pN3M0l74L70J56k22k80m5O2R5KN3p1L0J84k17k19L29j69
7522a20J37j6M8O8K92k79k95J48Rk58L54k60J23m7J3K45j82p1K94L4k21K89k14
$$ plain form
7545 91 190 133 21 48 112 140 38 162 105 351 52 -78 -120 36 -64 188 229 118 21 -90 141 -118 17
7568 17 29 -11 -114 -28 -5 69 67 -97 -291 -95 288 131 37 -64 34 -2 -52 -254 230 132 260 177 -194 -109 45
7593 45 46 146 82 -34 148 122 -202 -20 -260 110 -109 -74 -154 -217 -26 60 -153 -187 -66 -56 83 -30 79 -2
7617 -2 33 132 -149 100 42 -149 225 -22 11 119 11 60 166 63 71 -106 -255 -132 -29 21 37 -213 -137 37
7641 37 -20 46 -12 44 49 -25 30 66 -30 26 96 18 122 -138 137 -27 90 31 47 -38 -24 231 78 74 70 -105 53
7668 53 43 -4 -102 -307 -54 214 -124 156 -24 68 -132 -287 -78 72 -278 -222 -123 96 33 49 -21 -388 -6
7691 -6 -120 65 96 27 -80 -17 35 -52 -331 -331 -232 130 -24 -131 -204 -108 250 -70 127 -197 114 11 101 30 -44
7716 -44 -153 130 -98 -96 257 -130 157 166 180 68 47 79 73 132 105 105 38 194 103 -21 -111 -60 -96 -297 -6 44 -127
$$ packed form
7545I1R9n7j12K7O4K8j02J24n7K46k99j30m2J56j00K52M1j11r7j11K31k59J35
7568A7J2m0j03Q6K3P4kj64j94J96L83j57r4j01R8l6n0k02M84r8J28q3l71Q5J54
7593D5JJ00o4j16J82k6l24J82k40L70k19L5q0o3J91Q6k13l4J21J0J39j13J09q1
7617bL5R9k81K49n8j91L74k47L3J08j08M9J06j03Qj77j49J23J03N0J6k50P6J74
7641C7n7O6n8N6Np4N5L6r6N6P0p8J04k60K75j64J17n9J6q5J4K55j53mmj75J58
7668E3j0m7r8k05K53K68l38K80j80R2k00j55K09J50l50N6R9K19o3J6p0l67L82
7691fj14J85L1o9j07O3N2q7k79%R9L62j54j07p3R6L58l20J97l24L11j03R0p1p4
7716d4j09K83k28KL53l87K87RJ4j12k1L2oN9k7%o7J56r1j24r0N1l6k01K91N0j71
$$ plain form
7743 -127 -111 -220 -89 -5 -258 34 -92 -8 84 -254 8 -1 21 -295 -300 -114 -33 125 -339 91 71 -80 -198 -102
7767 -102 -25 -235 33 -68 -26 -135 -123 3 -275 66 83 -136 35 -231 -238 -165 -309 0 -31 -188 -19 76 127
7790 127 204 -22 -46 131 -58 53 -187 -13 118 103 -10 11 -12 -103 -30 -92 -18 23 -160 36 -178 -131 4 -79
7814 -79 -35 -313 57 29 -29 -85 -110 94 8 24 215 -11 -220 -255 148 46 78 -125 -49 -120 -372 5 -53 20 -149
7839 -149 173 -73 -307 -178 186 -25 -51 11 45 -297 72 -229 -72 -178 6 -195 -138 111 41 107 -1 59
7861 59 88 -72 -9 134 160 200 153 90 296 -93 -50 359 -75 49 -38 -59 -256 -24 237 17 212 -46 93
7884 93 -103 81 94 148 38 -124 134 33 -47 286 -180 -49 7 -48 62 -307 11 -55 8 124 -238 182 89
7907 89 218 -244 -80 -83 -177 -128 -166 -86 135 -85 54 144 56 2 81 70 7 70 114 276 185 3 -243 8 147
$$ packed form
7743a27J6j09J31Q4k53K92j26Q4R2l38K62rK2l16nJ86Q1J58m64M30k0j51j18R6
7767a02P7k10K68j01M2j09J2J26k78L41J7k19J71k66pP3j44L09l1j57J69R5N1
7790A27P7k26k4J77j89J11k40J74J31j5j13K1k3r1P3o2P4M1j83J96k14M7J35q3
7814g9M4k78L70k8n8n6k5K04q6J6J91k26k09l5M03j02L2k03P6p1k52L77n8P3j69
7839a49L22k46k34J29L64k11k6O2L4l42L69l01J57j06J84k01N7K49p0O6j08O0
7861E9K9j60O3J43K6M0m7o3K06l89M3M09m34J24q7k1j97K32K61k20J95k58J39
7884I3j96J84J3N4j10j62K58j01q0L33m66J31N6n5J10l69L18o6O3J16l62M20r3
7907H9J29m62J64lr4M9l8Q0K21k20J39R0q8n4P9j1o3O3M4J62r1j82k46K51J39
$$ plain form
7932 147 18 -2 31 -170 -12 58 -175 60 271 -95 -227 226 -91 178 10 -50 171 -26 174 -73 291
7953 291 -61 -29 122 107 -137 -164 212 130 -5 158 -146 146 122 72 22 72 -102 -106 53 33 -50 -138 290 31
7977 31 -147 171 -62 5 277 -39 -190 76 -128 -97 8 -8 -125 -56 58 62 46 -130 178 -5 31 -105 155
8000 155 92 57 81 23 142 82 20 131 299 19 -16 120 90 -178 -55 -145 58 -44 13 193 -144 134 -421
8023 -421 88 -105 66 46 -40 163 -58 -184 -203 174 -22 101 33 111 121 109 -106 16 25 170 -121 35 -77
8046 -77 -89 107 14 88 80 15 78 68 31 82 -26 -139 128 70 128 -7 -23 -48 148 230 143 -87 -134 -149 -24 -163
8072 -163 -55 -46 167 -7 17 254 252 31 -131 1 59 83 -131 61 -21 58 -153 127 -37 63 -80 -2 -139
8095 -139 -31 -26 -158 45 16 -8 -89 31 -57 312 103 2 -197 63 20 21 -102 -109 41 68 -238 19 14 249 259
$$ packed form
7932A47j29k0L3k01J58P0k33K35K11l66j32M53l17K69j68o0K21j97K00k47L64
7953B91l52L2J51j5k44k7L76q2j35J63l04K92k4n0n0N0j74mJ59k0q3q8M28k59
7977C1j78L18k33O7K72l16j51K66k04L1J05j6j17O9J14Mj6j76L08j83L6j36K60
8000A55o3l5K4n8J19o0o2J11J68k80l5J36l0k68J23r0K03j02N7J80l37K78n55
8023d21N09j93J71k0q6K03k21j26j9L77j96J23o8P8J0j2k15J22RJ45k91J56j12
8046g7j2J96r3P4qo5O3j0l7N1j08j13K67n8N8j35j6k5J96Q2q7k30m7j5J25j39
8072a63J08RK13j74K4K37kk21j62J32N8K4k14J92q2P9k11K80j64J00j43P8j37
8095a39J08Nj32K03k9k4q1J20q8L69k09j01j99K60m3Jj23pJ50K7l06K57nK35J0
$$ plain form
8120 259 63 -149 -51 208 85 100 -25 -5 163 70 -27 65 -140 6 138 -77 -53 6 -10 -31 199 71 -80
8143 -80 -348 -9 240 -26 -160 -92 -19 -5 -120 187 -31 289 -207 -98 69 114 -41 -14 158 8 45 124 51
8166 51 -79 28 221 255 31 33 27 -95 -45 -100 169 -10 122 171 183 -98 -164 185 185 -199 43 -103 133 63 -66
$$ packed form
8120B59j96k12R8K59j23J5j25K0J68r3r7R2k05J46J32k15K4N9j6k1K30j28j51
8143h0k68L39K49k66j34O8P3J4j15L07k18L20m96J09J67M5j55K7J72j50L7P9p3
8166E1j30J07J93L4k24Koj22N0n5K69j79J32M9J2k81o6L49%l84K42j46K36p0j29
8191f6
$$ Imaginary data points
##PAGE= N=2
##DATA TABLE= (X++(I..I)), XYDATA
$$ plain form
0 0 0 0 0 0 0 0 0 0 0 1 -16 16 -16 17 -32 33 -48 49 -65 81 -97 113 -130 157 -179 211 -243 284 -325 373 -430
31 -430 487 -552 628 -709 798 -895 1001 -1121 1250 -1389 1546 -1712 1896 -2096 2314 -2555
47 -2555 2816 -3104 3420 -3768 4150 -4576 5051 -5585 6183 -6869 7659 -8577 9668 -10975
61 -10975 12592 -14641 17339 -21060 26548 -35486 52523 -96723 455649 905590 -80295
72 -80295 -247621 202382 285499 -444377 -703800 -192302 222050 -95861 -347679 -89146
82 -89146 207059 33619 -161806 -39511 200453 266237 317122 372158 305095 161441 159041
93 159041 132970 -98446 -279736 -84446 161190 45170 -173670 -29497 207458 44127
103 44127 -284206 -204094 125852 161063 -17283 73625 326741 274807 4498 -29556 105956
$$ packed form
0@%%%%%%%%%Jj7L2l2L3m9O5q1R7j14J46j78K10k43K87l36L90m54N27o09O98q03
31d30R17j039J180j337J507j693J896k122K371k639K935l258L608l992M410m869
47b555N371n920O524p188P918q726R627j0636J1768j3052J4528j6236J8245k0643
61a0975K3567k7233L1980l8399M7608o2034Q8009j49246N52372M49941r85885
72h0295j67326M50003Q3117p29876k59423N11498M14352l17911k51818K58533
82h9146K96205j73440j95425J22295K39964O5784N0885N5036o7063j43654k400
93A59041k6071k31416j81290J95290K45636j16020k18840J44173K36955j63331
103D4127l28333Q0112L29946L5211j78346R0908K53116n1934k70309l4054J35512
$$ plain form
114 105956 32089 -131348 -9347 226286 160726 -45504 17602 167704 -17724 -315470
124 -315470 -218228 96987 82963 -153335 -79760 222319 205748 -107632 -173589 76641 175131
135 175131 19691 3775 222876 322790 179538 59580 68968 37952 -48096 -36422 27238
146 27238 -4957 -37289 64840 120657 -48600 -203820 -83081 75521 -37951 -186809 -10252
157 -10252 256597 168421 -109685 -92502 141795 119889 -131243 -139529 136150 243451 60040
168 60040 -36364 100613 160726 -5329 -131479 -51976 41125 1425 -43750 -4679 9606
179 9606 -48916 -79237 -59192 -71961 -87425 -6496 101380 96664 44080 88960 154642 77660
191 77660 -53700 -39124 57841 30381 -78621 -70656 14483 -20829 -144211 -154725 -64931 -53812
$$ packed form
114A05956p3867j63437J22001K35633o5560k06230O3106J50102j85428k97746
124c15470R7242L15215j4024k36298P3575L02079j6571l13380o5957K50230R8490
135A75131j55440j5916K19101R9914j43252j19958R388l1016q6048J1674O3660
146B7238l2195l2332J02129N5817j69257j55220J20739J58602j13472j48858J76557
157a0252K66849q8176k78106J7183K34297k1906k51132q286K75679J07301j83411
168F0040r6404J36977O0113j66055j26150P9503R3101l9700m5175L9071J4285
179I606n8522l0321K0045j2769j5464Q0929J07876m716n2584M4880O5682p6982
191G7660j31360J4576R6965k7460j09002P965Q5139l5312j23382j0514Q9794J1119
$$ plain form
203 -53812 -101681 -42644 87845 110879 51053 74601 148569 109154 5994 18541 103594 72366
215 72366 -40580 -43996 30487 -12844 -150807 -173331 -76986 -59323 -136416 -122346 3515 56809
227 56809 -6783 -23933 55734 90258 33845 15089 79008 109569 59792 26954 46034 30428
239 30428 -40158 -76141 -55513 -57932 -94522 -88511 -38699 -28751 -63171 -58951 -9690 4310 -20400
252 -20400 -5719 52966 73999 44309 35330 57537 48376 -745 -27321 -18778 -25097 -52698 -56056
265 -56056 -37713 -41569 -62182 -56495 -34076 -34308 -40822 -14265 22834 24175 11265 28639 51297
278 51297 30338 -7582 -6314 14808 717 -29849 -22148 5660 -4447 -38074 -36589 -8443 -10030
291 -10030 -36174 -31990 226 6380 -16704 -20634 -802 -2337 -29319 -35239 -9314 3893 -8580
$$ packed form
203e3812m7869N9037J30489K3034n9826K3548P3968l9415j03160J2547Q5053l1228
215G2366j12946l416P4483m3331j37963k2524R6345J7663p7093J4070J25861N3294
227E6809o3592j7150P9667L4524n6413j8756O3919L0561m9777l2838J9080j5606
239C0428p0586l5983K0628k419l6590O011M9812R948l4420M220M9261J4000k4710
252b0400J4681N8685K1033k9690q979K2207r161m9121k6576Q543o319k7601l358
265e6056J8343l856k0613N687K2419k32o514K6557L7099J341j2910J7374K2658
278E1297k0959l7920J268K1122j4091l0566P701K7808j0107l3627J485K8146j587
291a0030k6144M184L2216O154k3084l930J9832j535k6982n920K5925J3207j2473
$$ plain form
304 -8580 -11193 11421 23401 8497 -3187 6614 11782 -5517 -21818 -15802 -7957 -20546 -39856
317 -39856 -41745 -34214 -36098 -42104 -33922 -14740 -2462 -716 6236 21276 29811 23215 13137 12527
331 12527 15053 8666 -3403 -9657 -11393 -18605 -32165 -38303 -32269 -26465 -29741 -30723 -19558 -5801
345 -5801 -2830 -6461 -4243 2222 862 -5596 -4037 4702 5171 -4694 -9618 -3018 1191 -6006 -12773
360 -12773 -9820 -6565 -12901 -20033 -18135 -14858 -22794 -34701 -34758 -25187 -22119 -26789 -24558 -12187 -3888
375 -3888 -3944 -1398 8592 13133 5600 -3581 -2837 -1060 -10347 -24615 -30915 -31263 -35393 -41212 -38670 -28867
391 -28867 -22906 -21010 -13228 2665 15270 17600 16935 20772 24284 19969 11390 5716 915 -9568
405 -9568 -22842 -29140 -27439 -27928 -34995 -38283 -30928 -21279 -18314 -17539 -9404 68 222 -3977 -153 8791
$$ packed form
304h580k613K2614J1980j4904j1684R801N168j7299j6301O016P845j2589j9310
317c9856j889P531j884o006Q182J9182J2278J746O952J5040Q535o596j0078o10
331A2527K526o387j2069o254j736p212j3560o138O034N804l276r82J1165J3757
345e801K971l631K218O465j360o458J559Q739M69r865m924O600M209p197o767
360a2773K953L255o336p132J898L277p936j1907n7R571L068m670K231J2371Q299
375c888n6K546R990M541p533r181P44J777r287j4268o300l48m130n819K542R803
391b8867N961J896P782J5893J2605K330o65L837L512m315q579n674m801j0483
405i568j3274o298J701m89p067l288P355R649K965P75Q135R472J54m199L824Q944
$$ plain form
421 8791 7105 -3557 -7063 694 2756 -6806 -11832 -5219 -2754 -12239 -17305 -7564 -560 -11224 -22713
436 -22713 -17552 -8639 -15187 -24905 -18544 -6547 -8755 -16470 -8635 5506 3141 -9240 -7077 6141
450 6141 6231 -4945 -6869 108 -4332 -20175 -23582 -13032 -10645 -19835 -18831 -3873 4749 -207 -1442
465 -1442 7764 10732 3305 1338 10581 14929 7260 746 1820 -697 -9259 -12818 -9018 -7428 -9322
480 -9322 -4013 5837 7016 894 -89 2889 -1071 -6597 -72 10768 9579 2733 5870 11760 4680
495 4680 -6697 -2157 9560 8798 4812 14769 27319 17183 -2404 -2205 7590 -759 -15031 -4631
509 -4631 18180 16458 -3489 -2449 15106 9565 -15610 -16381 9997 19464 2168 -3496 13009 13548
523 13548 -13035 -27918 -13437 -1018 -7585 -6474 13772 25891 15985 7658 12874 10611 -2101
$$ packed form
421H791j686j0662l506P757K062r562n026O613K465r485n066R741P004j0664j1489
436b2713N161Q913o548r718O361J1997k208p715P835J4141k365j2381K163J3218
450F141R0j1176j924O977m440j5843l407J0550K387r190J004J4958Q622m956j235
465a442R206K968p427j967R243M348p669o514J074k517q562l559L800J590j894
480i322N309R850J179o122r83K978l960n526O525J0840j189o846L137N890p080
495D680j1377M540J1717p62l986R957J2550j0136j9587J99R795q349j4272J0400
509d631K2811j722j9947J040J7555n541k5175p71K6378R467j7296n664J6505N39
523A3548k6583j4883J4481J2419o567J111K0246J2119r906q327N216k263j2712
$$ plain form
536 -2101 -171 18202 21528 7522 6953 19685 9920 -20515 -25266 2842 15336 171 2458 37363
550 37363 51958 21252 -4674 8853 22750 2475 -17351 1490 27963 18501 -7030 -10119
562 -10119 -363 -6324 -17350 -8209 13657 26961 32943 39375 35698 20167 9984 9626 1134 -13002
576 -13002 -6952 15584 17933 -3645 -13191 -818 -1404 -22554 -24242 6127 26635 18527 15497 30466
590 30466 27562 -3712 -21197 -10492 -8391 -26713 -20601 14483 21176 -12262 -23632 8481 18499
603 18499 -19334 -30467 23108 62363 28123 -9364 19226 51593 8591 -54203 -39238 19553
615 19553 22595 -20723 -19004 30481 42958 -1726 -29908 -5503 22504 15067 -1528 5343 24231
628 24231 28979 9519 -22254 -38700 -23140 -830 -10209 -31371 -9972 38940 38865 -13754 -30455
$$ packed form
536b101J930J8373L326j4006n69J2732r765l0435m751K8108J2494j5165K287L4905
550C7363J4595l0706k5926J3527J3897k0275j9826J8841K6473r462k5531l089
562a0119R756n961j1026R141K1866J3304N982O432l677j5531j0183l58q492j4136
576a3002O050K2536K349k1578r546J2373n86k1150j688L0369K0508q108l030J4969
590C0466k904l1274j7485J0705K101j8322O112L5084O693l3438j1370L2113J0018
603A8499l7833j1133N3575L9255l4240l7487K8590L2367m3002o2794J4965N8791
615A9553L042m3318J719M9485J2477m4684k8182K4405K8007p437j6595O871J8888
628B4231M748j9460l1773j6446J5560K2310r379k1162K1399M8912p5n2619j6701
$$ plain form
641 -30455 16757 39136 -8458 -38493 12708 62928 27823 -30272 -17685 24768 6202 -44096
653 -44096 -35463 17265 28056 -2642 -5807 19562 15774 -17234 -28138 -14299 -14721 -22821 -7520
666 -7520 11491 -1494 -21952 -10404 8046 -7810 -26368 -1308 36731 33049 9607 18839 39766
679 39766 20695 -17796 -22242 -4546 -7788 -20775 -10244 3742 -8343 -20573 -5487 2703 -20991
692 -20991 -29010 11183 39411 11123 -11566 24467 51933 2877 -52950 -25269 27954 5500
704 5500 -50539 -31355 34868 33044 -29225 -41183 10503 27360 -14895 -29845 14664 46859
716 46859 24597 -2854 2418 11977 579 -12792 -13380 -9654 -872 15620 18610 -1275 -11770
729 -11770 5504 10239 -21098 -37887 -1569 31888 7949 -24950 -4275 27810 3037 -41782
$$ packed form
641c0455M7212K2379m7594l0035N1201N0220l5105n8095J2587M2453j8566n0298
653d4096Q633N2728J0791l0698l165K5369l788l3008j0904J3839m22q100J5301
666g520J9011j2985k0458J1548J8450j5856j8558K5060L8039l682k3442R232K0927
679C9766j9071l8491m446J7696l242j2987J0531J3986j2085j2230J5086Q190k3694
692b0991q019M0193K8228k8288k2689L6033K7466m9056n5827K7681N3223k2454
704E500n6039J9184O6223j824o2269j1958N1686J6857m2255j4950M4509L2195
716D6859k2262k7451N272R559j1398j3371n88L726Q782J6492K990j9885j0495
729a1770J7274M735l1337j6789L6318L3457k3939l2899K0675L2085k4773m4819
$$ plain form
741 -41782 -29438 15034 16268 -11040 1872 41054 37033 -1554 -8921 13553 10270 -12781 -3915
754 -3915 25325 22189 -3322 -376 16880 -2023 -36824 -27936 6899 6830 -14887 -1128 33075
767 33075 23063 -18230 -22767 6643 8052 -17330 -10684 26815 34844 8000 -1414 11538 4344
780 4344 -22175 -20677 7432 15786 3895 9173 25976 14399 -15097 -17589 1474 -998 -15191
793 -15191 -976 29849 28405 489 -5955 6213 -3530 -27142 -20520 9400 17708 3836 6482
806 6482 21577 11915 -14598 -17298 1333 4207 -3394 10960 35084 29530 3905 -1196 9134
819 9134 -561 -18458 -6523 22807 26735 9815 11697 24460 10519 -19232 -21040 597 5337
832 5337 -5018 3484 23961 17646 -10197 -17551 -4548 -5120 -17327 -6102 22432 29620 13759
$$ packed form
741d1782J2344M4472J234k7308J2912L9182m021l8587p367K2474l283k3051Q866
754c915K9240l136k5511K946J7256j8903l4801Q888L4835o9k1717J3759L4203
767C3075j0012m1293m537K9410J409k5382O646L7499Q029k6844r414J2952p194
780D344k6519J498K8109Q354j1891N278J6803j1577k9496k492J9063k472j4193
793a5191J4215L0825j444k7916o444J2168r743k3612O622K9920Q308j3872K646
806F482J5095r662k6513k700J8631K874p601J4354K4124n554k5625n101J0330
819I134r695j7897J1935K9330L928j6920J882J2763j3941k9751j808K1637M740
832E337j0355Q502K0477o315k7843p354J3003n72j2207J1225K8534P188j5861
$$ plain form
845 13759 8586 16059 6762 -16693 -19056 28 8058 752 2663 14349 9011 -11809 -18563 -8146
859 -8146 -3561 -6304 5185 26249 29706 16325 9586 10721 1765 -14505 -13847 1556 8467 1823
873 1823 1713 8647 3844 -11819 -16080 -5621 3101 6267 14365 27031 29125 19741 11388 7888 1043
888 1043 -5089 -265 9851 11443 8652 9849 10268 -277 -11407 -8807 1292 3850 2278 10729
902 10729 20651 15455 630 -6106 -3363 -5816 -11512 -6273 6987 12572 7712 5064 6747 4275
916 4275 -2754 -2879 4614 9415 9340 11242 14056 9158 -1458 -7254 -5589 -4434 -5084 -258 9075 13361
932 13361 9096 4519 5455 5032 490 -2320 2220 8456 9141 6524 4324 2538 -1125 -5021 -4854 -734
948 -734 5031 9688 11779 12555 12391 11127 7629 3569 2141 3765 5821 5972 5548 4924 2954 -531 -3065
$$ packed form
845A3759n173P473r297k3455k363J9084Q030p306J911J1686n338k0820o754J0417
859h146M585k743J1489K1064L457j3381o739J135q956j6270O58J5403O911o644
873A823j10O934m803j5663m261J0459Q722L166Q098J2666K094r384q353l500o845
888A043o132M824J0116J592k791J197M19j0545j1130K600J0099K558j572Q451
902A0729R922n196j4825o736K743k453n696N239J3260N585m860k648J683k472
916D275p029j25P493M801p5J902K814m898j0616n796J665J155o50M826R333M286
932A3361m265m577R36m23m542k810M540O236O85k617k200j786l663l896J67M120
948g34N765M657K091P76j64j264l498m060j428J624K056J51m24o24j970l485k534
$$ plain form
965 -3065 -1234 1466 3575 5949 9520 11371 10405 8417 6953 4118 -446 -1371 1427 3267 1363 -176
981 -176 1711 2123 -453 -1990 2138 6497 5794 4729 8249 11845 9209 3379 1119 2179 463 -2432
997 -2432 -1571 1606 1769 -1241 -1465 1276 1621 77 86 2057 3246 2709 3340 3430 676 -2651 -3448 -2407
1015 -2407 -3362 -3916 -2022 -218 -919 -970 2408 4959 3733 2156 4574 7205 5907 4938 6173 6201 1876
1032 1876 -952 1140 1923 -2585 -5341 -2516 -551 -4018 -5571 -663 1772 -3497 -6354 171 5459
1047 5459 917 -3210 3072 7851 2056 -3252 2216 7015 -319 -7993 -3265 3427 -2427 -10778 -6875
1062 -6875 -365 -4977 -11831 -6196 2683 -1114 -8566 -3612 5450 2071 -6197 -3363 3067 -1853 -10495
1077 -10495 -7221 -509 -5002 -13893 -10388 -2581 -5792 -12220 -6369 2341 -1308 -7350 -804 7861 2565
$$ packed form
965c065J831K700K109K374L571J851r66j988j464k835m564r25K798J840j904j539
981a76J887M12k576j537M128M359p03j065L520L596k636n830k260J060j716k895
997b432Q61L177J63l010k24K741L45j544RJ971J189n37O31R0k754l327p97J041
1015b407r55n54J894J804p01n1L378K551j226j577K418K631j298r69J235K8m325
1032A876k828K092P83m508k756K825J965l467j553M908K435n269k857O525N288
1047E459m542m127O282M779n795n308N468M799p334p674M728O692n854q351L903
1062f875O510m612o854N635Q879l797p452M954R062l379q268K834O430m920q642
1077a0495L274O712m493q891L505P807l211o428N851Q710l649o042O546Q665n296
$$ plain form
1092 2565 -6174 -1809 5456 -806 -9388 -4592 3121 -4229 -13614 -7299 1742 -4709 -13844 -6993 3280
1107 3280 -3084 -12416 -5804 3759 -4207 -15484 -8650 2444 -4209 -15077 -7352 4484 -2721 -13221
1121 -13221 -4555 7366 -793 -12421 -4228 7173 -1810 -14647 -7687 2397 -8234 -21133 -11462
1134 -11462 2233 -7081 -19658 -7896 8251 -169 -14657 -4545 11517 1794 -15014 -6560 10017
1147 10017 414 -19200 -14009 1396 -6092 -23542 -17374 527 -2208 -16006 -9021 7647 4001
1160 4001 -9426 -4736 8287 2938 -9061 -2710 8494 -889 -14600 -7585 2467 -9067 -22484
1173 -22484 -11263 4006 -6640 -20363 -7405 8797 -3903 -22706 -11245 7519 -2534 -20625
1185 -20625 -9444 11657 3260 -16509 -9357 9538 2151 -15614 -7715 11433 6433 -10155 -4519
$$ packed form
1092B565q739M365P265o262q582M796P713p350r385O315R041o451r135O851J0273
1107C280o364r332O612R563p966j1277O834J1094o653j0868P725J1836p205j0500
1121a3221Q666J1921q159j1628Q193J1401q983j2837O960J0084j0631j2899R671
1134a1462J3695r314j2577J1762J6147q420j4488J0112J6062r723j6808Q454J6577
1147A0017r603j9614N191J5405p488j7450O168J7901k735j3798O985J6668l646
1160D001j3427M690J3023n349j1999O351J1204r383j3711P015J0052j1534j3417
1173b2484J1221J5269j0646j3723J2958J6202j2700j8803J1461J8764j0053j8091
1185b0625J1181K1101q397j9769P152J8895p387j7765P899J9148n000j6588N636
$$ plain form
1198 -4519 8914 -1268 -19857 -14222 593 -7135 -20958 -9378 7784 -1283 -17550 -8268 8148
1211 8148 -1145 -16189 -3499 15746 7594 -9748 -2246 10999 -2551 -22455 -14146 3660 -4581
1224 -4581 -18726 -5443 12903 1244 -17397 -7357 11060 368 -17729 -3216 20998 11444
1236 11444 -12046 -6308 12871 1173 -24642 -19300 6094 5991 -13399 -10166 10138 7655 -13428
1249 -13428 -16415 -1627 -607 -10234 -4885 8844 6598 -4145 -2392 1732 -8926 -16842 -3355
1262 -3355 9889 983 -6643 8879 19484 -1193 -21875 -9338 8339 -4784 -21394 -4264
1274 -4264 19557 6491 -19842 -14945 4526 -3252 -22521 -12176 14638 16170 -23 3203 16633
1287 16633 7496 -13278 -11141 5780 4597 -6318 1432 15541 6234 -14303 -13019 -627 -6071
$$ packed form
1198d519J3433j0182j8589N635J4815p728j3823J1580J7162r067j6267R282J6416
1211H148r293j5044J2690J9245q152j7342P502J3245j3550j9904Q309J7806q241
1224d581j4145J3283J8346j1659j8641J0040J8417j0692j8097J4513K4214r554
1236A1444k3490N738J9179j1698k5815N342K5394j03j9390L233K0304k483k1083
1249a3428k987J4788J020r627N349J3729k246j0743J753M124j0658p916J3487
1262c355J3244q906p626J5522J0605k0677k0682J2537J7677j3123j6610J7130
1274d264K3821j3066k6333M897J9471p778j9269J0345K6814J532j6193L226J3430
1287A6633r137k0774K137J6921j183j0915P750J4109r307k0537J284J2392n444
$$ plain form
1300 -6071 -18498 -6291 16456 16853 2584 3968 14270 5877 -11063 -7859 8862 10815 2067
1313 2067 5577 13188 3148 -14404 -15266 -8493 -13911 -18733 -3917 13509 7794 -5075 39 8523
1327 8523 -3009 -16596 -4119 17758 16307 3469 8652 20024 8026 -16184 -18588 -4954 -4545
1340 -4545 -12613 -5100 10978 8818 -6674 -10282 -3544 -6345 -12737 -3868 13186 15640 8927 11867
1354 11867 16569 5348 -11035 -8970 3880 4980 305 7886 19117 12455 -4196 -7908 -2234
1367 -2234 -5108 -11623 -3562 11629 13742 5506 4477 5905 -2920 -13690 -7878 5609 8580 5735
1381 5735 12695 20227 10518 -6212 -8028 -608 -3734 -10843 -2759 12731 12087 -1850 -7189 -2670
1395 -2670 -5980 -14881 -11439 4006 12459 9443 8787 12542 8721 -3088 -7837 -4015 -724 -273 5135
$$ packed form
1300f071j2427J2207K2747L97j4269J384J0302q393j6940L204J6721J953q748
1313B067L510P611j0040j7552q62O773n418m822J4816J7426n715j2869N114Q484
1327H523j1532j3587J2477K1877j451j2838N183J1372j1998k4210k404J3634M09
1340d545q068P513J6078k160j5492l608O738k801o392Q869J7054K454o713K940
1354A1867M702j1221j6383K065J2850J100m675P581J1231o662j6651l712N674
1367b234k874o515Q061J5191K113q236j029J428q825j0770N812J3487K971k845
1381E735O960P532r709j6730j816P420l126p109Q084J5490o44j3937n339M519
1395b670l310q901L442J5445Q453l016o56L755l821j1809m749L822L291M51N408
$$ plain form
1410 5135 11470 9199 215 -4507 -4664 -7743 -10427 -4539 5549 8893 7153 7932 8089 759 -7812
1425 -7812 -6932 -822 1445 2975 10070 15427 10156 1235 -385 1819 -2204 -6454 85 10359 10079
1440 10079 1898 -366 1762 -4174 -13919 -13872 -2436 5181 3722 4681 11131 12302 4958 -1462 471
1455 471 3782 3306 3401 6870 8343 3880 -2737 -6814 -10109 -12513 -9891 -4318 77 2553 5794 8605
1471 8605 7062 2217 856 3283 4536 3783 5035 8310 7392 1368 -4533 -6656 -8171 -9937 -8530
1486 -8530 -4228 -379 1714 3481 3741 2032 -545 -349 1850 2871 3497 5841 8306 6509 1547 -1617
1502 -1617 -1675 -2309 -4877 -4145 277 3363 1960 315 51 -422 -2839 -4259 -2660 -206 1912 3607
1518 3607 4837 4353 2566 1690 1753 789 143 1811 4712 4893 1950 533 1140 -464 -5012 -7101 -4170
$$ packed form
1410E135O335k271q984m722j57l079k684N888J0088L344j740P79J57p330q571
1425g812Q80O110K267J530P095N357n271q921j620K204m023m250O539J0274k80
1440A0079q181k264K128n936r745M7J1436P617j459R59O450J171p344o420J933
1455D71L311m76R5L469J473m463o617m077l295k404K622N573M395K476L241K811
1471H605j543m845j361K427J253p53J252L275r18o024n901k123j515j766J407
1486h530M302L849K093J767K60j709k577J96K199J021O26K344K465j797m962l164
1502a617n8o34k568P32M422L086j403j645k64m73k417j420J599K454K118J695
1518C607J230m84j787q76O3r64o46J668K901J81k943j417O07j604m548k089K931
$$ plain form
1535 -4170 -1206 -1287 -1953 117 3339 2139 -716 -1217 1049 3019 2489 2532 4043 4964 3757 873 -1499
1552 -1499 -2365 -2457 -2168 -1930 -1334 256 1316 339 -1374 -1867 -1007 -549 -1123 -788 1841 3945 3429 1807
1570 1807 1281 1342 964 680 550 1732 2964 3520 2802 1313 507 -209 -1001 -2863 -3318 -1221 1261 763
1588 763 -765 -215 895 268 -1864 -1577 1436 3426 2116 1670 3630 4168 1484 -1456 -1661 44 34
1605 34 -549 250 1062 1055 -428 -799 -780 -999 -777 457 1476 2113 2769 4182 3367 1573 534 1728 2675
1624 2675 1449 859 2050 2879 970 -1017 -1097 -686 -1596 -2760 -1448 1015 2421 2120 2342 2859 2931 2751
1642 2751 3334 3796 3136 3213 3689 2812 587 -1047 -1052 -2398 -4657 -4416 -1569 -19 -1376 -1875 772 2713
1660 2713 1288 914 2907 4422 3149 1700 3065 3614 902 -1332 -1088 -492 -2190 -2625 -415 1076
$$ packed form
1535d170K964q1o66K070L222j200k855n01K266J970n30M3J511R21j207k884k372
1552a499q66r2K89K38N96J590J060r77j713m93Q60M58n74L35K629K104n16j622
1570A807n26O1l78k84j30J182J232N56p18j489q06p16p92j862m55K097K482m98
1588G63j528N50J110o27k132K87L013J990j310m46J960N38k684k940k05J705j0
1605C4n83P99Q12pj483l71J9k19K22J234J019O37O56J413q15j794j039J194R47
1624B675j226n90J191Q29j909j987q0M11r10j164J312K463J406l01K22N17P2j80
1642B751N83M62o60P7M76q77k225j634nj346k259K41K847J550j357m99K647J941
1660B713j425l74J993J515j273j449J365N49k712k234K44N96j698m35K210J491
$$ plain form
1676 1076 -439 -392 2291 4198 2273 1097 3641 5340 3067 1587 3856 5075 1589 -1545 865
1691 865 3122 989 -1724 268 3394 1777 -746 677 3051 1407 -1551 -58 2839 1821 -175
1706 -175 1512 3586 2261 532 3146 5335 3368 1815 4042 5836 3353 859 2439 3180 -192
1721 -192 -3177 -588 1812 -1184 -3858 -678 3009 851 -1425 2014 5078 2515 -283 2844 6059
1736 6059 3092 -486 1084 3956 861 -2514 65 3724 1118 -1761 1827 5660 3194 -118 2601
1751 2601 6047 3064 -483 2620 5751 1248 -3309 -331 3552 -318 -4083 190 5367 2186 -1748
1766 -1748 3021 7935 4530 -817 2860 8300 4866 -964 1847 6395 2517 -3439 -928 4860 2579
1781 2579 -2768 635 6942 5329 436 2538 7402 5118 -297 1793 6914 4071 -1232 413 3792
$$ packed form
1676A076j515M7K683J907j925j176K544J699k273j480K269J219l486l134K410
1691H65K257k133k713J992L126j617k523J423K374j644k958J493K897j018j996
1706a75J687K074j325j729K614K189j967j553K227J794k483k494J580P41l372
1721a92k985K589K400k996k674L180L687k158k276L439L064k563k798L127L215
1736F059k967l578J570K872l095l375K579L659k606k879L588L833k466l312K719
1751B601L446k983l547L103L131m503m557K978L883l870l765M273N177l181l934
1766a748M769M914l405n347L677N440l434n830K811M548l878n956K511N788k281
1781B579n347L403O307j613m893K102M864k284n415K090N121k843n303J645L379
$$ plain form
1796 3792 281 -4470 -1430 2739 -133 -3347 1055 5499 1904 -2733 1256 5860 1180 -3663 2000
1811 2000 7671 2423 -4445 184 5843 428 -7198 -2202 5932 2583 -4893 -516 7224 3619 -4825
1826 -4825 -2365 5210 3289 -3185 -143 6456 4082 -2616 -1105 3655 649 -4625 -1233 4680 1994
1841 1994 -2792 1116 5987 1031 -5043 65 6293 2339 -3184 2595 9636 4142 -3975 -419 6094
1856 6094 970 -6679 -2275 5816 2634 -5561 -2545 4049 -234 -8237 -5281 3014 1464 -4827 -884
1871 -884 5881 2288 -5767 -3726 2913 -436 -6808 -2519 5207 2194 -5518 -3145 2518 -1316 -8242
1886 -8242 -4521 3360 1261 -4596 -744 4869 532 -6426 -3556 2318 -1176 -6154 -1034 5567 831
1901 831 -5957 -2734 2751 -2863 -9275 -3769 4206 405 -6421 -1759 5637 373 -8169 -4465 3660
$$ packed form
1796C792l511m751L040M169k872l214M402M444l595m637L989M604m680m843N663
1811B000N671n248o868M629N659n415p626M996Q134l349p476M377P740l605q444
1826d825K460P575j921o474L042O599k374o698J511M760l006n274L392N913k686
1841A994m786L908M871m956o074N108O228l954n523N779P041n494q117L556O513
1856F094n124p649M404Q091l182q195L016O594m283q003K956Q295j550o291L943
1871h84O765l593q055K041O639l349o372M289P726l013p712K373N663l834o926
1886h242L721P881k099n857L852N613m337o958K870N874l494m978N120O601m736
1901H31o788L223N485n614o412N506P975l801o826M662P396n264q542L704Q125
$$ plain form
1916 3660 924 -5508 -1017 6572 3033 -5900 -4376 1438 -2237 -8660 -5714 2040 -353 -6345 -3466
1931 -3466 2558 -1346 -8345 -4357 2772 1268 -4181 -294 6153 2121 -6255 -5105 577 -2595 -9340
1946 -9340 -6653 453 -834 -6715 -5050 50 -2085 -7142 -4433 1645 1124 -2369 313 5199 1217
1961 1217 -4553 -2524 1085 -3571 -8165 -3388 2376 -1250 -6279 -2656 2392 -2594 -9087 -4649 2754
1976 2754 -198 -6307 -2195 4616 826 -7251 -5800 419 -1552 -7257 -4019 3792 2752 -3242 -2173
1991 -2173 2500 601 -5065 -4111 774 245 -3567 -2069 1562 -1029 -6356 -5817 -2101 -3548 -6111 -2125
2007 -2125 3091 1941 -2289 -133 2825 -606 -5464 -3298 1654 -169 -3405 -912 2760 -1067 -7112
2022 -7112 -5903 -1266 -2972 -6338 -2525 3516 2233 -2225 -1632 1779 -961 -6280 -4211 1851 2468
$$ packed form
1916C660k736o432M491P589l539q933J524N814l675o423K946P754k393n992K879
1931c466O024l904o999L988P129j504n449L887O447m032q376J150N682l172o745
1946i340K687P106j287n881J665N100k135n057K709O078n21l493K682M886l982
1961A217n770K029L609m656m594M777N764l626n029L623N048m986o493M438P403
1976B754k952o109M112O811l790q077J451O219j971n705L238P811j040n994J069
1991b173M673j899n666R54M885n29l812J498L631k591n327N39L716j447k563L986
2007b125N216j150m230K156K958l431m858K166M952j823l236K493L672l827o045
2022g112J209M637j706l366L813O041j283m458N93L411k740n319K069O062O17
$$ plain form
2037 2468 -639 686 3801 1094 -4124 -4333 -905 -1539 -3333 -983 3104 1734 -2420 -2972 -2154 -4688
2053 -4688 -7143 -3982 859 1040 -475 1819 3741 365 -4169 -2761 548 -336 -2314 953 4805
2068 4805 1940 -3768 -4634 -2830 -4985 -7839 -5124 957 2313 -205 282 1957 284 -3888 -4117 -319
2084 -319 955 469 1877 4006 1469 -2833 -4699 -4123 -5144 -5671 -2584 1321 1847 224 466 918 -1737
2101 -1737 -4857 -2763 929 2656 2416 4101 5029 2405 -1857 -3342 -2282 -2502 -2673 -289 2771 2410
2117 2410 -156 -1515 -1989 -4665 -6197 -3774 336 1375 1517 3029 3575 667 -3333 -3630 -1845 -1691
2133 -1691 -1958 716 3490 2316 -1493 -3237 -3367 -4948 -5471 -3569 638 2198 1891 2226 1779 -546
2149 -546 -3254 -2839 -1170 -142 628 2932 4369 2269 -976 -2517 -2659 -3473 -3687 -978 2240 2935 1688
$$ packed form
2037B468l107J325L115k707n218k09L428o34j794K350M087j370m154n52Q18k534
2053d688k455L161M841J81j515K294J922l376m534J408L309q84j978L267L852
2068D805k865n708q66J804k155k854K715O081J356k518M87J675j673m172k29L798
2084c19J274m86J408K129k537m302j866N76j021n27L087L905N26j623K42M52k655
2101a737l120K094L692J727k40J685R28k624m262j485J060k20j71K384L060l61
2117B410k566j359m74k676j532K423M110J039J42J512N46k908m000k97J785J54
2133a691k67K674K774j174l809j744j30j581n23J902M207J560l07L35m47k325
2149e46k708M15J669J028P70K304J437k100l245j541j42q14k14K709L218O95j247
$$ plain form
2166 1688 1063 605 -1447 -3753 -3284 -593 1235 2179 3369 4056 2275 207 -643 -739 -565 512 2911
$$ packed form
2166A688o25m58k052k306M69K691J828R44J190O87j781k068q50r6J74J077K399
$$ [...]
8191g4
##END NTUPLES=NMR FID
##END=
