##TITLE=1H ikalashn
AM_NV 170 OTOx1
18.11.2024
##JCAMPDX= 6.0         $$ Bruker NMR JCAMP-DX V2.0
##DATA TYPE= NMR FID
##DATA CLASS= NTUPLES
##ORIGIN= UXNMR, Bruker Analytische Messtechnik GmbH
##OWNER= root
$$ TOPSPIN		Version 1.3
$$ 2024-11-18 14:01:52.890 +0400  Irina@DPX200
$$ Compression mode = diff/dup
##.OBSERVE FREQUENCY= 200.131300845
##.OBSERVE NUCLEUS= ^1H
##.DELAY= (6, 6)
##.ACQUISITION MODE= SIMULTANEOUS
##.ACQUISITION SCHEME= undefined
##.AVERAGES= 8
##.DIGITISER RES= 18
##SPECTROMETER/DATA SYSTEM= spect
##.PULSE SEQUENCE= zg
##.SOLVENT NAME= CDCl3
##.SHIFT REFERENCE= INTERNAL, CDCl3, 1, 17.49637
##AUDIT TRAIL= $$ (NUMBER, WHEN, WHO, WHERE, WHAT)
$$ ##TITLE= Audit trail, TOPSPIN		Version 1.3
$$ ##JCAMPDX= 5.01
$$ ##ORIGIN= Bruker BioSpin GmbH
$$ ##OWNER= Irina
$$ $$ F:/spectra/data/iren/nmr/1H/4/audita.txt
$$ ##AUDIT TRAIL=  $$ (NUMBER, WHEN, WHO, WHERE, VERSION, WHAT)
(   1,<2024-11-18 14:01:39.375 +0400>,<Irina>,<DPX200>,<TOPSPIN 1.3>,
      <created by zg
	started at 2024-11-18 14:01:02.765 +0400,
	POWCHK disabled, PULCHK disabled
       terminated by command 'halt'
       configuration hash MD5:
       BE 6D 3F 07 2A EA 11 49 91 17 2B D3 AF B3 58 0D
       data hash MD5: 16K
       BE 8F CF BD 72 EA F2 00 E1 68 FD 4E B4 A9 3C C9>)
$$ ##END=
$$ 
$$ $$ hash MD5
$$ $$ 25 32 9A 60 CE 78 70 1A E9 14 9C F0 B7 4A D8 62
##$RELAX= 
##$RELAX= 
##$RELAX= 
##$RELAX= 
##$RELAX= 
##$RELAX= 
##$RELAX= 
##$RELAX= 
##$RELAX= 
$$ Bruker specific parameters
$$ --------------------------
##$DU= <F:/spectra>
##$EXPNO= 4
##$NAME= <1H>
##$PROCNO= 1
##$TYPE= <nmr>
##$USER= <iren>
##$AMP= (0..31)
100 100 100 100 100 100 100 100 100 100 100 100 100 100 100 100 100 100 
100 100 100 100 100 100 100 100 100 100 100 100 100 100 
##$ANAVPT= -1
##$AQSEQ= 0
##$AQ_mod= 1
##$AUNM= <au_zg>
##$AUTOPOS= <>
##$BF1= 200.13
##$BF2= 200.13
##$BF3= 200.13
##$BF4= 200.13
##$BF5= 200.13
##$BF6= 200.13
##$BF7= 200.13
##$BF8= 200.13
##$BYTORDA= 1
##$CFDGTYP= 0
##$CFRGTYP= 5
##$CHEMSTR= <none>
##$CNST= (0..63)
1 1 145 1 1 1 1 1 1 1 1 1 1 1 1 1 1 1 1 1 1 1 1 1 1 1 1 1 1 1 1 1 1 1 
1 1 1 1 1 1 1 1 1 1 1 1 1 1 1 1 1 1 1 1 1 1 1 1 1 1 1 1 1 1 
##$CPDPRG= <>
##$CPDPRG1= <>
##$CPDPRG2= <>
##$CPDPRG3= <>
##$CPDPRG4= <mlev>
##$CPDPRG5= <mlev>
##$CPDPRG6= <mlev>
##$CPDPRG7= <mlev>
##$CPDPRG8= <mlev>
##$CPDPRGB= <>
##$CPDPRGT= <>
##$D= (0..63)
0 2 0 0 0 0 0 0 0 0.06 0 0.03 0 0 0 0 0.0002 0 0 0 0 0 0 0 0 0 0 0 0 0 
0 0 0 0 0 0 0 0 0 0 0 0 0 0 0 0 0 0 0 0 0 0 0 0 0 0 0 0 0 0 0 0 0 0 
##$DATE= 1731924096
##$DBL= (0..7)
120 120 120 120 120 120 120 120 
##$DBP= (0..7)
150 150 150 150 150 150 150 150 
##$DBP07= 0
##$DBPNAM0= <>
##$DBPNAM1= <>
##$DBPNAM2= <>
##$DBPNAM3= <>
##$DBPNAM4= <>
##$DBPNAM5= <>
##$DBPNAM6= <>
##$DBPNAM7= <>
##$DBPOAL= (0..7)
0.5 0.5 0.5 0.5 0.5 0.5 0.5 0.5 
##$DBPOFFS= (0..7)
0 0 0 0 0 0 0 0 
##$DE= 6
##$DECBNUC= <off>
##$DECIM= 32
##$DECNUC= <off>
##$DECSTAT= 4
##$DIGMOD= 1
##$DIGTYP= 9
##$DL= (0..7)
0 120 120 120 120 120 120 120 
##$DP= (0..7)
$$ [...]
##$SW= 21.9926040160658
##$SWIBOX= (0..15)
0 0 2 0 0 0 0 0 0 0 0 0 0 0 0 0 
##$SW_h= 4401.40845070422
##$TD= 16384
##$TD0= 1
##$TE= 300
##$TE2= 300
##$TE3= 300
##$TEG= 300
##$TL= (0..7)
0 120 120 120 120 120 120 120 
##$TP= (0..7)
150 150 150 150 150 150 150 150 
##$TP07= 0
##$TPNAME0= <>
##$TPNAME1= <>
##$TPNAME2= <>
##$TPNAME3= <>
##$TPNAME4= <>
##$TPNAME5= <>
##$TPNAME6= <>
##$TPNAME7= <>
##$TPOAL= (0..7)
0.5 0.5 0.5 0.5 0.5 0.5 0.5 0.5 
##$TPOFFS= (0..7)
0 0 0 0 0 0 0 0 
##$TUNHIN= 0
##$TUNHOUT= 0
##$TUNXOUT= 0
##$USERA1= <user>
##$USERA2= <user>
##$USERA3= <user>
##$USERA4= <user>
##$USERA5= <user>
##$V9= 5
##$VALIST= <valist>
##$VCLIST= <CCCCCCCCCCCCCCC>
##$VD= 0
##$VDLIST= <DDDDDDDDDDDDDDD>
##$VPLIST= <PPPPPPPPPPPPPPP>
##$VTLIST= <TTTTTTTTTTTTTTT>
##$WBST= 1024
##$WBSW= 25
##$XGAIN= (0..3)
0 0 0 0 
##$XL= 0
##$YL= 0
##$YMAX_a= 742422
##$YMIN_a= -981294
##$ZGOPTNS= <>
##$ZL1= 120
##$ZL2= 120
##$ZL3= 120
##$ZL4= 120
##$ABSF1= 10
##$ABSF2= 0
##$ABSG= 5
##$ABSL= 3
##$ALPHA= 0
##$AQORDER= 0
##$ASSFAC= 0
##$ASSFACI= 0
##$ASSFACX= 0
##$ASSWID= 0
##$AUNMP= <proc_1d>
##$AXLEFT= 0
##$AXRIGHT= 0
##$AXTYPE= 0
##$AXUNIT= <>
##$AZFE= 0.1
##$AZFW= 0.1
##$BCFW= 1
##$BC_mod= 2
##$BYTORDP= 1
##$COROFFS= 0
##$CY= 7568.61572265625
##$DATMOD= 1
##$DC= 2
##$DFILT= <>
##$DTYPP= 0
##$F1P= 17.9538593292236
##$F2P= -4.03888763876832
##$FCOR= 0.5
##$FTSIZE= 32768
##$FT_mod= 4
##$GAMMA= 1
##$GB= 1
##$INTBC= 1
##$INTSCL= 1
##$ISEN= 128
##$LB= 0.02
##$LEV0= 0
##$LPBIN= 0
##$MAXI= 945.577
##$MC2= 0
##$MEAN= 0
##$ME_mod= 0
##$MI= -402.1523
##$NCOEF= 0
##$NC_proc= 0
##$NLEV= 6
##$NOISF1= 8.587773
##$NOISF2= 6.764455
##$NSP= 1
##$NTH_PI= 0
##$NZP= 0
##$OFFSET= 17.49637
##$PC= 1
##$PHC0= 321.6741
##$PHC1= 7.121206
##$PH_mod= 0
##$PKNL= yes
##$PPARMOD= 0
##$PPDIAG= 0
##$PPIPTYP= 0
##$PPMPNUM= 100
##$PPRESOL= 1
##$PSCAL= 0
##$PSIGN= 0
##$REVERSE= no
##$SF= 200.13
##$SI= 32768
##$SIGF1= 18.5376
##$SIGF2= -6.396296
##$SINO= 400
##$SIOLD= 32768
##$SREGLST= <1H.CDCl3>
##$SSB= 3
##$STSI= 0
##$STSR= 0
##$SW_p= 4401.40845070422
##$SYMM= 0
##$S_DEV= 0
##$TDeff= 0
##$TDoff= 0
##$TI= <>
##$TILT= no
##$TM1= 0
##$TM2= 0
##$TOPLEV= 0
##$USERP1= <user>
##$USERP2= <user>
##$USERP3= <user>
##$USERP4= <user>
##$USERP5= <user>
##$WDW= 1
##$XDIM= 8192
##$YMAX_p= 0
##$YMIN_p= 0
$$ End of Bruker specific parameters
$$ ---------------------------------
##NTUPLES= NMR FID
##VAR_NAME=  TIME,          FID/REAL,        FID/IMAG
##SYMBOL=    X,             R,               I
##VAR_TYPE=  INDEPENDENT,   DEPENDENT,       DEPENDENT
##VAR_FORM=  AFFN,          ASDF,            ASDF
##VAR_DIM=   8192,          8192,            8192
##UNITS=     SECONDS,       ARBITRARY UNITS, ARBITRARY UNITS
##FACTOR=    0.0002272,     1,               1
##FIRST=     0,             0,               0
##LAST=      1.8609952,     96,              -111
##MIN=       0,             -981294,         -981294
##MAX=       1.8609952,     742422,          742422
$$ Real data points
##PAGE= N=1
##DATA TABLE= (X++(R..R)), XYDATA
0@%%%%%%jRj6J6j7K5l3M1n6P2q8J05j30J62j94K27k68L17l74M39n12N93o83P88
$$ 0 0 0 0 0 0 0 -1 8 -8 8 -9 16 -17 24 -32 40 -48 57 -73 89 -105 122 -146 171 -203 236 -276 317 -366 422
30D22r02J027j172J331j503J693j905K140k393K672k979L312l676M076m514M990
$$ 422 -480 547 -625 706 -797 896 -1009 1131 -1262 1410 -1569 1743 -1933 2143 -2371 2619
46B619n508O077o701P383q132Q957r872J0889j2023J3298j4742J6390j8293K0524
$$ 2619 -2889 3188 -3513 3870 -4262 4695 -5177 5712 -6311 6987 -7755 8635 -9658 10866
60A0866k3179K6397l0396L5531m2400N2106o6987R2979j51422N17877k5541o60929
$$ 10866 -12313 14084 -16312 19219 -23181 28925 -38062 54917 -96505 421372 395831 -265098
72b65098N30539K33488l35250k28637N34869K12373n71420o41723J04360K68904
$$ -265098 265441 498929 163679 -64958 469911 682284 110864 -530859 -426499 -157595
82a57595n8401j36691J91451J47765j14701j49548Q0455J31289J29832J37113
$$ -157595 -215996 -352687 -161236 -13471 -128172 -277720 -197265 -65976 63856 200969
92B00969K3927k05721j07245J90304J89838q9481n8531J51290k9672m28422k77906
$$ 200969 224896 19175 -88070 102234 292072 202591 144060 295350 265678 -162744 -440650
103d40650K52847L40451k5481r7893J06283k9541l78325k42231K29296L10618
$$ -440650 -187803 152648 127167 29274 135557 106016 -272309 -514540 -285244 25374
113B5374M1490J7420J29486r3473l61329j18913K79993J98174p5471L9941K18093
$$ 25374 66864 84284 213770 120297 -241032 -359945 -79952 118222 42751 82692 300785
124C00785o7717l71525p9865L36394J60455k34518j38001J55837J2819k68139
$$ 300785 233068 -138457 -218322 118072 278527 44009 -93992 61845 74664 -193475
134a93475p8455K78889J68124j96061k19475o9K8770l5100R4858K28270J00548
$$ -193475 -271930 6959 175083 -20978 -240453 -240522 -211752 -246852 -151994 76276 176824
145A76824q9608j09846r9217j25772K0451K72300K36883o1739j55715k563k9890
$$ 176824 87216 -22630 -121847 -247619 -227168 45132 282015 220276 64561 61998 32108
156C2108k17881q8596K89671K99855r4720k48961k953R3173j22122j48227J47308
$$ 32108 -185773 -274369 15302 315157 220437 -28524 -31477 61696 -60426 -208653 -61345
167f1345K39109n9383k52895p7151R8624K9179l0244O9314R2083n6288j32829
$$ -61345 177764 118381 -134514 -211665 -113041 -83862 -114106 -44792 47291 -8997 -141826
178a41826l0366P5081J04230J35628J19249l4133j68733j06304J8278K0669J6418
$$ -141826 -172192 -97111 7119 142747 261996 227863 59130 -47174 -28896 -8227 8191
189H191J22157J31515r5665k73981j50502M7422M5132k038J01976J55360l0526
$$ 8191 130348 261863 166198 -107783 -258285 -210863 -165731 -167769 -65793 89567 59041
200E9041j97981q3472J09234J07211L8353Q8911J06051m9922j58311l6109J05485
$$ 59041 -138940 -222412 -113178 -5967 32386 121297 227348 177426 19115 -16994 88491
211H8491N7718k7250N225K155j31790j76635p251J33840O2738m1059j6557o055
$$ 88491 146209 118959 124184 126339 -5451 -182086 -189337 -55497 7241 -33818 -50375 -56430
223e6430j04941j20529N4525J98899J33944N419k1550k4910q1700p6000N3876
$$ -56430 -161371 -281900 -227375 -28476 105468 110887 89337 64427 -17273 -93273 -39397
234c9397J51561R7505j1922o6128r1565j06937n3435N0458Q8133L3411k4727n1224
$$ -39397 112164 209669 197747 131619 40054 -66883 -120318 -69860 18273 51684 26957 -24267
246b4267p8842p4016J4964J09739R3524N283l6885l3898m7206l5501N4343J28591
$$ -24267 -103109 -177125 -162161 -52422 41102 46385 9500 -24398 -71604 -107105 -52762 75829
258G5829P4812m0717q3783o1610m7821j6076P0284J20110M7291o5296r5975o4503
$$ 75829 150641 109924 26141 -35469 -83290 -99366 -29082 91028 138319 73023 -22952 -87455
270h7455l9889L349Q5175J12677K4634p8661q8082m3732j7545J9498Q7677R9766
$$ -87455 -127344 -123995 -38820 73857 98491 19830 -68252 -111984 -129529 -110031 -22354 77412
282G7412P414q3853p2411q473K3075M0978P4496O4437k3442r8469p3390L275M2772
$$ 77412 84826 973 -71438 -79911 -56836 -15858 58638 123075 99633 1164 -72226 -68951 -26179
295b6179M5027M3179J4201n6375j02937o3983K0360P0383O8471M0952m658o0002
$$ -26179 18848 62027 76228 19853 -83084 -147067 -126707 -56324 12147 53099 48441 -11561
307a1561q1179l6345M0638Q5996P4401K4385l4440p2712o7404j7995M3576P6282
$$ -11561 -92740 -129085 -88447 -2451 71950 96335 61895 -10817 -78221 -96216 -52640 23642
319B3642N8848K408n4264p1226m0269J2135N3603O4962L7772k0626p1636p1833
$$ 23642 82490 84898 30634 -40592 -80861 -68726 -15123 49839 87611 66985 -4651 -76484
331g6484k2077L2440N5700M6364J1892l8662p3685n4196J1449O7269P4781M4935
$$ -76484 -98561 -66121 -10421 35943 47835 9173 -64512 -118708 -107259 -39990 34791 79726
343G9726K360m0431o2132l5263K8326P2228N9220R624l7677o6022o9058l4559
$$ 79726 82086 41655 -20477 -55740 -27414 44814 104034 113658 75981 9959 -59099 -93658
355i3658K5916O4690M6612p184m8188n4624l3018Q508N7012P9548N0016j1349
$$ -93658 -67742 -3052 43560 36376 -11812 -66436 -99454 -90946 -33934 45614 95630 84281
367H4281n2946m8106j3046K5642N2268N2389J4708m3051p5229n4924l581L8282
$$ 84281 31335 -16771 -29817 -4175 48093 100482 115190 72139 -3090 -58014 -61595 -23313
379b3313N0857L6096q92m5292o4012l4125K3373O1228N5982K2198j7661m8839
$$ -23313 27544 63640 62748 17456 -46556 -80681 -57308 3920 59902 82100 64439 15600
391A5600n4869k1550L3691O4707M5635j398l8314n0110l8275k724M3648O4454
$$ 15600 -39269 -60819 -27128 37579 83214 81816 43502 -6608 -44883 -47607 -3959 60495
403F0495L5195j9708n3204m8643k2706J0916M3915N2773J7690l7964o2975m0753
$$ 60495 95690 75982 22778 -25865 -48571 -37655 6260 59033 76723 38759 -24216 -64969
415f4969l44L1678N0354M7589J0110m1172n7643k4250K2403M6090M5939K7613
$$ -64969 -65313 -33635 16719 64308 74418 33246 -24397 -48647 -26244 19846 65785 93398
427I3398j1817n4628o0564j9551K8195M4744L1972N256k9344n6117m6479K10M3754
$$ 93398 81581 26953 -33611 -53162 -24967 19777 51749 57005 27661 -28456 -74935 -74725 -30971
440c0971N1661K9283l367l4366m7118k4877K0628N0927M5137J4775k0633m6513
$$ -30971 20690 49973 46606 12240 -34878 -59755 -39127 11800 56937 71712 51079 4566
452D566m5094j0517L1881M6841K9126k224l3443n2009l7720Q777M7745M5942J6559
$$ 4566 -40528 -51045 -19164 27677 56803 54579 21136 -30873 -68593 -59816 -12071 33871 50430
465E0430j2441l5755m7863k6062K6301N8973M0546Q94k3427l6526m2331j6864
$$ 50430 37989 2234 -45629 -71691 -45390 13583 54129 55023 31596 -4930 -47261 -64125
477f4125L5513N9267K7403j6127l0739l1496l0959l612M4969N6717J2115l1057
$$ -64125 -28612 30655 58058 41931 11192 -20304 -51263 -54875 -9906 46811 58926 27869
489B7869l2036k0284j6158Q047M8783M7734p681m8605l5861j0569j473J9479N0951
$$ 27869 -4167 -24451 -40609 -32562 16221 63955 56274 7669 -28192 -38761 -40234 -20755 30196
502C0196L8662k0733n5575l2221P82J3486L2097N2107K6225l5121n9445k7960
$$ 30196 68858 48125 -7450 -39671 -38889 -25403 6694 58801 85026 49905 -9540 -37500
514c7500L629J3082K9957M4336R991m8729n6827j2230J7172J6733K7168L8776
$$ -37500 -33871 -20789 9168 53504 63495 14766 -42061 -54291 -37119 -20386 6782 45558
526D5558M850m7657m4587O809L3325K1765J6811J6206j4977m9980l3405J5745
$$ 45558 50408 2751 -41836 -35027 -1702 20063 36874 53080 38103 -11877 -45282 -29537
538b9537L6493K5793J5718j928l7602m8193o772L5430L4549K2612K2760m690n9440
$$ -29537 6956 32749 48467 46539 8937 -39256 -46028 -10598 23951 46563 69323 64633 5193
551E193o1775P150N1340K2527l233J5188M233n7857o7860J3948P1028L0559j6012
$$ 5193 -56582 -49432 1908 24435 21202 36390 40623 -17234 -85094 -71146 -118 30441 14429
564A4429K535J3678l2704m9350J5998O6007K5774k8930k3115o718k5740k4550
$$ 14429 16964 30642 -2062 -51412 -35414 30593 56367 27437 4322 -2396 -28136 -52686
576e2686K5715N0553R779k9434k2512j4059k0789N917N6500N3612m594l5074j9749
$$ -52686 -26971 23582 33361 3927 -18585 -32644 -53433 -47516 8984 62596 58002 22928 3179
589C179j8641k9199O069N8843M3313k2835m5924k1940j8243k3923J5618N9994
$$ 3179 -15462 -44661 -38592 20251 63564 40729 -5195 -27135 -45378 -69301 -53683 6311
601F311L3430k4542k7953r48r468j7301K7817N8555N610n3586k8165J6873m203
$$ 6311 39741 15199 -12754 -13702 -23170 -40471 -12654 45901 51511 -2075 -30240 -13367 -17570
614a7570k6948K2905N8993o812p6984l6020L9326L0051q597K1047N5213k23p1634
$$ -17570 -44518 -21613 37380 30568 -46416 -82436 -43110 -13059 -21656 -609 54604 54381 -17253
627a7253m5601K7498L9629J1778J4902K0138j9439n4598l2558N659J6632K5629
$$ -17253 -62854 -35356 4273 16051 30953 51091 31652 -22946 -55504 -49845 -33213 -7584
639g584L6636O421m4363l6870J4185J9477j1069Q239M8868R864o6512m7113M1011
$$ -7584 29052 35473 -8890 -45760 -31575 -12098 -23167 -14928 33940 43804 -22708 -69821 -28810
652b8810M9284j8551k4540L0400J5952n7658m6856M7177P2295L936k8265M829
$$ -28810 20474 1923 -22617 7783 23735 -33923 -80779 -33602 38693 42629 14364 19193
664A9193Q23m6789l3807L8852N8007Q573j7988q077k4718m9373j4116M4629M1180
$$ 19193 20016 -26773 -60580 -21728 36279 44852 26864 18787 -5931 -55304 -69420 -24791 16389
677A6389K57k922P912k1773m3224K457N1141K6629j7920r178Q550j8064l2382
$$ 16389 16646 13724 21636 -137 -43361 -40904 10237 36866 18946 9768 18318 254 -32128
690c2128J1798M2409M719l2082j3070L158j8204j0984M2066N0064j1615m2622
$$ -32128 -20330 22079 26798 -5284 -18354 -15196 -33400 -44384 -2318 47746 36131 -6491
702f491o888O385k5479r792N8884O0754k2814o1224j2353J2194k4215j8869N0326
$$ -6491 -13379 -6994 -32473 -42265 16619 77373 54559 -6665 -19018 -6824 -31039 -49908 418
715D18O3665j2396n6615j5848J5586q562j1527L2060L9814j0874l7700j0335P429
$$ 418 64083 51687 -4928 -20776 -5190 -13752 -25279 6781 46595 35721 -1979 -12314 -4885
728d885l512L165K2600L822l1639k1764J3065J2537k355J6637L0516j1850n2760
$$ -4885 -8397 -5232 17368 21190 -10449 -32213 -19148 -6611 -8966 7671 38187 26337 -26423
741b6423k1533L0464K5102K2J7847L1955j5885o2149l0734K6184K7204M741J6918
$$ -26423 -47956 -17492 7610 7632 25479 57434 41549 -20600 -51334 -25150 2054 6795 23713
754B3713K4584j7995n2775k2460K1008J7617L970J8884J8724k1039l8623j622
$$ 23713 48297 30302 -22473 -44933 -23925 -6308 -2338 16546 35270 14231 -24392 -26014
766b6014K5728N595p883J2360J1812k4526k9272J5487L5822L183j7999j416o75
$$ -26014 -286 5309 -2574 9786 21598 -2928 -32200 -16713 19109 22292 4293 2877 2202
779B202k7176k0013K7192M2918P774j6721r501j3742l0480j1249L4166M1334P339
$$ 2202 -24974 -44987 -17795 25123 32897 16176 6675 -7067 -37547 -48796 -14630 26704 34043
792C4043j1253p174j8502l3156p755L4295L3771J215r019j114j3125k6818l189
$$ 34043 22790 15616 -2886 -36042 -43797 -9502 24269 25484 16465 15351 2226 -24592 -27781
805b7781L0208K1872r178j3006m5o169j4025O234K5796P343k1035j7747k58j54
$$ -27781 2427 24299 15121 2115 2070 -4099 -18124 -11890 13906 21249 214 -17533 -17791 -17945
819a7945M54K0257K8365L53k7500k0420k058R29O977K6981K7784n248l1791k3754
$$ -17945 -17491 2766 31131 31484 3984 -16436 -18494 -17565 -10588 16393 44177 38929 7138 -16616
833a6616o798k078Q027K7024K3704p363k6166j4850j466K57R141K4286J6582j1229
$$ -16616 -23414 -25492 -17465 9559 33263 25900 -266 -15116 -16582 -16325 -7184 17102 33684 22455
847B2455k1041n267N117J124M470J3355L066j9476k0532J062J3501R137P239P710
$$ 22455 1414 -3853 1264 2388 6858 20213 23279 3803 -16729 -15667 -2166 6971 14210 21920
861B1920o012k2688j6364P550J9685J5633J0607L190j4853k7834j5742Q441J7944
$$ 21920 15908 -6780 -23144 -15594 4091 19724 30331 33521 18668 -9166 -24908 -16467 1477
874A477J3300R154K045j5063k5135j1276J1802J8810J1538N577k08j1945j7787
$$ 1477 14777 23931 25976 10913 -14222 -25498 -13696 5114 16652 22229 22021 10076 -7711
887g711n872J1524J5056N949l431r477j2842q444M315J3732J1612K800n807j2911
$$ -7711 -13583 -2059 12997 18946 15515 6038 -6804 -15248 -10933 2799 14411 17211 11404 -1507
901a507j3222j272J4973J8391P908l174r861j5308j5646k058J6754K0376O360
$$ -1507 -14729 -16001 -1028 17363 25271 22097 12236 -3072 -18718 -20776 -4022 16354 22714
914B2714q244j2881j2781r518K103J6674J9069N987q798j4094j0723l336O278
$$ 22714 14470 1589 -11192 -20710 -18607 -1933 17136 23123 14325 231 -10492 -13828 -7550
927g550J2789R708j252j0761j3006q287J211J1614J4168N363o878j2026q613j595
$$ -7550 5239 14947 13695 2934 -10072 -18359 -17148 -5534 8634 13997 7119 -4907 -13520 -15115
941a5115O601J3852J3448J713j2789j7120r421J969R793J2082Q379j686j2625
$$ -15115 -8514 5338 18786 20499 7710 -9410 -18831 -16862 -7069 5013 13392 11706 -919
954i19j5587p300N960J4629J3667N318m819j0969j0900m159O096J3318J0962k14
$$ -919 -16506 -23806 -17846 -3217 10450 15768 10949 -20 -10920 -15079 -8983 4335 15297 15083
968A5083j1192j3472p567J100Q212J1499P533l088j2259j1689k269P667J2349
$$ 15083 3891 -9581 -17148 -16048 -7836 3663 11196 8108 -4151 -15840 -18109 -10442 1907
981A907J0675L256o831j3274j0171k35R113J2137P992j379j1104j4059p385L620
$$ 1907 12582 15838 9007 -4267 -14438 -14673 -5560 6577 14569 13190 2086 -11973 -19358 -15738
995a5738J0874J1241N724l628j1683j1897k782Q221J2370Q863J633o356j1348
$$ -15738 -4864 6377 12101 8473 -3210 -15107 -17889 -9668 2702 11565 13198 6842 -4506
1008d506r030O69J0168J1574N453l083r627j1224n731M173J1070R887K680n803
$$ -4506 -13536 -12867 -2699 8875 14328 11245 1618 -9606 -15337 -11164 -94 9793 12473 6670
1022F670j1276j0003j257Q852J2208P510m29p190j0761p860J918J1230J1313L369
$$ 6670 -4606 -14609 -15866 -7014 5194 12704 12275 5085 -5676 -13536 -11618 -388 10925 14294
1036A4294m626q835r661n511M324J2033R589j26p386r093p381j656P633J2610
$$ 14294 9668 833 -8828 -14339 -10015 2018 11607 11481 4095 -4998 -12379 -14035 -6402 6208
1050F208O998l796r257q396m922J459R874J2066L410p373r868n969j790L883J0682
$$ 6208 13206 9410 153 -8243 -13165 -11706 -1832 10234 13644 6271 -3597 -9566 -11356 -7473 3209
1065C209J0688N3j0321j0213m023N62M873R604P662l549j2242r377j047M061P014
$$ 3209 13897 13950 3629 -6584 -10607 -10045 -5172 4432 12094 8545 -3697 -13074 -14121 -10060 -3046
1080c046R255N253n458j1531o286K358O304P456P192Q44r248j1829m190L835O221
$$ -3046 6209 11462 6004 -5527 -11813 -9455 -3151 4305 11497 12341 3093 -8736 -12926 -9091 -2870
1095b870O524N248k262j1095r950M35P497P215O077M068m335j2354q452L620Q875
$$ -2870 3654 8902 6640 -4455 -14405 -13970 -6473 742 6819 10887 6552 -5802 -14254 -10634 -1759
1110a759N582K913Q20o515j2545o046O860J0370M852J411k59o354j0450k412R454
$$ -1759 3823 6736 7556 1041 -11504 -17550 -10690 -320 4532 5943 5684 -670 -11120 -13532 -4078
1125d078J0081K279j942l273p824r311K16J0461Q506k08l659l943o508n017N418
$$ -4078 6003 8282 6340 3067 -4757 -14068 -13852 -3391 5115 4907 1248 -2695 -9203 -14220 -8802
1140h802J2931P598j827m617m611o894l752P052J1761L030o392o567n206o904
$$ -8802 4129 11727 9900 5283 672 -6222 -9974 -2922 8839 11869 5477 -1090 -6296 -13200
1154a3200k413R330J2666J796p346n023j458l048K30J0179J1479p31r714n933
$$ -13200 -15613 -6283 6383 8179 833 -4190 -5648 -8696 -8466 1713 13192 12461 2747 -3186
1168c186o17j147J058P892P061l854j0345n132J051K442M932Q403L656o663r287
$$ -3186 -3803 -4950 -3892 4000 11061 7207 -3138 -8270 -7219 -4777 155 8558 12214 5551 -3736
1183c736k924J553K807O619Q430n29j1086r411j28K838K143O970R502p13j2248
$$ -3736 -6660 -5107 -2300 4319 12749 12220 1134 -8277 -8405 -5567 -3424 3546 13048 12335 87
1198H7q180L362N287J351M289P260k012j2527p886M033N761O03J325L283l358
$$ 87 -8093 -4731 556 1907 6196 13456 11444 -1083 -8969 -4936 825 1428 2753 6036 2678
1213B678r874l530P237P554J883J051P68n350q188K52R209O931L67r86k502q458
$$ 2678 -7196 -10726 -3489 4065 5948 6999 7767 2417 -5771 -5519 3690 10621 10988 10002 7500 -958
1229i58q648J941J0014O063l86j244l215q566o766M228J0012M414j012n63k778
$$ -958 -9606 -7665 2349 8412 8026 6782 3567 -4999 -11765 -7537 2475 6889 5877 5314 2536
1244B536q067m575O454R078Q39l385lq02o150k378Q446Q849k337p304j717J31
$$ 2536 -5531 -10106 -3652 5426 6265 2880 2877 2075 -4075 -6453 1993 10842 8505 1201 -516 -385
1260c85l843p96Q283P530m048r594m254l52p53L029R184O158l672p364l649j406
$$ -385 -4228 -5024 3259 10789 6741 -2853 -7107 -7459 -8212 -5183 4001 10159 6487 -877 -4526 -5932
1276e932R0N954R574K963o089n929j741k432k379M703Q670K33q618n216J932P36
$$ -5932 -5842 112 9686 12649 6560 631 -1110 -3542 -5921 -1218 7452 7685 -933 -6149 -4217 -3481
1292c481j811L389P239n27q705m132M384M370R10K939L890l442q958l418M430
$$ -3481 -5292 -1903 5336 4809 -3896 -8028 -3644 726 1636 4575 8465 5023 -3935 -7353 -2923
1307b923M570K332L571J559o584r693k068N084L728K036M221J821o777r050n33
$$ -2923 1647 3979 7550 9109 2525 -7168 -9236 -4152 -424 1612 5833 7654 877 -8173 -8706
1322h706N942L464R87K953J331n497o414J102N667K454j77Q30j106n246k912M357
$$ -8706 -2764 700 1687 4640 5971 474 -5940 -4838 829 3283 3106 3936 2830 -2416 -5328 -971
1338i71N551O28j161r1l130o552j062P256O517p81k817r42l712o928j020Q160
$$ -971 4580 5208 4047 3956 826 -5726 -6788 468 6985 6204 3387 2445 -1267 -8195 -9215 -1055
1354a055P461m20l171j084k751m968j0P315O140n86k893j290k686l595J154N564
$$ -1055 6406 5986 2815 1731 -1020 -5988 -5998 1317 7457 6871 3978 2688 2 -3593 -2439 3125
1370C125K385l186l202q58j685j701L152N914P71m770l390K10K37P90M933N788
$$ 3125 5510 2324 -878 -1736 -3421 -5122 -1970 3944 4715 -55 -3445 -3235 -2998 -2208 2725 8513
1386H513m10n814m433r08RJ825N420M372k050n893l572j040p73J668N656L824
$$ 8513 8103 2289 -2144 -3052 -3043 -1218 4202 8574 6524 631 -2941 -3981 -4754 -3086 2570 6394
1402F394l122n412j419P99o49Q25M499K844l560m981J29L077J487O97K334N28
$$ 6394 3272 -2140 -3559 -2760 -3409 -2584 1915 4759 1199 -3782 -3653 -576 911 1608 3942 4470
1418D470m209m398N65L560K478J304N49k491n651l799J106L464K786K591J440
$$ 4470 261 -4137 -3572 -12 2466 3770 4319 1828 -3823 -7622 -6516 -3052 -266 2325 3765
1433C765k701n474k607K563L894K556K160J329k322n027k277K062K624Q77K12
$$ 3765 1064 -4410 -7017 -4454 -560 1996 4156 5485 3163 -1864 -4141 -2079 545 1422 1634
1448A634l83k679l291m4K857K123P0l08q25k596j784K406M715K026j271j715j862
$$ 1634 1251 -1428 -4719 -4763 -1906 217 287 -21 -846 -3442 -5226 -2820 1895 3921 2650 935 -927
1465i27l179j932K698N398K534j696k797k426k391j022K530M651K684q27k608
$$ -927 -4106 -6038 -3340 2058 4592 2896 99 -2327 -4718 -5740 -3210 1441 4125 3298 690
1480F90k824k058L7K317K596P54p51j526k080j481J207L321J914j173j852o56
$$ 690 -2134 -4192 -4155 -1838 758 1512 761 -765 -2845 -4326 -3119 202 2116 943 -909 -1565
1496a565l17j41J775L395J359k520l778j714K05J148K230K815Q54k571l901k320
$$ -1565 -1882 -2023 -248 3147 4506 1986 -1792 -3506 -3301 -2153 77 2892 3746 1175 -2726 -5046
1512e046K01K012L334K829L62k357k942j734o8J634L136K424n22k725k156l18
$$ -5046 -4845 -2833 501 3330 3692 1335 -1607 -3341 -3409 -1775 1361 3785 3263 538 -1618 -1936
1528a936N93J147J776J201j125k716j716O34J822J582P20n27k053k455r22J330
$$ -1936 -1343 -196 1580 2781 1656 -1060 -2776 -2142 -320 1262 1982 1455 -598 -3053 -3975 -2645
1544b645K641K643R48j428k984k360J25J968K557K378R19j681l621k723J79K080
$$ -2645 -4 2639 3587 2159 -825 -3185 -3060 -1092 1465 3843 4762 3081 -540 -3263 -3084 -1004
1560a004K060J314J57j558k869k006N72K301K050Q46n10j649j662l32J525K197
$$ -1004 1056 2370 2527 969 -1900 -3906 -3334 -1033 1017 1863 1353 -296 -1958 -2290 -765 1432
1576A432J476Mj498k358j508P16K285K004L76j097k176k537j333J170K993K273
$$ 1432 2908 2912 1414 -944 -2452 -1736 549 2553 2929 1832 -344 -2881 -4214 -3044 -51 2222
1592B222J23j479k143j957n82J746L018K242O2j683k246j687J48J882K233R35
$$ 2222 2345 866 -1277 -3234 -3816 -2070 948 3190 3252 1569 -677 -2364 -2216 -334 1899 2834
1608B834p69j808k069j232P36K332J804j46j498j590j170l72J550K602J659q84
$$ 2834 2065 257 -1812 -3044 -2308 24 1828 1682 184 -1406 -2576 -2948 -1398 1204 2863 1979
1624A979k216j822p78L89J909K545J030j396k508j753m78J109K365K250L23j763
$$ 1979 -237 -2059 -2837 -2448 -539 2006 3036 1640 -868 -2621 -3099 -1990 375 2625 2948 1185
1640A185k227j297j43J198K285J752n01k389k001n19N65J418K140J380j035k490
$$ 1185 -1042 -2339 -2482 -1284 1001 2753 2252 -137 -2138 -2657 -2092 -674 1466 2846 1811 -679
1656f79j503L39J292J628J634M22j798k768j277P53J463J570J280k29k275k542
$$ -679 -2182 -1843 -551 1077 2711 3133 1335 -1433 -2710 -1957 -494 1076 2356 2127 -148 -2690
1672b690l83J421J828J573J066n35k551k200J90J841J621J075L90j216k678j575
$$ -2690 -3073 -1652 176 1749 2815 2280 -271 -2471 -2281 -440 1181 2256 2646 1430 -1248 -2823
1688b823R12K250J493O79pj526k308q75J697K193R73L2n74k048k537l93K214K235
$$ -2823 -1911 339 1832 2511 2504 978 -1330 -2205 -508 1685 2658 2690 2116 68 -2469 -2862 -648 1587
1706A587M16l34p75j877j832N53K978K358J33q80r26j847j396Q91K711J499p08
$$ 1587 2003 1669 894 -983 -2815 -2262 716 3074 3207 2327 1401 -446 -1842 -951 1760 3259 2551
1723B551j451j376j616q61J598K806J192j097j278r78j134j7K393K814L09j801
$$ 2551 1100 -276 -1892 -2753 -1155 1651 2843 1746 468 -510 -1644 -1661 732 3546 3855 2054
1739B054j559j046r79J33K487K378o13k422j587n01m09P15K712K123r89k558j334
$$ 2054 495 -551 -1530 -1397 1090 3468 2855 433 -1154 -1655 -2064 -1349 1363 3486 2497 -61 -1395
1756a395p2L7J142K587J310j741k691r19L01N23J542K353N14k352k374l08P21
$$ -1395 -1467 -1430 -288 2299 3609 1868 -823 -1742 -1441 -918 624 2977 3491 1139 -1235 -1543 -822
1773h22O88J588J887l89l067k275L26J139P39J490J631r34l206j795J156J714
$$ -822 -134 1454 3341 2952 -115 -2390 -2064 -925 -186 1304 2935 2001 -1205 -3000 -1844 -130
1789a30R63J241J116j453l384j392J483J812P38O79L20j869l038o68K139J950
$$ -130 833 2074 3190 1737 -1647 -3039 -1556 256 994 1673 1993 124 -2914 -3582 -1443 507
1805E07O50N68l3k016k406L05K531J740J69o9p57k412j993J037K748J276l67l76
$$ 507 1157 1725 1692 -324 -2730 -2425 106 1846 2015 1946 1189 -1223 -3216 -2179 569 1845 1478 1102
1823A102j147k413j226K123L086Q30p27n26j268k394o88K629L030J90j352q63
$$ 1102 -45 -2458 -3684 -1561 1525 2355 1628 1102 -166 -2560 -3248 -619 2411 2601 1249 386
1839C86j167k070l47K815K809j99j884j000p44j133M86K811K103q35j962j070
$$ 386 -781 -2851 -3198 -383 2426 2227 343 -657 -1401 -2534 -2048 763 2866 2031 69 -1001
1855a001n65k98J366K769J021j782k148r05n11L0K110K909K52k734k313l88m9
$$ -1001 -1566 -1864 -498 2271 3292 1510 -638 -1543 -2054 -2024 86 2995 3247 513 -1800 -2188 -2237
1872b237L57K360L035n4l095k256j5M89O05K055K323n17l024k057L35Q13P66J713
$$ -2237 -1880 480 3515 3461 366 -1890 -1905 -1416 -811 1244 3567 3050 26 -2031 -1696 -883 -117 1596
1890A596J274j364k725r98J061J155R99J491L35k368k869q5J968J450Q21J077
$$ 1596 2870 1506 -1219 -2217 -1156 -1 998 2489 2824 456 -2413 -2498 -530 920 1741 2818
1906B818m57l098k973M29K689J922R12O90r01l061k536O79K676J903Q43K76j363
$$ 2818 2361 -737 -3710 -3281 -592 1330 2242 2932 2031 -1030 -3566 -2887 -211 1692 2535 2811 1448
1923A448l007j786J283K259J089K74J38j499k469o40K283K220N4p27m96j353j974
$$ 1448 -1559 -3345 -2062 197 1286 1560 1698 199 -2270 -2910 -627 1593 1647 920 424 -929 -2903
1940b903L29L023K340n98j748j235j506j244J261L641K419q03k158j847j846r94
$$ -2903 -2574 449 2789 2191 443 -792 -2298 -3542 -2281 1360 3779 2976 818 -1029 -2875 -3869
1956c869J715L536J822j101k161j843j624o20K001L210J269j298j620q09o77J79
$$ -3869 -2154 1382 3204 2103 -58 -1901 -3525 -4145 -2144 1066 2335 1037 -583 -1392 -2069 -1890
1972a890K023K320q6k068j731l88R4Q63J893J122j631k889j521K74J121K059K724
$$ -1890 133 2453 2367 299 -1432 -1820 -1726 -863 1030 2152 521 -2368 -3889 -3615 -2494 -435 2289
1989B289Q91k394l313j157Q26J384K301K823O12l061l736j130R50J215J650K201
$$ 2289 3180 786 -2527 -3684 -2858 -1474 827 3650 4262 1201 -2535 -3665 -2715 -1500 150 2351
2005B351N02k702l092m82J596J414J062R37l37k154j902M03J922J523M99n08j714
$$ 2351 2853 151 -2941 -3423 -1827 -413 649 1586 1249 -905 -2807 -2404 -482 1041 1540 1032 -682
2022f82k128n50J789K471J615L61j212k810k650J95K729K739J113J9j501l270
$$ -682 -2810 -3360 -1571 900 2515 2876 1664 -1146 -3796 -3601 -872 1867 2980 2999 1498 -1772
2038a772k830L60L137K718Q09l16j125k384k062P02L047K257M3j089j241j571
$$ -1772 -4602 -4242 -1105 1613 2422 2106 981 -1403 -3465 -2763 284 2541 2584 1495 254 -1317
2054a317r25J218K364J107j061j831j507q19N54K423K528K48j917k273j563l80
$$ -1317 -2242 -1024 1340 2447 1386 -445 -1952 -2771 -2217 206 2734 2982 1065 -1208 -2771 -3151
2070c151J493L212K433l81k532k697j558j64J807L277K145o70k456k243j011K48
$$ -3151 -1658 1554 3987 3606 1074 -1623 -3181 -3345 -1538 1739 3884 3214 758 -1485 -2496 -2248
2086b248K032K701J237j427k357j398k90O74J766J912j55k432k268l92J114J654
$$ -2248 -216 2485 3722 2295 -62 -1460 -1750 -1076 690 2602 2447 15 -2253 -2645 -1531 123
2102A23J856J203r98l002k305L04K109K460J805M58j911l360k149L17K164K653
$$ 123 1979 3182 2184 -818 -3123 -2819 -710 1750 3555 4013 2102 -1258 -3407 -3090 -926 1727
2118A727J701j28k371l086j417Q71K024K180J357m27k404k344k33J781J909J213
$$ 1727 3428 3300 929 -2157 -3574 -2703 -679 1501 2858 2431 27 -2317 -2550 -769 1140 2353
2134B353K90j206k348j608P68K495J930L08j094k209k429r72J690L002K041J7
$$ 2353 2643 1437 -911 -2519 -1751 744 2674 2982 1888 -321 -2750 -3722 -2032 970 3011 3028
2150C028j765k750k339j43K504L255J774k52j790k686k010L95K594K707Q17j000
$$ 3028 1263 -1487 -3826 -3969 -1465 1790 3564 3312 1522 -1164 -3174 -2779 -185 2522 3339 2339
2166B339j921k114j243Q87K497J847k80j768j904j205J73J991K574J039j247k343
$$ 2339 418 -1696 -2939 -2052 445 2292 2012 244 -1660 -2865 -2692 -701 1873 2912 1665 -678
2182f78j862n10J276K988K586K18k027k758j869k84J692L222K280l89k704k806
$$ -678 -2540 -3050 -1774 1214 3800 4018 1991 -767 -2636 -2920 -1228 1994 4274 3885 1181 -1625
2198a625j518R0J849K963J773q02k632k073n44R55K183K258P24j640k379j284
$$ -1625 -3143 -3053 -1204 1759 3532 2730 98 -1975 -2519 -1564 619 2877 3601 1961 -418 -1702
2214a702L49J541K089J301r02k666k431l50J241K138K240R28j663l294k126M85
$$ -1702 -1353 188 2277 3578 2676 10 -2421 -2771 -1530 608 2848 3776 2113 -1181 -3307 -2822
2230b822K238K608K036K77k161l487j906R64K368K313J396l19k499k979r00J483
$$ -2822 -584 2024 4060 4337 2176 -1311 -3217 -2253 115 2428 3824 3505 1006 -1973 -2873 -1390
2246a390K392J857P20r72k592k128K57K073K022Q25l96j876k819j449J408K819
$$ -1390 1002 2859 3579 2607 15 -2113 -1856 217 2239 3064 2668 792 -2027 -3476 -2068 751
2262G51J839J16j079k258k483m56K455L380J659m07j771k593k252J82K782K909
$$ 751 2590 2706 1627 -631 -3114 -3570 -1115 2265 3924 3517 1746 -847 -3099 -2917 -135 2774
2278B774Q94j047k060k578j773R57L099K359qj497j885j936q03J747L273J594
$$ 2774 3668 2621 561 -2017 -3790 -2833 266 2625 2617 1120 -765 -2701 -3504 -1757 1516 3110
2294C110j192k143j609j151Q4K407L156P93k150k521j441n00Q87K871K748k80
$$ 3110 1918 -225 -1834 -2985 -2901 -494 2662 3455 1305 -1216 -2657 -3157 -2270 601 3349 3069
2310C069k731k708j176l0J604L181K172j083l029k118l13O77K079L035J353j868
$$ 3069 338 -2370 -3546 -3576 -1972 1209 3381 2298 -731 -2849 -3162 -2485 -406 2629 3982 2114
2326B114l188j494K93J031J919K239J92k923l206p31J072J480K056J840q13l254
$$ 2114 -1074 -2568 -2275 -1244 675 2914 3106 183 -3023 -3754 -2682 -1202 854 2694 1881 -1373
2342a373k502L73J893J955J908J175j690l658k030J186K253J606J376M10k305
$$ -1373 -3875 -3502 -1609 346 2254 3429 1739 -1919 -3949 -2763 -510 1096 2472 2882 577
2357E77l621j134K011K613J467Q62k16k556l142j78K772K506P89Kj038k937k638
$$ 577 -3044 -4178 -2167 446 1913 2775 2559 3 -3139 -3317 -545 1961 2750 2752 1714 -1223 -3861
2374c861Q87L209K072L8o03j577k825j704J926L573J668n56j050j875k512p29
$$ -3861 -2974 235 2307 2345 1742 165 -2660 -4364 -2438 1135 2803 2247 1197 -678 -3190 -3919
2390c919K746L507R76j184j480j982k132K08L337L044p2j864j601j726j473J022
$$ -3919 -1173 2334 3310 2126 646 -1336 -3468 -3260 77 3121 3049 1185 -416 -2142 -3615 -2593
2406b593L718K483j121k378j452j085p24J859L763J723j972k773j362o10Q0K264
$$ -2593 1125 3608 2487 109 -1343 -2428 -3152 -1293 2470 4193 2221 -552 -1914 -2524 -2444 -180
2422a80L409N61k921k862r41o2Q11K690K953n10l344k473k30N61J372K736K122
$$ -180 3229 3790 869 -1993 -2934 -2996 -2185 505 3458 2948 -396 -2869 -3099 -2538 -1166 1570 3692
2439C692j406l633j938M41J033J583K642J278k406l630j093J311J489J591K163
$$ 3692 2286 -1347 -3285 -2844 -1811 -228 2414 3692 1286 -2344 -3437 -2126 -637 954 3117
2454C117K70l209l501j29K032J556J274J414o64l677l022P57K695J839J009P04
$$ 3117 3387 178 -3323 -3452 -1420 136 1410 2824 2160 -1517 -4539 -3782 -1087 752 1761 2465
2470B465j280l621k133J619L073J812O34o7k103l415j138K337K865J135J58o77
$$ 2465 1185 -2436 -4569 -2950 123 1935 2569 2502 399 -3016 -4154 -1817 1048 2183 2341 1664
2486A664k600k961L3L054K506K41m66r39k564k440J082L678K349o01j236j189
$$ 1664 -936 -3897 -3864 -810 1696 1937 1471 532 -2032 -4472 -3390 288 2637 2036 800 -389
2502c89k130j352J946L997J860j273j917j668j830n13K505L554P94j899k264j772
$$ -389 -2519 -3871 -1925 2072 3932 2659 742 -926 -2756 -3269 -764 2790 3584 1685 -579 -2351
2518b351j526L50L152L182M5k212j756j107p88J190L531K422j079k675j600n90
$$ -2351 -3877 -3527 -375 2807 2852 640 -1116 -2223 -3011 -1821 1710 4132 3053 378 -1222 -1812
2534a812j06J616L054J229k218l108j173J56P39K235K854L19l043l092n31Q61
$$ -1812 -1918 -302 2752 3981 1763 -1345 -2518 -2362 -1623 612 3466 3785 742 -2350 -2881 -2020
2550b020J366K419K376m51l524k991r1J440J839K261J673j018l307k286M07J830
$$ -2020 -654 1765 4141 3690 166 -2825 -2916 -1476 363 2624 4297 3279 -28 -2314 -1907 -77
2566g7J865J720M93k023l099j221J078J594J417J187n36k836k705K55K488K047
$$ -77 1788 3508 4001 1978 -1121 -2342 -1264 330 1747 2934 2398 -438 -3143 -2888 -400 1647
2582A647J050P26r74l238k461J209L434K271L87m17j724l336k225J299L499K200
$$ 1647 2697 3423 2449 -789 -3250 -2041 1393 3664 4051 3634 1910 -1426 -3651 -2352 1147 3347
2598C347N5j064k160k721j233J771L034J650m9j148k130j989J05K490K475M55
$$ 3347 3402 2338 178 -2543 -3776 -2005 1029 2679 2630 1482 -648 -2637 -2532 -42 2433 2888
2614B888r65j380j632j115J228K984J894p68k158k047j455k34K036L180J332j536
$$ 2888 1923 543 -1089 -2204 -976 2008 3902 3134 976 -1071 -2526 -2760 -724 2456 3788 2252
2630B252k756k370j298N57L024L575J006j808k485j869r61P81L039L104L13k423
$$ 2252 -504 -2874 -4172 -3615 -591 2984 3990 2182 -303 -2172 -3133 -2352 687 3791 4104 1681
2646A681k500j196k77O70K121J913n19k580k041k09J098J575J696O31j491k491
$$ 1681 -819 -2015 -2292 -1622 499 2412 1893 -687 -2728 -2937 -1839 -264 1432 2063 572 -1919
2662a919j341P34K021K509J550o43k889k831o96J350K388K589J587j047l529l053
$$ -1919 -3260 -2526 -505 2004 3554 2911 22 -2809 -3505 -2155 233 2822 4409 3362 -167 -3220
2678c220m08J778K391K056J132j184l158k644l3J824K127J350J49j449k217j102
$$ -3220 -3628 -1850 541 2597 3729 2545 -613 -3257 -3290 -1466 661 2011 2160 711 -1506 -2608
2694b608R46J927J541N83q87k010j761L39K234K163O72o79j842k537j719J016
$$ -2608 -1662 265 1806 2389 1502 -508 -2269 -1930 304 2467 3139 2460 618 -1919 -3638 -2622
2710b622L123K683L15j511k380k521j230J378L406K813M56j649k584k119m70J731
$$ -2622 501 3184 3499 1988 -392 -2913 -4143 -2765 641 3454 3910 2261 -323 -2442 -2912 -1181
2726a181K760J864p7j543k176j598J86J935J992L40j311j741j418m79J052K287
$$ -1181 1579 3443 3366 1823 -353 -1951 -1765 170 2162 2502 1191 -550 -1968 -2447 -1395 892
2742H92J628p54k339j921n71Q75K165K761J188j287k854k305m76J413K748K468
$$ 892 2520 1766 -573 -2494 -3065 -2190 -25 2736 3924 2637 -217 -2522 -2998 -1585 1163 3631
2758C631N08j981k978k260m16J354K566K168j7k146k485j113L59J547K130J463
$$ 3631 4139 2158 -820 -3080 -3496 -2142 424 2592 2575 429 -2056 -3169 -2810 -1263 867 2330
2774B330o44k209j728J2J372J767J327P6j621k467j197P80K125J991Q10j011k558
$$ 2330 1686 -523 -2251 -2239 -867 900 2227 2303 682 -1785 -2982 -2202 -77 1914 2724 1713 -845
2791h45k523o54J570K542K166N78j368k900k249l7K052K511J750K55j659k630
$$ -845 -3368 -4022 -2452 90 2256 2834 1466 -1434 -3683 -3720 -1668 843 2593 2848 1189 -1441
2807a441j770N67K088J974P93n84j787k215p86J234K194J400j88j346k022j442
$$ -1441 -3211 -2644 -556 1418 2211 1627 -160 -2375 -3161 -1927 267 1667 1479 133 -1889 -3331
2823c331L49K129K313Q43r50k051k020r54J275K733K217L04j471k246j954m27
$$ -3331 -2982 -853 1460 2303 1353 -698 -2718 -3672 -2397 336 2553 2857 1386 -860 -2814 -3241
2839c241J668K849J813l38j898k194j474o9J828K409R42j022j995j748o99Q25
$$ -3241 -1573 1276 3089 2751 853 -1341 -2815 -2884 -1056 1353 2295 1273 -722 -2470 -3169 -2344
2855b344K124J951J97j594j884j046K65J661K360J409q16k241k027n91P61J966
$$ -2344 -220 1731 1928 334 -1550 -2596 -2331 -670 1690 3099 2283 42 -1985 -2576 -1815 151
2871A51K212Q13j637k688j819j52J259K204J957K54j767k509j175N65J601K115
$$ 151 2363 3176 1539 -1149 -2968 -3120 -1861 343 2300 2554 787 -1722 -2897 -2332 -731 1384
2887A384J410l50k073k051k84J053J690J618N69j281k519j602L54J672J582J016
$$ 1384 2794 2444 371 -1680 -1964 -911 779 2397 2966 1685 -834 -2436 -2082 -410 1172 2188
2903B188k64j921k466r75J173K193J830O58p35k069k105j60J760K365J529K38
$$ 2188 1924 3 -2463 -3438 -2265 -72 1758 2416 1681 -388 -2493 -2653 -893 1472 3001 3239
2919C239j180k429j707K93J947J803P17l78j610k312j163J013K246J376L5q78
$$ 3239 2059 -370 -2077 -1784 163 1966 2683 2305 695 -1617 -2780 -1767 479 1855 1890 1012
2935A012j597j749l71J869K447R70o80j405j722j226M40K301K297M32j331j853
$$ 1012 -585 -2334 -2705 -836 1611 2581 1901 496 -1226 -2452 -2012 289 2586 3018 1687 -166
2951a66j620p23J009K457J851k62j759j807j304k41J469K371J260q66j837j548
$$ -166 -1786 -2509 -1500 957 2808 2546 787 -1020 -2324 -2565 -1096 1275 2535 1669 -168 -1716
2967a716o95M66J847K249N08j470j856j040j26R47K080J688l43k145j916o17M35
$$ -1716 -2411 -1945 -98 2151 2659 1189 -667 -1707 -1833 -886 1194 2882 2539 394 -1522 -2139 -1704
2984a704J254K021J195j105k572j629oR89J545J840P48j546k479j187O28J360
$$ -1704 -450 1571 2766 1661 -911 -2540 -2546 -1557 -12 1828 2576 1030 -1449 -2636 -2008 -648
3000f48J789J432M2j920k161n13J081J551J378Q38p38k323j916J15J462J436R14
$$ -648 1141 2573 2615 695 -1466 -1979 -898 653 2031 2869 2131 -192 -2108 -1993 -531 905 1819
3017A819K47j295k448j304R24K042J421O92j87j609k145n85J569K206J222J48
$$ 1819 2066 771 -1677 -2981 -2057 -15 1406 2098 1911 302 -1843 -2428 -859 1347 2569 2717
3033B717q41j871j860m2J917J822O57m45j100j939j456P35K198J629O7p57j255
$$ 2717 1876 5 -1855 -1897 20 1842 2499 2054 954 -985 -2441 -1706 492 2121 2188 1431 176
3050A76j658p19J402K481J182n91j157j306j262j31J803K313N74j140j568j346
$$ 176 -1482 -2201 -799 1682 2864 2273 1116 -190 -1452 -1583 220 2533 3107 1967 399 -947
3066i47r08M30K031J913q4j612j556j066m28R95K256J528o10j802j297m88J93
$$ -947 -1855 -1425 606 2519 2435 823 -733 -1799 -2227 -1232 1024 2552 1942 140 -1157 -1645 -1452
3083a452J365K126Q66j269j944r88j89N76J531J708P1j768j935n53L32R83J634
$$ -1452 -87 2039 2905 1636 -308 -1296 -1485 -909 622 2330 2401 633 -1302 -1855 -1523 -540 1094
3100A094J395n75k149j660RP97J134J513Q43j131k403j284M51J210J265J255L07
$$ 1094 2489 1914 -235 -1895 -1886 -1089 45 1558 2401 1270 -1133 -2417 -1966 -756 509 1764 2071
3117B071j528k134p74R31J439J172P54k90j854j955j88J229J387P93L09p75j944
$$ 2071 543 -1591 -2365 -1434 5 1177 1931 1641 -213 -2168 -2356 -1127 260 1053 1362 587 -1357
3134a357j437N19J814J282M97j28j045j739q30J174J949J062k6o34j459j641k97
$$ -1357 -2794 -2275 -461 821 1318 1190 145 -1594 -2424 -1250 699 1761 1735 1101 -358 -1999 -2296
3151b296J501J825O27l72r84j609j305L41J933J656J61o68j113j283q70Q15K092
$$ -2296 -795 1030 1657 1285 301 -1308 -2613 -2272 -339 1317 1478 810 -303 -1586 -2456 -1641 451
3168D51J355l28j016j008r93k90J199J991P63q01j317j065o36J72J458J625J54
$$ 451 1806 1478 462 -546 -1539 -1829 -630 1361 2124 1323 6 -1059 -1695 -1523 -65 1560 1714
3185A714j392j426p80k24P19J802J474l08j558j297m37L14J091J801R90p45j799
$$ 1714 322 -1104 -1884 -2108 -1389 413 1887 1579 21 -1276 -1713 -1399 -308 1493 2483 1738 -61
3202f1j236k22M59J193J397L54j206j704q43K22P01J332J188j07j563j397j40
$$ -61 -1297 -1519 -1060 133 1530 1884 678 -1026 -1869 -1647 -946 386 1574 1467 -96 -1493 -1633
3219a633P06R32J074P97o26j861j267L60J171J028Q05K61j002j862r16O15J467
$$ -1633 -927 5 1079 1876 1250 -611 -1878 -1518 -347 681 1486 1747 745 -1117 -2033 -1418 49
3236D9J170N62k09j401j642n35Q36J313R56L60o47j480j280N5J257J138O07K3
$$ 49 1219 1781 1572 171 -1471 -2006 -1170 143 1099 1459 812 -668 -1948 -1893 -636 502 1109 1132
3254A132p51j317r02O96J506J050J7o10j024j143l75R14J594Q04l59j017j276
$$ 1132 381 -936 -1838 -1142 364 1414 1431 821 -203 -1346 -1721 -807 787 1591 1232 215 -1061
3271a061j018K68J357J473M40m76j054j206q03N43J719J236O7p97r16r11l90O13
$$ -1061 -2079 -1811 -454 1019 1459 983 -71 -1277 -2080 -1537 182 1418 1485 688 -228 -1139 -1529 -916
3289i16J557R77m52j143q91m68R5R02J104M30p83j220q37j08P33J358R58j74j125
$$ -916 641 1618 1166 23 -868 -1336 -1241 -339 765 1195 412 -808 -1645 -1753 -1020 338 1296 1122 -3
3308cj094m74K04R70J518R08n87j461j193k87M58R35J209N67p22j448j078MO42
$$ -3 -1097 -1571 -1367 -397 1121 2029 1442 -19 -1212 -1499 -1041 -106 1103 1670 948 -500 -1578 -1574 -932
3327i32J017R19O6p90j116m45L02Q36R04N00l76j196p81Q7P83P84O24J14q12j420
$$ -932 85 1004 1070 280 -836 -1281 -979 -143 761 1261 885 -311 -1092 -1005 -222 562 1186 1300 488 -932
3347i32q17N27J264R86M83l12j012j250n97O60J327J077L65n36j167j085k02P38
$$ -932 -1749 -1222 42 1028 1511 1199 187 -1063 -1660 -1000 327 1404 1769 1233 66 -1019 -1221 -483
3365d83J017P77J87o03j122p71K00R08P70K47k84n89q30l83O30J073N98k89q17
$$ -483 534 1311 1498 895 -227 -998 -798 110 880 1127 843 254 -576 -959 -329 744 1342 1053 236
3384B36p96n09J33R72J124M33m53j038r73m03N47J228J072K11n93j002r88l38
$$ 236 -560 -1069 -936 36 1160 1593 1140 102 -871 -1274 -727 501 1573 1784 1191 189 -799 -1137
3402a137N96J219Q66j05p46q66o28j29N94R91N52l19p97o22j51L46P14O84j9n97
$$ -1137 -541 678 1544 1439 693 -173 -801 -930 -336 655 1207 888 91 -531 -682 -336 378 1062 1043 446
3422D46p91m59J66P35Q67M06l41j109q52k37M54Q26R42L04o43j158p77j05O05
$$ 446 -345 -804 -638 97 964 1370 1029 -80 -932 -1169 -715 111 1053 1357 714 -444 -1221 -1326 -721
3441g21R97P62K11o44j018o17R6O64Q17M94n7p55p38l09L92N66N75P4m44p95n37
$$ -721 276 1038 1249 605 -413 -1030 -934 -270 547 1041 984 229 -509 -818 -426 140 715 789 345 -450 -987
3462i87J26O63O47K09r7p07p82l16M79R36P31J45m33p76p94j51O14R80O22Pn26
$$ -987 -861 -198 449 658 561 -146 -928 -1244 -765 171 902 1047 614 -162 -956 -1107 -493 487 1109 1116 590
3483E90r39o57j9O89Q32L76j49o15p00l81K38O96N56J29l23o26m37p4N26P26L72
$$ 590 -349 -1006 -1025 -336 496 872 723 108 -592 -973 -735 -39 517 646 323 -303 -740 -814 -288 438 810
3504H10j86n93n59k57K30P05O73J70m40p71n09j96M09Q29O52p5n85p12m46M7L99
$$ 810 624 31 -528 -785 -555 150 823 993 553 -218 -727 -923 -514 315 967 892 307 -405 -851 -804 -405
3525d05P99M97j79o00n75k01J79N33O21K23l20p16m25M8L67N07L45Kn87o16k84
$$ -405 394 891 712 112 -463 -664 -485 48 669 892 572 -144 -569 -521 -154 353 698 700 113 -503 -787
3546g87K53M85N74K21l28o74n27k3L64N76N30J70m54p34m14J55M69N42L98n1n21
$$ -787 -534 -49 525 746 418 -256 -783 -806 -442 134 664 834 380 -354 -768 -613 -144 398 796 745 224
3567B24p28k65K98M82M09J40k03m83n31j30M04N92L12k3l44n11l74J60M63N27
$$ 224 -504 -769 -471 11 420 560 357 -126 -657 -787 -383 209 521 498 154 -357 -731 -571 -108 419
3587D19J98k10n19m78k09K93N69M31N9l29m95m56k3M36N70L22j42l44m43k90J5
$$ 419 617 407 -112 -590 -799 -506 63 494 553 224 -271 -727 -750 -314 256 578 436 92 -351 -641 -626
3608f26M79N11Q1k27l88l16k13J83N17M06nm24l26k74N1K99N15J80j53m20l97
$$ -626 -147 364 445 218 -170 -486 -699 -516 1 407 402 -22 -348 -622 -571 -272 243 423 270 -150 -547
3629e47j24J20M04M67J77l64m24k54m2K64L82M11m9l39l88j95L1K87L98K21j38
$$ -547 -671 -551 -147 320 497 133 -291 -545 -587 -323 59 470 421 82 -306 -501 -470 -183 215 436 298
3650B98m46l00m0J57K67L50J62k64m94k16J26K04L26K00N2l39m83j75K02L34L29
$$ 298 -148 -448 -488 -331 -64 286 448 184 -310 -526 -400 -196 130 330 382 43 -440 -615 -413 -79 250
3671B50P4k9m22k65q4K40L27L08L6k39m08k31O2K81K55J89m5k32l72j66J89L52
$$ 250 324 295 -127 -392 -476 -236 91 399 435 196 -212 -443 -381 -100 155 344 299 67 -305 -471 -282 70
3693G0K51O0j17k16l61l3K62L44J36p2j22l43k90N5K97K86J59j39k09k05k31J76
$$ 70 321 381 264 48 -313 -346 -84 260 396 324 202 -141 -431 -376 -79 207 366 227 18 -187 -418 -242
3715b42L04K85P5j95k31k02o8J10L43J92j30k11j78j76M1K58K96P0p7k30j55j40
$$ -242 62 347 422 227 -4 -206 -274 -164 179 371 241 30 -148 -324 -283 -25 271 341 264 34 -121 -261
3737b61P0L12K99n8j98k03j62n3J29L16J51r5j98j97r0L5J59K57J52j34l12j51
$$ -261 -191 121 420 362 164 -39 -201 -254 -125 191 342 247 49 -148 -238 -203 -44 213 365 231 -81 -232
3759b32RJ04J05K40O3j60k29j19L8J15K05J39n8j86j54j13J04J33J45J00q1k35
$$ -232 -223 -119 -14 226 289 129 -100 -219 -181 -66 139 278 220 34 -120 -233 -129 4 149 249 168 -67
3781f7j54nJ09J16J53O2j27j89r8L5J34J22J54n8j19j93o0J31O3P4J20p6j62j70
$$ -67 -221 -226 -117 -1 152 214 87 -102 -200 -165 -31 91 245 187 68 -125 -185 -54 9 83 203 127 -35 -205
3805b05l7J20J25J32K4n8j37j56k3K01J08N5Oj07j68m3L5J52P8N5m0j33p8q6J31
$$ -205 -242 -122 3 135 159 101 -36 -192 -215 -14 94 149 155 48 -120 -163 -128 24 102 157 117 -16 -94 -180 -49
3830d9J35N1Jm0j06j03oO0J47J8%k9r0j07k0J27J52N5j07k5p6q3J6R7R5N6l2q4
$$ -49 86 137 138 98 -8 -111 -117 -57 90 108 108 79 -11 -118 -138 -11 141 196 89 64 -12 -95 -79 18 113 169 137 53
3858E3q1o0L9J06O5K2j01m8r3m0R1J20N8J1p3j34k9K6j5J69P4n0m9r7p4nJ03Q7
$$ 53 -28 -88 -49 57 122 144 43 -5 -98 -138 -47 73 131 142 69 -65 -94 -68 -83 86 160 110 61 -36 -110 -115 -12 75
3886G5R9q7p2r6r4M9J39J39j1m1r1j49J2K2J51J20J7j07j06q8K2J03N2J49rj71
$$ 75 174 87 15 -81 -175 -126 13 152 141 100 9 -140 -128 -106 45 165 182 75 -31 -119 -97 6 58 207 198 27
3912B7j79k1P1J28Q9OPj42j15p4J22J42J07ql5j84j19%R0J34J11J6j47j73l3N5
$$ 27 -152 -173 -102 26 115 121 128 -14 -129 -203 -81 61 168 160 125 -59 -178 -178 -88 46 157 173 26 -147 -180 -125
3938a25J04J55N3m0j60j74l3J30J04J96k1j57r3k05L7J90J34J11Jj35j95j10O1
$$ -125 -21 134 187 147 -13 -187 -220 -90 14 210 189 32 -61 -266 -229 -39 95 206 207 72 -123 -233 -172
3961a72J68J77Q4p1k26j44m5M7K16J19%j0k18j05k8J23J95J21j0j71j91j36R5
$$ -172 -4 173 257 186 -40 -184 -229 -182 34 153 153 143 -75 -180 -208 -85 110 231 221 50 -141 -277 -182
3984a82J72K28j0q4j47k07jJ18J97J87rj41k51j44K0J69K16J92l7k18k32j09O9
$$ -182 -10 218 208 124 -23 -230 -231 -113 84 271 262 121 -130 -274 -254 -85 131 323 286 68 -164 -273 -204
4007b04J89K52O5p5k84j88q9J50K66K04m4j77k22j14L7J37K53J77j45k28k26n6
$$ -204 -15 237 302 227 -57 -245 -334 -184 82 286 242 65 -157 -271 -234 -97 156 333 188 -40 -266 -322
4029c22J58K52K45j1j16l17k50K6J59L27K13n8j92l01j90O7K21L00J22m4k67l15
$$ -322 -164 88 333 322 206 -111 -361 -335 -176 151 364 306 114 -187 -377 -310 -89 211 333 289 22 -293
4051b93q5J99K65J75R0j36k98k31M0K26K95P7l8l22k28q8J16L37K73Pj66l57k76
$$ -293 -378 -179 86 261 351 215 -83 -314 -274 -48 247 324 286 -36 -264 -352 -236 101 374 381 215 -142 -418
4074d18pK54L28K21Ok48l45k15M2K71L98J76j23k62k65k13J59L16K67N4j89k97
$$ -418 -425 -171 157 378 384 136 -209 -424 -382 -111 287 463 340 78 -187 -400 -241 75 342 396 207 -90
4096i0k09k3K26K93J48m3k46l58r3Q3L34K88J49k13k95l55m3K76L71L44o7k69
$$ -90 -299 -322 -96 197 345 302 56 -302 -395 -312 22 310 459 246 -49 -404 -447 -171 200 544 477 208
4118B08m22k20RK59M24K17o3l42l81j25Q4K58M02J17j41l62k57n9J83L09K83m2
$$ 208 -214 -434 -425 -166 258 475 412 70 -311 -436 -352 -94 308 425 284 -78 -335 -394 -211 98 381 339
4140C39k72l16j99J30L21L38J59k02l35l68n0K64L48L05N7k81m85l30LL77L81
$$ 339 67 -249 -448 -318 3 341 500 298 -37 -405 -455 -191 157 462 519 238 -247 -577 -574 -197 184
4161A84K51p2k61m59k17J35L84L98J40j66l48l41p8K24L60K67L5l11m09j87P5
$$ 184 435 363 102 -357 -574 -439 -55 343 483 317 -31 -372 -450 -226 134 401 436 125 -284 -471 -396
4182c96L32L12J34q7l56l57j50K54M20L29mk67m06l20J0L33M35K65j25k64m28
$$ -396 -64 248 382 295 -61 -418 -568 -314 106 435 431 164 -242 -562 -552 -219 216 481 356 92 -336
4203c36k41O6M82L54J09j31l37l58j71K04M69K72J0l09l34k34M0K51M82K04j23
$$ -336 -577 -511 -29 325 434 303 -34 -392 -563 -359 110 382 392 83 -251 -485 -445 -194 288 492 369
4224C69l71l68j00J65L58M20J0k39m21l23j06L45M26L21n4l63m85k03O8M02M60
$$ 369 -2 -370 -470 -305 53 473 483 244 -177 -500 -606 -261 165 486 432 69 -416 -619 -551 -149 311
4245C11K26j59l78m32j27K38M05L14J09k95m62k47NL59L71K22l0l98m09j49K15
$$ 311 537 378 0 -432 -559 -321 84 398 507 212 -250 -497 -492 -133 238 460 430 32 -377 -526 -311
4266c11L79L86J18k30n15l36k1L29M03K92m2l02m87k90J76M03M21J99j15l90m23
$$ -311 68 454 572 342 -173 -509 -530 -201 202 494 452 150 -337 -627 -451 -48 373 572 457 67 -356
4287c56j96K65M12L32P9k65m35m32M4L42M67K13p9l21l98j90J61M26M41Q9k72
$$ -356 -552 -287 125 457 536 271 -164 -596 -552 -210 257 470 391 70 -328 -518 -357 69 510 599 327
4308C27l80m00q2K92M65L47m5l54m03k84NM12M54K36j66m34m09j98K13M55M08
$$ 327 -53 -453 -535 -243 222 569 524 170 -233 -517 -512 -100 354 590 424 -10 -419 -617 -404 51 459
4329D59J10l25m22l37m1L17M57K92n0l64m66k08J60M00M39J69k09m73l69o1K13
$$ 459 569 244 -178 -515 -556 -239 218 510 460 96 -370 -578 -418 -18 421 590 381 -92 -461 -522 -309
4350c09M32L91L6l81m86k99J05M03L80L03j49l99l84k25K34L86L90J79l02m94
$$ -309 123 514 550 169 -317 -616 -511 -108 272 575 426 27 -357 -582 -348 38 428 607 305 -189
4370a89l31jK61M54L32k8m44m32k60K09L35M28J80j47m44m21r9L10M21L38N9k85
$$ -189 -520 -521 -260 194 526 498 54 -378 -638 -429 -94 334 514 367 -77 -498 -597 -287 134 472 531 246
4392B46m24m05N8M36M88K03j17l45l78k87J20N15L86P5k24m27l81k5K57M82K89
$$ 246 -178 -583 -525 -89 399 602 485 140 -238 -525 -405 110 496 571 347 -80 -461 -486 -229 253 542
4413E42j04k57m07l07J35M12M38J48j30m07m16j97K79M85L20Ok70m59k67m8L43
$$ 542 438 181 -226 -533 -398 14 452 600 470 63 -353 -550 -271 214 534 540 270 -189 -456 -504 -161
4434a61N10K67j32m06l39k13O0M25M72J20k36l82l30o4K25M14L94K2m24m41k09
$$ -161 349 616 484 78 -261 -474 -414 11 483 603 367 -15 -345 -409 -184 230 624 646 222 -219 -428
4455d28L8L43L89K79j60m91m11q5K41M34M04L7l18m17l02qK93M54L32o2m58m81
$$ -428 -390 -47 342 621 461 -30 -441 -526 -285 149 553 590 272 -145 -447 -455 -162 292 624 562 104 -377
4477c77j23J35L87L85J64j86m70l78q5K91M35K86M0k98m49k98K6L76L95K71j56
$$ -377 -500 -365 22 407 571 385 -85 -463 -548 -257 178 464 504 206 -243 -541 -515 -139 256 527 371
4498C71l69m54j34K25M28M00M3k18m45m01OL77M75K42r0l37l82l36N6M92M59J06
$$ 371 2 -452 -586 -361 67 467 510 292 -153 -554 -548 -171 304 546 456 119 -263 -599 -543 -51 408 514
4520E14j55m18m71j28K82N17L38M0l09m18l01j0L55M82J74j07l42m00k20J79M08
$$ 514 359 -59 -530 -658 -376 141 479 519 210 -208 -509 -519 -164 318 492 385 43 -357 -577 -398 10
4541A0M25N0k65m51k85m3K78M83K97p8l39m92k24J63L93M64K11k25m15m16r9K22
$$ 10 435 485 220 -231 -516 -559 -281 202 499 421 82 -410 -634 -471 -78 386 597 372 -43 -459 -558 -336
4563c36M48M28L6l17m78k93k3L28M53K91j14l75m45j91J29L57M57J24j91m72k90
$$ -336 112 540 576 259 -219 -512 -535 -207 246 537 423 48 -397 -588 -459 -102 355 479 288 -184 -474
4584d74o4K96M93K44J9m15m42k25J61L79M19K43k17m80m85p7K86M15L70J13k71
$$ -474 -538 -242 251 495 514 99 -343 -568 -407 -28 391 634 417 -63 -548 -625 -339 76 446 559 288
4605B88m61m24J0L57M23L21p0l01m38k52J09L96M50R4j75l69l71q7K81M09L11
$$ 288 -173 -597 -587 -230 193 514 444 143 -295 -547 -438 -42 408 502 327 -42 -413 -500 -219 190 501
4626E01jl70m39k45M1M34M33J69k00m40l88j42J79N13M38R3l32m54l05j5L48N03
$$ 501 500 130 -309 -554 -513 -79 354 523 323 -117 -505 -647 -468 45 483 576 244 -210 -515 -530 -182 321
4648C21L15o4l96m42l29J68L50L91K06k19l77m40q0K43M79L45j3l37m77j97Q8
$$ 321 636 572 176 -266 -595 -427 -77 314 520 301 -76 -516 -596 -353 126 471 458 121 -356 -553 -465
4669d65L99L80K37j26m57m57j23K53M37L72J79l51n32l57M2L30M52K87Ll31m90
$$ -465 -66 314 551 425 -32 -489 -612 -359 78 450 629 278 -254 -611 -569 -239 213 500 503 172 -318
4690c18l01Q1M43M13J53j53l98m21o6K58M24L40M8l15m74k20O8L66M27J67p5m55
$$ -318 -619 -538 -95 318 471 318 -80 -501 -567 -309 115 455 503 188 -286 -506 -438 -72 355 522 447 -8
4712hm61j71K37N03L12P8k32m83l84l5L02N74L04j6l45m02l27J02M26L86K12j96
$$ -8 -469 -640 -403 100 412 490 258 -225 -609 -644 -342 232 536 520 175 -227 -554 -452 -26 360 572 376
4734C76l40m22j45K55M48K98Mk33m57l03P2L54M52K24j88l80l83k34J93M97M34
$$ 376 36 -386 -531 -276 172 470 474 241 -216 -519 -447 -93 359 583 395 15 -368 -602 -409 88 522
4755E22P5k93m08l54o2K93N16L97p9l73m10k45QL64N13J81k14m26l51j85K38M02
$$ 522 597 304 -104 -458 -520 -227 289 686 607 234 -176 -421 -413 -49 464 645 431 5 -346 -531 -293 109
4777A09L76P5l37l98k74J02L35M45K49j20m42m52j15J46M00M34Q1k74n19l73l0
$$ 109 485 560 223 -175 -449 -347 -12 433 682 562 120 -332 -447 -301 99 533 614 340 -179 -552 -582
4798e82L79M00M22k4l89m94l00J28L52L77L35j39l88n22p7K58L58L42J11k67l99
$$ -582 -203 197 619 595 206 -288 -588 -460 -108 269 604 465 77 -445 -522 -264 94 436 547 280 -119
4819a19m05J15L44M06K47p9m07n05j28J95M34L55J23j73n27m79m1L61N25L02M
$$ -119 -524 -409 -65 341 588 509 102 -403 -531 -336 98 453 576 403 -124 -603 -644 -283 242 544 548
4840E48l23n00l29M7M33M49K62j59m26l51k80K13M28L82O8k50m19l21J0L34M89
$$ 548 225 -275 -604 -557 -124 325 587 428 2 -349 -629 -416 12 394 462 212 -207 -528 -518 -184 305
4861C05J89l5l89m67j43J08M81M24J08k40m71l46o6K61N44L72Mm01m73k99K3M42
$$ 305 494 459 70 -397 -540 -432 49 473 581 341 -130 -476 -542 -281 263 635 639 238 -235 -534 -511 -69
4883f9M62K73k23l98m10j96J44M80L90J12l32m31k93K5K79L74L93q3m02m48j59
$$ -69 393 666 443 45 -365 -561 -417 63 453 565 233 -198 -491 -466 -187 187 580 497 95 -353 -512
4904e12J71L38M74J30k17m95l64q2L50L97L58P3m33m42k74j1L97M83L06r8m82
$$ -512 -341 -3 471 601 384 -111 -475 -557 -207 190 548 621 188 -254 -528 -539 -142 341 647 549 67
4925F7m59j27K14L46L75J86j98n40l75j9M25K98K57J1l28m31k36J33M01L94J55
$$ 67 -392 -519 -305 41 416 602 404 -136 -511 -530 -105 193 450 461 133 -298 -534 -401 0 394 549
4946E49k04m41m06r6K59M85L24L1k92m74l50R1L60M62K42r9l93m68k06J96M45
$$ 549 345 -96 -502 -598 -339 146 470 501 209 -265 -615 -524 -164 298 540 441 48 -420 -626 -430 15
4967A5M18P9k56l86l84n5K94M46K91o2k91m69k20P8M09M54J24j84l83l55j59K31
$$ 15 433 512 256 -130 -514 -569 -275 171 462 400 109 -360 -580 -502 -93 361 485 301 -82 -437 -596 -365
4989c65M95L46K7l24m63k59J0L03M41K75j09l90m06k16J84M05M00J05j99m49l44
$$ -365 130 476 503 179 -284 -543 -533 -230 211 486 377 -13 -419 -635 -451 -46 354 459 260 -189 -533
5010e33n5K74M50L42l0l83l35k21O5K69N07J76j37n07m34l9K67L59L58R2k58m88
$$ -533 -588 -314 136 478 448 65 -270 -491 -426 -157 350 526 389 -118 -552 -591 -324 35 393 485 227 -261
5032b61l55N0L44M10K78mm07m50j82J32M06L62J88j76m59l74n8K75L78K87P7l07
$$ -261 -616 -566 -222 188 466 462 55 -395 -577 -445 -39 323 511 335 -124 -498 -556 -281 97 384 461 154
5054A54m30k85N9L50M22K17j22l80m22j61K47M41L58O9k15m94l02p5L68M67K56
$$ 154 -276 -561 -502 -152 270 487 365 -15 -437 -598 -351 90 448 517 302 -192 -494 -569 -201 266 522
5075E22o9l23m17k47J20M38M28Q5j69l97l86j30K64M97K99M9l16m52l16M8L72
$$ 522 453 130 -287 -534 -414 24 452 537 368 -29 -415 -545 -281 216 515 564 248 -204 -520 -472 -100
5096a00M21K23j16m03m00j51K27L77L87R0k14m35m13K0K56M91L20j15l74m09j70
$$ -100 321 544 428 25 -375 -526 -299 78 465 555 341 -94 -507 -487 -231 260 580 465 91 -318 -488
5117d88M4M10M45J78j45m67l45q1K24L66L89N3k72m44l35R6K87M23J80p0l59m34
$$ -488 -444 -34 411 589 444 -23 -368 -449 -225 141 530 583 311 -133 -468 -372 -85 338 518 448 89 -345
5139c45k42J85M11M04J12k95l95l33L3K96L81L14m6l04m47k85J08L62M46J48j57
$$ -345 -587 -402 9 413 525 230 -165 -498 -465 -169 212 526 480 176 -271 -556 -448 -86 360 508 351
5160C51m22l61r0J19M68L53K7k64m26k74J7K77M50K64p1l47m39j78J46M29M16
$$ 351 -71 -432 -522 -403 65 418 445 181 -245 -519 -502 -225 225 489 418 71 -368 -546 -400 29 445
5181D45Q7k16m30k96q9K90L89L56k5l55m31k90P9L81L56L15k21l76l76j22K07
$$ 445 532 316 -114 -410 -499 -209 180 536 511 156 -275 -565 -486 -105 251 566 345 -31 -407 -529 -322
5202c22L83L86N9j99m57k75l9L08L89K77o8k99m29j83Q7L54L59J87k47l32l94
$$ -322 61 447 506 307 -150 -425 -464 -156 233 510 442 143 -286 -469 -382 -28 331 518 271 -61 -455
5223d55m8K41L85L84l8k71m01k34N7L03M73K25j32m21m01j27J63M20L94Q0j86
$$ -455 -503 -262 123 507 469 198 -203 -437 -380 -77 396 621 489 68 -333 -460 -297 123 517 597 411
5244D11m37l71j6K82L95K50l2k73m33k46O1M20K97K00j92k70l70j14K12M13K92
$$ 411 -26 -397 -413 -131 264 514 482 209 -224 -470 -409 11 308 508 316 46 -324 -438 -226 187 479
5265D79K7k67l63l02M6L18L98K00j50l79l48j88J02M48L73R9j73m23l29m3K30
$$ 479 506 239 -124 -426 -380 -62 336 536 386 7 -341 -529 -427 21 394 493 320 -103 -432 -475 -245
5286b45M57L40o1k38m46l11R1L38M19J93j89k99l55j33J42L65L46K9k92m13j76
$$ -245 212 552 491 253 -193 -504 -413 -75 344 537 348 49 -306 -439 -297 68 414 443 151 -262 -438
5307d38K0K48L63L11k05l12l59j93K14K93M05J47k02m29l34n6K18M35L58L3l19
$$ -438 -418 -170 193 504 299 -13 -372 -565 -351 -58 347 494 292 -137 -471 -527 -309 126 484 517 198
5328A98m31k85K2K92M09J91p5l68l58p9J70L25L36O8j56m24k76K4L01L42K06m3
$$ 198 -233 -518 -496 -204 205 396 321 -47 -405 -484 -314 11 347 415 259 -165 -441 -417 -116 226 432 389
5350C89l50l81j88J32L76L84J02j55m64l52m6L00L46K69J01l14m57k37P6K92M03
$$ 389 39 -342 -530 -398 -22 362 464 309 -155 -507 -553 -253 93 362 463 149 -308 -545 -469 -177 226
5371B26K38j02l09m09j26J90L55K60J74k22l67l40M5K71L77J31m5k72l88j71Q8
$$ 226 464 362 53 -356 -482 -292 63 323 497 275 -92 -432 -387 -116 261 392 347 75 -313 -484 -396
5392c96L87L78K7j49l37l31r2K45M53K54Mk54m12k67L2L18L77K06r2l54l18j54
$$ -396 -9 369 396 247 -90 -421 -513 -268 185 439 443 189 -223 -490 -458 -140 237 443 351 -3 -321 -475
5414d75J13L18L69O6j83k87k69n6K20L34K96q4l18l20j08M8L29L13J45j76l25
$$ -475 -362 -44 325 391 208 -79 -348 -404 -184 150 446 362 44 -276 -384 -336 -7 306 451 275 -50
5435e0l12o9J96L60L12K9k79l66k62k3K91L75K81j16m05l38r5J07L20L10J36j23
$$ -50 -362 -431 -235 125 437 466 187 -179 -441 -464 -173 202 483 367 -38 -376 -471 -364 -44 266 402 279
5457B79m25k44k7K88K65K33J1k80l10k58J57K77L60J05j69l81k69pJ45L35K63
$$ 279 -146 -390 -417 -129 136 369 380 100 -210 -468 -311 -34 326 431 262 -119 -388 -395 -250 85 348
5478C48Q1k39m23k35L6L26K71K31j7k62l96j71J14L40K83P9j51k79k91p1K34L18
$$ 348 429 190 -233 -468 -432 -106 165 396 379 117 -279 -450 -336 4 287 366 215 -64 -355 -426 -192 126
5500A26K36K3k49l57j79J02K53K73J41j00k42l56j31J69M09K01L5j91k86k42j19
$$ 126 362 385 136 -221 -400 -298 -45 228 369 269 27 -329 -460 -291 118 319 354 163 -123 -365 -484
5521d84K82L75K46k4l23k75j76P2K66L40Q2j45k72k44j27J66L58K37ok16k75j96
$$ -484 -202 173 419 395 72 -203 -379 -307 -41 299 381 236 -36 -280 -407 -241 117 354 348 132 -143 -339
5543c39j3K54L83R7q4k65k85j11J14L26L06O3k22k40k83p7K08L93J87m1k65k39
$$ -339 -352 -98 285 382 298 33 -252 -363 -249 77 383 446 224 -16 -299 -376 -168 225 412 371 106 -133
5565a33k32N8K23L66J17j22l06k43k1J22K55K24J46k44l39k00P0K65K29J68q7
$$ -133 -365 -307 -84 282 399 277 -29 -272 -293 -171 84 308 454 210 -129 -329 -259 6 235 403 316
5586C16k16l45j00J44K30K93R0j84l02k27p6K26L08K21Pk19l46j22N2K41K34J37
$$ 316 100 -245 -345 -201 29 322 412 228 -74 -301 -377 -151 157 378 385 166 -180 -302 -250 -9 225 362
5608C62l1k60l08j08J66L00J86k4j30k79k02PK26L40J08l1k83k41j48Q6K97K22
$$ 362 331 71 -237 -345 -179 121 307 283 153 -126 -328 -321 -95 245 353 322 39 -202 -350 -264 33 255
5630B55P2j12k54k26j08J82L10J89k4k00k77j99J09J66L22J34j11k22k42r8J16
$$ 255 327 215 -39 -265 -373 -191 119 308 284 84 -193 -392 -283 -117 205 339 228 6 -236 -334 -218
5651b18K23K66O5k13k91j39M3J23K87J80q9j42k35j42N4K73J77J19j47k20k47
$$ -218 5 271 336 123 -168 -307 -264 -141 146 326 237 95 -140 -282 -228 45 222 341 194 -26 -273
5672b73l9J42K14K67j1k29k69j89J02J72K35J36m6k08k47n4O2K70J90J08j41k74
$$ -273 -312 -170 44 311 300 71 -198 -387 -285 -113 122 258 212 4 -243 -297 -235 35 225 333 192 -82
5694h2j92J0K26J76J29K0k27k18j17Q5J25K60J25j20k20j87o6O4K70J96K1j53
$$ -82 -274 -264 -38 138 267 287 60 -158 -275 -190 -65 195 320 200 -20 -207 -273 -209 61 257 278 125
5716A25j97k28N9K06J97J39m4j64k99j06J32K15K15J4n1k63j60lN8K41J81l1j81
$$ 125 -72 -300 -241 -35 162 301 257 93 -206 -312 -180 35 250 264 213 -50 -210 -213 -155 86 267 236 55
5739E5j71j07L2J66J88J43j26j90k15j6Q8K11J80J5j21k45j70K7J72J98J43n4
$$ 55 -116 -223 -191 -25 163 306 180 -10 -225 -241 -153 58 238 253 132 -113 -283 -256 -84 114 257 203
5761B03j38k13j47O8K32J60R8p3k74j09rM5K24J53J8j56j98j49K2J99J77O9o1
$$ 203 65 -148 -295 -227 5 165 263 190 -84 -193 -202 -157 67 220 238 82 -116 -265 -243 -44 133 202 141
5784A41j45j92p8R1K07J32N2r8j49k14K4J43K04J04L0j96j95j07O3J68K01J7q7
$$ 141 -4 -196 -274 -183 24 156 208 110 -39 -253 -229 -86 118 222 252 56 -139 -246 -183 -15 186 203 116
5807A16j63j46l4J13J14J78M6j61k09j16nJ79J98P8m5j48j74o0P9J60J93k4o7
$$ 116 -47 -193 -227 -114 0 178 224 63 -146 -262 -267 -88 110 188 143 -5 -179 -239 -160 0 193 169 102
5830A02j94j40oO6K42Q7K7j72j40r9J1J46K19Q8r8j37j37j42J26J47J45J06j59
$$ 102 -92 -232 -238 -172 70 157 184 12 -128 -227 -216 -70 149 237 139 2 -135 -277 -151 -4 141 247 88
5853H8j79q3j9J22K23O9m3j68j46n4L4J66J38M1j05j24j14p4P5K11J54n3j24j83
$$ 88 -91 -174 -193 -71 152 221 178 10 -136 -190 -156 10 148 189 84 -40 -154 -228 -153 58 212 159 35 -148
5877a48n4J7J25J76P6k1j83j26n0Q7J34R3P5q3k13o3J1P7J13J40m8o5j35j53J16
$$ -148 -202 -185 -60 116 192 171 -12 -138 -188 -101 33 126 201 118 -95 -158 -147 -70 43 183 135 70 -65 -218 -102
5902a02J31R5N9l9j80j37J0J14J36Q2J7j16j47j05O8J06J20O4o0j04j58m9O5J81
$$ -102 29 124 183 144 -36 -173 -163 -49 87 169 186 70 -77 -182 -114 -8 112 176 116 12 -146 -195 -130 51
5926E1R3O2j36q2j34rQ6J29R4j0o7j54p5K7J71L5O8k7j40p5o6R5J22J02j9o2j43
$$ 51 144 206 70 -12 -146 -155 -69 60 154 144 77 -77 -152 -125 46 81 149 122 -18 -93 -159 -64 58 160 141 79 -64
5953f4r0j0R8J06O6l9p2p4l7pJ62J15l1Qj55r8l9J15O1R8j6n5q9n3JO3J04R1p3
$$ -64 -154 -164 -66 40 106 67 -5 -79 -116 -123 39 154 123 131 -24 -122 -161 -46 15 113 97 42 -47 -100 -99 -36 68 159 86
5982H6n7j04k8L3P8J02j5r5K2j50K3K9R2J22j6j02r5q3KJ35P5J14o5p2j12nj4
$$ 86 29 -75 -103 -70 8 110 95 0 22 -128 -105 -76 16 138 122 20 -75 -158 -156 -21 54 168 103 31 -81 -86 -100
6009a00L5J49J9k7j10k6l8N5N6L8L4q6on2k2O8Q5K7J2j13p7j0N9L1M7M8j21Kj06
$$ -100 -65 84 103 76 -34 -60 -98 -43 13 51 85 -1 -7 -59 -81 -13 72 99 111 -2 -79 -89 -30 1 48 96 -25 -23 -129
6038a29QQ7P3M7J1l4j19k5K5P3M2j7mk1q2l6P4K4P3J1k9l4j13L9O3L4N0jk9p1
$$ -129 -121 -34 39 86 97 63 -56 -81 -56 17 59 42 38 17 -65 -101 -27 -3 70 81 52 18 -95 -56 7 41 91 90 61 -10
6068a0p7J4J04J8mj7k8p2%mJ28N7nr0n1n4lQ6J5O2j3n3j9n7k3R6K4J1qj2o7j4
$$ -10 -87 -73 31 49 45 28 0 -72 -72 -76 52 109 104 14 -37 -91 -94 -8 7 69 56 3 -16 -73 -96 0 24 35 27 15 -52 -66
6100f6N1M8L1jqm3p8nN1P9L0k2j2p9o0j3R0O3jJ0o7l3n1N0N0K9Nl5m1j3o1N2M8
$$ -66 -15 33 64 63 55 12 -66 -71 -20 59 89 67 55 -24 -84 -97 -7 56 55 65 -2 -35 -86 -36 14 43 48 13 -28 -41 -102 -50 -2
6133bL8O0j35Ll2pM0P7k7M9n6l8Nk1L6O7L5p7K1j12J6K0N8O7mm4q8Km1M2Q6K4
$$ -2 36 96 -39 -36 -68 -75 -35 42 15 64 8 -30 -25 -46 -10 57 92 15 36 -76 -60 -40 18 85 81 37 -51 -49 -90 -48 38 62
6165F2O3j06q4J1NK0R9L6o3mq9l9MO6J01k2Kj24JpM7O8PKqq9q5M6R2RL5L7j21
$$ 62 125 19 -65 -54 -49 -29 70 106 43 39 -50 -89 -85 -19 82 60 62 -62 -61 -68 -21 47 54 56 48 -41 -126 -80 12 21 56 93 -28
6198b8n7n2O3M4J01J5J4j23l6rN3N1M7k0k6p7n7L8Q7J8L2Pm9j03j6J9J02L3N0
$$ -28 -85 -137 -74 -30 71 86 100 -23 -59 -68 -15 36 83 63 37 -40 -97 -59 28 46 78 85 36 -67 -83 -64 38 71 121
6227A21o2n8r8l3O9R0Q1o7m4o4o2J9J35P8Ko1o2q9l7N6Q9P6M6p9o9r5L4L2P8O2
$$ 121 59 1 -97 -130 -61 29 110 43 -1 -65 -127 -108 27 105 107 46 -16 -105 -142 -86 3 79 125 46 -23 -118 -84 -52 26 88
6257H8lk7j07q3M8R3J35j4m3j28m3oM4J19K8%r5o0n1j2N7J02R6q0l4j04n7O1Q6
$$ 88 85 58 -49 -132 -84 9 144 130 87 -41 -84 -90 -46 73 101 101 6 -54 -105 -117 -60 42 138 58 24 -80 -137 -76 10
6286A0R5M4q2r4j16J5O6J03P8Rr9j18o9P8Q0R2R2q4j22j03n2J21R1R6K4o9j72
$$ 10 105 149 67 -27 -143 -128 -62 41 119 128 29 -89 -158 -80 0 92 184 100 -22 -125 -177 -56 35 131 155 86 -86
6313h6q4L8P1J82J3k2j09j03o6N1J60J39jm8k17k7o6J14R2J21j1j35q8j40N2J45
$$ -86 -170 -132 -61 121 134 112 3 -100 -166 -115 45 184 183 135 -82 -109 -175 -61 31 152 141 6 -82 -222 -170 -25
6339b5J28M7m1j35j07o9O1J53J63j7p3j15j60M7J03J31Q2m4r9j17q7O5N9J50Q2
$$ -25 103 150 109 -26 -133 -202 -141 12 175 158 85 -30 -190 -143 -40 91 173 129 30 -87 -174 -109 -50 100 182
6364A82p3j45j19l3R2J65Q5k0p3j52j09Q5J00J42M7p2j00j52l8O7R7J49O0r3j67
$$ 182 109 -36 -155 -188 -96 69 154 134 61 -91 -200 -115 -15 127 174 102 2 -150 -188 -121 -24 125 185 92 -75
6389g5j64J6J18J90O5Mj14j67q0nJ94J57K3j2j88r9q7J67J23R7M1q8k01p9k1R5
$$ -75 -239 -223 -105 85 150 154 40 -127 -207 -212 -18 139 162 150 -38 -137 -224 -57 66 163 204 116 -85 -164 -185 -90
6415i0J47J47m6j00k03m9N9J30K20k5j26j24j49M3O1J63K06q7r1j96q9MJ53J72
$$ -90 57 204 158 58 -145 -194 -135 -5 215 190 64 -60 -209 -166 -105 58 264 177 86 -110 -199 -195 -42 130
6439A30J03p4j57j78o1N4K28J69k8o6k13j26j4J00K11J52k7k38j11q1J12J17J91
$$ 130 233 159 2 -176 -237 -183 45 214 186 120 -93 -219 -233 -133 78 230 203 -35 -146 -227 -115 2 193
6462A93N1j39r3j88pO4J73J67k7r6j71j52P1J57J69J04j18j32j76p2N0K24J30
$$ 193 244 105 12 -176 -183 -119 54 221 194 98 -73 -225 -154 3 172 276 158 26 -150 -222 -172 52 182
6485A82K2r5j88j98M2J28J85J56m0j55j59j57Q4K10J67P2j06k27j43o8J49K11
$$ 182 204 109 -79 -277 -235 -107 78 234 194 39 -120 -277 -193 17 184 256 150 -77 -220 -288 -139 72
6507G2J36J9j62j17k05O0J80J95Q8l5j97j79n8R1J63K02Qj33j96j79K7R8K54R8
$$ 72 208 227 65 -52 -257 -197 -17 178 266 231 34 -145 -203 -112 51 253 261 128 -68 -247 -220 -122 132 230
6531B30pj51k06j19O2J76J51J03m9k20k12j9J08K16J94p0p4k05j79J7J64K24R4
$$ 230 223 72 -134 -253 -191 -15 136 239 190 -30 -242 -261 -153 63 257 187 113 -92 -271 -254 -90 134 228
6554B28l2j71j54j42J23J51K06O6j28j79j95k3J59J56K32r8j50k16q5L2K03J78
$$ 228 196 25 -129 -271 -148 3 209 275 147 -32 -227 -250 -91 65 297 199 49 -167 -252 -220 -17 161
6576A61J63j27k33j17j00J15J82J70M9j32k20j66N6J44J71J75l5j98k21q0N1K17
$$ 161 324 197 -36 -153 -253 -138 44 214 263 131 -89 -255 -199 -55 116 291 256 58 -163 -243 -192 25
6598B5J92N5j32j79j84KQ4L16O9P3k45k06j44J07J45J88J01j6j68k64n5N8K42
$$ 25 217 272 140 -39 -223 -221 -137 179 248 321 76 -130 -274 -167 -22 166 267 251 83 -181 -236 -178 64
6621F4J27N8r9k11j65PJ90K06J01pk14k33j20J38K10J42O5p4j58k32r4J38K68
$$ 64 191 249 150 -61 -226 -219 -29 177 278 271 57 -176 -296 -158 52 194 259 185 27 -205 -299 -161 107
6644A07J38K6j29k19j76k2K05K06J56p5j73j72j35J06K07J49J3r6j71j61p4K10
$$ 107 245 271 142 -77 -253 -275 -70 136 292 217 44 -128 -263 -157 50 199 212 116 -55 -216 -290 -80
6666h0K10J64r9q3k42j84Q0K11K53R2j09k73j49p5P1K52K25Oj77j86j84M1J74
$$ -80 130 294 195 112 -130 -314 -234 -23 230 322 213 -60 -209 -284 -213 39 264 270 93 -93 -277 -236 -62
6689f2J78J92m0k47k11q4L9J97K49M3j75j62j82J2J06K39J43L8k33j57j46JJ84
$$ -62 116 308 268 21 -190 -274 -235 -38 211 254 79 -83 -265 -253 -147 92 235 273 40 -117 -263 -262 -78
6712g8J94J94r8k10k02j08J46K16K12K9j70k42j33l0J65J92K00l5k23k67n9R3
$$ -78 116 310 212 2 -200 -308 -162 54 266 295 125 -117 -250 -280 -115 77 277 242 19 -248 -307 -214
6734b14J62K56P3p3k54k21m8J92K34J72Pj88k55j68M3K17K64O0o6k16k87k8J53
$$ -214 -52 204 277 204 -50 -271 -319 -127 107 279 286 98 -157 -325 -282 -65 199 259 193 -23 -310 -338 -185
6757a85K59J55N2r4k99j79k6K47K20J72q5j54k53j31P0J83K98M9j47j95j47j17
$$ -185 74 229 281 187 -112 -291 -317 -70 150 322 237 83 -170 -301 -231 -48 250 299 152 -43 -190 -307
6779c07J49K46K05n0j58k13j96Q6J51K55Q5n6k24k23m7Q4K50J97N5j09k84j25
$$ -307 -158 88 293 243 85 -128 -324 -238 -87 168 253 197 -27 -250 -297 -213 37 234 289 180 -104 -229
6801b29p1J61K29K70o8k41j85k17R0J86K65J32j47k24j81l1J62K00J97k2j42k57
$$ -229 -300 -139 90 360 292 51 -134 -351 -261 -75 190 322 175 -49 -230 -261 -99 101 298 276 134 -123
6823a23j68M2J85K27J40r6j84k24j40J35K58J38Q2j05l00k01L8J77K21J89Mk31
$$ -123 -291 -249 -64 163 303 207 23 -201 -341 -206 52 190 272 167 -133 -334 -296 -119 102 291 295 64
6845F4k29j70L8K44K01J30o0k46k24o0Q9L23J59N4j70k32k60L8K04K80J17j29
$$ 64 -165 -335 -297 -53 148 278 218 -28 -252 -312 -223 100 259 313 143 -89 -349 -311 -107 173 290 161
6867A61j58k44j19J14K73K35N2j45k51j83l6J65K59J66rj91k79j32O9J65K39J36
$$ 161 3 -241 -360 -246 27 262 314 169 -82 -265 -301 -136 123 289 280 89 -190 -322 -253 -88 151 287
6889B87n2k69k24l7J12K11K56Oj93k33j69K5J88K14K02q1k53k23n6L8K27L01O2
$$ 287 235 -34 -258 -295 -183 28 284 290 97 -136 -305 -280 -92 122 324 243 -10 -233 -289 -251 -24 277 339
6912C39j11l13j70lJ12K79J63mk00k21j83L3K64K39O8n2k69k11m9J13K42K20J08
$$ 339 228 -85 -255 -258 -146 133 296 292 92 -129 -312 -279 -15 224 292 240 -29 -240 -289 -176 66 286 394
6935C94k31k44j48J0J96K13J40q7j55k79j02P7K89J99J2n8k42k18q5K51K06J76
$$ 394 163 -81 -229 -219 -23 190 330 243 88 -191 -293 -216 73 272 284 226 -16 -234 -319 -68 138 314
6957C14M5k31k43j69P7K12K32P6k2k25k43j21J24K54K01J6j06k37k31k1K09K77
$$ 314 359 128 -115 -284 -207 5 237 313 291 66 -177 -298 -174 80 281 297 191 -46 -277 -298 -89 188
6979A88J81j05j80k95p6J33J88K41L4q6l03j50k0J19K72J96j0k11k26j64J1J81
$$ 188 369 264 84 -211 -287 -154 34 275 309 223 -80 -230 -250 -131 141 337 327 116 -110 -274 -263 -82
7001h2K90J07j06j86k71n1O4K65K16Q4j66l24j21j5J97K07J65qj96k92o4O5K71
$$ -82 208 315 209 23 -248 -299 -235 30 246 330 164 -160 -281 -296 -99 108 273 265 69 -223 -287 -222 49
7024D9J88R1j35k67j83k5J63K03K20Rj40k94k05N8K48K07J00o1j95k96q9J53K37
$$ 49 237 328 193 -74 -257 -282 -119 84 304 313 173 -121 -326 -268 -20 187 287 226 31 -265 -354 -201 36
7047C6J69N5j05k46j74j1J74K76J03n9j42k74j35O6K64J97P7q9k37k39k9J08L29
$$ 36 205 260 155 -91 -265 -276 -102 174 277 218 76 -198 -333 -267 -3 194 271 182 -55 -294 -323 -215 114
7070A14K09Pj72k74k01M7K16K80J49j27j93k81q3O8L08K08K2j68k03j60r3J70
$$ 114 323 330 158 -116 -317 -270 -54 226 375 248 55 -226 -309 -241 67 275 297 129 -74 -234 -327 -157
7092a57L09J54n5k20k42n2J8J98K23J50j47k50j95o4J18K81J82Jj38k55j45kK37
$$ -157 152 306 251 31 -211 -263 -245 -47 176 326 179 -71 -266 -330 -212 69 251 252 114 -141 -286 -288 -51
7115e1K18J52n3k88j86j03M4K49K67Q9j54k81j64j8J47K63K19m3k60k18r6K1J91
$$ -51 167 319 266 -22 -208 -311 -267 -18 249 338 184 -97 -261 -279 -132 131 350 307 47 -171 -267 -246 -55
7138e5K62J04j04k44j91j09J78K29J35O0j75k34k03R8J63K56J29j03j59k36j42
$$ -55 207 311 207 -37 -228 -337 -159 70 205 265 90 -144 -347 -249 -86 170 299 196 37 -199 -341
7159c41J24K32K03Q8j06k96k27L4J37K32K03l4j59k81r2K0K04K08J33p3k48k22
$$ -341 -217 15 218 306 200 -96 -323 -289 -152 80 283 249 90 -191 -283 -263 -59 149 282 209 -39 -261
7181b61m8J15K54K00j8j35k38j80OK07K60J88j11j94k63j35J09K57K34J7j25k00
$$ -261 -309 -194 60 260 242 107 -131 -311 -305 -98 162 350 239 45 -218 -353 -244 13 247 264 139 -61
7203f1k44oJ82J97K09p0j59k76r8M5J85K97P8m8k74j74q7J05K12K40L0j56k43
$$ -61 -305 -311 -129 68 277 207 48 -228 -326 -281 -96 201 279 231 -43 -217 -304 -199 13 253 283 127 -116
7226a16j73j8K23K26J28m7j71k87r7R0K75K12N8j27k25k29k7J64K81J52Qk15k26
$$ -116 -289 -307 -84 142 270 223 52 -235 -332 -242 33 245 303 176 -49 -278 -305 -141 140 292 300 85 -141
7249a41j41LJ98K72J22p4k74k18m9J23K36K12j7r2k24k34J7J48L10Q3J7k43k54
$$ -141 -282 -279 -81 191 313 239 -35 -253 -302 -179 57 269 252 160 -64 -298 -281 -133 177 260 277 34 -220
7272b20o9P1K16K73Q0j12k99j97k7K29K29J19M1k47k06k30P0K67J87J33l8k06
$$ -220 -289 -218 -2 271 351 239 -60 -257 -284 -55 174 293 334 87 -119 -349 -279 -12 175 308 270 64
7294F4k76r1J57K22J94L2j23k65j98qJ54L01J51k6k06k76q9J8K84J83J06r8k34
$$ 64 -212 -303 -146 76 270 302 179 -86 -284 -292 -138 163 314 288 82 -194 -283 -265 19 202 308 210 -24
7317b4k14p4J47K64J98j2k05k15j52J8J43L13J21p5k28j95q4O1K54K40Q2j80k48
$$ -24 -238 -312 -165 99 297 285 80 -135 -287 -269 -126 187 308 233 5 -190 -274 -213 41 281 363 183 -65
7340f5j79J2J26K26K22r5k46j65j25jK40K36J00j14k48j73m2J08L14J53Nj57l01
$$ -65 -244 -232 -106 120 342 247 1 -164 -289 -290 -50 186 286 172 -76 -249 -291 -183 131 284 289 132 -169
7363a69j15l1K10K86J22q2k20k16r1R7K16K12J22j63k39k09L7J52K09J25Mj77
$$ -169 -284 -315 -105 181 303 221 1 -215 -306 -209 7 219 341 178 -61 -270 -233 -81 128 253 257 80
7385H0k18j51N9K39K34M1o5k26k33q4K02K54J66j3j32k14k08RK23K12R7m1j55
$$ 80 -138 -289 -230 9 243 284 219 -7 -240 -324 -122 132 298 285 153 -61 -269 -260 -37 175 272 231 76
7408G6k61j03J03J78K51K8p2k60j75l0J74K27J53j8j88k17j80J16J73K64R4p0
$$ 76 -185 -288 -185 -7 244 272 200 -60 -235 -265 -91 136 289 271 83 -134 -314 -198 -25 239 333 263
7430B63k97j97k4J03K16K44L3j97k05k10K0J94K23J76n8k14k08j56Q5K38J97J06
$$ 263 -34 -231 -255 -152 64 308 341 144 -61 -271 -251 -57 166 342 284 70 -138 -294 -209 29 226 332
7452C32j60k20j62n1J29K28J94n8j16k68j52P3J57K31J52j48k29j57n2J31J84
$$ 332 172 -48 -210 -261 -132 96 290 232 116 -152 -304 -231 -74 157 309 161 -68 -225 -277 -146 38
7473C8K11L6j73j88k16MJ84K27J35p0j84k27j15J08K32J71R9j01k50j86JJ44K91
$$ 38 249 285 112 -76 -292 -288 -104 123 258 188 4 -223 -338 -230 2 173 272 171 -79 -265 -264 -120 171
7496A71K7O1j50k80j24K7J85K39P1p3j89j86j19J07K94J54M4k11j92j76K7J48
$$ 171 198 259 109 -171 -295 -268 -83 156 227 154 -35 -221 -340 -233 61 215 259 48 -144 -320 -293 -145
7518a45K71J54r0j45k38j39Q6K17K04P5j11k45j01k1Q1K17K13j7j46k64j45O6
$$ -145 126 280 190 45 -193 -332 -246 -29 175 250 139 -106 -207 -228 -147 70 283 266 120 -144 -289 -223
7540b23J76J69J35j00j72k00o5P2K55J99K5j81k25j45M5J50K33K06p0k74k28k9
$$ -223 -47 122 257 157 -15 -215 -280 -208 47 246 271 90 -135 -280 -235 -85 148 354 284 10 -218 -247
7562b47L1K09J30J51p2k51k26l0J75K29J06j0j17j88j72P2J80J60J33j16j82j97
$$ -247 -216 -7 123 274 202 -49 -275 -305 -130 99 205 195 78 -110 -282 -210 -30 130 263 147 -35 -232
7584b32n9J85J94J29Q0j34k02k15M0J18K07J53l8j68k54j08P7K60J36R0o1k13
$$ -232 -291 -106 88 217 297 163 -39 -254 -214 -96 111 264 226 58 -196 -304 -227 33 169 259 198 -15
7606a5k33m6J35K81J48k0j23k40j38oJ81K31J10j03j66j81j22J23J65K69m0n7
$$ -15 -248 -294 -159 122 270 250 127 -113 -251 -257 -76 155 265 162 -4 -185 -307 -184 -19 250 210 153
7628A53k54j25j6J44K29J21j2j73j72j19K6K64J45J10j14j93j76n8J22J81J79
$$ 153 -101 -226 -242 -98 131 252 240 67 -105 -224 -198 66 211 321 207 14 -162 -220 -98 83 262
7649B62Rj84j74j71OJ86J90J29k7k35j67j02N2K31J84O3j65k14j49M5J00K23J08
$$ 262 271 87 -87 -258 -252 -66 124 253 226 -9 -176 -278 -226 5 189 252 87 -127 -276 -231 -131 92 200
7672B00L7j81k13p7J1J72K02P7n2k45k14jJ77J49J64L4j32k38j41L2K01J97O6
$$ 200 237 56 -157 -234 -223 -51 151 228 176 -69 -283 -284 -107 42 206 240 108 -130 -271 -239 -38 159 225
7695B25k6j60j40j03R3J34J99K4j11j94j92L7R1K20J45n9j12k74o6P1J60J95P4
$$ 225 199 39 -101 -204 -111 23 222 246 135 -59 -251 -214 -123 97 242 183 71 -203 -269 -198 -38 157 231
7718B31l1k18j37p9R2J72K08J6j12k22j49j8J54K18R4k7k24j46r1J28J53J64P4
$$ 231 200 -18 -155 -234 -142 30 238 254 142 -80 -229 -247 -93 125 219 192 -32 -178 -269 -141 12 176 250
7741B50r0j50j75o0J29J99J69n2q7j59j47oK06J70O5m8k42j34n3Q4J85J77j7j31
$$ 250 160 10 -165 -225 -96 103 272 220 133 -26 -173 -179 27 197 262 214 -28 -162 -215 -131 54 231 214 83
7765H3j35j52K2O3K54R9p1j18j81j20J17J70K00M0j14k05j36KQ1K11P7N3j29j87
$$ 83 -52 -204 -182 -119 135 234 163 45 -136 -256 -139 31 231 271 157 -48 -184 -182 -101 110 187 240 111 -76
7789g6j56O1J77J44J29r2j65j53n0J0K11J71O6j55j79j35l0J16K14J32l4j40k14
$$ -76 -232 -171 6 150 279 187 22 -131 -181 -171 40 211 277 122 -57 -192 -222 -106 108 240 206 66 -148
7812a48n2Q8Q2J91P7k0k49j19j25K12J03P6N3j31j74j27Q4Q1J74J25p3j27j86
$$ -148 -200 -112 -30 161 238 218 -31 -150 -275 -63 40 116 169 38 -136 -263 -179 -98 76 201 128 1 -185
7835a85o8J35J49J78jj9k05j56j8R8J79J48m0j50j83j08O6J81J22P6k7j94j58
$$ -185 -253 -118 31 209 208 189 -16 -172 -190 -92 87 235 195 45 -138 -246 -180 1 123 199 172 -22 -180
7858a80l3Q7J52J32O9j65j28j30J5J21J69Q1k2j71j12j01M9K06J43J0q2j49j72
$$ -180 -213 -126 26 158 227 62 -66 -196 -181 -60 109 190 168 -3 -115 -216 -167 39 182 192 110 -39 -211
7881b11k7J06K00J36m8j27j67p0P4J00J62J24j12j45j15o0Q1J59J63Or7j79j64
$$ -211 -238 -132 68 204 156 29 -138 -208 -134 -34 128 252 140 -5 -120 -180 -99 60 223 229 132 -47 -211
7904b11P2J07J39Q5j9j66j37r0L9J87J74K8j31j21j49J7N9J75J40l0j34j46q3
$$ -211 -139 -32 107 192 173 7 -130 -220 -181 6 180 208 77 -44 -193 -176 -117 58 198 168 34 -112 -195
7927a95M0R4J19J23k6j79j44o0J19J26J44N1p9k59l2l8J20J78L2K5j22j60p2Q8
$$ -195 -155 -61 58 181 155 -24 -168 -228 -109 17 161 212 133 -126 -158 -196 -76 102 134 159 37 -123 -195 -107
7951a07J22J59N2j11j16j55j2P0J65J02J6p3j91j40L9J18J49N7L2j73j80j9N5
$$ -107 15 174 226 115 -1 -156 -168 -98 67 169 185 112 -79 -219 -180 -62 87 144 176 3 -177 -196 -141
7974a41J89Q5L1p1j31j48J7O0J57J23m7r3j26j25N8J58J04Q8r8j27q5o9M3K05
$$ -141 48 133 164 93 -38 -186 -169 -109 48 171 124 31 -95 -220 -162 -4 100 188 90 -37 -122 -191 -148 57
7998E7J33J8j18j72q8OJ52J09Q2lj52j31o7K1J96J29J9r0j52j26j1M8J69J11m1
$$ 57 190 208 90 -82 -170 -164 -12 97 179 176 24 -107 -174 -153 43 172 191 101 -51 -177 -188 -140 29 140 99
8023I9q0j28n7M4Q0J88M6p9j37j17j8O0J33Q0O5j25j12j25j1J17J65R7m3j18j82
$$ 99 19 -109 -166 -122 -42 146 192 113 -24 -141 -159 -99 34 114 179 54 -58 -183 -194 -77 88 185 142 24 -158
8048a58oK3J54J62J5q4j27j01j3P3J84Q4o8j02q7j14N4J16J04Q0n6j42j44n3J50
$$ -158 -164 -141 13 175 190 106 -21 -122 -135 -62 122 206 138 36 -51 -165 -111 5 109 189 133 -9 -153 -206 -56
8073e6J30J16J6j04j44j18J1J05J13J51n7j38j10j27P6J14J47O7p6j38j16MO7
$$ -56 74 190 206 102 -42 -160 -149 -44 69 220 163 25 -85 -212 -136 -22 125 192 116 -22 -138 -134 -67
8096f7J57R6Mj41j54n1J0J30J32Q9o4j42j12n3J00Q9J53J2j16q0j03j9Q0J67J18
$$ -67 90 186 190 49 -105 -156 -146 -16 116 205 141 -1 -113 -166 -66 23 176 188 72 -8 -111 -130 -50 117 235
8121B35j01j16j15o3L1J26Q5J02q5j62o7o8J11J09J41K4j23j73q7N4J35J13N9
$$ 235 134 18 -97 -160 -129 -3 82 184 99 -63 -130 -198 -87 22 163 187 64 -109 -196 -142 -7 106 165
8144A65n9r4j27l7P1R8J38K7r5j34m0n2P6J11R3j7q8j36o0J8J13J35O8j01p6r8
$$ 165 106 12 -115 -152 -81 17 155 182 87 -47 -87 -139 -63 48 141 124 36 -100 -160 -142 -29 106 174 73 -3 -101
8170a01q9Q8J42J18K5j66p8j03J8P9J83M5n9p5j61n0P4J39J61l4o0
$$ -101 -190 -102 40 158 183 17 -61 -164 -146 -67 116 161 102 27 -134 -184 -110 29 190 156 96
8191I6
$$ Imaginary data points
##PAGE= N=2
##DATA TABLE= (X++(I..I)), XYDATA
0@%%%%%%Qq%qJ6j6J6k4M0m8N6p2Q8j05J22j46J78k05K38k80L25l77M35m97N68
$$ 0 0 0 0 0 0 0 8 0 0 -8 8 -8 8 -16 24 -24 32 -40 48 -57 65 -81 97 -108 130 -150 175 -202 233 -264 304
31C04o49P35q32R41j062J192j332J492j669J856k059K285k533K800l091L413l767
$$ 304 -345 390 -442 499 -563 629 -703 789 -880 976 -1083 1202 -1331 1469 -1622 1791 -1976
48a976M150m571N037n549O117o747P455q255R160j0202J1412j2836J4547j6641
$$ -1976 2174 -2397 2640 -2909 3208 -3539 3916 -4339 4821 -5381 6031 -6805 7742 -8899
62h899J9276k2712K7393l4180M4961o4765J12919m42632o12655Q24126N18786
$$ -8899 10377 -12335 15058 -19122 25839 -38926 73993 -368639 -981294 -157168 361618
73C61618k00130j42234N32534J90634n80036n03190L16674M22722r2881k68899
$$ 361618 161488 19254 551788 742422 162386 -340804 -24130 398592 305711 36812
83C6812M4861K3884k49519k35369O0980J23878L6410M898m1156j53284j1258K69226
$$ 36812 81673 105557 -143962 -379331 -318351 -194473 -158063 -153165 -194321 -347605 -358863 -89637
95h9637K29355q4843r6235J13959J87k95317r6327L88999L55494j31757k58626
$$ -89637 139718 54875 -41360 72599 72786 -222531 -318858 70141 425635 293878 35252
106C5252r484m0515k86802j01735L45623L26420p2923j71852j9035j22967k84849
$$ 35252 25768 -14747 -301549 -403284 -57661 268759 195836 23984 4949 -118018 -402867
117d02867q201L58602K04589j49573p9931J24086p6172k94368K5146M03678J66407
$$ -402867 -411068 -52466 152123 2550 -77381 46705 -29467 -323835 -298689 104989 271396
128B71396k57488j38727J98955Q3544j95686k7568K79725J04969k80585k45350
$$ 271396 13908 -124819 74136 157680 -38006 -65574 214151 319120 38535 -206815
138b06815O1425J15677l717M8800J29200k6495k07119j49976k0486J8827J18276
$$ -206815 -145390 -29713 -33430 15370 144570 118075 -89044 -239020 -259506 -240679 -122403
149a22403K58685J39421j75464k31959q069M7650q8975J5727L01604K19443j99074
$$ -122403 136282 275703 100239 -131720 -139789 -92139 -181114 -165387 136217 355660 156586
160A56586l01067K2735J69252l6794q3833J68259K08404j11852k68211k8513J68181
$$ 156586 -144481 -121746 47506 10712 -73121 95138 303542 191690 -76521 -105034 63147
171F3147N2719p1637n052J8540j11315j50658j881J13760Q9344M5936N575r9011
$$ 63147 115866 44229 39177 57717 -53598 -204256 -206137 -92377 -3033 42903 48478 -50533
183e0533j51251j7796J43480J34627O8527R4783O3860j33964k37312m9089J60609
$$ -50533 -201784 -219580 -76100 58527 127054 221837 285697 151733 -85579 -134668 25941
194B5941J09730k0670O903K7301j35418k41133o5933J46493J11348j4519K728
$$ 25941 135671 115001 121904 149205 13787 -227346 -293279 -146786 -35438 -49957 -47229
205d7229L5338o7788j16202M4183J85420J01878k5714p462J6642p0519q3816P6121
$$ -47229 -11891 -79679 -195881 -151698 33722 135600 109886 102424 119066 48547 -35269 40852
217D0852J66617K9116j19506r3716m2859r1845q0632P8539J66012L6130j17988
$$ 40852 207469 236585 117079 23363 -19496 -111341 -191973 -113434 52578 88708 -29280
228b9280j09465l9409k9423O060J21320J69545O0675o7726q5400m4729j2126M3135
$$ -29280 -138745 -178154 -207577 -201517 -80197 89348 150023 82297 -3103 -47832 -59958 -16823
240a6823J08301Q9391j2671q3752q1458o1421k9821M4257R4156L3762p1058r1583
$$ -16823 91478 180869 168198 84446 2988 -58433 -88254 -43997 50159 83921 12863 -78720
252g8720m0344q290J6345P9511J07217J9679r1898r2864j5318L1070N1344Q9605
$$ -78720 -119064 -127354 -111009 -31498 75719 95398 3500 -89364 -104682 -73612 -22268 67337
264F7337Q4918j6630j15470r7136j2028L6316N7120Q5489O2231m3894j23394q3213
$$ 67337 152255 135625 20155 -76981 -89009 -52693 4427 89916 152147 108253 -15141 -98354
276i8354N129M1171M7918O4952L7151n9664j18035n8159L7132O4136M7612M2326
$$ -98354 -93225 -52054 -4136 60816 97967 38303 -79732 -137891 -100759 -36623 10989 53315
288E3315J4888n6140q7917j9698P1356Q6753M4502P514k6427p0740p6201q278
$$ 53315 68203 12063 -75854 -95552 -24196 62557 107059 114573 88146 17406 -58795 -67073
300f7073P0279P9562K7252k8280o3656p8855n3982J5965Q0711Q3838K8843l5410
$$ -67073 3206 82768 110020 81740 18084 -60771 -114753 -98788 -18077 65761 94604 59194
312E9194p0344o3180j8383M1596P8294O5752J1579m9021p5829n0384Q333N7551
$$ 59194 -11150 -74330 -92713 -51117 27177 92929 104508 55487 -20342 -70726 -62393 -4842
324d842O8044M0916p215n3685o7102k9042L4450O9711N2994P066l8539o9106o7078
$$ -4842 63202 104118 96903 43218 -23884 -52926 -18476 51235 104229 111295 72756 3650 -63428
337f3428j9839M4285O9079L5780j8540n3111n9247l6728J6385P3865Q6021L8919
$$ -63428 -83267 -38982 30097 65877 47337 -5774 -65021 -101749 -85364 -11499 74522 113441
349A13441k2864n1625m2905j3309K8160O4029N9176L926n9139p9318n1792p540
$$ 113441 90577 38952 -3953 -17262 10898 74927 134103 138029 78890 -428 -52220 -59760
361e9760L0335N0558L7823j0726n9828o4140j9490L4754O2770N8788K9247j7441
$$ -59760 -29425 21133 58956 48230 -11598 -75738 -95228 -60474 2296 61084 90331 72890
373G2890n5986n3170n620M6274O0535L4758p121m4665o3782m7819K785N2945O0407
$$ 72890 16904 -36266 -41886 4388 64923 99681 92560 47895 -15887 -63706 -60921 -7976 52431
386E2431K2347k5181n1036m9272k3049K1915O0062N6640Q563m3213n8491l7242
$$ 52431 74778 49597 -1439 -50711 -73760 -51845 8217 64857 73420 30207 -28284 -65526
398f5526j434L3992N6343M4381m230n1618n5447j8293K3395M6567M9637K7600
$$ -65526 -66960 -32968 23375 67756 63526 11908 -43539 -61832 -38437 8130 57767 85367
410H5367j9727o1177n6064r076L4473M4657L0336K840l5481o2858m5791R442N2867
$$ 85367 65640 4463 -51601 -60677 -26204 18453 48789 51629 16148 -46710 -92501 -83059 -30192
423c0192N2216K3570p952l5975m8913k4593K7885O1334M6883O052k8235m6585
$$ -30192 22024 45594 37642 1667 -47246 -71839 -43954 17380 64263 70315 42080 -4505
435d505m5073j4075L2819N4248L0786j1972m1196m7339l0651P465M6042N1937
$$ -4505 -49578 -63653 -30834 23414 54200 42228 1032 -46307 -76958 -69493 -23451 28486
447B8486J9915k0579m2324l9136j2850K7385N3156M0223N25l2992m4334l4096
$$ 28486 48401 27822 -14502 -53638 -66488 -39103 14053 54276 54801 21809 -22525 -56621
459e6621j657L9909N4630K4809j9813m1579l9137k3363J0292N0260N5491J2351
$$ -56621 -58278 -18369 36261 61070 41257 -322 -39459 -62822 -52530 -2270 53221 65572
471F5572l4322m3574k8435j0697J8501N2174M7811l973m7514m2679j7442n44K1805
$$ 65572 31250 -12324 -40759 -51456 -32955 19219 67030 63057 15543 -27136 -44578 -45122 -23317
484b3317M7745L4912k0284n4132l1780K729J4751K6548M3453K3201l3663n7596
$$ -23317 24428 59340 39056 -15076 -46856 -44127 -29376 -2828 40625 63826 30163 -27433
496b7433k0679K0334K5565K4916L0418M143m8963o0983j2789L1426L3810K6952
$$ -27433 -48112 -27778 -2213 22703 53121 57264 8301 -52682 -65471 -34045 -235 26717
508B6717K3849p563n3696n1031L911M1652L5513K5140J8126j7854n9371m3889
$$ 26717 50566 43003 -10693 -61724 -57813 -16161 19352 44492 62618 44764 -14607 -58496
520e8496J5737M2037K1980Q492O761k1657n4036k9482L1120M8973J7285m213n978
$$ -58496 -42759 -722 21258 29750 36511 14854 -39182 -68664 -37544 11429 28714 24501 18523
533A8523k2912l8139q131L9826M3013P939j6219k6355l9351k9411J8708N1891
$$ 18523 -4389 -42528 -50659 -10833 32180 40119 23900 -2455 -41806 -71217 -52509 -618
545f18L1241j715r427k2044m7302k6455M4619P2036J9443k5020j1803j0323m9150
$$ -618 30623 28908 19481 -2563 -49865 -76320 -31701 40335 59778 34758 22955 12632 -36518
558c6518m1564L8183P4744J0552m8404k4497M147k2761k8004L4550O9420J2323
$$ -36518 -78082 -39899 34845 45397 -3007 -27504 -23357 -46118 -74122 -39572 29848 42171
570D2171m6501k7666Q800J136k245L2519L9556j3809n2145k9046jJ718J7358M6645
$$ 42171 -4330 -31996 -23196 -22060 -24305 8214 47770 33961 -18184 -47230 -47231 -45513 -28155 18490
584A8490K7036l4211n1359j1793J2006P931K9403N7978K3356m6741n6752j0844
$$ 18490 45526 11315 -40044 -51837 -39831 -31900 -2497 55481 78837 32096 -24656 -35500
596c5500Q801R42K1487M3548L718n3313m2753M725J0718P57L0055M6493p840n6339
$$ -35500 -26699 -25757 -4270 39278 42996 -10317 -53070 -48345 -37627 -36870 -6815 39678 31838 -24501
610b4501j6792L8717J9048j4382J6853L8855k5588q0450k2911N6659L6309k0571
$$ -24501 -41293 -2576 16472 2090 18943 57798 32210 -48240 -71151 -14492 21817 1246
622A246n399K5365j9805o9605k0544O1195N9319O574n855J873k4356m3605p143
$$ 1246 -4153 21212 1407 -68198 -88742 -27547 31772 38346 32491 34364 10008 -33597 -40740
635d0740L6013L3204J5484P991j8751n1910k9380K8318L3181n304l98L0255k818
$$ -40740 -4727 28477 43961 51952 33201 -18709 -48089 -19771 13410 8106 7708 37963 35145
648C5145o1523k8721N7706N3223k8009m0487J6600J1675m9225l0779N7812O5056
$$ 35145 -26378 -55099 2607 55830 27821 -12666 3934 15609 -33616 -64395 -6583 58473
660E8473k0446n4729o526J0479k2678o638N7247N8017j0677m2531j7996j1961
$$ 58473 38027 -16702 -23228 -12749 -35427 -42065 15182 73199 62522 19991 1995 -9966
672i966k3209R284N3642L1477k5077l1188p801j7993k7252J7331N5524J9044l1820
$$ -9966 -33175 -23891 29751 61228 36151 4963 -2838 -20831 -48083 -30752 24772 43816 11996
685A1996j8602J2006l192j5982K0595M1069m372m2663j5605J3042k837m356L2155
$$ 11996 -6606 5400 2208 -13774 6821 47890 43518 855 -14750 -1708 -4545 -8901 23254
698B3254K8472l3745n5126l832K4899j677L339N1592L7921m5760o9608j387L6310
$$ 23254 51726 17981 -37145 -40977 -16078 -17755 -14416 37176 75097 29337 -40271 -41658 -5348
711e348L9o631M3743M1083l8604p0633r814L4421Q316n791K6667K7885k3393m2114
$$ -5348 -5309 -11940 31803 72886 34282 -36351 -46165 -11744 -3428 -9219 17448 45333 21940 -20174
725b0174j390K4535P801J737J3552k691l1616j5862K2173J8995o304J95J0444
$$ -20174 -21564 2971 10772 12509 26061 23370 -8246 -24108 -1935 17060 10756 10951 21395
738B1395k2157m7354m920M7584L1976q704k739J1007k4529n2375o255N2023L9371
$$ 21395 -762 -48116 -53036 -5452 26524 17820 15081 26088 1559 -50816 -57071 -5048 34323
751C4323l059m410L790k6792m5955l887M1199K6958l286Q08K694k6201l2932R543
$$ 34323 31264 26854 30644 3852 -42103 -45990 -4791 22167 18881 19689 22383 -3818 -36750 -27207
765b7207L5452P784j4380K892P739j9941j9624K3212L5824n359k9556o892N167
$$ -27207 8245 16029 1649 4541 12280 -7661 -27285 -4073 31751 26392 -3164 -10056 -4889
778d889j2784n479L3071L5243j0992l6215j6887l950r823P749M1128L2334j3404
$$ -4889 -17673 -23152 9919 45162 34170 -2045 -18932 -22882 -32705 -24956 16172 48506 35102
791C5102l2192j5498r280j2790J1300M1804K6532j6149k5979p652o540j2873Q978
$$ 35102 2910 -12588 -21868 -34658 -23358 18446 44978 28829 2850 -4802 -11342 -24215 -15237
804a5237L3937J5956j9526j9821K084L051n045Q973K1090j227k7359j6494Q920
$$ -15237 18700 34656 15130 -4691 -2607 444 -4601 4372 25462 24235 -3124 -19618 -10698
817a0698J0520L620J2284J2504j5019l3919j3734J4530J7493J3134J9379J1560
$$ -10698 -178 3442 15726 28230 13211 -20708 -34442 -19912 -2419 10715 30094 41654
829D1654k0115l5845j3061J3574J6212J3868J8034N801k4173l3511r934J1025
$$ 41654 21539 -14306 -27367 -13793 2419 16287 34321 40122 15949 -17562 -27496 -16471
841a6471J0456R848J4983L443k0180k1129L131J6285Q142L746P429k157j9020
$$ -16471 -6015 3833 18816 22259 2079 -19050 -15919 366 8508 12254 19683 17526 -1494
854a494j3381J0787J8781N066m953n823j2848j9801n744J8716K3482Q026m489
$$ -1494 -14875 -4088 14693 19759 14806 8983 -3865 -23666 -29410 -10694 12788 20814 16325
867A6325r871j7392j8026J406K3765K3128N931n817j1245j8887j8162J619K1970
$$ 16325 6454 -10938 -28964 -27558 -3793 19335 25266 19449 8204 -10683 -28845 -27226 -5256
880e256J9353K279p551r231j1985r460N730J9286J4466j499j1111j0925p240J99
$$ -5256 14097 16376 8825 -406 -12391 -21851 -16121 3165 17631 16132 5021 -5904 -13144 -12945
894a2945J0177J2529L047q770j3518j1742m431Q705J8747J3589k526j3056j2154
$$ -12945 -2768 9761 12808 4038 -9480 -21222 -25653 -16948 1799 15388 12862 -194 -12348
907a2348p774j373J1231K1393J3967o734j9337j5710o232J513J0481J6653J0178
$$ -12348 -20122 -21495 -10264 11129 25096 18362 -975 -16685 -22917 -21404 -10923 5730 15908
920A5908o707j7538j3204j446Q243J3205J2168L150q679j3451q392R00R033J2168
$$ 15908 9201 -8337 -21541 -22987 -14744 -1539 10629 13779 5100 -8351 -16743 -15843 -6810 5358
934E358O972n272j4453j2164j823P460J1848J1612M985p402j5767j1010K793J3193
$$ 5358 12330 7058 -7395 -19559 -21382 -13922 -2074 9538 14523 7121 -8646 -19656 -16863 -3670
948c670J3753P458j880j1198j5727j0509K265J3123J3841N104n964j2381j0902
$$ -3670 10083 17541 15661 4463 -11264 -21773 -19508 -6385 7456 12560 6596 -5785 -16687
961a6687l348O343J3276J3208M403p681j3584q725J921R356J0380O189k166j1301
$$ -16687 -20035 -13692 -416 12792 17195 9514 -4070 -12795 -10874 -1518 8862 15051 12885 1584
975A584j4145o614N622J2432J0045K380o074j1427j0177j089R818J4030R428p4
$$ 1584 -12561 -19175 -13553 -1121 8924 11304 5230 -6197 -16374 -17463 -7645 6385 15813 15739
989A5739r023j2850q498K303J1434J2054N055m133j0953j2389n790N592J2941
$$ 15739 6716 -6134 -14632 -12329 -895 11159 16214 12081 1128 -11261 -17051 -11459 1482
1002A482J0246J002p169j0539q602j068Q626J3024P826k294r468j0218n276L114
$$ 1482 11728 12730 5561 -4978 -13580 -14648 -6022 7002 14828 12534 3066 -7152 -12428 -9314
1016i314J0570J1138L757n896j1174j0023l134O403J2058Q775q66q726j0441p137
$$ -9314 1256 12394 16151 10255 -919 -10942 -14076 -7673 4385 13160 12294 3568 -6873 -14010
1030a4010J30R036J2833O645m450j0409q707l580K925R645J1203L139p990j1559
$$ -14010 -13880 -4844 7989 14634 10184 -225 -8932 -12512 -9587 58 11261 14400 6410 -5149
1044e149p037m20N559J0287R135o00j0411j0875l784L010P407J0123O325m479
$$ -5149 -12186 -12606 -7047 3240 12375 11775 1364 -9511 -13295 -10285 -2878 7245 13570 9091
1058I091j2517r264n6N648P718Q641M003o816j2774o634L763P858P419O240R32
$$ 9091 -3426 -12690 -12746 -7098 620 9261 13264 6448 -6326 -12960 -9197 -1339 6080 12320 13252
1073A3252r105j2966m697N853Q390N583K711k751j0335j0699p66Q864R318N092
$$ 13252 4147 -8819 -13516 -7663 727 6310 9021 6270 -4065 -14764 -15530 -6666 2652 7744
1087G744J185m415r932p202L362J0299P623K282j777p242j1119n249O483J0719
$$ 7744 8929 4514 -5418 -12620 -9258 1041 8664 10946 9169 1927 -9192 -14441 -7958 2761
1101B761N314k59k925p270r432j456J0586J1895L075l024m230p217q326M74J1327
$$ 2761 8075 7816 4891 -2379 -11811 -13267 -2681 9214 12289 9265 5035 -2182 -10508 -10034 1293
1116A293R837p20n980n144o065n544L654J2734Q783k601o714m320m004k457N747
$$ 1293 11130 10410 4430 -714 -6779 -12323 -8669 4065 12848 10247 3533 -787 -4791 -7248 -1501
1131a501J1717M711o791r066m939l136l18P596J0634J672q325p508j874QL537
$$ -1501 10216 14927 8136 -930 -5869 -9005 -9323 -1727 8907 10579 2254 -5254 -7128 -7120 -3583
1146c583J0683J0528j371j0325o996r76k41K435R224P359n753j3188o429J470
$$ -3583 7100 17628 16257 5932 -1064 -2040 -2281 154 9378 16737 10984 -2204 -8633 -7163
1160g163J608K912Q745O681n834j1665l162N253M436L072N809K592p783j0950
$$ -7163 -5555 -2643 6102 12783 6949 -4716 -7878 -2625 1811 4883 10692 13284 5501 -5449
1174e449j910N779M986L059L027j987r343p695K225P395N518M507K909n140j1971
$$ -5449 -7359 -1580 3406 6465 9492 7505 -1838 -9533 -7308 87 5605 10112 13021 7881 -4090
1189d090n918N532P464K689K613K519o291j3272m804Q624R078J363R44K903m136
$$ -4090 -10008 -4476 2988 5677 8290 10809 4518 -8754 -13558 -4934 4144 5507 6451 9354 5218
1204E218j0796k902R487Q500q29k847n38m666q409o72Q915O027k870m561k177
$$ 5218 -5578 -8480 1007 9507 8678 5831 5293 627 -7782 -8454 461 6488 3618 -943 -3120
1219c120m204m122M720J1240N321l864m865k786m445k361P095J1385L024o018
$$ -3120 -7324 -11446 -6726 4514 9835 5971 1106 -1680 -6125 -8486 -1391 9994 13018 7000
1233G000n918l874n075j524P888J0107P67o305m352k721m532m03Q589P906k682
$$ 7000 1082 -2792 -7867 -9391 -1503 8604 9371 3066 -1286 -4007 -8539 -8942 -353 7553 4871
1248D871p291j836K36l010K96Q639O438n545q662j25M184M33J357P310M139p580
$$ 4871 -2420 -4256 -4020 -7030 -6734 1905 8343 2798 -5864 -5989 -1805 -1372 -15 7295 11434 3854
1264C854j0467j426M533K664K808N174M07q676r046j171L611L870N946O267j427
$$ 3854 -6613 -8039 -3506 -842 1966 7140 7547 -1129 -10175 -11346 -7735 -3865 2081 8348 6921
1279F921q737n288K111K922J645N300O214k976j0166m063M570L069j545J328L693
$$ 6921 -1816 -7104 -4993 -2071 -426 4874 11088 8112 -2054 -6117 -1547 1522 -23 1305 4998
1294D998l439r240k337O977N264q69n41P48m199o731P26Q544O027J65n78j632
$$ 4998 1559 -7681 -10018 -3041 2223 1354 813 1561 -2638 -9369 -8643 -99 5928 6093 5515 3883
1310C883o538o374K867Q935M493q18m12j770p439o466L378Q740L226k009p63r91
$$ 3883 -2655 -9029 -6162 2773 7266 6448 6036 4266 -3173 -9639 -6261 2479 5705 3696 2933 1942
1326A942n353m269L871P094J450k814j434j393l419m79N698M951j764m016j412
$$ 1942 -3411 -7680 -3809 3285 4735 1921 487 -906 -4325 -4804 894 5845 4081 65 -1347
1341a347j639k869K152Q387M733m288n925j580j343k906K372Q769M793m985p054
$$ -1347 -2986 -5855 -3703 4684 9417 5129 -796 -2376 -3719 -6625 -4253 4516 9309 4324 -2730
1356b730k160q92j785K537P547M015l890n097r94K19k13L307N692J116m819l623
$$ -2730 -4890 -5782 -7567 -5030 2517 6532 2642 -2455 -3449 -3230 -3443 -136 5556 6672 1853 -1770
1372a770N23N14j88K573L443k286o778l233K118K386J370L151K553l429o780k400
$$ -1770 -1247 -733 -921 1652 5095 2809 -3969 -7202 -5084 -2698 -1328 1823 4376 947 -5833 -8233
1388h233K989L762L068L773J307m724o504j504K487K284K511L848O98n509n805
$$ -8233 -5244 -1482 1586 5359 6666 1942 -4562 -6066 -3579 -1295 1216 5064 5762 253 -5552
1403e552J21L106R75N68K678N09m909m593J691M503J263p99K73n80l483k056L363
$$ -5552 -5431 -2325 -1350 -782 1896 2405 -2504 -7097 -5406 -903 360 -439 -166 -746 -4229 -6285 -2922
1420b922N413K044p65j473k850l861p16M006M517J101j034k225m392m806k29M781
$$ -2922 2491 4535 3770 2297 -553 -4414 -5130 -1124 3393 4494 3460 1235 -3157 -7963 -8192 -3411
1436c411M389R51n97r54k866l146O68M711L702J78j176j190k080j925J300L271
$$ -3411 978 1929 1332 378 -2488 -5634 -4966 -255 3447 3625 2449 1259 -821 -2746 -1446 1825
1452A825R80j965j992j267j465j36L229L981M3l295k547o58n25Q37M120M517j83
$$ 1825 2805 840 -1152 -2419 -3884 -4020 -791 3190 3233 -62 -2609 -3267 -3792 -2955 1165 5682 5499
1469E499m422l838j292J19J390L530L618J95l268l454j516L80K243L155J843q32
$$ 5499 1077 -2761 -4053 -3934 -2544 986 4604 4799 1531 -1923 -3439 -3059 -816 2339 4182 3350
1485C350k231j948j225n7J878K629J83k680k428L6J070Q37J777K243k82l418k942
$$ 3350 1119 -829 -2054 -2111 -233 2396 2579 -101 -2529 -2493 -1423 -586 1191 3434 3152 -266 -3208
1502c208N52K754K389J659P73j350l800l331j78K495L001K188L12k211l562k309
$$ -3208 -2656 98 2487 4146 4919 3569 -231 -3562 -3740 -1245 1756 3944 4256 2045 -1517 -3826
1518c826K29J971K595K306M86k225l245j176J333J896J368Q12m7j795k269k63
$$ -3826 -3597 -1626 969 3275 3761 1536 -1709 -2885 -1552 344 1712 2524 2477 682 -1587 -1850
1534a850K101K212P57p37j712k115j278P12K436K214N87j460k888k781n50K135
$$ -1850 251 2463 3220 2483 771 -1344 -2622 -1910 526 2740 3327 1867 -1021 -3802 -4352 -2217
1550b217L096K073N32j128k654k754m13K613L315J611l67j493k261k161m95J919
$$ -2217 879 2952 3484 2356 -298 -3052 -3465 -852 2463 4074 3707 2214 -47 -2208 -2703 -784
1566g84K527Q75j055j947j874q31Q23K116J767J16j289j780j254L04K260K728
$$ -784 1743 2618 1563 -384 -2258 -3089 -2266 -150 1617 1733 444 -1336 -2590 -2286 -26 2702
1582B702J046j158k078j847r67O00K476K638M47j966k840j997n89J025K544K312
$$ 2702 3748 2590 512 -1335 -2302 -1702 774 3412 3859 1893 -947 -2944 -3533 -2508 36 2348
1598B348L72j871k537j484J37J873K629J644m17j820j803r29M50J862K176N48
$$ 2348 2720 849 -1688 -3172 -3035 -1162 1467 3111 2694 874 -929 -1858 -1408 454 2630 3178
1614C178j658k272j272KR06J863J919mk241k450p05R59J741K003J332o76k628
$$ 3178 1520 -752 -2024 -2022 -1116 747 2666 2662 421 -2029 -2734 -1775 -34 1969 3301 2625 -3
1631ck354l67J325K088J934P41j346k633j710L48J511J960J646L23j852k681j148
$$ -3 -2357 -2724 -1399 689 2623 3364 2018 -615 -2325 -1977 -466 1494 3140 3463 1611 -1070 -2218
1648b218R18J631J377Q94l73k202k442l84J819K024J209L97q22k200j836N15K334
$$ -2218 -1300 331 1708 2602 2229 27 -2415 -2799 -980 1044 2253 2650 1828 -372 -2208 -1693 641
1665F41J925O35l05j494k489j570R92K419J545J84o29j643k239q45J756K728J194
$$ 641 2566 3201 2896 1402 -1087 -2657 -1665 754 2299 2483 1854 211 -2028 -2873 -1117 1611 2805
1682B805l07j007j693j927k03K169K334M89r55j216j604j365P00K727K122r5j160
$$ 2805 2498 1491 -202 -2129 -2332 -163 2171 2660 1705 489 -1115 -2480 -1780 947 3069 2974 1814
1699A814j198j398j003J176K821J527j162j973j449j314o54J507K851J092j548
$$ 1814 616 -782 -1785 -609 2212 3739 2577 604 -845 -2159 -2813 -1306 1545 2637 1089
1714A089k011q65m15K67K089K754O04j907k015p89k44M63K011J962n03k612j926
$$ 1089 -922 -1787 -2202 -1935 154 2908 3512 1605 -410 -1199 -1443 -980 1031 2993 2490 -122 -2048
1731b048m04J43R78K367J759j138k648j285M18P01J213K284J179j973l059q77
$$ -2048 -2452 -2309 -1331 1036 2795 1657 -991 -2276 -1858 -1157 56 2340 3519 1546 -1513 -2390
1747b390P95Q67J056J818N24k367k899m24J464J214J187J452j52k662k501K27
$$ -2390 -1595 -728 328 2146 2670 303 -2596 -3020 -1556 -342 845 2297 2145 -517 -3018 -2791
$$ [...]
8191a11
##END NTUPLES=NMR FID
##END=
