##TITLE=1H ikalashn
AM_NV 169 VAP
25.9.2024
##JCAMPDX= 6.0         $$ Bruker NMR JCAMP-DX V2.0
##DATA TYPE= NMR FID
##DATA CLASS= NTUPLES
##ORIGIN= UXNMR, Bruker Analytische Messtechnik GmbH
##OWNER= root
$$ TOPSPIN		Version 1.3
$$ 2024-09-25 13:50:32.421 +0400  Irina@DPX200
$$ Compression mode = diff/dup
##.OBSERVE FREQUENCY= 200.131392401
##.OBSERVE NUCLEUS= ^1H
##.DELAY= (6, 6)
##.ACQUISITION MODE= SIMULTANEOUS
##.ACQUISITION SCHEME= undefined
##.AVERAGES= 8
##.DIGITISER RES= 18
##SPECTROMETER/DATA SYSTEM= spect
##.PULSE SEQUENCE= zg
##.SOLVENT NAME= CDCl3
##.SHIFT REFERENCE= INTERNAL, CDCl3, 1, 17.95386
##AUDIT TRAIL= $$ (NUMBER, WHEN, WHO, WHERE, WHAT)
$$ ##TITLE= Audit trail, TOPSPIN		Version 1.3
$$ ##JCAMPDX= 5.01
$$ ##ORIGIN= Bruker BioSpin GmbH
$$ ##OWNER= Irina
$$ $$ F:/spectra/data/iren/nmr/1H/4/audita.txt
$$ ##AUDIT TRAIL=  $$ (NUMBER, WHEN, WHO, WHERE, VERSION, WHAT)
(   1,<2024-09-25 13:50:20.093 +0400>,<Irina>,<DPX200>,<TOPSPIN 1.3>,
      <created by zg
	started at 2024-09-25 13:49:42.687 +0400,
	POWCHK disabled, PULCHK disabled
       configuration hash MD5:
       BE 6D 3F 07 2A EA 11 49 91 17 2B D3 AF B3 58 0D
       data hash MD5: 16K
       F6 87 50 38 AF 07 65 84 A3 96 2B 54 B7 58 CA 24>)
$$ ##END=
$$ 
$$ $$ hash MD5
$$ $$ 05 26 10 C4 79 FC 72 34 2F 90 4C 62 D8 30 B6 22
##$RELAX= 
##$RELAX= 
##$RELAX= 
##$RELAX= 
##$RELAX= 
##$RELAX= 
##$RELAX= 
##$RELAX= 
##$RELAX= 
$$ Bruker specific parameters
$$ --------------------------
##$DU= <F:/spectra>
##$EXPNO= 4
##$NAME= <1H>
##$PROCNO= 1
##$TYPE= <nmr>
##$USER= <iren>
##$AMP= (0..31)
100 100 100 100 100 100 100 100 100 100 100 100 100 100 100 100 100 100 
100 100 100 100 100 100 100 100 100 100 100 100 100 100 
##$ANAVPT= -1
##$AQSEQ= 0
##$AQ_mod= 1
##$AUNM= <au_zg>
##$AUTOPOS= <>
##$BF1= 200.13
##$BF2= 200.13
##$BF3= 200.13
##$BF4= 200.13
##$BF5= 200.13
##$BF6= 200.13
##$BF7= 200.13
##$BF8= 200.13
##$BYTORDA= 1
##$CFDGTYP= 0
##$CFRGTYP= 5
##$CHEMSTR= <none>
##$CNST= (0..63)
1 1 145 1 1 1 1 1 1 1 1 1 1 1 1 1 1 1 1 1 1 1 1 1 1 1 1 1 1 1 1 1 1 1 
1 1 1 1 1 1 1 1 1 1 1 1 1 1 1 1 1 1 1 1 1 1 1 1 1 1 1 1 1 1 
##$CPDPRG= <>
##$CPDPRG1= <>
##$CPDPRG2= <>
##$CPDPRG3= <>
##$CPDPRG4= <mlev>
##$CPDPRG5= <mlev>
##$CPDPRG6= <mlev>
##$CPDPRG7= <mlev>
##$CPDPRG8= <mlev>
##$CPDPRGB= <>
##$CPDPRGT= <>
##$D= (0..63)
0 2 0 0 0 0 0 0 0 0.06 0 0.03 0 0 0 0 0.0002 0 0 0 0 0 0 0 0 0 0 0 0 0 
0 0 0 0 0 0 0 0 0 0 0 0 0 0 0 0 0 0 0 0 0 0 0 0 0 0 0 0 0 0 0 0 0 0 
##$DATE= 1727257816
##$DBL= (0..7)
120 120 120 120 120 120 120 120 
##$DBP= (0..7)
150 150 150 150 150 150 150 150 
##$DBP07= 0
##$DBPNAM0= <>
##$DBPNAM1= <>
##$DBPNAM2= <>
##$DBPNAM3= <>
##$DBPNAM4= <>
##$DBPNAM5= <>
##$DBPNAM6= <>
##$DBPNAM7= <>
##$DBPOAL= (0..7)
0.5 0.5 0.5 0.5 0.5 0.5 0.5 0.5 
##$DBPOFFS= (0..7)
0 0 0 0 0 0 0 0 
##$DE= 6
##$DECBNUC= <off>
##$DECIM= 32
##$DECNUC= <off>
##$DECSTAT= 4
##$DIGMOD= 1
##$DIGTYP= 9
##$DL= (0..7)
0 120 120 120 120 120 120 120 
##$DP= (0..7)
150 150 150 150 150 150 150 150 
##$DP07= 0
##$DPNAME0= <>
$$ [...]
##$SW= 21.9925939549014
##$SWIBOX= (0..15)
0 0 2 0 0 0 0 0 0 0 0 0 0 0 0 0 
##$SW_h= 4401.40845070422
##$TD= 16384
##$TD0= 1
##$TE= 300
##$TE2= 300
##$TE3= 300
##$TEG= 300
##$TL= (0..7)
0 120 120 120 120 120 120 120 
##$TP= (0..7)
150 150 150 150 150 150 150 150 
##$TP07= 0
##$TPNAME0= <>
##$TPNAME1= <>
##$TPNAME2= <>
##$TPNAME3= <>
##$TPNAME4= <>
##$TPNAME5= <>
##$TPNAME6= <>
##$TPNAME7= <>
##$TPOAL= (0..7)
0.5 0.5 0.5 0.5 0.5 0.5 0.5 0.5 
##$TPOFFS= (0..7)
0 0 0 0 0 0 0 0 
##$TUNHIN= 0
##$TUNHOUT= 0
##$TUNXOUT= 0
##$USERA1= <user>
##$USERA2= <user>
##$USERA3= <user>
##$USERA4= <user>
##$USERA5= <user>
##$V9= 5
##$VALIST= <valist>
##$VCLIST= <CCCCCCCCCCCCCCC>
##$VD= 0
##$VDLIST= <DDDDDDDDDDDDDDD>
##$VPLIST= <PPPPPPPPPPPPPPP>
##$VTLIST= <TTTTTTTTTTTTTTT>
##$WBST= 1024
##$WBSW= 25
##$XGAIN= (0..3)
0 0 0 0 
##$XL= 0
##$YL= 0
##$YMAX_a= 604162
##$YMIN_a= -551363
##$ZGOPTNS= <>
##$ZL1= 120
##$ZL2= 120
##$ZL3= 120
##$ZL4= 120
##$ABSF1= 10
##$ABSF2= 0
##$ABSG= 5
##$ABSL= 3
##$ALPHA= 0
##$AQORDER= 0
##$ASSFAC= 0
##$ASSFACI= 0
##$ASSFACX= 0
##$ASSWID= 0
##$AUNMP= <proc_1d>
##$AXLEFT= 0
##$AXRIGHT= 0
##$AXTYPE= 0
##$AXUNIT= <>
##$AZFE= 0.1
##$AZFW= 0.1
##$BCFW= 1
##$BC_mod= 2
##$BYTORDP= 1
##$COROFFS= 0
##$CY= 7568.61572265625
##$DATMOD= 1
##$DC= 2
##$DFILT= <>
##$DTYPP= 0
##$F1P= 17.9538593292236
##$F2P= -4.03888763876832
##$FCOR= 0.5
##$FTSIZE= 32768
##$FT_mod= 4
##$GAMMA= 1
##$GB= 1
##$INTBC= 1
##$INTSCL= 1
##$ISEN= 128
##$LB= 0.04
##$LEV0= 0
##$LPBIN= 0
##$MAXI= 945.577
##$MC2= 0
##$MEAN= 0
##$ME_mod= 0
##$MI= -402.1523
##$NCOEF= 0
##$NC_proc= 0
##$NLEV= 6
##$NOISF1= 8.587773
##$NOISF2= 6.764455
##$NSP= 1
##$NTH_PI= 0
##$NZP= 0
##$OFFSET= 17.95386
##$PC= 1
##$PHC0= 104.8706
##$PHC1= 8.628091
##$PH_mod= 0
##$PKNL= yes
##$PPARMOD= 0
##$PPDIAG= 0
##$PPIPTYP= 0
##$PPMPNUM= 100
##$PPRESOL= 1
##$PSCAL= 0
##$PSIGN= 0
##$REVERSE= no
##$SF= 200.13
##$SI= 32768
##$SIGF1= 18.5376
##$SIGF2= -6.396296
##$SINO= 400
##$SIOLD= 32768
##$SREGLST= <1H.CDCl3>
##$SSB= 3
##$STSI= 0
##$STSR= 0
##$SW_p= 4401.40845070423
##$SYMM= 0
##$S_DEV= 0
##$TDeff= 0
##$TDoff= 0
##$TI= <>
##$TILT= no
##$TM1= 0
##$TM2= 0
##$TOPLEV= 0
##$USERP1= <user>
##$USERP2= <user>
##$USERP3= <user>
##$USERP4= <user>
##$USERP5= <user>
##$WDW= 1
##$XDIM= 8192
##$YMAX_p= 0
##$YMIN_p= 0
$$ End of Bruker specific parameters
$$ ---------------------------------
##NTUPLES= NMR FID
##VAR_NAME=  TIME,          FID/REAL,        FID/IMAG
##SYMBOL=    X,             R,               I
##VAR_TYPE=  INDEPENDENT,   DEPENDENT,       DEPENDENT
##VAR_FORM=  AFFN,          ASDF,            ASDF
##VAR_DIM=   8192,          8192,            8192
##UNITS=     SECONDS,       ARBITRARY UNITS, ARBITRARY UNITS
##FACTOR=    0.0002272,     1,               1
##FIRST=     0,             0,               0
##LAST=      1.8609952,     -76,             -132
##MIN=       0,             -551363,         -551363
##MAX=       1.8609952,     604162,          604162
$$ Real data points
##PAGE= N=1
##DATA TABLE= (X++(R..R)), XYDATA
0@%%%%%%%%%%%%Qj6J6j7K5l2L3m1N1o0P4r0J04j21J40j62J87k15K48k84L23l67
34a96M17m72N33n97O70p52Q36r27J031j145J267j401J549j710J886k078K290k522
52a321K777l061L378l732M130m585N107n712O427p283Q329r648J1367j3716J7135
67I592k2631L3314r0144K72853j06849n19015J74526L17072k64393l55688L01423
78b49940L53785j56525k05789J84409J10306j83560r4006J66859J35516M5160
88A06215K8850m5891q8917M5350N2213r3013O69K27551N3839k48989r3376J65783
100A10284m8537k35477R1384K96995o4107k72861K4754J34046j34538j07405K00829
111d633J33081j46333n0058J25081o6297j82819Q7684J86088p0565q6988J45785
$$ y = [0, 0, 0, 0, 0, 0, 0, 0, 0, 0, 0, 0, 0, 8, -8, 8, -9, 16, -16, 17, -24, 27, -33, 41, -49, 55, -66, 74, -88, 99, -116, 132, -152, 171, -196, 221, -251, 282, -315, 355, -397, 439, -488, 543, -602, 665, -736, 813, -897, 989, -1089, 1201, -1321, 1456, -1605, 1773, -1959, 2171, -2414, 2693, -3019, 3408, -3875, 4454, -5194, 6173, -7543, 9592, -13039, 20275, -69869, 202984, 96135, -422880, -248354, 68718, -195675, -551363, -249940, 103845, -52680, -258469, -74060, 36246, -147314, -241320, -74461, 61055, 106215, 135065, 89174, 257, 45607, 97820, 4807, 5476, 233027, 286866, 37877, -55499, 110284, 61747, -173730, -82346, 214649, 150542, -122319, -97565, 36481, -98057, -205462, -4633, 128448, -17885, -67943, 57138, -9159, -191978, -104294, 81794, 11229, -75759, 70026]
122G0026K4109k57858o9624K45323O5100j81687M0030K15178p8385k44822M9507
133a23103J97260l5493r1438J23987J02972j30029j20370N3496N5628p719L5728
144F0919L0718m4281j1227K7491p4128p7739J09259J20546r0350q1186J20408
155I0430L0742k06443n9925K25005Q2875j83509l4197J75563k4128k13218J4121
166a02684J97381j046j30778M7400J04825r0405j24051N4792Q2036l5950k5373
177b3853L9632j8915o6327k453J1703l7000J3461Q0310O55o9801J2982N0557m6776
190e5825l7303J03822Q9312o0710m7523O9564K0868p7903M129R7030P011o6092
202D6380J4463L7324o1462n7280M7646L0229n3754j1484M5465l3826q2453J2545
$$ y = [70026, 94135, -163723, -233347, 11976, 77076, -104611, -64581, 150597, 72212, -172610, -123103, 74157, 38664, -52774, 71213, 174185, 44156, -76214, -22718, 32910, 25191, 60919, 91637, 47356, 36129, 63620, -10508, -88247, 21012, 141558, 51208, -29978, 90430, 121172, -85271, -145196, 79809, 162684, -20825, -55022, 120541, 96413, -116805, -102684, 94697, 93651, -37127, 10273, 115098, 24693, -99358, -44566, 37470, 1520, -23853, 15779, -3136, -69463, -71916, -60213, -97213, -83752, -3442, -2787, -72588, -59606, -9049, -55825, -93128, 10694, 100006, 39296, -8227, 61337, 82205, 4302, 8431, 105461, 112472, 46380, 60843, 98167, 36705, -20575, 27071, 57300, 3546, -7938, 37527, 3701, -78752, -66207]
214f6207M8345m1910m0957N9821L3701p6324m1721N7521J7049m9637J9575P5650
226e094p493n7413J8817M9328j5181j5509M9061L3401k6404n926L1277m191k5718
239A8955K0698L1440j4089j0693K5452l383m3072m133L3225n970k8078J4059J6712
252E1123l8279l5885J9447J3478k9546j1135K4443n350l5877l684J8927r465j4481
265e6284J9081J6230j5335n680K0351K947j4408J1130K4973l71n167J7828P542
278B2837k0969n213K5369J0320j3558J247J1286j2425j7195J1443J3740j3471
290A3411j0746J4310O996j5490n859J0613j68q813Q251J3048p563j2292M772N559
304A6029j0555o925O897K408r007n218j596j0240j0532M624R777l899r879k109
$$ y = [-66207, -17862, -59772, -100729, -40908, -7207, -83531, -125252, -67731, -50682, -100319, -80744, -5094, -12587, -70000, -51183, -1855, -17036, -32545, 16516, 49917, 23513, 17587, 48864, 44673, 18955, 39653, 71093, 57004, 46311, 71763, 68380, 25308, 21175, 54400, 48430, 20352, 34411, 51123, 12844, -23041, -3594, 9884, -19662, -30797, -6354, -11704, -47581, -51265, -32338, -41803, -56284, -37203, -20973, -36308, -41988, -21637, -18690, -33098, -21968, 3005, 2634, -2533, 15295, 22837, 1868, -3345, 22024, 32344, 18786, 20033, 31319, 18894, 1699, 13142, 26882, 13411, 2665, 16975, 23971, 8481, 2622, 13235, 13067, 4254, 12505, 25553, 17990, 5698, 10470, 16029, 5474, -1451, 5446, 7854, -1153, -6371, -7967, -18207, -28739, -24115, -14338, -18237, -28116, -30225]
318c0225K425R95K578M772J04j246N713J0334L593l664j702M115P381O905L552
333A5630j025k240L62K684K722O73r14j18J304J82n202o477p12M448J669l933
349I053m892l228n96K712L175j765o399k412N776M729l349p915n181p03J356J104
365h535k943q535p533j20M738M16l796j391L760N547M585L923L235M119P197R114
381A3781N105P4K82N786N953O50m378l797p00J933N14l912q417p458r11L833K30
398H568p420r152l376K322J875k700n088m969k084K731M589o71n054j078O306
413a5201N890L2K60L729L016J788L471K249k841j443O319M274n971p532K196M662
429D898P24J15J093l715l556P229J1195q43p623J656P120O99k616M49l661q070
$$ y = [-30225, -27800, -26805, -24227, -19455, -19351, -20597, -14884, -4550, -957, -4621, -6323, -2208, 5173, 12078, 15630, 14605, 12365, 12727, 15411, 18133, 18806, 17892, 17774, 19078, 19260, 14058, 7581, 6869, 11317, 12986, 9053, 4161, 933, 337, 3049, 6224, 4459, -1940, -4352, 1424, 6153, 2804, -5111, -10292, -10995, -9639, -8535, -11478, -20013, -27546, -27666, -22928, -22512, -26308, -27699, -23939, -18392, -13807, -9884, -6649, -2530, 4667, 13781, 18886, 18960, 19242, 25028, 30981, 31631, 27253, 23456, 22756, 24689, 25203, 21291, 12874, 5416, 4505, 8338, 8568, 1148, -8004, -11380, -9058, -7183, -9883, -14971, -19940, -22024, -19293, -14704, -15375, -20429, -21507, -15201, -9311, -9279, -9019, -5290, -2274, -486, 2985, 5234, 2393, 950, 7269, 11543, 5572, -1960, 236, 4898, 5622, 5737, 6830, 3115, -441, 6788, 17983, 17140, 9517, 11173, 18293, 18992, 16376, 16825, 13164, 5094]
445E094q88O073l771j3792o154K855j642m560J646J887n263j930O469J831n433
460a7578K152J1400L895n304j463K327j007J619Q687K917p654k506O929K267m817
475A864J6L441r80J81O331j422j2776o228O835L512l903O05J735q112p454N852
491a0503O772l350J841J2076L214r278k158O928P97m11R580N036j1835r162N803
506E350L46j2046p23J3101K62j0624J727N644j1406r487J6248J9047n576j0264
520A599M559R61j2441j839J4114M928q945l030K458q407j0333K971O996K192M597
535C80M345q000q677O254O657n334M548K0590M034j9353n263J4093k849j4063
549b638J4591K7872p735k8196J35J4425j0271j3736J6713J7214j5735k1344J869
$$ y = [5094, 4206, 10279, 6508, -7284, -13438, -10583, -12225, -16785, -15139, -13252, -18515, -20445, -13976, -12145, -17578, -15426, -4026, -131, -5435, -6898, -4571, -5578, -3959, 4728, 7645, -9, -2515, 4414, 6681, 1864, 1880, 5321, 4341, 4522, 10853, 9431, -3345, -9573, -2738, 774, -3129, -2524, -789, -8901, -16355, -10503, -3731, -7081, -5240, 6836, 10050, 772, -1386, 5542, 6339, 5928, 15508, 20544, 8709, -453, 5350, 5696, -6350, -7073, 6028, 6290, -4334, -2607, 3037, -8369, -17856, -1608, 17439, 11863, 1599, 6158, 7119, -5322, -7161, 6953, 11881, 2936, -94, 2364, -6043, -16376, -13405, -6409, -4217, 380, 4725, -3275, -11952, -5698, 959, -4375, 173, 20763, 24797, 5444, 181, 14274, 11425, -2638, 11953, 39825, 32090, 3894, 4029, 18454, 8183, -5553, 11160, 28374, 12639, -8705, -6836]
562f836J526j4629n161J3231O472p758n436l255q060p15J0560P488L659J0873
576A959N612j4502j1902J1948J2579l429L329J5222l771k4043p117J1520K45n082
590g432J1520R444j3308j1654N760j225r038J3714K3156p488j7718J1406R757
603A6894k6082j3737L4523K2224k8706j6239K6153k18m4247o176M6623J2430l8157
616a4715r228K8921n194l8173M19L6622Q336k1129k752J6540n97j7071m524J7751
630d794K2239L801j4903m122J7652K970k6071l660L9800J6313l6786j6432L1460
643B7467J626m6360m024N2275Q529m8946r006L7926m963m1972P715M1385l358
656A8294k7989J0554J9437j9418k0430J6572J6357q056m45Q888j2279j7572Q146
$$ y = [-6836, -5310, -19939, -25100, -11869, -5397, -13155, -18591, -21846, -29906, -30621, -20061, -12573, -8914, 1959, 7571, -6931, -18833, -6885, 5694, 2265, 5594, 20816, 17045, -6998, -14115, -2595, -2350, -7432, 4088, 13532, 224, -11430, -5670, -6895, -15933, -2219, 20937, 13449, -4269, 7137, 16894, -9188, -22925, 11598, 33822, 5116, -11123, 15030, 14812, -29435, -35611, 11012, 23442, -14715, -23943, 4978, -216, -38389, -37970, -1348, 6988, -14141, -16893, -353, -950, -18021, -22545, -4794, 17445, 21246, 6343, 2221, 19873, 22843, -3228, -6888, 32912, 49225, 12439, -3993, 27467, 29093, -17267, -21291, 30984, 39513, -9433, -18439, 19487, 14524, -27448, -19733, 21652, 18294, -9695, 859, 20296, 878, -19552, -2980, 13377, 5321, 4876, 13764, 1485, -16087, -7941]
669g941Q490j3281n79K2582m90k7269m519J7816m602j3291J6533K0382j2143j5642
683a3954J0163O971r831K868J4605r35k589J2970k455k5435J81K7404k446k3721
697f204J4925K5841k8624l7898K4862L2415l0695k7282L7614K5783m3459l0315
709d3037L4639J9834l2140p810L7383P978l3302q214K2783K069j4954N287J6016
722F532J902m362n449j1509k017J6112N390j1743N025J6054j5478k7990J3138
735a4395K7433j3455j9762K5177K2777k8899k5797K3916J7886j9773j940L0862
747B4030K414l0113l070J9378o610j4046J7771J7667j4952j2415Q813o109j9687
760a6929J1514K6992o611j9906Q245P505k3042j0849K4612J1846j7648m90J8584
$$ y = [-7941, 549, -12732, -13311, 9271, 8781, -18488, -23007, -5191, -9793, -23084, -6551, 13831, 1688, -13954, -3791, 3180, -6651, -3783, 10822, 9887, 7298, 20268, 17813, -7622, -7441, 19963, 17517, -6204, 8721, 34562, 5938, -31960, -7098, 25317, -5378, -32660, 4954, 30737, -12722, -43037, -8398, 11436, -20704, -28514, 8869, 16847, -16455, -24669, -1886, 183, -14771, -9484, 6532, 8434, 4072, -1377, -12886, -14903, 1209, 6599, -5144, -119, 15935, 457, -27533, -14395, 13038, -417, -20179, 4998, 27775, -1124, -26921, -3005, 14881, -4892, -6832, 24030, 26444, -3669, -6739, 12639, 6029, -8017, 9754, 27421, 12469, 54, 8867, 2758, -16929, -5415, 21577, 14966, -4940, 3305, 10810, -12232, -23081, 1531, 13377, -4271, -4761, 13823]
773A3823r958k7636M244K1548q92n338J4306L038k2016q394J4418J990o945J4107
787F295J5605j4141j7628O030K856j2534O769K5941j98k2434k098J0048j0138
800e627r927J8479J6906j0376p310R279n566k0501K963K1763K927q371N577N66
814A0782k0726j0703J5840Q741p639M667J2750j1431k1542K644J2468l480k43
827g872J6975L605k0565r973R794N01o851J1663J5911o681j2981L055J693j0502
841a2228K945K1506Q062j0627l480K097r679p900J2842J3524m194n297L121o355
855D337j5419l89J1850L093k043N062pj4543q907P483N747k416N382R803n806
870C227j3712j191N019k108J849J3145O202j0087q500J476L09j555P958J0031
$$ y = [13823, 3865, -23771, -19527, 2021, 1129, -4209, 10097, 13135, -8881, -17275, -2857, -867, -7812, 6295, 21900, 7759, -9869, -3839, -983, -13517, -6748, 19193, 18995, -3439, -5537, 4511, -5627, -15554, 2925, 19831, 9455, 2145, 11424, 5858, -14643, -11680, 10083, 13010, 4639, 10216, 10782, -9944, -20647, -4807, 3934, -3705, 962, 13712, 2281, -19261, -16617, -4149, -7629, -7872, 9103, 12708, -7857, -17830, -8036, -7535, -14386, -2723, 13188, 6507, -6474, -3419, -1726, -12228, -9283, 12223, 20285, 9658, 6178, 8275, -1404, -9304, 3538, 17062, 12868, 7571, 10692, 4337, -11082, -11471, 379, 3472, 1429, 6491, 6484, -8059, -16966, -9483, -3736, -6152, -770, 9033, 3227, -10485, -11676, -6657, -8765, -6916, 6229, 12431, 2344, -6156, -4680, -4371, -5926, 2032, 12063]
884A2063j260o788j793k399n738J655R116L617k670J5j746q329m426P237P331
899E885p01J292M590m033j0136j372O590K526m39M117J076r095q851J40K812J57
915e442K009L373k531o004k448L52o50K498O680L767k424k124L09j673j119M727
931g00O580J014j880m70j147l449j380M233M874P19j334k117l150k385K68K325
947B001K050P29q05k753k523l55l36j19J930L345J57k806j833Ln13k15K649K284
965B890q59k493j522j381j812L8J939J235l90j220j756j618R79K469J850L28J158
982a65J571o90j033J227K004l96M67K248R90k721k294P33N70q59M65J230r69j990
1000C88o56J21o96RJ295L19j396m45l25q06o9J886K32k007K06K110j63j696O46
$$ y = [12063, 10803, 4015, 2222, -177, -5915, -4260, 4856, 8473, 5803, 5818, 4072, -4257, -8683, -1446, 5885, 5184, 6476, 11066, 7033, -3103, -4475, 2115, 4641, 4202, 8319, 9395, 300, -8551, -8411, -5599, -5442, -3433, -60, -2591, -8595, -11043, -10691, -11341, -8843, -2163, 1604, -820, -2944, -2635, -4308, -5427, -700, 5880, 6894, 5014, 4544, 3397, -52, -1432, 2801, 7675, 8394, 7060, 4943, 1793, -592, -324, 2001, 4051, 4780, 3975, 1222, -1301, -1656, -1992, -2111, -181, 3164, 3321, 515, -1318, -1315, -1828, -2043, 606, 2890, 2031, -462, -1984, -3365, -5177, -5139, -3200, -1965, -2355, -3575, -5331, -6949, -5970, -3501, -1651, -1323, -165, 1406, 716, -317, 910, 2914, 2518, 2985, 5233, 6223, 3502, 1208, 1941, 2511, 1652, 2117, 3347, 2378, 388, -268, -147, -843, -834, 461, 780, -616, -1061, -1386, -2192, -2261, -375, -143, -2150, -1944, 166, 3, -1693, -1047]
1019a047J796p01n48K733J392k817j431K718Q17k064K73K278j513k682J514J343
1035B061k837j491L076J71l887q0K874j458l092K087K531l352k081M323K159m734
1051c730j038N334O27l667K400M814k554l972M630M531l899k675M984J162n217
1066A730R9M692k367n625K171L825m563m013L909J088n481q67M981j441m972L274
1082c560M450m296l986N771K830n250l11O216j400o156L684O179m408n056N808
1097E15L790o555j634P468m53p295K607Q135m198o598N857N655o749l354Q561
1112E752J732q617O16Q300l223q159M975O733p130n919O789J840r015k38Q210
1127B646l128r228M484P271p043n748Q432L414q918J66J1208j420j0410N015J0910
$$ y = [-1047, 749, 48, -500, 2233, 3625, 808, -623, 2095, 2912, 848, 1121, 3399, 1886, -796, 718, 2061, -776, -2267, 809, 980, -2907, -2987, -113, -1571, -4663, -2576, -45, -3397, -5478, -1155, 1004, -3730, -4768, 566, 1193, -2474, -74, 4740, 2186, -1786, 2844, 7375, 3476, 801, 5785, 6947, 1730, 1829, 6521, 4154, -1471, 700, 4525, -38, -4051, -142, 946, -4535, -5402, -421, -1862, -6834, -3560, 890, -3406, -7392, -1621, 1209, -4041, -4352, 1864, 464, -5692, -2008, 4171, -237, -5293, 515, 4305, -2250, -3884, 3584, 3131, -4164, -1557, 6578, 2380, -4218, 1639, 7294, 545, -2809, 5752, 7484, -1133, -517, 7783, 4560, -3599, 1376, 8109, 979, -4940, 1849, 3689, -5326, -5564, 2646, -482, -9710, -5226, 2045, -4998, -10746, -2314, 1100, -7818, -7652, 3556, 2136, -8274, -3259, 7651]
1142G651n411p603R841P327j0043m213J1421J855j1199J272J1777l798j1185M217
1156A909P606p329o099P899K642r457r22Q269l909q480N067O692p128l357Q857
1171B260j56j1577J946J1893m090j0079P658R132j1171q324J1898N646j2847j379
1185i190J5047o92j5312K425J3068m793r592R469R715r706n906J0372K177j0534
1199c452K338J2162k399q983M969N150r853m088J1867K342j1003r1R014o372j1633
1214a0032O450Q481q136n062J0112J031j3795j117J1816j563q743P980R313j0098
1228c363q261J0725M453j1523J338J6393j205j5366K262J1779p475r967J2712
1241B502J1432j1439r328R940L314j2533p82J3830J753r228J654N012p144n581
$$ y = [7651, 2240, -5363, 4478, 11805, 1762, -2451, 8970, 10825, -374, 898, 12675, 8877, -2308, 1909, 9515, 2186, -3913, 3986, 6628, -2829, -3751, 4518, 609, -7871, -2804, 3888, -3240, -6597, 2260, 2104, -9473, -7527, 4366, 276, -9803, -2145, 6987, -4184, -12508, -610, 5036, -7811, -9190, 5857, 5165, -10147, -7722, 5346, 553, -9039, 430, 10145, 439, -5467, 4905, 7082, -3452, -1114, 11048, 8649, -334, 4635, 9785, -68, -4156, 7711, 10053, -950, -1041, 7973, 1601, -10032, -3582, 4899, -3237, -8299, 1813, 2844, -10951, -12068, -252, -1815, -10558, -2578, 6735, -3363, -11624, -899, 3554, -7969, -6631, 9762, 8557, -6809, -4547, 7232, -243, -10210, 2502, 13934, 2495, -6833, 3107, 6421, -6112, -6894, 6936, 8689, -539, 1115, 6127, -1017, -6598]
1255f598P793N094l867J755M221p399p866O512M965p323J102J2439k507j6223
1269g902j8J1615m401r305J1453J2121j2616j2862Q868O727j1375j655J5693L486
1283I829j3314k197P670n249p946R276J0701n591n880N000j987j0087K569J1840
1297D634L60n691M897L392j0743o611R468O474m327J782P525m948j1765J221O980
1312B648j719p87P742J036j0212m427L418k638l025Q818P611p322p776L972m01
1327c062q439L456J4384J237r785N74N130p537p251R454J0814l934m453M373k030
1342B931j1034n21R966K937l160K790K018q645o539M907M495j194L742O851l939
1357E605r615j77M755j067N32Q618L239p956n949J776j275l115M732P258j877
$$ y = [-6598, 1195, 6289, 2422, 4177, 8398, 999, -6867, -355, 4610, -2713, -1611, 10828, 8321, -7902, -7920, 3695, -706, -10011, 1442, 13563, 947, -11915, -3047, 3680, -7695, -9350, 6343, 9829, -3485, -5682, 1988, -3261, -11207, -1931, 8770, 3179, -2701, 2299, 312, -9775, -7206, 4634, 4994, -697, 4200, 7592, -3151, -9762, -294, 6180, 1853, 3635, 11160, 6212, -5553, -4332, 2648, 929, 142, 7884, 8920, -1292, -5719, -2301, -4939, -7964, 854, 8465, 1143, -6633, -2661, -3062, -11501, -8045, 6339, 7576, -2209, -1635, 3495, -4042, -11293, -1839, 8975, 5041, 588, 4961, 2931, -8103, -8624, 1342, 4279, 1119, 3909, 5927, -2718, -9257, -4350, 145, -1049, 2693, 9544, 5605, -4010, -4187, 568, -499, 33, 8651, 11890, 3934, -2015, -239, -1514, -4629, 103, 7361, 5484]
1372E484o219j493k289n469J204Q178L023l633J27J95o509m399O857P354j045
1387A366j93M661k219r193j048P859K988j598L386L079o293p572J423M065R9J251
1403B061M820n84o365l326R81k96R24N850L643l124l814o36j759j722L587N528
1419E768J59k869j149k581m442r43M119K583p07j06j064n075m169K521L530N03
1435c922J137L278j201n434q26M449J658J05M316M423k811n110L69L066j7N37
1451D017M139J707l976l812l64j21p66J134K354p5k453k382k485j573J009K564
1467a083R87m68r9j094k899q91K261K112K65R54J402j516l160p27J852J441P49
1484H6J132J92j906j563j92L52N08J800J769o89r75m14o71r82J365L172J274j431
$$ y = [5484, -735, -2228, -4517, -9986, -8782, -604, 2419, -1214, -1087, -892, -7401, -11800, -4943, 2411, 1366, 1173, 5834, 3615, -5578, -6626, 1233, 4221, 2623, 6009, 9088, 2795, -4777, -3354, 711, 810, 2061, 6881, 6297, -68, -3394, -2413, -2709, -1785, 4065, 7708, 4584, 770, 134, -1625, -3347, 240, 5768, 5927, 3058, 1909, -672, -5114, -6057, -1938, 645, -62, -168, -1232, -6307, -10476, -7955, -4425, -3922, -2785, 493, -708, -6142, -6968, -2519, -861, -756, 3560, 7983, 5172, 62, 431, 3497, 3480, 4017, 8156, 9863, 5887, 2075, 1711, 1590, 824, 1958, 4312, 4237, 1784, -598, -3083, -4656, -3647, -1083, -96, -564, -663, -1757, -4656, -5547, -3286, -1174, -909, 45, 1447, -69, -3229, -3956, -2104, -663, 86, 1218, 1410, -496, -2059, -2251, -1899, -1391, 409, 2178, 1489, 514, 100, -571, -1553, -188, 2984, 4258, 2827]
1502B827p37K38j151j384J189K297O2j130l33k08j705k061O31J471P41n39q66
1519f58j109j028k13J55N57J146J007k59j044j31L57o31L48K506J445q49j690
1536i1K92P78j025m56J753J150p95j084q9j06j183n49J317J363Mq68j179j57J53
1555g72l3L47R62R46l46j236l64L40k61m52J256J609o18j797o52M15J4k77L95
1574e24J209j50q48l63m33n2J30Q59Q31O03n87j355n91P68Q23q0n8J071M6j422
1594a23q78P11N30m76K97J518J21j755r33R14N80k27J37J091j18j024m13r4k12
1613c54K05N23L19l50k48q62r11l9J380J99p29J85O10q41q21M06J142r6k36J229
1633G11M47j310o86O49N98J18j9M93p61p50J82k71m17J55R83j95p78K15L82q73
$$ y = [2827, 2090, 2328, 1177, -207, 982, 3279, 3341, 2211, 1878, 1670, -35, -2096, -1465, 6, 747, 208, -658, -1767, -2795, -3008, -2853, -2296, -1150, -143, -402, -1446, -1577, -1220, -1851, -1503, 1003, 2448, 1599, -91, 201, 979, -46, -502, 1251, 2401, 1606, 522, 433, 327, -856, -1405, -88, 1275, 1279, 411, -768, -925, -772, -805, -458, 504, 1450, 1104, -132, -496, -156, -417, -869, 387, 1996, 1378, -419, -1071, -656, -642, -919, -524, 685, 535, -313, -676, -1109, -1161, -1031, -172, 659, 1262, 675, -680, -1271, -503, 320, 240, 182, 1253, 1299, -123, -1001, -290, 240, -236, 61, 1579, 1700, -55, -988, -74, 506, 279, 416, 1507, 1389, 365, -48, -142, -354, -149, 374, 693, 343, 95, -767, -1678, -1717, -337, -138, -867, -682, -72, -913, -1734, -1328, -186, -282, -518, 711, 1158, -152, -838, -189, 409, 527, 508, 1001, 240, -510, -328, -599, -1016, -861, 122, -73, -851, -636, -254, -1127]
1653a127l49J894J004j161m05J449M29j244K13J593N5r80O79Q90j372j338O40
1670H70Q30j062m21L91r85j306J44R14j012j038J020N11j126m30J505j37j297
1687b629J176J973q43j380J350J574j567o92J971P06j759J53J605n15k000Q25
1703e2J477o77o95Q55L39j254J06J889l31j394J117J338j030q76J623J23j941
1720F17J05K154q20k863P56J601j825k052J576J012k694r26K266j90k964M09K807
1737a031p10k096J578K055j798q71K906R64k320O17K956q0k362J277J975j510
1753A550j340K646O29l154l90K698n35l036J285K156k381k114K167J476l568n87
1769b498L395j50l264P10K918j834k292K696K082k805j609L210Q12l278q5L297
$$ y = [-1127, -1476, 418, 1422, 261, -144, 1305, 1734, 490, 703, 2296, 2351, 1371, 2050, 2940, 1568, 230, 870, 1700, 638, 217, 608, -377, -1683, -1539, -625, -1637, -2675, -1655, -1144, -2270, -2700, -1195, -1332, -2629, -1453, 520, -323, -1703, -353, 1221, -346, -1038, 933, 1639, -120, 33, 1638, 1123, -877, -52, 1425, 748, 53, 908, 1247, -7, 99, 1988, 1657, 263, 1380, 2718, 1688, 812, 2435, 2558, 617, 722, 2876, 2056, -807, -51, 1550, -275, -2327, -751, 261, -2433, -3359, -1093, -1283, -4247, -3838, -1031, -1741, -3837, -2259, -204, -2002, -2873, 33, 997, -1323, -706, 2250, 2170, -192, 1085, 3060, 1550, 210, 2856, 3485, 331, -59, 2639, 2104, -932, 353, 2509, 128, -1986, 181, 1657, -1911, -2498, 897, 747, -2517, -1807, 1111, -723, -3015, -319, 1763, -1042, -2651, 559, 1371, -1907, -1992, 1305]
1785A305m76k754J749K129k556j810L000J548k742n3K620r65k843J794K376k146
1801A76j588L128O78l493o6L393r28l068K281K959l244k702L239J837m153r36
1817b487M615N6m646N97L789k154l559K930L780l368k478L119J244l668K19L887
1833A876k98l028J423K533k376k036L077J398l042M79L118j690l343J549K874
1848B514k817j626L603J095m598q18L980r31l525K140M004k953l539K830K003
1863A362l339o77M381N26m125O17L648j795l407L061L018k692j841L229K30m487
1879b291L03M318r13l243J975K275l639k681L488J661l370K20L607j331l872J499
1895a994L018k033j682L623J518m027k08L402r00l272K280L930k258k992K957
$$ y = [1305, 829, -1925, -176, 1953, -603, -2413, 587, 2135, -607, -660, 1960, 995, -1848, -54, 2322, 176, -1412, 1716, 2394, -1099, -1165, 2228, 1300, -1768, 513, 3472, 228, -2474, 765, 2602, -1551, -2487, 2128, 2184, -2462, -1865, 1924, -230, -3789, -859, 2921, -447, -2925, 194, 1438, -2230, -2011, 1876, 1578, -1450, -27, 2506, 130, -1906, 1171, 2569, -473, 6, 3124, 1434, -1909, -360, 2514, -303, -1929, 1674, 2769, -1829, -2647, 1333, 402, -3123, -983, 3021, 68, -3471, -641, 1362, -1977, -2654, 1727, 2253, -1872, -1255, 2393, 598, -2809, 252, 3270, 578, -1263, 1966, 2196, -2291, -1988, 2330, 1417, -1826, 149, 2424, -1215, -3896, -408, 1253, -2117, -1897, 1710, 379, -3493, -1994, 1024, -1009, -2691, 932, 2450, -1577, -1785, 1617, 717, -2555, -275, 3655, 1397, -1595, 1362]
1910A362J447l975p32M679M77l782L76L206k411l331K625L082k687j533K877K42
1926A922l954N04L386r92k742K265K542l201k499K844R10l380L77L770q75l838
1942b961J023K363k416k075L312K070k795r18K458l27k912J525L501q67j815K395
1958A561J035k777m25K974J57k047J632K521k462l052K120J542k577m28L376l46
1974B804m391j75L058j563k994K562K958k670k579K140R61k955k0L603M44k658
1990a475M58J924j551k099K179J649j147l29J835q84k822L74K161j45p35J832
2006A225O76k944p35K054j22j198J433K763j492k022J021Q71k017KL116O18k654
2023E95l25J373j674k232J963K406j542j119J120k73l163m22L017P65j170L48
$$ y = [1362, 2809, -1166, -1898, 2781, 3258, -524, -148, 3058, 647, -2684, -59, 3023, 336, -1197, 1680, 1922, -2032, -1528, 1858, 866, -1876, 389, 2931, -270, -2769, 75, 985, -2395, -2018, 1752, 877, -2961, -1938, 425, -1991, -4066, -754, 1316, -1479, -2397, 61, -266, -3178, -1653, 1848, 981, -834, 1561, 2596, -181, -606, 2368, 2525, 478, 2110, 4631, 2169, -883, 1237, 2779, 202, -226, 3150, 2804, -1587, -1762, 1296, -267, -3261, -699, 2259, -411, -2990, -850, 111, -2844, -2864, 739, 1183, -1475, -1017, 907, -644, -2743, -564, 1085, -62, -391, 1444, 560, -2262, -1888, 273, 128, -607, 1225, 1901, -1043, -1778, 276, 154, -1044, 389, 3152, 1660, -362, 659, 1530, -487, -485, 2631, 3249, 595, 270, 1643, -31, -2263, -300, 2106, 564, -555, 565, 292, -2871, -3293, -276, 489, -681, -333]
2039c33J257k058j774J502J509p65K64J952l81k230n15J242l42J50K091Q54j964
2056D59j157L89k53r58J415K368o46j505J82j95j649k27K495J438j471m89P54
2073I50j218j843R85K125j21l63O89N0k306j209J490O33J64R27N27j514j735J02
2091a667P15j67J232J521l31j825l56J0k91L09J997J145j101j107J0n42r83J105
2109c26J872R0p64j44J22j885l98J432J323J64K81j09j672j498L04J410M04J48
2127G54N27o91j789q79O93J32L45R68P49p34j346k38K71k4M75J827K39j042m06
2146a69l39n21j18J208J192j0n71k35j176q16Q04J327N99l48P9n38j164m42P74
2165d64O47L32M40Q6q50j104K60L30M57N64Q91J86j057r33J44LJ25J018L65m59
$$ y = [-333, 924, -1134, -2908, -1406, 103, -662, -398, 1554, 1173, -1057, -1572, -330, -672, -522, 1569, 2423, 459, -698, -309, -562, -1520, -105, 2263, 1617, 112, 294, 99, -1550, -1777, 718, 2156, 685, 196, 950, -268, -2111, -1126, 999, 878, 515, 1204, 1254, -1052, -2261, -771, -138, 26, 953, 1480, -34, -1769, -1667, -952, -1119, 113, 1634, 1303, -522, -878, -868, -1159, -850, 1147, 2292, 1191, 84, 94, -448, -1431, -326, 1546, 1636, 872, 728, 850, -1035, -1433, -1, 1322, 1486, 1767, 1658, -14, -1512, -1208, 202, 606, 754, 1281, 590, -1199, -2078, -1385, -1253, -908, 60, 809, 75, -1271, -1509, -1238, -1262, -787, 1040, 1279, 237, -169, -508, -1029, -1147, 61, 1253, 1243, 672, 437, -739, -1555, -751, 576, 1175, 827, 906, 368, -796, -1238, -464, 183, 515, 955, 1041, 191, -913, -653, -323, 134, 698, 1589, 1775, 718, -215, -71, -68, 57, 1075, 1440, 981]
2185I81j066m12n64n42N39J175K5r51j59k68p50l3J092R67j05P1K53n25p53L53
2205f72Q25K66K14O09j75j060o29K48L57M58Q37M17o39r94K5K32l8L47Q09j57
2225A280p35k44j2j99n65O94N75k45k44o9k60o92J70O12J20p5k78j56j000m90
2245a813L56J94N5K22J00o28n40K91Q57o4K82Q34J07k78O7N36M3n7N47P08k09
2266A610o90R3q9n43l5N92L4p67l3m7o42k33M02L67n08J9R3l62n20K31N81M9m78
2289h76N65L22l39m4L76Kj63M11P67j02o87L2K90k98K13L64k26o07o4L67k30l27
2311b54L30P28l28m19N10J85q23L30N32J39o39JO90m51o35K66K4p20K9N93k19
2332a31r33%M81l9m79N98M16p30j0N94L80o36L08N06K12n89K58P24q40j10P68
$$ y = [981, -85, -497, -1061, -1603, -1064, 111, 136, -815, -974, -1242, -1992, -2025, -933, 34, -71, 0, 253, -272, -1025, -672, 153, 419, 633, 1242, 1067, 7, -622, -374, -17, 441, 1278, 1695, 1056, 62, 87, 319, 281, 628, 1437, 1280, 545, 301, 289, 90, -475, 219, 794, 549, 305, 236, -24, -716, -546, 66, 186, 111, -167, -323, -1323, -1813, -1457, -1263, -1208, -986, -886, -1514, -2054, -1763, -906, -970, -688, 146, 253, -25, 42, 578, 621, 564, 1111, 1819, 1610, 920, 1013, 924, 381, 346, 938, 972, 205, 172, 125, -517, -750, -348, 19, -489, -470, -377, -739, -1259, -1028, -447, -398, -876, -311, 11, -328, -372, 4, 6, -157, 254, 1021, 919, 232, 264, 554, 256, 469, 833, 607, 0, -64, 303, 73, -254, 76, 804, 476, 57, 567, 752, -71, 259, 791, 930, 291, 292, 982, 531, -104, 162, 186, -534, -505, 88, -131, -1064, -1064, -583, -622, -1101, -503, -87, -817, -827, -233, 147, -489, -181, 325, 537, -52, 206, 930, 90, -20, 748]
2353G48J15o11k21P35j60n16P2L45k45m60L56J99q57k98N47M2m07Q4L94l23m12
2374h73N75L30m02l88M93O69p70k0M22m78l40L17N51l50n41O86K13n96L6N85n7
2395F2m33K31O32m95k50N27K45m96j59M62J96m91N2O80p21m90N34L31k18m37N79
2416C41q4o13M11O78k89q00O04L59l09l92M86L08o81q1P80q0p38J35P10l20m88
2437f3K28L21o83j67O22K39p75o5O32j38p83K97K81m20j14N89l8q21K6M72Nl68
2459g23K00L43j10l85O75Q8k87j20O91J73m19J68O39m44l60N83N96n59j61M07
2479I95o1p85M6N86j59n51M51J93o32n91N09K45p96j96M59k44n15n4M87l43k44
2500a200N80J80j2o0K65j98j80N24O01l61k91J62K17m22KO40j58l74M5N09l79
$$ y = [748, 863, 252, 31, 766, 606, 90, 162, 507, 262, -198, 158, 357, -500, -798, -251, -209, -616, -532, -138, -461, -873, -298, 32, -370, -758, -265, 404, -366, -386, 36, -442, -782, -465, 86, -264, -805, -119, 94, -502, -466, 119, 62, -371, -140, 492, -3, -253, 274, 519, 23, -136, 326, 522, 31, 83, 763, 42, -448, 86, 417, 199, -238, 341, 257, -356, 55, 733, 444, -356, 248, 607, 298, -94, 392, 700, 19, -62, 718, 638, -100, 35, 745, 425, -63, 165, 486, -197, -364, 258, 497, -278, -343, 289, 151, -632, -335, -54, -474, -588, 1, -37, -858, -832, -360, -355, -723, -523, -180, -290, -675, 0, 88, -199, -319, 372, 545, 126, 294, 933, 489, 129, 712, 1308, 749, 588, 995, 934, 149, 195, 781, 622, 71, 522, 715, 83, -508, 1, 246, -550, -746, -287, -531, -1046, -1100, -613, -956, -1200, -620, -440, -452, -512, -247, -445, -625, -101, 500, 139, -152, 10, 227, -195, -193, 447, 289, -85, -40, 469, 90]
2521I0o47M47P74p0l96K89L73p50j42O92J12m79J15K32k98l98n0J09j59K57K14
2542C15j61o36j12K61r7j96M88L6n01l75M18j53l88K20N95K40m27O6L90m76k0
2563e13Q09N19k49k0M80j18n22j48L70n4n0J67k0o51o16K15O43k28J12M00m14
2584A12n06L61P8l36r6O26K19n14k78j08l88j3N67K91l24k93J72j01j82k16R82
2605E3O5PL44l7o92l92P73O93j27k81J85K0m63j7N55Q8j57L59L41k08p26l40L15
2628C58J1J66K69m14o88j77j59l00j4M39K96l67j16J1l34j29M95P52j15j65l2
2649b13j45l18l4M19K89l13K47K37l14n72Q9M71J34M71M10l94n44k2L17J40mN00
2671H51L68o73k52j21ok06K41O72p1m72j59j45j55j04M64L32k86j11Rn91m18M0
$$ y = [90, -557, -110, 664, 594, 198, 487, 860, 110, -32, 660, 772, 293, 408, 640, 342, -56, -106, 3, -156, 101, 315, 154, -482, -594, -333, -430, -626, -138, -102, -603, -978, -560, -713, -1101, -881, -286, -46, -473, -407, -17, -493, -513, 296, 815, 566, 546, 1026, 908, 386, 238, 608, 554, 504, 671, 651, 0, -616, -401, 242, 14, 126, 526, 112, -394, -33, 45, -291, -387, 239, 458, -56, -334, -442, -830, -843, -276, 15, -309, -602, -430, -531, -713, -929, 53, 118, 125, 469, 432, -260, -652, 121, 814, 687, 406, 591, 611, 148, 131, 686, 774, 617, 976, 1317, 1109, 383, 43, 358, 369, 535, 804, 390, -298, -475, -634, -934, -948, -509, -213, -580, -696, -685, -1019, -1148, -653, 99, -16, -181, -213, -358, -676, -710, -291, -2, -315, -68, 169, -145, -717, -628, -157, -23, 448, 858, 464, -80, -102, 215, 355, 351, 851, 1219, 546, 294, 173, 167, -39, 202, 874, 803, 331, 172, 27, -128, -232, 232, 564, 278, 167, 176, -415, -833, -793]
2693g93L93J29J74o3k77o37k23Q39L73q5J10K25k31k57r7P6J80O1N22J10n13l67
2715c51O8JK07M13M22j71k36J64n1j24L6O03J03k37Ll74m32l54L81M79m77n1l4
2738a2j97n28M5K54j02M31J84N7m40k32O0J71l6L74J45k19m46k6K84J4M1K60M56
2761E38l86l35J1n1k9L91L74pn71K09k39n0nL09m7J07K9L9n8m38K57K50L38Qm3
2786F01j72m60o9K20j56KJ41j76k14j03m9k15j20K25K63L03l93J25m4j10K79J86
2808F4J25j06L30p2k8k67J92O1L29k36K39k01l80Q6K43J70j58j22J34n7j99m4
2830A03N6j47l3K17P5k67m63J0J83M9O2p5J3k73Mr4k10L27r6N9k7M3k4p1j13M57
2856b35L23j98Q3L5N5Q2K09J09j7mK19J13j01q8K3qlP0Nl51n8N6j51l97j67K40
$$ y = [-793, -400, -271, -97, -160, -437, -1074, -1297, -458, -85, -170, -60, 165, -66, -323, -420, -344, -164, -103, 419, 529, 16, -351, -283, -282, -75, 338, 760, 589, 353, 517, 466, 342, 378, 981, 1084, 847, 850, 476, 44, -310, 71, 550, 73, 22, -12, -209, -737, -692, -438, -540, -109, 75, 132, -308, -540, -480, -309, -345, 29, 174, -45, -491, -517, -233, -219, -178, 82, 538, 152, -183, -172, -223, -252, 139, 513, 506, -65, 144, -95, -145, -150, 159, 112, 219, 248, 287, 229, -209, 48, 298, 636, 644, 601, 429, -31, -100, 120, -36, -34, 107, -69, -283, -386, -435, -650, -770, -545, -282, 21, -372, -247, -291, -401, -122, 64, 189, 83, 413, 341, 313, 46, 238, 299, 628, 392, 631, 430, 50, 136, 379, 549, 391, 269, 403, 346, 147, 103, 159, 12, -21, 196, 271, 4, -459, -449, -266, -217, -155, -230, -217, -490, -486, -580, -790, -463, -559, -500, -527, -484, -508, -579, -692, -235, 88, -110, -27, 8, 63, 145, 354, 463, 446, 442, 661, 774, 673, 585, 608, 600, 597, 667, 672, 321, 263, 319, 168, -229, -396, -156]
2882a56K6r2k48Nj51j79J68K78m0k09L87j80j62J10K57k36J41K18K66l80q9Q6
2904a80M63j14J02j6Jj98J44J44j64k3J51J92k67J23n2j62j32L04Q8l07J9p4J20
2927A62p4J10j70J44K9q4K25l18j87l3J78m0Q3j8j32k90J11K83j54k78J85K16
2949e2o4P2qj38P8J12K03Q2k58n0j4J1k02J23R6k22J46K62k00r8j8K85m5j72K04
2974A33k46j20J01J86J67n61R8K57N5k67J52k47R0J13J78J31k33P1J91m7j97N6
2996F1j08P6k59J43K71l92q9J11J20k9l1RK7j70M36M8k18r1N7K77k82Q9j22q3
3020a49J9J83K33l36j5J47j27j05K37j8j5j60K38K26k47l08J58O4r3j26J10N2
3042c2l79K42K41l8k66M49J37r2k8p4J31j3Q0K32l30m05O9J69n8q1M4j22j63K
$$ y = [-156, -130, -222, -470, -465, -616, -795, -627, -349, -389, -598, -211, -391, -553, -443, -186, -422, -281, -63, 203, -177, -266, -180, 283, 169, 271, 255, 256, 58, 202, 346, 182, 159, 310, 502, 235, 358, 306, 144, 12, 316, 404, 97, 116, 42, 162, 88, 198, 28, 172, 201, 117, 342, 24, -163, -196, -18, -58, 25, 7, -125, -415, -304, -21, -175, -453, -268, -52, -116, -44, -52, -190, -112, 0, 203, 285, 27, -23, -37, -26, -228, -105, -9, -231, -85, 177, -23, -121, -139, 146, 101, -71, 133, -113, -233, -132, 54, 221, -340, -242, 15, 70, -197, -45, -292, -202, -89, 89, 220, -13, 58, 249, 202, 5, 61, -47, 29, -230, -87, 184, -208, -297, -186, -66, -95, -126, -117, -90, -260, 176, 224, 6, -85, -28, 249, -33, 56, -66, -149, -130, 53, 286, -50, -65, 82, -45, -150, 87, 69, 54, -106, 132, 358, 111, -197, -39, 25, -68, -194, -84, -32, -411, -169, 72, 34, -232, 217, 354, 262, 234, 160, 291, 278, 358, 590, 260, -145, -76, 93, 35, -46, -2, -124, -287, -285]
3066b85K66R9m19M3M84j68p6J33K3k04O0J08K07k41j84L03o5r8m0M4Q9j86J03
3089dJ25Oj74K24j97k92K40k04J16k54K56r8l12K07L14Mj44J06K08k33M4L64J67
3112D69l51mJ77J52l95O5J96k81r9Q8K49l23j7O6M2m0j50K04M4o2Q9R0j63O2J65
3137B73Q8l58j07p0n1j0J01M8k8l93K14K50k65j29L21j03j02l4K41j10j37L56
3159eK25j41j01J35j03M2R2K95l23K61J9J64k53j91K18j53q9PK53m36j29K01k19
3182b31J07j52J68J7j68K08K6J46k47J99P5Q4k47K99j49j19j44L22o4k92J34J65
3204A37j97k42K21N6q5Jk5n7n4O8J38R6k73K35k06M6j4K70L0j59j0K13j31k18
3228a60K48m1j3j2M4J2j31k25L08j8j70P6R9l9r9O5Rj9J13O0j02l5J5N9n4J13
$$ y = [-285, -19, 80, -339, -296, 188, 20, -56, 77, 100, -104, -44, 64, 271, 30, -154, 149, 84, -14, -54, -10, 79, -107, -4, 121, 127, -47, 177, -20, -312, -72, -276, -160, -414, -158, -256, -568, -361, -47, -43, -187, -81, 127, -106, -62, 302, 469, 118, 114, 291, 443, 48, 113, 309, 28, -71, 17, 266, -57, -74, -8, 34, -6, -156, 48, 92, 30, 119, 209, 46, 108, 273, 361, 3, -104, -174, -225, -235, -134, -86, -114, -507, -293, -43, -308, -437, -116, -219, -321, -355, -114, -224, -361, -5, 220, 79, -22, 113, 10, 52, 144, 439, 116, 377, 396, 560, 307, 116, 334, 181, 92, 99, 352, -84, -213, -12, -231, -124, -276, -108, -91, -259, -51, -25, 121, -126, 73, 148, 232, -15, 284, 135, 16, -128, 194, 130, -162, -28, 137, -60, -302, -81, -25, -110, -109, -134, -191, -245, -177, -39, 57, -216, 19, -187, -141, -155, 115, 145, -14, -24, 189, 58, -160, 88, 47, 34, 22, 66, 78, -53, -278, 30, 12, -158, -82, 17, -22, -121, -56, -47, -66, 47, 107, 5, -30, -15, 44, -10, 103]
3254A03J29j29k93K00L19k52l02OL28M4k35N3J47l17R0M7k3J88l83K84r1N4O0
3277B7L4j88N1K07j50j35J62J55j20l54L07J07j26o8k8J52j53j54K29K37j45K5
3299G2R7j37J48j75L18On0j07J4R4L7k61q4k21K01J55j01J69k57Q7l14R0Q1Q0
3323e8q4O1M4j39o7O5J56n0o3K02p0K19k31O7J1M4N9N2rRn7k81J06K4K39k08j64
3350a23j67rJ41j44N90n1k53m9J59j67j90j36K74K24j38q3o3L2k99K19L7K44o6
3373a8Kl3l9q5m2K26J05L02r0l47J0LJ59LL4J93p5k82r5K2L8J52m8J29n9n5l42
3400b32jJ21o8K83Om7k1j78k58J27P8K62j09K73r2l40j17J3M01J85j9rk15n2j76
3425a85J3J11J22j2J12J6j01m02n3K95K59O6j7L2j90m09LK29L96J47j44l06O9
$$ y = [103, 232, 103, -190, 10, 329, 77, -225, -219, 109, 153, -82, -29, 118, -199, -109, -62, -85, 103, -280, 4, -87, -33, 27, 61, -127, -76, 131, -19, -154, 8, 163, 43, -311, -4, 103, -23, -91, -119, 33, -120, -274, -45, 192, 47, 72, 169, 32, 180, 5, 323, 329, 279, 172, 186, 280, 317, 56, -28, -249, -48, 107, 6, 175, -82, 5, -309, -219, -138, -58, -142, -81, -37, -176, -243, -178, -22, -72, -135, 67, -3, 216, -15, 52, 63, 107, 166, 218, 209, 218, 161, -120, -14, 10, 249, 41, -123, -290, -299, -158, -302, 288, 237, -16, -65, 94, -73, -263, -399, -125, 99, -39, -122, -185, -153, -452, -233, -196, 48, -18, -16, -49, -88, -173, -215, 11, 116, 418, 328, -19, -9, -6, 153, 156, 190, 383, 308, 26, -69, -47, -9, 143, 95, 224, 165, 110, -232, -233, -112, -180, 103, 109, 62, 41, -137, -395, -268, -190, 72, -37, 236, 144, -196, -313, -300, 101, 286, 267, 258, 43, -9, -185, -172, -61, 61, 49, 161, 177, 76, -326, -379, -84, 175, 241, 224, 256, 66, -343, -340, -111, 285, 432, 288, -18, 51]
3448E1j21k16K59L06M1j13j86j67q2lR8J33L8K4k42M2j6l20P3L31K61Mk18l06
3472c29J21o0R5J57K36nk35k7k82J30M2K40L5p0Pj58j23q6L30J76ooL6oj81k75
3498b44K02K9Q0K80J32l80k51O5J98J03q6J47L4j87j22j95L78j14P7k3K16k40
3520I9k58k2K5J30N4l3N7k64Q0j10J6Q8O5J80P3j09l00j1l7J82K57K10k44j42
3544a4j08J8K24p9J9qJ2k02P0j18j5O4J74J34J06j62p0m9o3J34p3J80m7q3j28
3569h4j74K2P0J55M3j50k9k5K34j89j4P8L1jj79J63L9j63N4O2J02L8l1j01r7J8
3595a28K89j02m5O2p1j1q1M5Q6n6M6lj34j1n8pJ92k27J40J88j54P5nL4p5R4n3
3622C0K42o9n3j30L3L4M3J35m2j09J10j66J38r5OK4j24O8M4m0N0J77j57j48J5
$$ y = [51, -70, -286, -27, 279, 320, 207, 21, -146, -228, -231, -133, 0, 38, 62, -180, -138, -154, -474, -401, -70, 191, 195, -23, -329, -208, -268, -173, -16, 220, 215, -20, -47, -329, -199, -157, 83, 118, 48, 55, -103, -226, -312, 18, 194, 188, 182, 218, 212, 31, -244, -42, -13, 67, 347, 479, 99, -152, -87, 111, 214, 128, 275, 309, 122, 0, -195, 183, 69, 146, 123, 339, 99, -159, -181, -156, -26, 28, -5, 52, -212, -132, -242, -226, -138, -73, 107, 180, 71, -229, -240, -277, -95, 162, 372, 128, -14, -122, -104, 120, 41, 60, 52, 64, -138, -68, -186, -201, -137, 37, 171, 277, 115, 45, -4, -67, 67, -6, 174, 127, 44, -84, -258, -236, -166, -11, 32, -118, -147, -172, 62, -127, -141, -63, -32, -33, -212, -49, -10, -173, -119, -57, 45, 83, 52, -49, -146, -128, 161, 59, 14, 76, 5, -6, -87, -42, 44, -12, 34, 31, -103, -114, -172, -179, 13, -214, -74, 114, -40, 35, 30, 64, -11, 83, 30, 272, 203, 150, 20, 53, 87, 130, 265, 223, 114, 224, 58, 196, 101, 107, 131, 7, 75, 119, 79, 129, 306, 149, 1, 16]
3647A6R1k11J20Q2q9k1J5J62j0j87j23R4k6j4J03M7r3l74J73J08j06O4n0K02l29
3672c56P8L21q1j65O0M0j6r2K02k3K14l64K00J42J2k0j20nJ7J07j40J37J1L9k59
3697f1k1PK82k50n4R3j03q7J81Q7q6o3j44J15J47k40J98M3k21p1K90L6k0j44n4
3722a40J18l36L89J83k14q4q8L39j07j8J06l7j0j73K7K51K1j14J20q4j05K50J8
3745C12l91J97m6N1j78L47q6j82n7J77p9r5J32r0Q8j25p8K91j82R6K9K03m98K00
3769C6J59j19J2o6R6k62L4m4K63k32J30j07K44k70J09j61j69J06p1K64j08l0J9
3792a67J2K0M4J86j19j74J22Q1j18J32P1q9L0J34o5K1j52J58K69l90l63O05Q1
3815C29l60K0O2Q0k3l5N8M0m11O2J95p0R8J1k10J03j40R5K8n7P5L2k36R7J00k03
$$ y = [16, 107, -104, 16, 98, 9, -12, 3, 165, 155, -32, -155, -61, -87, -101, 2, 49, -44, -418, -245, -137, -243, -179, -229, -27, -356, -278, 43, -38, -203, -143, -103, -119, -211, -9, -32, 182, -182, 18, 160, 172, 152, 32, 27, 44, 151, 11, 148, 159, 198, -61, -82, -75, 207, -43, -97, -4, -107, -194, -13, 74, -12, -75, -219, -104, 43, -197, 1, 44, -177, -248, 42, 78, 58, -86, -140, -22, -358, 31, 214, 0, -84, -172, 167, 60, 42, 148, 111, 101, -72, -45, 206, 227, 113, 233, 149, 44, 294, 312, -79, 118, 72, 123, -55, 292, 206, 24, -33, 144, 65, -30, 102, 12, 100, -25, -103, 188, 6, 102, 131, 334, -164, 36, 195, 76, 88, 22, 118, -144, -110, -154, 109, -123, 7, -100, 144, -126, -17, -178, -347, -241, -312, -48, -156, -186, -167, -155, -135, -91, 95, -24, -198, -76, 5, -113, 19, 90, 1, 31, 165, 100, 121, -31, 127, 396, 6, -357, 248, 329, -31, -11, 51, 131, 108, 73, 131, 171, -240, -178, 17, -53, 45, 56, -154, -51, -191, -96, -68, -125, -50, -18, -254, -157, -57, -260]
3841b60J53j0J41j20l76M35L7j60j64L44P0k93Q1K20j62j92J82K63Jk5mj01k30
3864a70RK87J25n0J61N2m51q6K81j18j6j36K49j20j77m0N6l4J6J68J04r5k66Q1
3888a70q9J36L49J41l98K8L1rj74J90L77j58l16J02J29j47j99K83L02k30k51K49
3910A76j01j3l12K34J89p6J21l0p1k30j26J12K72J42j82k14k44K65j26J2J57J14
3932F9n9k69j84K28J73k48J96K12j26j38l9L0N6j23L18J73l4j2p0j46J2J10J9
3955A48Q0J62Km81r6J71J21o7k50J46K84l10m86M06K19j41q2J50J66l72j95R4
3977c31L09q0j9K71r4J22m42m6P5M65J4l05L7l8L4j81L50K24j88j72J14J99k03
4000A15m0j36K61k6n7J70q2j71k1j76J6M42Q3j1m50Q1j95NN5L38J14l41k28J86
$$ y = [-260, -107, -117, 24, -96, -472, -37, 0, -160, -324, 20, 90, -203, -122, 98, -64, -256, -74, 189, 190, 165, 161, 60, -170, -161, 126, 251, 201, 362, 414, -37, -123, 158, 40, 24, -112, 137, 17, -160, -200, -144, -178, -162, 6, 110, 15, -251, -170, -259, -123, 226, 367, -31, -3, 28, 19, -155, 35, 412, 254, -62, 40, 169, 22, -177, 106, 408, 178, -73, 176, 75, 62, -250, -16, 173, 97, 218, 188, 117, -113, -239, -127, 145, 287, 105, -109, -353, -88, -214, -202, -45, 69, 10, -259, -443, -215, -42, -290, -94, 118, -8, -146, -185, -155, -99, -222, 96, 269, 235, 223, 153, 7, 19, 129, 148, 228, 390, 392, -89, -185, -14, 107, 40, -210, -64, 220, -90, -576, -170, 49, -92, -174, -24, 142, -230, -425, -331, -22, -102, -121, 150, 56, 178, -264, -310, -235, 230, 244, -61, -24, -62, -28, -209, 141, 365, 177, 5, 119, 318, 115, 75, -61, 200, 174, 117, 287, 205, 34, 13, -163, -147, 295, 378, 367, -83, -2, -197, -192, -137, 201, 315, -26, -254, -68]
4024f8K1j34J2L07r9j14j68L42q0j57j71K77J31j3n1M5k24R8j74L02j5rK1r9j41
4049a61M9J61k9J46P0j62l17J45J87j64O1M3O7j33K04p2n5p0j66J59J68j16q8
4072g3P6r2N7j23N0L9P1j2k32n4M50k02j75J13J45n6j23r1L88k06k22K83K10l7
4096A84j40J09j03l5j36J89J53O9l52P7qJ31j43K05k54K29Pj16j79O7J39r7J34
4119A30J57Oj25n8j3j34j20J76M6r4j10q7J11q0J7m3K39k3k16J39q9k8R7K8P0
4144dnR6j1j14p4K18J36l2J58n3j71l19K07J3j34K89K7K2k96q7oM9N9QJ74j90
4170d0r9J63j29j36M0R4P5j42Q7k34j44J19m8L94j48K67k79j1l24P5L33l5J92
4193G0J07l2k89J81Pj13K34J53J12j26j53o4J90j53J0L23j73q3nk04O2l29K80
$$ y = [-68, -47, -181, -169, 138, 39, -75, -243, 99, 19, -138, -309, -32, 99, 86, 35, 80, -144, -46, -220, 82, 67, 58, 79, -20, -161, -112, 49, 20, 166, 236, 74, -243, -98, 89, -75, -14, 29, 96, -37, 167, 95, 40, -30, -196, -37, 131, 15, -73, 3, -89, -32, -155, -105, -66, 5, -7, -239, -293, 157, -45, -220, -107, 38, -18, -141, -232, 156, -50, -272, 11, 221, 184, 44, 153, 50, 15, -121, 68, 221, 290, -62, 15, 7, 138, -5, 200, -54, 175, 182, 66, -113, -46, 93, -4, 130, 287, 293, 168, 110, 97, -37, -157, 19, 65, -29, -139, -226, -115, -195, -178, -221, 18, -5, -221, -82, -171, -199, -102, -74, -4, -9, 87, 76, -38, -112, 106, 242, 210, 368, 315, 144, -175, 32, 45, -89, 200, 227, 249, -47, -134, -140, -91, -32, -24, 150, -40, -139, 24, -105, -241, -201, -107, -32, -174, -87, -321, -465, -346, -394, 0, -148, 119, -160, -171, -495, -420, -87, -122, 70, 177, 145, -144, 37, 44, -69, 165, 318, 430, 304, 151, 87, 277, 124, 134, 457, 284, 201, 196, -8, 54, -275, 5]
4216EJ8P0j25j02j14j55P2M62Jl7j80P6p9J3J61L5k01K06k9R1k74J0J32j06k7
4241g7L41J5r7o6j53P3j4J47N9Q0k42J26j05K9q0K23q8q8m4k6M4mJ33J59j02j29
4267A14q1Q6l31m5K29j95pK00m7p1j64N1J99k62K57K50j16j75Q3J75j18j95K59
4290I6R8k25J40n5j44k7N8n8L1J12K1R4k69n9J00k8J91j06n6j30L4m0J1N2O7l2
4316a24R2p8PK69k80J04Q0l2J11j50Kl0j55J10J34j33q9q4o5J15J70J9R5J3J42
4341B43N5k05J41P9J6L3j55M5Q3k12k5l1Q8k19k64J34J83Jk55L9K3p5J09J22N3
4366Fj70l0q0K92n2Mp9J02k5q5J0nK46Q7k80J48J11l2k36J35m8l4JM7o0k13K6
4393b14O6J49p9J48J09m0k18K58m8J78r3O0k08N3j22L8P9l17J19j9k63K58j5j99
$$ y = [5, 23, 93, -32, -134, -248, -403, -331, 131, 132, 95, -85, -9, -88, -75, 86, 121, -80, 126, 97, 188, -86, -76, 56, -50, -77, 264, 279, 182, 116, -37, 36, 22, 169, 228, 308, 66, 192, 87, 116, 36, 259, 171, 83, 39, 13, 57, 53, 186, 345, 243, 114, 33, 119, -212, -257, -28, -223, -230, -30, -77, -148, -312, -261, -62, -324, -67, 183, 67, -108, -25, 150, 32, -163, 96, 194, -31, 109, 54, -90, -117, -59, -117, -86, 26, 47, 141, -128, -187, -87, -115, 76, -30, -86, -216, -182, -222, -211, -159, -92, -124, -32, -110, -103, 166, -114, -10, 70, 38, 149, -1, 1, -29, -184, -74, 60, -73, -162, -246, -311, -196, -26, -7, 88, 101, 243, 298, 93, 234, 313, 329, 362, 207, 252, 335, 123, 98, 67, 155, -64, -328, -194, -11, -10, -265, -226, -203, -278, -169, -47, 6, -164, -194, -274, 18, -34, -30, -109, -7, -32, -117, -107, -112, 134, 221, -59, 89, 200, 168, -68, 67, 19, -15, -14, 33, -27, -240, -214, -148, 1, -78, 70, 179, 139, -79, 179, 131, 309, 216, 276, 68, 121, -1, 37, 116, -201, -82, -101, -364, -106, -121, -320]
4417c20L2K36p6J33m3J2K08k45nK17J11j87Q0j99R1p4Q3O1kj33Q%k34K52m5P8
4443C9j89Q8J22j32L2q9p7J01j01J53K00pj80M1K8%K90j90K08o8r8j13J24K6l4
4468A74k71M1o5K15j41QP4j65NP2Q8o1jj38L38k91R7Q3j4%Kk07P6j33L5N5o5N5
4496a34j16R4J13J35j63M8rm7K79j51oj1L7m0q6J08M8j95m8K69n0N4j35R9j22
4521b9j7Q8p3N3J31k79Q3k0N7pj06J48P7j89Q8RLL4j77P7K63k0o1j75m9Q9j81
4548a83J74J47n0p1j40Q5K54l56J59k17K16L4j98R8j28N7R9M8r9J38m3j71J37
4571a0p8J29J6n6R8j66j16N3Q1K15N2k1m5M1j55K6J42L2qk13K38L3p9k82J35j43
4597h1L36m8k01N4Ol00m8O2K10j38J58j02k6j84J0O1J12J22R0j09k58K27m2j38
$$ y = [-320, -288, -52, -128, 5, -38, -26, 182, -63, -68, 149, 260, 73, 153, -46, 45, -29, 54, 115, 113, -20, -12, -12, -246, 6, -39, 39, -150, -62, 60, -72, -40, -129, -206, -105, -206, -53, 147, 140, -40, 1, 29, 29, 319, 129, 337, 269, 171, 58, 182, 208, 174, -97, -56, -121, 94, -47, -39, 35, -130, -125, -53, 35, -26, -27, -165, 173, -118, -21, 62, 48, 48, 50, -157, -81, -214, -179, -124, -189, -134, -250, -156, -43, 92, -71, -23, -32, -79, 200, 49, 43, 32, 69, 29, -57, 51, 99, -96, -144, 125, 75, 129, -6, 93, -29, -46, 42, -31, 22, 153, -126, -43, -63, -6, -13, -119, 29, 106, -83, 5, 14, 17, 51, -126, -49, 214, 194, 133, -42, -91, -2, -183, -9, 138, 88, 17, -123, -38, 216, -140, 19, -198, 18, 52, -146, -48, -176, -119, -20, 28, -71, 67, 24, -147, -10, -88, 41, 57, 1, 99, -67, -183, -130, -49, 166, 218, 197, 152, 193, 38, 64, 206, 238, 230, 17, 255, 288, 209, -73, 62, -81, 255, 207, 6, 60, 66, -234, -282, -220, -10, -148, 10, -92, -118, -302, -292, -231, -119, 3, 93, -16, -274, -47, -89, -227]
4621b27P1J02M13k43k7j60l7K7J79L7N2Q3j89M4k68M7J13J52j37O7k61R2j93J68
4645i5J04J55O8j66jj01Jj50K5n4J52R5j82L5l65j20L11J4K31J69l93J53j60L30
4669E6qL1K76j24J05k58j27j14M04j09N3L3k37p8kr6r3L05J29rJ00k75k78l4J57
4694a93J02j2K70k49j01k03J38L19o1J05J41j14j39J56l05M57m9qJ71j74l49j
4716i9N9p0k7R1Q4J8n0o3j3nL75p1J92k0j16j48Ro9n1K25j25o0k65o5j86J96J46
4743a08nJ19k24J52k24J61j6j7K14J11Q5k22j89K79k33QK42J51j03k09J23k19
4765a24J15J83J01j34k8K14l26K9k43Q2Q2J06j62n9r7k9J46j05Q2J61J05J03k49
4788d7j51O5J82PM1M8k87j16q5Q9j24K2J43o4k3j50L84j41J11J0L06M3j11J21
$$ y = [-227, -156, -54, 359, 116, 89, -71, -108, -81, 98, 135, 187, 270, 81, 125, -143, -96, 17, 169, 32, 99, -162, -70, -263, -95, 9, 164, 232, 66, 65, -36, -35, -185, -160, -214, -62, 33, -149, -114, -479, -599, -288, -274, -43, 126, -267, -114, -274, 56, 48, 79, 355, 231, 336, 78, -49, -163, 241, 132, 185, 218, -19, -97, -99, -195, -288, 17, 146, 137, 237, -38, -316, -350, -193, -91, -103, 167, -82, -183, -386, -248, 71, 10, 115, 256, 142, 3, 159, -146, 311, 262, 254, 425, 251, -98, -99, -40, -110, -137, -46, 38, 56, 6, -57, -70, -75, 300, 229, 421, 401, 285, 137, 146, 77, 26, 251, 126, 66, -199, -264, -450, -254, -108, -113, 6, -218, -66, -290, -129, -145, -162, 52, 163, 248, 26, -163, 116, -117, -109, 133, 284, 181, -28, 95, -124, -9, 174, 275, 141, 113, 327, 1, 30, -213, -131, -49, 57, -105, -164, -261, -290, -144, -249, -167, -6, 99, 202, -47, -198, -133, 49, 56, 97, 145, -142, -258, -343, -254, -378, -356, -213, -277, -300, -450, -66, -207, -96, -86, 220, 263, 152, 273]
4812B73k52j09K15O0j76j07J91r9P8j4j59J20J81k8M7r9j62J92r6Kq9K7M4k35
4836a95L4M6j21L1J13K05j37r5R5O1j03PL99k69J24j24l1j88J24J20P8j58l8j4
4860c6r6LK33n9o1Q1O3J14j58P3J11r3m8r9L65k31j80M0Rk34r9J84J71j31j41
4885b19K27j60J44k51L44j14QR1j49j31J3J03oQ9J09j15r9l6J58n8R3M5R0j63
4909A3J24k09lL8J14j41k2j49J67N7k43R3N3J3M8QR2R3l53J60P6P1j72K71k18
4934a9m2J5m3jJ25j11j35O9R0m0N1M8r7J54K2L7j21J92j99R8j93K12j74j6K99
4959B21j39m35J45J55R8k38K96N9k12j55K21J50j64J62k3rk32L01k2m6j46J02
4981H9K18k71Mj24K08l48K45J5K21k44J8j44J13j47K1J9r7R2j69K59j29q3J10
$$ y = [273, 21, -88, 127, 187, 11, -96, 95, -4, 74, 60, -99, 21, 202, 174, 221, 122, -40, 152, 56, 58, -31, -4, 40, -195, -161, -115, -236, -205, -92, 113, -24, -119, -24, 37, -66, -59, 340, 71, 195, 71, 40, -148, -24, 96, 174, 16, -22, -36, -132, -129, 104, 45, -16, 65, 128, 242, 84, 157, 268, 175, 127, 28, 393, 162, -18, 22, 31, -203, -302, -118, 53, -78, -219, 8, -152, -8, -259, 85, -29, -21, 70, -79, -210, -197, -94, -100, -11, 98, -17, -116, -152, 6, -52, 41, 86, 176, 13, 137, -72, -75, -37, 77, -64, -86, -235, -68, -11, -254, -161, -108, -95, -47, -39, 53, 146, -207, -47, 29, 100, -72, 199, -19, -61, -46, -89, -90, 35, -76, -211, -142, -52, -92, -41, 7, -90, 64, 86, 123, 2, 194, -5, 93, -100, 112, -62, -78, 221, 82, -353, -208, -53, 45, -193, 103, 162, -50, -205, 16, 166, 2, 164, 141, 132, -100, 201, 179, 133, -13, 89, 307, 36, 40, -84, 124, -224, 21, 36, 257, 13, 31, -113, 0, -147, -126, -107, -204, -112, -281, -22, -151, -234, -124]
5004a24j32J78j3J60k38J46J14j03j60L50M4j74l6J90j68j40P9J74K2o6k05O1
5026d1J76k16M7J27j68J47j2K2K8k03J86j35r0K26m1j17p8N8j57M7l1J41J61j52
5050g5q3P9L5k6J20j03N7Q1P9L3J4k55K39k25N5j10M1m3J34j32J44o0j13J73j60
5075a01%K44p8l8j05K47j88k9m2M3j8J05l7o2R7j39J0Q0J67j51L25l10K63l05
5099b2n7J26m7P8L0o3j51J15k7k12L01L3r5l5J06n7j19j7j1J52j14N3j78n0J2
5124b49l4K24j16j79O8J19J11k6N9M9N1J68n8j07r9O0r4j91L28o1N7o8m1K06j89
5149a2KQ1j20J61J18j06j68J56J08j38n5l7J2o5r6l5j49J85n9J70mk23J68j61
5173b67K72m2M2K6J7M2rj37J12r2J43n6j48K24j37J35P9L0j12K5L07k03qN3k23
$$ y = [-124, -256, -78, -91, 69, -169, -23, 91, -12, -172, 178, 222, 48, 12, 202, 34, -106, -27, 147, 169, 103, -102, -41, 135, -81, -34, 93, -75, 72, 60, 82, 110, -93, 93, -42, -132, 94, 53, -64, -142, -84, -241, -194, -225, -84, 77, -75, -158, -79, -44, -70, 50, -53, 4, 85, 164, 197, 211, -44, 195, -30, 25, -85, -44, -87, 47, -85, 59, -1, -114, 59, -101, -101, 143, 65, 27, -78, 169, -19, -48, -90, -47, -65, 40, 3, -59, 38, -101, -91, -11, 156, 5, 330, 20, 283, -22, -79, 47, 0, 78, 108, 45, -106, 9, -18, -230, 71, 104, 9, -26, 80, 23, -96, -113, -124, 28, -86, -33, -211, -261, -249, -283, -59, -175, -354, -286, -167, -56, -82, -23, 26, 77, 245, 187, 80, -19, 41, -53, -244, 84, 23, 80, 12, -29, 177, -12, -10, 71, -49, 112, 230, 124, -44, 112, 220, 82, 27, -10, 2, -63, -159, -194, -343, -158, -217, -47, -51, -274, -106, -267, 5, -37, 5, 31, 48, 90, 81, -56, 56, -36, 107, 51, -97, 127, -10, 125, 204, 234, 122, 147, 454, 251, 243, 296, 73]
5198G3N4J16n9j06j88m2q7q0J54J67j79nk9K17j79J9J43M5mO6j57J03J5j79J03
5223a9o7Q5K5j94J37o6J80O5n5K14m5o4j19j5J02Km2O3l7k49J29j45ko5M8O6J3
5250e5p5M0j32K01pl7k5r6J10j28j13J72p7J33k00K99n0j77P2n7K24k0p2L11l07
5275f6J22J13j96O9J14j11J5P9n7m6k5l6J34J42k20K4K6j2j46Q9R6j16o8L8J13
5300G5j85j14M6J39n9m8j9N5O1l9J5M2l7R0N7K1L6k01l1Q0j23J38K8j74J77j02
5326g2L3J68N1o5n9N2O2j6n3J44q9M8K6J0K8j62j23L5L7j81J0J16m2O2n3q6K0
5353i9J19Q3p7Mk31R1L2j2J74p5k3j6l4j9l0K06N4j00J01l3l6j04L2M6k5O6J2
5380A06J4q8m2J3J68j14L2j42m1J15j44J1J02j6m8M34k45j94j15J86j43j2J53
$$ y = [73, 127, 243, 184, 78, -110, -152, -239, -319, -165, 2, -177, -182, -211, 6, -173, -154, -11, 34, 30, 96, -61, 42, 57, -122, -19, -86, -1, 24, -170, -33, -99, 81, 146, 91, 305, 260, 196, 77, 62, 164, 166, 124, 187, 150, -99, 30, -115, -117, -182, -134, -68, -55, -130, -90, -222, -21, -28, -65, -90, -186, -76, -204, -317, -145, -222, -89, -289, 10, -40, -217, -145, -202, 22, 2, -70, 241, -66, 56, 169, -27, 42, 156, 45, 60, 139, 82, 36, 11, -25, 109, 251, 31, 55, 81, 69, -77, 12, 108, -8, -76, -38, 75, -110, -224, -178, -39, -98, -146, -165, -110, -49, -88, -73, -31, -68, 22, 79, 100, 136, -65, -96, -16, -139, -1, 27, -147, 30, -72, -39, 129, 180, 115, 56, 108, 170, 154, 101, 245, 156, 204, 230, 240, 268, 106, -17, 18, 55, -126, -116, 0, -42, 20, -33, -119, -99, 20, 103, 26, 30, -201, -110, -78, -90, 84, 9, -14, -30, -64, -83, -113, 93, 147, 47, 148, 115, 79, -25, 7, 53, 28, 94, 106, 120, 32, -10, 3, 171, 57, 89, -53, -94, 21, -123, -112, -10, -26, -74, 360, 115, -79, -194, -8, -151, -163, -10]
5403a0o2N4j35J6J08j10Q6NO6Jj3k49J43l2k6J63K6J23K8j38k9K1k0J9R1o3n2
5430A1nj87O0P8OR5K7m2q7K0j51J03m5J88j9K9j22j9j55J93j83J50J84r8O4j94
5456i9N7J65P2j03K67k12r7j96R2N6L8rJ77j62J86m38k0M20j72p3L3J81n9N0m70
5481c16L36J4P4J52l81L3R0q4L7o1M17k62J61j81q3m3o8J73M3N1K8r3m8L9Rj30
5507i3J37j36K5R7k80j8J86k7j0Q6O2j44p0K36j5k59J83l9R9L8j36L9o7J18O3
5532G5J71q9j18N7O5J03l66J43P3O1Q0j2j81M1j41Q6j12J82l5k53k0J09j83L7
5556b27O5N2J10k27l8J25J03l3k01K92j4j93O3J19q5om7K05L5m1jj7O2j7L0J07
5582B21Np0Q7j09r5k3Q3n7J83l35m7J21n3L6N5k68K98K09j69p2J4m1L4O3Kp9Q1
$$ y = [-10, -72, -18, -153, -137, -29, -139, -53, -48, 18, 19, 6, -243, -100, -132, -158, 5, 31, 154, 182, 44, 15, 36, 16, 35, 126, 63, 11, 6, -181, -121, -43, -37, 58, 85, 43, -44, -24, -175, -72, -117, 71, 52, 81, -41, -60, -215, -22, -205, -55, 129, 31, 95, -99, -42, 123, 195, 92, 359, 147, 50, -146, -54, 2, 40, 31, 208, 46, 232, -206, -226, 194, 22, -51, -18, 163, 104, 154, -316, 20, 34, 108, 260, -121, -88, 2, -82, -45, -106, 311, 49, 210, 29, -54, -97, -165, 8, 51, 102, 130, 37, -11, 28, 37, -93, 44, -92, -67, 30, -250, -268, -82, -109, -119, -33, 29, -115, -185, 51, 36, -223, -40, -79, 20, 58, -78, -39, -106, 12, 75, 246, 157, 39, 96, 161, 264, -102, 41, 114, 175, 255, 243, 62, 103, -38, 48, -64, 118, 83, -170, -190, -81, -264, -227, -162, -110, 0, -227, -265, -140, -37, -70, -271, 21, 7, -186, -123, -4, -89, -95, -142, 63, 98, 57, 56, 39, 101, 84, 114, 221, 226, 156, 243, 134, 39, 16, 99, 42, 225, -110, -157, -36, -89, -53, 2, -266, 32, 241, 72, 0, 14, -27, 7, 70, 72, -7, 74]
5609G4j21J2p8R2N4p4J63r4J98k92J6J07N4m7p5J81k95J68k46R0O7o6J68j7m5
5634fo6L5P5n6N7J28j88J77o4k7j75J95J7r8m7P6n2M2k43J72J64j87N2R9P2j77
5660b5l0J24o7K20o5l4k40L3P3j54j7K5K56q2pk42K18J33j02k8J66q4k60K43n7
5685cn0Q6M5J48l00q3j2J62LN4J02k9j2P5l34K74k67J49K65k22q6J00j25k8K8
5710f0mj3J3kl8J01k11J87j35J7O1J75j07NO6j39Q9n4P1m6j43Q0J28q3J09k17
5736a50K60j12m6P8M9J66j15Q1r7O9j30k9n5k6M6Q3n0L8J14l33J92N8j14J8j65
5761a70K61j08j31j75L5K57J0j38k2J42k63Q5J72R6j52O4M6j17K16n6L3p3J16
5784A28N2p6N2oq1J3nQ3J37j53m4K1k1l4L9l5J39k71mM1q4n8O2k3MjRR3l25L16
$$ y = [74, -47, -35, -113, -21, 33, -41, 122, 28, 226, -66, -50, 57, 111, 64, -11, 170, -125, 43, -203, -113, -46, -112, 56, 39, -6, -72, -37, 38, -18, 39, 167, -21, 156, 92, 65, -110, 85, 102, 4, -43, 33, -19, 23, -220, -48, 116, -71, -19, 80, 152, -25, -55, 69, 2, 222, 157, 123, -117, -84, -11, -165, -182, -157, 99, 17, 10, -232, -14, 119, 17, -11, 155, 71, -189, 54, -3, -53, 33, 78, 226, -74, -157, -169, -7, -4, 50, 152, 123, 111, 186, -148, 126, -141, 8, 273, 51, -35, 65, -60, -88, -60, -64, -77, -64, -66, -104, -3, -214, -27, -162, -145, -84, 91, -16, -11, 55, -84, 5, -49, 22, -24, -167, -87, 41, -42, 67, -150, 110, -2, -48, 30, 79, 245, 130, 211, 114, 183, 53, 24, -31, -57, -11, 72, 22, 60, 174, -159, 33, 91, -23, -5, -170, 91, -17, -148, -323, -288, -31, -21, -159, -181, -39, -302, -217, -45, 51, -101, -37, 9, -108, 108, 52, 85, 12, 128, 180, 104, 156, 150, 69, 82, 77, 160, 297, 144, 100, 121, 100, 66, 105, 70, 209, -62, -66, -25, -109, -167, -105, -128, -124, -125, -116, -23, -348, -32]
5814c2J0j20J2L1Jk2J71p2q1J0n2Q5j6j4K3K11k24j6o0M60l32J34K52l57K13j66
5840D9M7j95K55l8lj19J47n4m8j88K37pj88Q4O6q8k46K31j7j01k2J12Q9o9n0Q1
5866c5Jq8Q4m5K2M3J34j49J80r7q2lrM8P0J45k51J46J03K0k47J29L2k09J91K3
5892A56j51Po0P5o7J11L6j48K01j34l5k19J20J00j36r6J91o3o7J45j10n8K0J61
5916b1L1K2p6j12J81p2j53O8K32j68R5L2m2J48j52j7J72n1j18J27q5j56J22R3
5940A00k36J94N8j38j78K8J00M4n4j1m2j10K13r3M6o8l6K6P1Nl1Q1j73J35J62
5965I3o5j13n3K26j20O1J99j85J04m63K11K52k57L53j87L5r2r7K44k35N7J73j23
5988A8k16L88j97p8j22K71j06J5J2J24o7j55QQ3R8j61J32n3k11J89n1L2k1J48
$$ y = [-32, -22, -142, -130, -99, -98, -120, 51, -21, -102, -92, -144, -59, -75, -89, -66, 145, -79, -95, -155, 305, -27, 107, 359, 2, 215, 49, 96, -99, 156, 118, 115, -4, 143, 89, 41, -147, 90, 83, -105, -21, 45, -43, -289, -58, -75, -176, -198, -86, 3, -66, -116, -35, -34, -122, -38, -83, -61, -18, 116, -33, 147, 50, -32, -35, -44, 4, 74, 219, -32, 114, 217, 237, -10, 119, 151, -58, 133, 156, 5, 12, -48, 27, -40, 71, 107, -41, 160, 26, -9, -228, -108, -8, -144, -240, -49, -112, -179, -34, -144, -202, -182, -21, 10, 32, -44, -156, 25, -47, -200, -132, 100, -68, 27, 59, 17, 165, 13, -4, 168, 117, -1, 126, 41, -115, 7, 100, -136, 58, 116, -22, -200, -172, -72, -28, -82, -93, -135, -245, -32, -125, -79, -147, -183, -157, -86, -81, -112, -31, -204, -69, 93, 28, -85, -138, 88, -32, 29, 228, 43, 147, -316, -105, 147, -110, 243, 56, 91, -1, -98, 146, -89, -32, 141, 18, -198, 190, -7, -85, -207, 64, -42, -27, -15, 109, 42, -113, -105, -22, 76, -85, 47, -6, -217, -28, -79, -47, -68, 80]
6012H0j7Mk29M6J98k26J8qK69o1k22N8J6j7P8K30l0k19J1J07l24O5K92rk1K05
6038B94p6k64lL0J64j09pJ95l62Q1L1N8j17K83q1j3j85k5M1O2l4j40L00K3j40
6063FP8l9m16J71K72j16j3J2r7N2r7J52L2p5P8o5m4J17j77K34l7j53J84J01k8
6088A32r0r8O9J02j14L64k82n1l1rR9k9M4j15R7n3k42L14k12J78l6l1l6On4l3
6114a11Q0P1K9o0O8pk77Q0J80j68J08r6J59j37q2R9J95k10m4K58j03o9j31O9M8
6139e1O9Rl0P5j8J19l8m0O3j54Rk1K22j63M5l49M7L47k39mN6l4J0p9J43Oj24K41
6167A17k18J23J1l2j80K88M7l6j98K26p2L5j20m8J38J08k10J8rN1m8L6J29j82
6191b6p2l2R0L9K21k44K5k45J88J11j78L8j17M3J06K6q9R8Oj62K16j37L3k1L4
$$ y = [80, 63, 67, -162, -116, 82, -144, -126, -134, 135, 74, -148, -90, -74, -91, -13, 217, 187, -32, -21, 86, -238, -173, 119, 110, 89, 294, 218, -46, -49, -19, 145, 36, 29, 224, -138, -57, -26, 32, -85, 198, 117, 104, -81, -106, -65, -3, -37, -177, 123, 146, 6, 84, 45, -371, -200, 72, -44, -57, -45, -142, -90, -187, -35, -3, -78, 0, -65, -109, 8, -169, 65, 28, -125, 59, 160, 132, 42, -56, 13, 115, 1, 365, 83, 32, 1, -8, 91, 62, 106, -9, 88, 35, -207, 107, -105, 73, 37, 6, -30, -24, -78, -111, -31, 40, 69, 9, 77, 70, -207, -127, 53, -115, -7, -103, 56, -81, -163, -64, 131, -79, -123, 135, 32, -37, -168, -99, -51, 18, 27, -3, 72, 54, 173, 135, 95, 158, 4, 13, -8, 214, 51, 96, -253, -206, 141, -98, -102, -46, -80, -70, -149, -6, 0, -124, 117, -101, 22, 33, 1, -179, 109, 156, 120, -78, 148, 76, 111, -9, -57, 81, 189, -21, -3, -12, 39, -9, 27, 156, -26, -98, -130, -40, -1, 220, -24, 1, -244, -56, 55, -123, -85, -202, -159, -53, -27, -116, -18, -12, -174, 42, -95, -62, -83, -49]
6216d9K8j45R0Q8L8r2j5K6K9N9k1N5K4j13m9J71j58j6J66j51O0o9N7r8L8J98k80
6243a29m2Q2o9R5lL9O2q3mQ2l1m4J81j44j30K81j36N0L8j98m4K28J11j77j09J81
6269H7j24k1R2m5Q7n5n9J4J27j56p8K76k46R8J9K3k07O4P9j8J50p8q8j01J79q5
6295f6j00J72n7O7j11J08K5jj16J15m9N1M8LM6j57K26j05p1j56R0NJ78p5j10O
6321c4p3j72J75K65k8j84p8L4J76jq9p9J2P7Q7q1%P1j93J75j00J38j84J53j95
6346a28J82j58l9J81k18J02n2K44mk5k12K06Rj37M4J02p6O1q8n3K8Q7J12j49M9
6371F8o6r4J37p7L3n4j19L86j59j17n9j23M9K02J6N8j59l1J57Q8k43O6K2J02K8
6396A11j04L1J39j27p2N1l7q6R5J62l0j79Q5k4j58NN7K03j64j20m2J36K48j56
$$ y = [-49, -21, -166, -76, 12, 50, -42, -57, -31, -2, 57, 36, 91, 115, 2, -47, 124, -34, -50, 116, -35, 25, -44, 13, -85, -47, 151, -129, -171, -89, -158, -63, -66, -27, 35, -48, -52, 30, -1, -45, 136, -8, -138, 143, 7, 57, 95, -103, -147, 81, 192, 15, -94, 87, -37, -58, 34, -11, 76, 21, -38, -24, 103, -53, -131, 145, -101, -3, 16, 39, -168, -104, -25, -43, 107, 29, -59, -160, 19, -66, -166, 6, -51, 16, -95, 13, 38, 37, -79, 36, -13, 38, 86, 89, 135, -22, 204, 99, 28, -128, -38, -33, 145, 70, -40, -34, -107, -279, -104, 161, 133, -51, -129, -95, 81, 80, -9, -88, -76, 1, 88, 7, 7, 78, -115, 60, -40, 98, -86, 67, -128, 54, -104, -143, 38, -180, -78, -130, 114, 110, 85, -127, 79, 88, -49, -5, 97, 21, 82, -6, -59, -31, 56, 168, 19, 68, 2, -92, 45, -32, 1, -53, -172, 214, 55, -62, -121, -244, -195, 7, 23, 81, -78, -109, 48, 136, -107, -41, -19, 83, 111, 7, 38, 177, 50, -22, 29, -8, -94, 1, 163, 133, -46, 39, 15, -143, -138, -81, 122, -42, -162, -204, -68, 180, 24]
6420B4m7o3o3M5J21k28J26J50j6l8m7k8p1J39l2J00J2j73K28k56QJ09P4m3Q0o3
6446D8O1j16J76j6k48L3J26J18j68p8m8P6l2q5M4q5J05j8PjM1P7j43J6J38k7K28
6473B29l26L8J2K40n5k62L33j29o4L3j0k0J0l3KJ59j04m5k8J52p2M4q0Q7l5q0
6499dP0r6J28N2k50J47L7j04J70q9M9n0J4l2o0jQ6NL9j60J87l2j83J33j29N0N
6526a8r0O4O9j43J92j91J39K7j26J81j67J72k89J26R9n0j27Q6j87J41K8J19j53
6549i8Q8n2P9P1p0j31J49M9r2J19j23J2J11k03K14j28J37M7k12NR3j0j75Q9K11
6574A80j12O3k82O8Q0o9q3K01r3qn2Q9J31k40j0P0L2l4J03n5N3O2l8j59N8j0J26
6601G1j19K2J06K8qMP4j36M8j27K13j83J88j23L1p4R2%l4R2j11L6o1l5n5K35l33
$$ y = [24, -23, -86, -149, -104, 17, -211, -85, 65, 49, 11, -36, -64, -135, 4, -28, 72, 84, -89, 139, -117, -109, 0, 74, 31, 111, 48, 109, -7, 169, 153, -95, -62, 64, 182, 14, -64, -112, -36, -68, -153, -109, -194, -89, -107, -100, -101, -60, 17, -126, -110, 28, 1, 229, -97, -59, -47, 193, 138, -124, 209, 80, 16, 49, 39, 19, 29, -4, -2, 157, 53, 8, -20, 132, 60, 104, 24, 111, 76, -4, 66, -30, 98, 150, -100, 47, 84, -20, 150, 61, 110, 60, 74, 42, -18, -19, 67, 72, 111, -49, 138, 106, -77, 56, -73, -23, -18, -108, -44, 25, -118, 74, -117, 22, 49, -77, 104, -63, 109, -180, -54, 45, -5, -132, -46, -233, -92, -64, 55, -98, -10, -62, 17, 88, 18, -113, 36, 85, -7, 112, -11, 1, 112, -91, 123, -5, 132, 179, -33, -28, 65, 55, -120, -31, 180, 68, 131, -151, -83, -3, -72, -155, 46, -47, -55, -107, -18, 113, -127, -137, -67, -35, -69, 34, -21, 32, 94, 56, -103, -45, -55, 71, -48, -26, 80, 108, 100, 104, 178, 42, 90, -37, 176, -7, 181, 58, 89, 15, 107, 107, 73, 165, 54, 90, 29, -6, -61, 174, -159]
6628a59nL6N6L4R7k1j87K53j37p6Q1l0J65j73j2k7J30j4k8Ok1J71j51M7J0K1J18
6655A84j49j11J24J87k85J20r4l0Q7r0l0P4%j33O2J44n2j12J5O3n5m0O7K2n3K2
6681f3j5j9J4N2P8m1l8K32k31p5J53L4j12j98O25k83j28Q1R3nj55l5J71l8j00
6706cK1J28p6r6N5k7K0J8L9N2k63lP7j31J70J15j16r0r6J71k8j47K96j56M6j21
6732a45K19N7j33p7j29L86k9k32R3j90J88k7J76j33m0R3p5n8J39J36j75j0R7r9
6756C2k05J12Pl3O9k0j40J53j42J65j87P1j75K92j9j52%J39M8m7R2L5p7o3j09
6781a54J04k18K19L7K67p9j97Q1o6k1R1J17k07L6J26j94l3P4l7J59Qk72L13k80
6805a26Q9l4n5J28L4l3J06o4L1K9q6LO8p0O8k40J44j47J38k3J61j40%k3J9L6N6
$$ y = [-159, -164, -128, -72, -38, 59, 38, -149, 104, -33, -109, -28, -58, 107, -66, -78, -105, 25, 11, -17, -11, -32, 139, -12, 35, 45, 66, 184, 35, -76, 48, 235, -50, 70, -24, -54, 33, -57, -87, -13, -13, -146, -84, 60, 8, -104, -89, -26, -81, -121, -54, -32, -85, -63, -78, -97, -83, -31, 47, 6, -32, 200, -31, -106, 47, 81, -31, -229, 396, 113, -15, 66, 159, 154, -1, -36, 135, 97, -3, 18, 146, 70, -26, 29, 2, 22, 40, 79, 131, -132, -135, -58, -189, -19, 96, -20, -110, -206, -35, -63, -210, 86, -70, -24, -145, 74, 131, -2, -79, -208, 178, 149, -83, 10, -180, 8, -19, 157, 24, -16, 77, 2, -56, 83, 219, 44, 34, 131, 32, -173, -61, -54, -87, -18, -38, -178, -25, -167, -2, -189, -118, -293, -1, -20, -172, -172, -33, 15, -32, 60, 95, 18, -45, -154, -50, -268, -49, -12, 255, 176, -21, 60, -6, -27, 64, 181, -26, 10, 136, -58, -91, -17, -54, 105, 113, -159, 154, -126, -37, -71, -126, 2, 36, 3, 109, 45, 76, 105, 19, 22, 90, 20, 88, -152, -8, -155, -17, -40, 121, -19, -19, -42, -23, 13, 69]
6832F9l6j24J24l4J9q6j33J82OJ67j05j07J05r8J8R3K6j13O8l6l6jM6p4J24j44
6858h0O4p7L0J51j70J12L9R9j86j42K62K9q6P2M5m9j48Q2M5j91R6m7J5J82j35
6883A2j48M7J78j63j5K6p8J65j74L5n3J44L3K6j74K70l80L52j2j7mm4K7Nm4L3
6909D7j39J60pnN5q1l8r0J81kj74l2J48p4R9L3p9M1n7J27J8n7j98J00o1Qr3K55
6937H5r6j39J40nJ03k80P8K04k05M4j01M0M0J36J26j21rN4J21j33Q0k1p4M8q0
6962C5N7L9j53J92j11q3j68J26j07p9K08r4n8mL02N3r1r3LP%j17l8L35k89R3J91
6989A56k60J47k6J27r3j57K89j26R7n1m9l9j73K95k4j4P0j15J6k46J75J23k6J16
7013B12j76o0K6o9o4J96j13j22J04J79n4j17o1oQ7M6N6k08J36k2l4J19k49K28
$$ y = [69, 33, -91, 33, -1, 18, -68, -201, -19, -13, 154, 49, -58, 47, -51, -33, 60, 86, -27, 41, 5, -31, -32, 14, -60, 64, -80, -16, -93, -63, 88, -82, 30, 69, 168, -18, -160, 102, 131, 45, 117, 162, 113, -35, 47, 92, -99, -3, -50, -35, 147, 12, -136, -89, 89, -74, -89, -63, -141, 24, -150, -115, -168, -24, 9, 35, -139, 131, -249, 103, 91, 74, 70, 26, 53, 58, 14, 47, -92, 68, 61, 56, 111, 30, -8, -98, 83, 81, -93, -125, 23, -51, 48, 81, 2, 43, -14, 113, 131, 74, -124, -24, -85, -77, -170, 85, -11, -150, -10, -15, 88, -192, -114, 90, -115, -71, -172, -132, -92, 44, 170, 49, 40, 94, 215, 82, 162, 141, 67, 115, 35, 92, 131, -22, 170, 59, -24, -192, -66, -173, -252, -44, -138, -196, -200, 102, 155, 64, -29, -26, -19, -19, -136, -174, 161, -128, -35, 156, -104, 43, 17, 144, 51, -106, 183, 57, 154, 103, 54, 15, -158, 137, 113, 99, 169, 54, 70, -176, -1, 122, 96, 212, 36, -24, 2, -67, -131, 65, -48, -170, -66, 113, 59, -58, -119, -125, -38, 8, 64, -144, -8, -30, -64, 55, -194, 34]
7037C4L0j16L7kM0j66J85j30L5m1N8nK2k92L57l1KM9O4k06n5k1R1P3k94M81j85
7064A4J9n9K06k37K2J46l1j99K34Poj17n6q0O4J51j16O2j57Q3p0J28k8mj8j11
7090a53K7j6K67k52R8J59r2L4q8J23j75l6M9L8L9N4k7m6n5J6Q7p8q0R8J84k27
7116e2J08J62k41j23R3J48k65L18q3k2r7j7J48r8Q4K0Q2j74j1J17l31J45P1R2
7140G4j94R9l2j57J87p3M9k38K57r1R8Q6K6k59J22n3K11l8M1j62O8P5k51J93m2
7165dJ77k14J67m2o4J06n3l6N2l4o1q1K10q0L8j30J4L9jP7n9j91J58j90j5J05
7191a12o1O1lK13k72K10k12J38j07M5J59P4p1J00j01o9J85j15J16k38J63lq2K4
7215D2Q9j96K41k90K52J15j60k2N0k50J99M0p7o7j11K75j64P2m3j09j48p7K39
$$ y = [34, 64, -52, -15, -17, 23, -143, 42, -88, -53, -94, -36, -41, -19, -311, 46, 15, 17, 66, 130, -76, -131, -152, -61, 12, -282, 199, 14, 33, -26, 180, -57, -35, 111, 80, -119, 115, 122, 116, -1, -57, -137, -73, 78, -38, 24, -133, -50, -120, 8, -20, -24, -42, -153, -126, -142, 125, -127, -29, 130, 38, 72, -16, 107, -68, -104, -55, -17, 22, 76, 49, 3, -52, -36, 51, -27, -107, -9, 175, -52, 56, 218, -23, -146, -53, 95, -170, 148, 65, 43, -54, -71, 77, -21, 63, 83, 165, -9, -20, 97, -234, -89, -18, 74, -120, -21, -53, -210, -23, -96, -47, -285, -28, -119, -21, 65, 91, -168, -46, -99, 112, 74, 115, -47, 21, 96, -155, 38, -4, 173, -41, 126, 84, 20, 126, 73, 37, 89, 55, -6, -87, 123, 43, 81, -49, -35, 4, 3, 80, 21, -170, -12, -202, -217, -112, -173, -112, -115, 98, -174, 36, -176, -38, -145, -100, 59, 133, 62, 162, 61, -8, 177, 62, 178, -60, 103, 100, 18, 42, 131, -65, 176, -114, 138, 253, 93, 71, 121, -129, 70, 110, 33, -34, -145, 130, -34, 38, -5, -114, -262, -339, -100]
7238a00J18r6Ro0J30r1j04l2J66p5J93N0M9j75J24l7j75J75P7k87K42L6o0L28
7262D05k87p4K7P3n8q9M5N1k05%K48j83p4P9j24J38Q6j43p0P7o9J25o3j91K09
7287f7O8q0J49j15j40J39J11j22j79O4J6J86R5j07J12j34N5q7J39r2m1Q6o8k3
7311c5M7J25M4j85Np0N4J08k20K36m7j08M8Q9r9m4K15r7j96K77l63N5J22l6o7
7336a42J01j07L12j49j00M9k4R2m5J25r9J9q9J12Q9k25P9l9J08k14J35n0J7R5
7360E0N0J7Q8m26J82M0m1M3L4Pk08K91j85q4K89j60RJ09j16p3J32o0k0l7J38q3
7386a4J14j47m9J20j42n1J6J3L2P6kM1j07K14r7M3p2J30k15K16p4m2M7j14J58
7411I4l0j22R5N0j05k8J70o2k52K07o4m1J37mn0J78j97J19r8P8j66NP7jj23J18
$$ y = [-100, 18, -78, -69, -129, 1, -90, -194, -226, -60, -135, 58, 108, 157, -18, 106, 69, -106, 69, 146, -141, 101, 137, 77, 405, 118, 44, 71, 144, 86, -3, 42, 93, -112, -112, 136, -47, -121, -42, -166, -28, 58, -85, -155, -78, -147, -22, -85, -276, -67, 1, -79, 70, -45, -185, -46, 65, -57, -236, -172, -156, 30, 125, 18, 130, -4, 51, -36, 103, 11, -30, 56, -12, -35, 12, 137, 181, -4, 1, -69, -15, 93, -127, 109, 62, -46, 2, 91, -8, -52, 163, 66, -130, 147, -216, -161, -39, -75, -142, -41, -148, 164, 15, -85, -36, -60, 32, -13, 112, 13, 32, -57, 55, 144, -81, -2, -41, 67, -147, -12, -62, -45, 50, 100, 117, 205, -221, -39, 1, -40, 3, 37, 44, -164, 127, -58, -142, 147, -13, -4, 105, -11, -84, 48, -12, -32, -69, 69, -14, 100, -47, -96, 24, -118, -169, -153, -140, -108, -32, -34, 7, -100, 114, 17, 60, -12, 118, -97, 119, 45, 3, 50, -64, 94, 64, -58, 37, 87, -18, -46, 124, 62, -190, 17, -47, -88, 49, 45, -5, 173, -24, 95, -3, 75, -91, -86, -9, -10, -133, -15]
7437a5J27j60r3O0N9Q5j60m4J86k44R2Q0J27M2j85L4R5n7j07J96r1Q6j1M0r3l3
7463A6J19o1O1k0j7L0j99o9J26p9J18q4q6J30q5q3K33n5j04K08Qj03m0n0J28k7
7489A5N1j41j19J20o1J95o7j14J46q3P4q0J34k00J71j4J38k3l2m1l1%j6l2r2K98
7515A96l2j26J1K4k0o1J46L7l23K7L17j56m9L6q8R3R3j50j52J15q9N8m6J35r3
7540i7J75P0n4J8q6j00l0m1K51j86K50n6j07P9q7L8j02m7K26j25r2J37l7q5J58
7565G0Mj54o4K27m3l8K8j2J66l10K36q4p2j02J3J69j02Q7m7j02l0MJ67qj62J48
7591a1J7j96K19KJ45j24L1K6l35K99n5J05o8j63J16m9nK9O3o6k15L35m4N2p0M4
7617H2j42lQ7o1j29K56o0p4N8p5J1N9j29J64R4r6l4J33j2j89N4q9K02j29J10j90
$$ y = [-15, 112, -48, -141, -81, -22, 63, -97, -141, 45, -199, -107, -27, 100, 142, -43, -9, 86, 29, -78, 118, 27, 113, 102, 142, 49, 16, 135, 74, 135, 115, 98, 128, -71, -140, -14, -93, 25, -59, -145, -15, -100, -183, 50, -5, -109, 99, 107, 4, -36, -86, 42, 15, 66, -75, -194, -74, -135, 60, -7, -121, 25, -58, 16, -64, 70, -130, 41, 27, 165, 142, 110, 69, 38, 38, 22, -10, -102, 196, 164, 38, 49, 73, 53, -8, 138, 175, -148, -121, 196, 40, -9, 27, -61, 32, 125, -25, -177, -62, -151, -93, -139, -4, -97, 78, 148, 94, 112, 26, -74, -104, -145, 106, -80, 170, 114, 7, 86, -1, 37, -65, -112, 114, -11, -103, 34, -3, -88, 70, 74, -80, -144, 83, 40, 2, 30, 18, 184, -126, 110, 26, -46, -148, -135, 34, -68, 19, -28, -130, -160, -156, 11, 3, -159, -11, 6, -190, 29, 31, 176, 52, 83, 109, -226, 73, 18, 123, 55, -108, 8, -41, -46, -17, 46, -20, -235, 100, 56, 108, 38, 82, -60, -63, 24, -37, -166, 90, 30, -44, 14, -61, -50, 9, -120, 44, 138, 42, 8, 141, 129, -60, -6, -95, 107, -22, 88, -102]
7643a02J67J10k30J9N4j11J53Q8k09j16J82j46p0K38q5L9o5J6J18k12k2J71J67
7666A54k84Q8k0J88j63lM8j19Q3O1p1j3J14R6k76kO4J66j68N6j22K14O1k34J47
7691F5J9j79J38r1j08J41o8LKP8Ln8M6j33J54L3j41N7J61j34JJ1J0J3o1J55k47
7718a30J9J9q3J45j24N7K19l9p7M9k8n7J84r2o0o0J93k81L2J22J3p2O0K1M1j23
7744e2K39k75RJ95j76qM0P8n7k6N7j45O2R0Lj5M5P0r2J24j39J5J57n9K2n0M1Q
7772A61k8j11L71l96L3O3j63J37n0L6j10P8q8M7J15q5p4J22j58J66j22J22j60
7795i4p9Q2O4k9PJ27k63J42nM1J41j25k3K40k52k3J03N8m3L2p1JQj8J07n4R8j62
7823A0Q1j56J22k5r9m4J89p9m3L6P4k56j6L56p6j05j00n4R1J15n1j01K11k1RM7
$$ y = [-102, 65, 175, -55, -36, 18, -93, 60, 148, -61, -177, 5, -141, -211, 27, -58, -19, -84, -68, 50, -162, -184, -13, 154, -130, -42, -62, 126, -37, -40, 8, -111, -28, 33, -38, -51, 63, 159, -117, -119, -55, 111, -57, -1, -123, 91, 152, -82, 65, 84, -95, 43, -48, -156, -15, -83, -80, -78, 0, 3, -55, -9, -142, 12, 45, -96, -39, 122, -12, -11, 0, 10, 23, -38, 117, -130, -111, -92, -175, -30, -154, -97, 122, 83, 6, 55, 27, -30, 154, 62, 2, -58, 135, -146, -114, 8, 21, -51, 9, 30, 71, -52, 187, -88, -79, 116, -60, -68, -28, 50, -7, -33, 24, -121, -59, 31, 34, 19, 64, 134, 42, 166, 27, 42, 199, 140, 162, 112, 153, 161, 133, 22, 393, -3, 30, 93, -70, 67, 17, 53, -57, 21, -67, -20, 95, 10, -64, 58, -100, 66, -56, 66, -94, -173, -91, -27, -56, -49, 78, -185, -43, -48, -7, 134, 9, -14, 226, -26, -49, 54, 112, 69, 101, 30, 31, 39, 21, 128, 74, 172, 10, 91, -65, 57, 32, -67, -111, 78, -1, -44, -8, 66, -190, -206, 150, 74, -31, -131, -185, -94, 21, -30, -131, 80, 59, 68, 115]
7849A15q8Ln1K4m5l9L1R5j57J60n9L6j28L5J15j04L4J93j44Q2j24M2k22J83N6
7874D3p3J82k66O3q6M9Q2j7R9J3l3o6J72n3j06L5n5l1P9J0j04L2Q0j36L6P2kM8
7902F7q6m0R9k0L1J58k73O1p5J91o1J3j18R6j3j7l3j32L4P0J79j65N4N4j43R1
7928B2l4K31j79J3j9k9j58L5J33j88K62r1m7K39j08k59K20J31m0m6j31O6J11j4
7952A20o7j26J61K0j20n0Q2q2P8j11K42j81N4o5R0j03KJ39j74J11J46k0j87L1
7976a0M8nO0l8J5Mj52Ql0J86j11j00j0N0J11J89j98Jj01J32j52JK00k44O7m9J32
8003DJ49j17j83lK55k85K26j50J59q0r1K63k30P5j7j25J29j1K13j65K2O1k47J38
8027a0j64K66j30J40q7J36j07m3J15oj33P3j35R6j18J2J23m9l2j66J95N1j06j09
$$ y = [115, 27, 30, -21, 3, -42, -81, -50, 45, -112, 48, -11, 25, -103, -68, 47, -57, -23, 170, 26, 108, -16, 26, -196, -13, 43, -30, 152, -114, -51, -137, -88, -6, -23, 76, 89, 56, -10, 162, 109, 3, 38, -17, -48, 31, 41, -63, -31, 49, -87, -51, 21, 19, 67, -19, -59, 40, 20, 51, 209, -64, -3, -78, 113, 52, 65, -53, 43, 30, 13, -20, -152, -118, -48, 131, -34, 20, 74, -69, 22, -12, 219, 40, 53, 34, 5, -153, -118, 15, -173, 89, -2, -49, 190, 82, -177, 43, 174, 134, 88, -43, 23, 134, 120, 53, -73, 88, 108, -12, -62, 20, -62, 16, -95, 147, -34, 20, -45, 45, -58, -56, 83, -91, 20, 166, 146, -41, -10, 38, 33, 93, 55, 70, 74, -78, -70, -100, 86, -25, -125, -135, -85, 26, 215, 17, 18, -83, 49, -103, -102, 98, -146, -79, -128, 4, 153, 36, -147, -150, 105, -180, 46, -104, 55, -25, -116, 147, -83, -8, -25, -150, -21, -32, 181, 16, 38, 99, -148, -10, -174, 92, -38, 102, 15, 151, 44, 1, 116, 110, -23, 50, -85, 11, -107, -95, 28, -21, -53, -219, -24, 27, -79, -188]
8051a88L10k45J26R0o3L7o7J24j95J92j84Q3r6J22N9r0j56J45j1j2N3j25P9%J10
8076I8l8l0K42j23j90M9n9J75j54J18j63R7j0R4j96L5J89j09j84J94r2m9K28k10
8100h8P0J12j06m3r2J90L9k43J48R1n8q7J24J54j50j72L1k1J72l6j61Q6L4%J22
8125A16l13K94j8l0n7P9j10Q5P2k98R7J72%k1o1L8L8j04o5rL8J83k55J03j33K04
8151D5K66k04j42k7J4K2L5R0N9o3q6k7j00J92kK3j00k19J35J09Plk50M65j24o5
8177E0K1k3j89p0P5Q4J8j5o0K5Q7o7P3q5
$$ y = [-188, 122, -123, 3, 93, 30, 67, 0, 124, -71, 121, -63, 20, -76, 46, 105, 15, -141, 4, -7, -19, 34, -91, -12, -12, 98, 60, 30, 272, 149, -41, 8, -51, 124, -30, 88, -75, 22, 12, 106, -90, -55, 134, 25, -159, 35, -57, -106, 122, -88, -18, 94, -12, -55, -147, 43, 82, -161, -13, 78, 20, -67, 57, 211, 61, -111, -80, -101, 71, 35, -126, -40, -6, -6, 116, -197, 97, 79, 49, -8, 71, -39, 46, 118, -180, -83, 89, 89, 68, 7, 45, 83, -21, -86, -95, -57, 126, -129, -26, -159, 45, 311, 107, -35, -62, -48, -26, 9, 99, 158, 95, 9, -18, -118, 74, 72, 95, -5, -224, -89, 20, 27, 24, -226, 239, 115, 50, 71, 48, -141, -211, -136, -52, -34, -49, -109, -84, 3, -64, 9, -76]
8191g6
$$ Imaginary data points
##PAGE= N=2
##DATA TABLE= (X++(I..I)), XYDATA
0@%%%%%%jJqJ6j6J7k5L3m1N1o0P5r2J16j40J65j98K32k73L21l72M31m98N72o58
31c52P51q54R70j096J235j387J555j742J944k163K406k671K960l276L620l998
47b098M412m862N354n899O501p164P901q726R656j0710J1916j3316J4957j6913
61h991J9298k2282K6138l1338L8772n0346P1017j19105M31866K49133o76820J66782
73I4124L06540k24553m04527K82250K96844k57725l54488J29216R6499k01652
83b37472j18223J95649J17608m6859o3357m6396o6911O7125R9002k5825N463J89600
95F9404L4346k37009p7884K20226M2201j71503R4696K83459q2705k99513L0285
106i3997K03784p0596j03370J81969J24432j84631j08675J20052j6574j52500
$$ y = [0, 0, 0, 0, 0, 0, 0, -1, 0, -8, 8, -8, 9, -16, 17, -24, 27, -33, 42, -50, 66, -74, 91, -107, 125, -148, 173, -199, 232, -266, 306, -352, 399, -455, 515, -581, 654, -733, 822, -920, 1024, -1139, 1267, -1404, 1556, -1720, 1900, -2098, 2314, -2548, 2806, -3093, 3408, -3756, 4145, -4581, 5075, -5635, 6281, -7035, 7922, -8991, 10307, -11975, 14163, -17175, 21597, -28749, 42268, -76837, 355029, 604162, -72658, 94124, 400664, 176111, -228416, 53834, 350678, 92953, -261535, -132319, -35820, -237472, -355695, -160046, -42438, -89297, -152654, -199050, -265961, -198836, -99834, -125659, -120196, 69404, 103750, -133259, -211143, 9083, 51284, -120219, -25523, 257936, 175231, -124282, -93997, 109787, 39191, -64179, 117790, 242222, 57591, -51084, 68968, 52394, -100106]
116a00106Q9814J98772p4289j44489R2666L7918k12964m5241K63082P6196k15664
127c4305k5794J76445q5169k50291N5864K22277m1060j47608O9108P8834j45782
138a27481j19599R8951J04961j1140P130K9215l7456j8431M4291j6846l3334J13032
150C3293J16692r4212j05342R6843M9263j64710l8936K26069P7054k07729o7838
161g9553J70082j204j93426K8727K19273K904j60480K2623J12494p3332j12959
172f4851P9897J11475m1360n5900K9008j0377o5827J56L4966j9835k276N2088
184D7164j9228r1929r326N0675l3732m3325P7698O2679q7854p4824O2658L7871
196b1473o4536N852J03629J4811p1551J2408O1073k6827l3259P0892N8219m1451
$$ y = [-100106, -10292, 188480, 114191, -30298, 62368, 100286, -112678, -157919, 105163, 181359, -34305, -60099, 116346, 31177, -219114, -163250, 59027, 17967, -129641, -60533, 18301, -127481, -247080, -148129, -43168, -54308, -47178, -17963, -55419, -73850, -29559, -46405, -79739, 33293, 149985, 55773, -49569, 47274, 96537, -68173, -107109, 118960, 196014, -11715, -79553, 90529, 89325, -104101, -75374, 143899, 146803, -13677, 8946, 121440, 48108, -64851, 15046, 126521, 85161, 29261, 58269, 47892, -17935, -17779, 17187, -2648, -4924, 47164, 27936, -63993, -73319, -22644, -56376, -99701, -22003, 40676, -47178, -122002, -59344, -21473, -86009, -80157, 23472, 38283, -33268, -20860, 40213, 13386, -19873, 51019, 109238, 67787]
208F7787j6938M9395j4936o8593K0214O3233l1542n1827M0561K3314q4283n1488
220e5103N6622K2626n9519m580N5224k3103p5863O890N1208j7052l0561L4031
232c9180K5029l8719j9830L0765M115k2270K0841L7030j0241j4971K5068Q707
244F344k8003P669M7468P186k5209J3104K3397k6816k5988K9862K5760k4986j4741
257A5047K3083l018l6183m380K3430o424j9926J0875J1142k2315j5194J4504J825
270g534j8432M331K0508n287j5044R016O422j8014l384K7769J1601j6817l228
283h093J2999o017j2734J4040J6892j2014j2396J2621P353j6801q222J1858K295
296A781r796M345J0683p957j2726O951J0768m652k947J1848P708n793k560M917
$$ y = [67787, 50849, 100244, 85308, 16715, 36929, 100162, 68620, 16793, 57354, 80668, -3615, -55103, 1519, 24145, -35374, -39954, 15270, -7833, -83696, -76806, -25598, -42650, -73211, -39180, -14151, -52870, -72700, -41935, -37820, -60090, -39249, -2219, -12460, -27431, -2363, 6344, -21659, -13990, 33478, 40664, 15455, 28559, 51956, 25140, -848, 29014, 54774, 29788, 15047, 38130, 35112, -1071, -5451, 17979, 11555, -8371, 2504, 13646, -8669, -23863, -9359, -7534, -25966, -21635, -1127, -6414, -21458, -12442, -6020, -24034, -27418, 351, 11952, -4865, -8093, 4906, -1111, -13845, 195, 17087, 5073, -7323, 5298, 12651, -4150, -12372, -514, 1781, -8015, -3670, 7013, -944, -13670, -6719, 4049, -603, -3550, 8298, 16006, 10213, 7653, 12570]
310A2570j178k844R069J0555n756j2579k375L351j604k966j677n124o316j09L009
325c974l979q987l644M302N721L270p58k726j261K633N297L851J267M49P59J741
341C961J19l343l292K312N380N64n348m883j58J897L051J835k381m564O42P242
357C034M681m157n814O3N063N256K152k039n198k463M504O154n88n720k628J681
373C981J359k049l807l381k474m08M40k688n666k632L371M055o58k865J131N820
389f471P302M813L19j303J232O929P752J217o562o640J65L741k40n993p558m992
405f289j489J422J280l644o299o17O453M383j751j554L298L141O54J948J518k114
421C40p75N373L173o265o412M402O872p71k994o61k517k647N875P119m835j0062
$$ y = [12570, 11392, 8548, 17617, 28172, 22416, 9837, 7462, 10813, 9209, 6243, 4566, -558, -6874, -6983, -3974, -7953, -16940, -20584, -16282, -10561, -7291, -8049, -10775, -12036, -9403, -4106, -255, 1012, 1461, 2220, 3961, 4080, 737, -2555, -243, 5137, 5701, 353, -4530, -4688, -2791, 260, 2095, -286, -4850, -4208, 3034, 7715, 3558, -2256, -2193, 2870, 8126, 10278, 8239, 3041, 578, 5082, 11236, 10648, 4928, 2300, 3981, 5340, 3291, -516, -3897, -6371, -6779, -6339, -9027, -14693, -17325, -13954, -9899, -10557, -13422, -12291, -6471, 831, 5644, 5963, 4660, 5892, 12821, 20573, 21790, 15228, 8588, 8753, 12494, 12254, 6261, -1297, -6289, -7778, -6356, -5076, -8720, -15019, -15636, -9183, -4800, -6551, -8105, -4807, -1666, -1012, 936, 2454, 340, -435, 4938, 8111, 1846, -4566, -164, 6708, 5937, 2943, 2282, -235, -2882, 2993, 10112, 5277, -4785]
437d785N22P299k84m886k25k42l283K882Q857p89q962J30R924L884k389K198K603
454A2454m179l178M226j05p971j850O442j631j0983n110K720J02N89N838J352
469a284p341j600Q822M432m211J72N519J22j322K771k564j1442l462R892M822
484C326o004k975J383n132m529Q346Q922k685q42Q288P71j1036k629Q982K612
499F798l263M051J303j2833r141P618M167q855j29J2658p4j2989n39P180o318
514a0366o263J5822J5408j1020j6324L762N494p410P31J6065M932j1264l889N567
528A245k505m966P952J0960O58j550n62q975q572O354P898n559j095J1931j759
543A1455k2273n909J7451L923j0459J1742K3042j1219k8673L751K2536k627j2033
$$ y = [-4785, -4263, 3036, 2752, -2134, -2359, -2601, -5884, -3002, 5855, 5066, -3896, -3766, 6158, 10042, 7653, 9851, 12454, 8275, 5097, 9323, 9218, 1247, -603, 5839, 4208, -6775, -11885, -9165, -9063, -8474, -2636, -1284, -8625, -10225, -1403, 3029, -1182, -1010, 4509, 4631, 3309, 6080, 3516, -7926, -11388, -1496, 3326, -2678, -5653, -4270, -9402, -13931, -5585, 3337, 652, -190, 8098, 8869, -2167, -4796, 4186, 6798, 3535, 7586, 8889, -3944, -13085, -5467, -1300, -10155, -10284, 2374, 2300, -10689, -11228, -4048, -10366, -16629, -807, 14601, 3581, -12743, -8981, -3487, -10897, -10166, 5899, 10831, -433, -4322, 1245, -1260, -6226, 1726, 12686, 13344, 11794, 11232, 2257, -6315, 39, 7937, 2378, 1283, 13214, 11455, -10818, -16727, 724, 4647, -5812, 5930, 28972, 17753, -10920, -7169, 15367, 12740, 707]
556G07J4313J4271j9772k3535N326Q997r231l617J3555M158j2861q635M20j079
570a6983L294J3189P862j298K792J067j2499p118J6492J6708m096l214R173n466
584A9903k1549k371J8650N201p968M278M323j7092j5376O025L887q287O448J4116
598A0188j3785k4794N892J1863j8367r624L3298K0327l0732j9407K7443R106l1906
611c0498J758N0135J2097m1992j2335L1950J168l3277M205L8809L970l0759q084
624a2853J6069o25j7024k03J9940J5067o426j9604n224J5616M650k0077q62L4883
638B3327R947l9947j9102L1848Q095l8850j628M9992N116n3462j1771M1271J179
651F015l9404P733M3182m515l5125N998K3473j4240j7514K1929K2349r022o842
$$ y = [707, 15020, 29291, 9519, -14016, -8690, 307, -8924, -12541, 1014, 5172, -7689, -16324, -15904, -16983, -13689, -500, 7362, 6064, 8856, 9923, -2576, -9694, 6798, 23506, 19410, 16196, 25369, 19903, -1646, -4017, 14633, 19834, 11866, 16144, 20467, 3375, -12001, -5976, -2089, -10376, -3928, 10188, -3597, -28391, -22499, -10636, -29003, -38627, -5329, 14998, -15734, -35141, -7698, 1408, -30498, -28740, 21395, 33492, -8500, -20835, 11115, 12283, -20994, -16789, 22020, 25990, -4769, -12853, 3216, 2591, -14433, -14636, 5304, 20371, 13945, -5659, -10883, 4733, 9383, -10694, -11556, 23327, 33274, -6673, -25775, 6073, 14168, -24682, -26310, 23682, 28798, -24664, -36435, 4836, 6015, -33389, -25656, 17526, 13011, -22114, -16116, 7357, -6883, -24397, -2468, 19881, 10859, 4017]
664D017R236n351j2160J2711J6242p829l173J7891k146k8106m532K1137q22j6527
678E88R003J4002j8663k2291Q159R533j0656j715J2916j909r258O058j13j8415
692b2761L530L0071J945k3528R528K4621k2175l1568K8140L7158k6407k9393L3458
705A2619K5031m3055k9917L8817K5613l2732j3590L3841N977l7759r305K8387
717C927N910j7565L275J6172k325j1674m681m057K959J6276N673j3639j755J1848
731A0344j2112k3251J4698K8879j2768k3892J8283J9073k9918k5790K6590K3265
743A3401k0408r156K4974N76l2110l403K5905M95j4155J4536J6696j7015j6362
756a6026J1386M174j1869J1789K5623q901k5088N608J2627j5671p934K5941J2720
$$ y = [4017, 13253, 7902, -4258, 8453, 24695, 16866, 13693, 31584, 29438, 1332, -3200, 17937, 17115, 588, 9591, 23593, 4930, -17361, -9202, 331, -10325, -12040, 876, -1033, -10291, -4233, -4346, -22761, -19231, 10840, 12785, -10743, -1215, 23406, 1231, -30337, -2197, 34961, 8554, -20839, 12619, 37650, -5405, -35322, 3495, 29108, -3624, -17214, 16627, 22604, -15155, -24460, 3927, 9837, -7728, -4453, 11719, 9394, -2280, -6961, -11018, -8059, 8217, 13890, 251, -1504, 10344, -1768, -25019, -10321, 18558, 5790, -18102, 181, 19254, -10664, -36454, -9864, 13401, -7007, -16163, 8811, 9387, -22723, -26126, -221, 274, -13881, 655, 17351, 336, -16026, -4640, -466, -12335, -546, 25077, 16176, -8912, -3304, 9323, -6348, -14282, 11659, 24379]
769B4379k1462p687J5713o867k3896Q188K6936j096j3088O146J741k0427o455
782a7875J9900P406q817O809J0220j6405j8723R576J1514o517M455K0197m811
795A6929k6487l264J5734l265q326J6045J3926j6109j5027P110j098j4895N986
808a2741K3149J050j5847n64K483j3773m266K1712J3121r464j629R344r509j7760
822a4694Q075J9484p44n155R506q64k2206r091J4879O052p079N835J0489j1729
836B758j7246K873P258n367L229J8142K898j7125p371N611k118k630J4366J3401
850A8679p959j0479K126j928r464M037J5484K651p841j402k301j2946o198J1127
864f414P785m587p57M341p845j3367K320J0975K655J293J0048K767j1838p349
$$ y = [24379, 2917, -4770, 10943, 4076, -19820, -11632, 15304, 14208, 1120, 7266, 9007, -11420, -17875, 2025, 9431, 614, 7423, 17643, 1238, -17485, -7909, 3605, -2912, 1543, 21740, 16929, -9558, -12822, 2912, -353, -8679, 7366, 21292, 5183, -9844, -2734, -3832, -18727, -12741, 10408, 11458, -4389, -4953, -2470, -16243, -20509, 1203, 14324, 4860, 3231, 12575, 3066, -14694, -6619, 12865, 12121, 6966, 16472, 15608, -6598, -15689, -810, 5242, -1837, 3998, 14487, 2758, -14488, -11615, -4357, -9724, -6495, 11647, 14545, -2580, -9951, -4340, -6458, -9088, 5278, 18679, 10720, 241, 2367, 439, -9025, -4988, 10496, 13147, 5306, 3904, 1603, -11343, -17541, -6414, 1371, -3216, -3973, 368, -7477, -20844, -18524, -7549, -4894, -3601, 6447, 9214, -2624, -9973]
878i973P016P021J826O298O965n345j0343j737R97j618K415P865L71p793m493
893e28j782n537j364Q945O666l779l370J361l764p707K049J0056L866k567Q27
908C372n08p765n570N246P221J285k94Q90l864o172r71L026J478J591M089J55
924C209n907l778R60R81P90M799N297q80m210m66Q31l92J129N554M070j713l961
941F313l070k130j032J453J728m7k302l378l753j863K28Q53N75J504K038r67l189
958g039p05K277K151J664L113K360q26k116l7J018P67J639K516O57j530k193j191
975B525q78P39J973J22k319j216m24k073j867L00J426r17n61J444J49k639j231
992e447K525K413l9O84J191j97j426K01J232q8J38Q57l88j967j165J71o04p4J227
$$ y = [-9973, -2957, 4064, 5890, 12188, 19153, 13808, 3465, 1728, 2725, 1107, 3522, 11387, 11758, 3965, -528, -2310, -7847, -9211, -266, 6400, 2621, -749, 612, -3152, -10859, -8810, 1246, 5112, 2545, 3372, 2864, -4901, -10471, -5225, 1996, 3281, 2987, 3877, 13, -6159, -7130, -4104, -2626, -1035, 3054, 3209, -2698, -6476, -5516, -4535, -3745, 1054, 6351, 5471, 1261, 795, 1626, 1234, 2363, 7917, 11987, 10274, 6313, 3243, 1113, 81, 1534, 3262, 3215, 913, -2465, -6218, -8081, -7853, -7000, -6425, -4921, -2883, -3850, -7039, -7744, -5467, -3316, -1652, 1461, 3821, 2995, 879, 842, 1860, 2627, 4266, 6782, 7439, 5909, 3716, 2525, 1647, 2386, 4359, 4481, 2162, 946, 522, -1551, -3418, -3118, -1692, -2609, -3170, -1726, -1577, -4216, -5447, -2922, -509, -548, 136, 1327, 1130, -296, -95, 1137, 1049, 1187, 2044, 1656, -311, -1476, -1305, -1909, -1983, -756]
1011g56k26j691m27K048O8j733P13K311l86n81K189J255k816j045L059J448k253
1028A177J7K162j039k523J600J860k244j363K747P12l680k81L252p99l304J496
1044b10K894k968k610L939J838m872j566N180P67m539P27M336k692m668L791M197
1060C544m444l486M588J572n210m68M965j230m938K570M888l418l822M685K780
1075B576m555r43N481J13m875K237M795m050l683N061L730n398j850N861k13n991
1091a704K763O321l912n610N024M424o379k768O733L30p883J032O919l857q287
1106f854M383N904p047n222P218K186q713q78Q362j658q114M688P988n649n820
1121i226P624M638p150m94R450r51q389M012Q677n623o637P945M667q894k015
$$ y = [-756, -982, -2673, -3100, -1052, -984, -2717, -2004, 307, -79, -660, 1529, 2784, -32, -1077, 1982, 3430, 1177, 1194, 3356, 2317, -206, 1394, 3254, 1010, -353, 2394, 3106, -574, -855, 2397, 1598, -1706, -210, 2684, -284, -2894, 1045, 2883, -1989, -3555, 1625, 2392, -2147, -1420, 2916, 224, -4444, -653, 3544, -900, -4386, 202, 1774, -3436, -3904, 1061, -169, -5107, -2537, 2351, -1067, -4889, -204, 2576, -1979, -2922, 2559, 2672, -2203, 34, 4829, 779, -2904, 2157, 5887, 489, -1361, 4500, 4287, -1704, 1059, 7380, 3468, -2142, 2882, 7306, 927, -1841, 4892, 5222, -2661, -1629, 5290, 1433, -6854, -2471, 3433, -3614, -8836, -1618, 568, -8145, -9023, -661, -2319, -10433, -5745, 2243, -3406, -9226, -1602, 3036, -4114, -4608, 4842, 3891, -4498, -486, 8191, 2568, -4069, 3876, 8543, -351, -2366]
1136b366R812j126j1425L124J0575n364r419P842P245j0148n743J0904L532j1053
1150c610j36J1601k531j1755L912R371n978p140P618L675r234k343Q218j889q458
1165h679M381P553o135n039P748J909r983J668J2690k034j0473O624J0122q869
1179A483q328J2200P900j1890l404J3795P6j5810R15J3907m275j1824O608Q645
1193I998j0582q897R384L496j1014P6J1847k598j1280L684P316p185l582J1832
1207B495M214j1186j053R960l061r775O952J0957p003p179Q789K457j2695j140
1221g268J3236j3j0187M545Q400r691r558J0649O892j0255j121J4146j314j6867
1235h406J593J3613m102j0037J0562J0824j2737j1452J0004N997j1020j743J3446
$$ y = [-2366, 7446, 6320, -5105, -1981, 8594, 3230, -6189, 1653, 8898, -1250, -6993, 3911, 7443, -3610, -3746, 7855, 5324, -6431, -2519, 6852, 874, -6266, 1352, 5027, -4207, -6550, 1668, -221, -8679, -4298, 3255, -2880, -7919, -171, 1738, -8245, -6577, 6113, 4079, -6394, 230, 10352, 1483, -6845, 5355, 13255, 1365, -2039, 11756, 11832, -3978, -3063, 10844, 6569, -5255, 1353, 9998, -584, -9481, -97, 3399, -7615, -7539, 4308, 1710, -9570, -5886, 1430, -5755, -9337, 2495, 6709, -4477, -5530, 4430, 1369, -8406, -1454, 9503, 2500, -4679, 4110, 6567, -6128, -7268, 5968, 5955, -4232, 313, 8713, -978, -10536, 113, 7005, -3250, -4371, 9775, 8461, -8406, -6813, 6800, 2698, -7339, 3223, 14047, 1310, -10142, -138, 5859, -5161, -6904, 6542]
1248F542Q31j2251j412O237m982m935Q055O158n811k163L545n148n802Q069P842
1263D775n656j319J0084k176j4774J501J5073q49r494Q438J0351j2733j3710J0569
1277H0J0048r438l638J3834J408j5926m150R577j540p091P802R464q170r693L875
1292c558J549p065L087J2242o71r083J739L807q364m189J1326Q077o100k559N143
1307E381m097j0098L678J0309k28l293M506J36j0652l479P065J624k239O178N258
1322A0049r717r014M628L556n176L139J2210j320j3284j540O607l816n431J0066
1336I57J0323o892q534K872M85p449J687J1906K968o824m39J341o574m272P476
1351i69P070j978k58L163n061r242J611P971J007j067M897N19r518n868M609K902
$$ y = [6542, 7373, -4878, -6290, -53, -5035, -9970, -1915, 4243, -1568, -3731, -186, -5334, -11136, -3067, 4775, -881, -2200, 7884, 5708, -9066, -7565, 7508, 6659, -2835, 5603, 15954, 3221, -10489, 80, 10128, 690, -2948, 10886, 12294, -3632, -7782, 1795, 255, -6836, 966, 10430, 2260, -7433, -3558, -2009, -9074, -5987, 6255, 5584, -3499, -1760, 2047, -6317, -10506, 820, 8897, 2797, 238, 5381, 1284, -8814, -5136, 5173, 4945, 1652, 6158, 6294, -4358, -7837, -772, 852, -1387, 4791, 10049, 332, -8682, -4054, -498, -5674, -2535, 9675, 8355, -4929, -6469, 138, -3678, -9109, 957, 11280, 4388, -4146, -1274, -789, -8238, -6551, 5355, 8323, 1499, 1060, 2401, -4173, -8445, -969, 6101, 4123, 3865, 7028, 1967, -7275, -5664, 2307, 3314, 2247, 7144, 7663, -1855, -7723, -3114, -212]
1367b12j325L557N419m280q101j386J645j727K527P785J199o897k631Q45l631
1382g213j590P980P233l283l890K238j787o919J631R793L946l995K26J452n874
1397e2n556M433O838K38j396K048k306p227k357L627K122N95L097N32n472n052
1413e888N09J157N45L646M405j652m859j450J10j291J810N720K466k360k100q27
1429e9l262j765M525M653n84j789O22k465n236J6N479K106j900J412J926m209
1445e30n385J883N054R99k37K572L83m666k974J932K568K28J072J710j150l488
1461b9k318n84K09J999K461o38k161j193j294j705N50L215K237o81n51N24j301
1478a260j997J013L492J866J77n5n74j865j211R58J600L88P07L54j818k363k26
$$ y = [-212, -1537, 2020, 7439, 3159, -4942, -6328, -4683, -6410, -3883, 3902, 5101, -1796, -4427, -3582, -7213, -8803, -823, 6410, 3127, -763, 1475, -312, -7231, -5600, 4193, 8139, 4144, 4370, 5822, -52, -5608, -1175, 5663, 5901, 4505, 6553, 4247, -2980, -5337, -1710, 412, 1007, 4104, 4636, -836, -5888, -5379, -4222, -3677, -31, 4374, 2722, -2137, -3587, -3477, -4768, -2958, 2762, 5228, 2868, 768, -59, -3321, -5086, -561, 4092, 3508, 1719, 2341, -124, -5360, -5344, 135, 2241, 341, 1753, 3679, -530, -5915, -4032, 1022, 2021, 1784, 4356, 4739, 73, -2901, -969, 1599, 1827, 2899, 4609, 3459, -29, -2347, -2931, -2722, -723, 1738, 1100, -1061, -2254, -3548, -5253, -4703, -1488, 749, 68, -483, 41, -1260, -3257, -2244, 1248, 3114, 3291, 3236, 2662, 797, -414, 544, 2144, 2532, 3239, 3593, 1775, -588, -814]
1495h14j32m14J217K162J4k822j527O01j86l25J363K380j70k019m07L74r98l42
1513b045J495J923N3j413j035n68m28M29P10M75P60L2q60j290O1Q47J59N14J967
1532A786R78j743j728N09J505k01k75J564J122j474j614oM06n13p4J077R17j017
1550A219j676r72L27K47K61K05O50P2p36j632R5Q39L40j56Q91R08j002j646k67
1569b033J205L41j60P91N83m55j040m72L02N05L82P64L55k61q85j088n7J034J095
1588I06j20m99M80J1j459q36J432R54m42n0R37J60j996n95J719R95m12p2Q02k84
1608A631j214k39M15M80K9K95l4r30o17p68l74M43J011j70j210l29R7m10j073
1627b967P75J212k84m56O54L36j070k57J405J266j9nM02l09o36M52P03j30K69
$$ y = [-814, -946, -1360, -143, 2019, 2033, -789, -2316, -1715, -1901, -2226, -863, 1517, 1347, -672, -1079, -705, -1703, -2045, -550, 1373, 1426, 13, -1022, -1590, -2018, -1589, -879, -404, 356, 388, -472, -1762, -1701, -854, -695, -181, 1786, 2764, 1021, -707, -198, 1307, 1106, 831, 2395, 3517, 2043, 429, 423, 829, 316, 242, 1319, 2236, 1219, -457, -1429, -1102, -855, -594, -389, 261, 333, -403, -2035, -1940, -1101, -761, -917, -26, 882, -120, -1766, -2033, -828, -487, -647, 144, 727, 272, -768, -1240, -938, -433, -51, 713, 1068, 807, -78, -1166, -1223, -189, 906, 786, 287, 767, 778, -681, -1517, -85, 869, 427, 377, 1314, 1474, -522, -1117, 602, 1597, 1185, 1113, 1915, 1631, 417, 178, 593, 1073, 1102, 1397, 1363, 433, -184, -952, -1326, -883, 128, -42, -1252, -1581, -1484, -1894, -2967, -2192, -980, -1264, -1720, -1066, -730, -1800, -2057, -652, 614, 595, 590, 992, 683, 47, 499, 1202, 1072, 1341]
1646A341O95n81q14j34K67m59l30J333M33j384r54J100M23j542K52J653k42j215
1664a58L83Q89j022j284J071J038n77q30K74k76j358L97R79p11j026Q27O31j312
1682b065m50J311L13j363J078J788q28j286J418J884j114o95J788J136j657M8
1698A306J653n69j625N40J558r01j460L75K86j636l99J304p37j944O40J259j021
1715a371j502J557N21j627K63K405k97k269R23K632r91j536J881J634k001j027
1731h05K558K28k668n4K915n77k684Q56K130j726j403K290R78k577k44K763L9
1748B019k750R25K300j207j660J959J086l077p27K792q5l145O95K010k099k310
1764c274K037J243k944j048L228K34l393K61L229p92k483K520K577k119j545L218
$$ y = [1341, 2036, 1455, 641, 507, 774, 315, -15, 1318, 1751, 367, -587, 513, 936, -606, -354, 1299, 1057, -158, 225, 1114, 92, -1192, -121, 917, 340, -490, -216, -492, -1850, -1453, -474, -1185, -2211, -1384, -753, -2065, -2515, -1204, -891, -2254, -1176, 612, -216, -1502, -84, 1800, 686, -9, 1779, 2915, 1258, 1306, 2959, 2390, 765, 1305, 2863, 1962, 502, 877, 1163, -473, -872, 432, -305, -2249, -1609, -350, -1371, -2873, -1316, -795, -2422, -2159, 246, -51, -2320, -1397, 1235, 244, -1292, 589, 2223, 222, -805, 1753, 1981, -687, -741, 2174, 1597, -1087, -231, 1899, 173, -1230, 1060, 2038, -539, -783, 1980, 2019, -731, 194, 2494, 1287, -373, 1586, 2672, -405, -1132, 1660, 1575, -1570, -875, 1135, -964, -3274, -1237, 6, -2938, -3986, -758, -524, -3917, -3656, -427, -1219, -3702, -1182, 1395, -724, -2269, 949]
1780I49J698l088j74L691J3k956J253K194k233k185K755J558k947j281K419p26
1796I40k717J180K554k185k080K426J218l388m70L600j55l175J619L339k967l021
1812c282L401K326l890j047M249M71m787O3M145j462l797K957L742l239l332L249
1828b33J898l104l94M039K2l595Q28K876j920k165K899J736l049l30K601j254
1844H55l386J512L539k380k041L090J088m319q06M237K10l713J877L807k596l852
1860b878L004K839k942j089L967O46m556l24L931j340l595K463L144l111k647
1875b488K787M57l713K42M190j88m007J426K736k939k350L661K356l410n21L246
1891A485q02l915J559L613j804k230K982J426l974r54M011k09l159J983L676k195
$$ y = [949, 2647, -441, -615, 3076, 3089, 133, 1386, 3580, 1347, -838, 1917, 3475, 528, -753, 1666, 940, -1777, -597, 1957, -228, -2308, 118, 1336, -2052, -2522, 1078, 923, -2252, -633, 2706, -261, -3282, 119, 2445, -1445, -2492, 1757, 2228, -2559, -2496, 1649, 187, -3610, -653, 3089, -150, -3482, -233, 1665, -1439, -1833, 2206, 2228, -1367, -539, 2337, 417, -1748, 1151, 2887, -162, -492, 2109, 855, -2531, -1019, 2520, 140, -1901, 1189, 2277, -2042, -2848, 1389, 1599, -2114, -237, 3570, 974, -2878, 126, 2965, 23, -1066, 2901, 3547, -1009, -1333, 2598, 1258, -2337, 126, 3270, 159, -2488, 299, 756, -2957, -2715, 1475, 1287, -2720, -1294, 1442, -1497, -3847, -186, 2170, -1240, -1761, 1485, 683, -3232, -1673, 1940, 136, -2094, 888, 2314, -1660, -2614, 1397, 1188, -1971, 12, 3688, 1493]
1907A493l445K478K545l636q19M505Q52m426k35L406j939l180K381L161k857k630
1923b346K468N94l593k73L603l29l029J525K598k860k361L078K032k765K85L683
1939B310n49l942J058L183j366j990L266K017l416j630K398M02k954R87L106j478
1955A402k712J180J495k847q16L084N19k595Q00K476k306k755K275K551k114j020
1971a383L231l26m027k5L512o66k761K073K771k863k902K240J558k197l52L456
1987A339N75l438J93K451r67j706K383K363j551r09J483n42k401O82K890l28j501
2004A016N63K25k520j118K187N48j790N23J629j623k759J046J319j096k77K927
2020H00K95l000o21J879j57j672K315K540j402j933J000M66k121R8L312Q02k050
$$ y = [1493, -1952, 526, 3071, -565, -1384, 3121, 3973, -453, -688, 2718, 779, -2401, -20, 3141, 284, -2346, 122, 716, -2877, -3150, 453, 124, -2905, -1380, 1218, -1642, -4003, -925, 1107, -1658, -1373, 2310, 1761, -2181, -1123, 2060, 694, -1296, 1970, 3987, 571, -1059, 1339, 1741, -1213, -226, 2880, 1402, -1310, -130, 1365, -1482, -2298, 786, 1305, -1290, -490, 1986, -320, -3075, -800, 1751, -363, -1383, 1848, 1522, -2505, -2530, 982, 316, -2445, -372, 2399, -464, -3366, -1126, 432, -1765, -2117, 1339, 1914, -1524, -1331, 1120, 153, -1553, 830, 3193, 1642, 733, 2216, 1674, -727, -45, 2845, 2517, 1016, 1579, 1804, -716, -1834, 353, 901, -889, -366, 1263, -360, -3119, -2073, -754, -1850, -2127, 800, 1095, -1905, -2526, -647, -804, -2476, -161, 2379, 977, -956, 44, 510, -1611, -1513, 1799, 2601, 551]
2037E51n36R55j415j568J978J983r78m37J108n64k092j41J857L95n4J363K62k281
2055C86j386R72M28k90R91J537j497k432J66L39j253J53K553N82k177j370Q70
2072a428o11j016J613K190k21j346M23L8j536k04K077J336j21L9M1j590j274P85
2090h05J577M21J81P46j169k054k16J098J18L06J691K47j816j607L39M19l16J150
2108C10J466k87j488l42j48q63L42J881J136p54q25m52j208q23J213J671J86n47
2126D68kq40j534J65J269R67k3O82N46j769j097K43J057P6N10Q16l22j432j124
2145a344K96P9N25J163O44q56j088m17k29P9J051J280K15p89m36m64r31L13J331
2164D22P04k11m09k12r81n93M85R75L80J62K75n00j249m12N87J30M93R18Rq94
$$ y = [551, 15, 970, -445, -2013, -35, 1948, 970, 533, 1641, 1077, -1015, -1156, 701, 1096, 1042, 2405, 2667, 386, -1000, -28, 400, 110, 1101, 2638, 1141, -1291, -1125, -786, -2039, -1886, 667, 1249, -928, -2298, -1428, -2039, -3055, -1442, 748, 527, -819, -396, -358, -1894, -2098, -21, 1315, 1194, 1233, 1274, -316, -1590, -805, 772, 1193, 1374, 2120, 951, -1103, -1319, -221, -103, 203, 1894, 2141, 325, -1282, -943, -524, -840, 310, 1776, 1489, 1, -341, -489, -1352, -1010, 871, 2007, 1253, 428, -24, -1232, -2055, -842, 829, 1015, 468, 466, -374, -1908, -1743, -474, 493, 470, 1152, 1698, -71, -1168, -925, 132, 208, 718, 1534, 1212, -220, -1344, -1048, -969, -444, 719, 1363, 507, -581, -998, -1227, -1148, -97, 1183, 1398, 609, 173, -291, -1222, -909, 422, 1126, 915, 506, 294, -687, -1280, -795, 180, 560, 722, 997, 497, -752, -1164, -577, -447, 46, 964, 973, 79]
2184G9j125K7K75J19R07J103p21j012k38K00l60j4J326N81o84o67P8n63n40M76
2204g53J026J81k74R6k20p00l22J040P04M42L02j71p49q64M38N48o3M6K48o86
2224B69r04l10K34q5N2N48M46m55n38RP4J71K89Q19K06m90j16k48m08L0R17K86
2246G96l24Q4r7m56l39M59Q50l57n2K10j34o66o2M18n7o32M83P21p22o97M0K06
2268c28n8J80N92j02p90j9L42m31l57N01L32n85l39Q9k85m82K71P09l0n49L85
2289i54N72k64J47N41M67m20K85J108l75o64J37M56K29k51K39N6p52k51L81m7
2309F40n81P9O67o15m21K45L0o26P0N98k23o38j66N56j36o88M41M70l23K6O45
2330E0k3n98N5Q98N0l78K74K91m88j36N19L28q31j19P76o1n16Q9N38n08l12O50
$$ y = [79, -1046, -1019, -744, -625, 282, 1385, 664, -348, -586, -386, -746, -760, 566, 1147, 463, -204, -126, -689, -1229, -753, 273, 454, 180, 276, 56, -644, -966, 74, 778, 1220, 1522, 1351, 602, -262, 176, 724, 661, 707, 955, 269, -635, -945, -711, -796, -744, -196, 250, -205, -743, -734, -660, -489, -200, 619, 825, 335, 219, -29, -437, -407, 510, 796, 472, 556, 459, 3, -336, 123, 973, 616, 564, 774, 640, -26, -88, 330, 273, -359, 124, 845, 123, -574, -534, -328, -386, -206, 386, 284, -506, -525, -183, -614, -971, -470, -138, -723, -1062, -973, -1258, -1740, -1469, -760, -790, -1339, -954, -382, -646, -499, 42, 509, 89, 374, 1482, 1107, 443, 580, 1036, 1265, 1014, 1253, 1309, 557, 306, 687, 640, 59, 138, 805, 190, -231, 14, 44, -582, -512, 86, -137, -775, -941, -385, -521, -1209, -768, -298, -621, -595, 50, 27, -571, -516, 382, 432, 54, 328, 619, 131, -5, 514, 842, 11, -108, 668, 607, 91, 180, 718, 210, -102, 548]
2352E48L36o54q5M28M8o62l1M59Qn94L92Q3n99k52N95M87p50m8N31k74m40P32
2374B58K86o96l95Q05K05n98o0L88l9n58L33N44o36o18N58L34n02l17Q02Jo54
2395e59J19N02n49l51L70M74n14l21N60O7m17K33L83l45n07O71O89m99k69L09
2415D6K10m17J88O06l08m37K04P08l84m42M45J57p96j20Q23o3q46K20N72j97p40
2436e71L32P35n64l45L00K34n60P2P34j39p34p6O66o7k10M49J68o21J73K51K21
2457D48m72K39L95k51k00K62K60o15k72O22q6n58r7N26k96m01L54L80k68l36M10
2478D4N2m73J28O49l04k61K25M60o85j17L41L39l01n55M46Qn38L2P12k95j68L29
2500F8L93m57k05L19q6N0L42M22k42o76P6M38m08k9O83k7o52K3L36k09o97M07
$$ y = [548, 884, 230, 145, 573, 621, -41, -72, 387, 395, -199, 193, 276, -323, -575, 20, 507, -243, -291, 240, -34, -474, 258, 544, -152, -547, 258, 463, -135, -195, 193, 154, -404, -71, 473, -163, -781, -223, 111, -391, -708, 94, 95, -559, -440, 62, -487, -838, -468, 6, -508, -829, -269, -202, -619, -386, -3, -348, -855, -184, 505, 6, -263, 46, 256, -161, 27, 633, 325, -112, 92, 800, 416, -26, 419, 576, -220, -340, 483, 420, -426, -206, 366, 169, -571, -239, 496, -68, -413, -113, 121, -439, -367, 367, 228, -506, -582, 84, 17, -193, 256, 424, -197, -24, 227, 448, -24, 215, 610, 359, 159, 421, 681, 66, -206, 416, 330, -228, -325, 201, -95, -496, -142, 238, -30, -366, 44, 96, -377, -249, 400, 96, -165, 60, 520, -165, -282, 59, 398, 97, -458, -12, -4, -542, -510, 202, -93, -261, 68, 461, 4, -201, 118, 32, 82, 424, 846, 604, -72, 4, 442, 34, 5, 688, 661, 9, 32, 368, 159, -538, -131]
2522a31O15l47n13L6J59n52l42M02L69l37j07N16q3n84K68L60K52L20L62l04n13
2543a54J59M29ok32L17O1m79k71J54O6l38m0P40L3o99P1L24j13m23Q23K73m65
2565B30k44M00j71m78j27N80o2j70K23j98p17k10Q87K20k63n9J96k94l08K57K83
2586b5j36RK66K35o89k77P0J62K00M94N47o09l86J63J81l76K78M99R9n53j30Q4
2608A06n61n58P54N34l00m76J20J80k90L13M91L14j31K45J86m80m86oM75J65J26
2629G21J75p37n60r7K73Q5J14L37J90n10j28J20k38L6M38O29l23o14k9m7o7j7
2651b49L60K86m00m8K65n74m17M89N28K00p4j30l71o55j98N96N92m47k5J33l68
2672e07l18J72M18L5L93O45j02n95k57K15L45M6J68J84k50m95j28j88j81J82O13
$$ y = [-131, 484, 137, -376, -340, -181, -733, -1075, -673, -304, -641, -748, -232, -315, -899, -631, -271, -19, 301, 663, 359, -154, 5, 434, 428, 196, 513, 574, 95, -176, -22, 44, -294, -334, 406, 439, -260, -189, 135, 22, -401, 422, 695, 230, -14, 386, 215, -263, -390, 190, 128, -42, 181, -17, -734, -944, -57, 163, -100, -159, 37, -257, -565, -308, -25, -161, -152, 114, 349, -340, -617, -547, -385, -185, 309, 856, 247, -139, 24, 205, -171, 107, 606, 705, 152, 22, 106, -455, -1013, -259, 275, -25, -501, -381, -201, -491, -178, 313, 627, 496, 741, 927, 447, -39, -45, 430, 595, 721, 896, 159, -401, -498, -225, -140, -26, 311, 501, -9, -137, -17, -255, -219, 219, 848, 525, -89, -118, -165, -232, -249, 111, 397, -3, -51, 214, -360, -777, -288, 240, 440, 366, 236, -135, -790, -988, -392, 200, -247, -272, -139, -507, -825, -653, -235, -200, 193, 838, 736, 141, -116, 99, 444, 490, 658, 842, 592, 97, -31, -219, -400, -218, 395]
2693C95P7k11k72k57o44M43M73M42M3m98j2j25m05J8L67j53L66q4l8p02j18J86
2715g09K97L54J06K77k32n08K58J62O5P8N43R3j33o51J36k03K27L54M75k30n04
2736B55Kj6j97R0K64k1m2l0k20o15l98L36J66Q4J89j3l81k53J17K82K42J53K68
2759B62J61j95k48Q6K33j97O53R6m25l34m0J14%n3N2J87j07o5j79l8l45K99K60
2782A77K10l08k40j43l01Q5M45r%j27q9j92J2n9K02M8K21R1r8l45o8K15N2J60
$$ y = [395, 472, 261, -11, -268, -912, -469, 4, 446, 489, -9, -21, -146, -551, -533, -166, -319, 47, -37, -75, -777, -895, -709, -412, -58, 48, 325, 93, -415, -157, 5, 70, 148, 691, 784, 651, 0, 136, -67, 160, 514, 989, 759, 255, 257, 241, 44, 134, 398, 377, 335, 305, 85, -530, -928, -592, -426, -342, -153, -166, -547, -800, -683, -401, -159, -6, 262, 423, 228, -20, 66, 299, 102, 755, 851, 426, 92, 52, 166, 166, 113, 165, 352, 245, 180, 1, -37, -382, -83, 177, 387, 79, -161, -304, -605, -520, -75, -84, -84, -211, -300, -492, -480, -539, -337, -289, -68, 23, -75, -420, -488, -273, -221, -61]
$$ [...]
8191a32
##END NTUPLES=NMR FID
##END=
