##TITLE=1H ikalashn
AM_NV 168F
18.9.2024
##JCAMPDX= 6.0         $$ Bruker NMR JCAMP-DX V2.0
##DATA TYPE= NMR FID
##DATA CLASS= NTUPLES
##ORIGIN= UXNMR, Bruker Analytische Messtechnik GmbH
##OWNER= root
$$ TOPSPIN		Version 1.3
$$ 2024-09-18 11:09:56.640 +0400  Irina@DPX200
$$ Compression mode = diff/dup
##.OBSERVE FREQUENCY= 200.131392401
##.OBSERVE NUCLEUS= ^1H
##.DELAY= (6, 6)
##.ACQUISITION MODE= SIMULTANEOUS
##.ACQUISITION SCHEME= undefined
##.AVERAGES= 32
##.DIGITISER RES= 18
##SPECTROMETER/DATA SYSTEM= spect
##.PULSE SEQUENCE= zg
##.SOLVENT NAME= CDCl3
##.SHIFT REFERENCE= INTERNAL, CDCl3, 1, 17.95386
##AUDIT TRAIL= $$ (NUMBER, WHEN, WHO, WHERE, WHAT)
$$ ##TITLE= Audit trail, TOPSPIN		Version 1.3
$$ ##JCAMPDX= 5.01
$$ ##ORIGIN= Bruker BioSpin GmbH
$$ ##OWNER= Irina
$$ $$ F:/spectra/data/iren/nmr/1H/4/audita.txt
$$ ##AUDIT TRAIL=  $$ (NUMBER, WHEN, WHO, WHERE, VERSION, WHAT)
(   1,<2024-09-18 11:09:10.296 +0400>,<Irina>,<DPX200>,<TOPSPIN 1.3>,
      <created by zg
	started at 2024-09-18 11:07:02.546 +0400,
	POWCHK disabled, PULCHK disabled
       configuration hash MD5:
       BE 6D 3F 07 2A EA 11 49 91 17 2B D3 AF B3 58 0D
       data hash MD5: 16K
       16 4F 42 88 CF 7F DB F0 BF 14 88 41 00 60 94 9B>)
$$ ##END=
$$ 
$$ $$ hash MD5
$$ $$ ED 60 11 D0 EF 4C EA 02 50 48 FB 8C 6A 73 5B 65
##$RELAX= 
##$RELAX= 
##$RELAX= 
##$RELAX= 
##$RELAX= 
##$RELAX= 
##$RELAX= 
##$RELAX= 
##$RELAX= 
$$ Bruker specific parameters
$$ --------------------------
##$DU= <F:/spectra>
##$EXPNO= 4
##$NAME= <1H>
##$PROCNO= 1
##$TYPE= <nmr>
##$USER= <iren>
##$AMP= (0..31)
100 100 100 100 100 100 100 100 100 100 100 100 100 100 100 100 100 100 
100 100 100 100 100 100 100 100 100 100 100 100 100 100 
##$ANAVPT= -1
##$AQSEQ= 0
##$AQ_mod= 1
##$AUNM= <au_zg>
##$AUTOPOS= <>
##$BF1= 200.13
##$BF2= 200.13
##$BF3= 200.13
##$BF4= 200.13
##$BF5= 200.13
##$BF6= 200.13
##$BF7= 200.13
##$BF8= 200.13
##$BYTORDA= 1
##$CFDGTYP= 0
##$CFRGTYP= 5
##$CHEMSTR= <none>
##$CNST= (0..63)
1 1 145 1 1 1 1 1 1 1 1 1 1 1 1 1 1 1 1 1 1 1 1 1 1 1 1 1 1 1 1 1 1 1 
1 1 1 1 1 1 1 1 1 1 1 1 1 1 1 1 1 1 1 1 1 1 1 1 1 1 1 1 1 1 
##$CPDPRG= <>
##$CPDPRG1= <>
##$CPDPRG2= <>
##$CPDPRG3= <>
##$CPDPRG4= <mlev>
##$CPDPRG5= <mlev>
##$CPDPRG6= <mlev>
##$CPDPRG7= <mlev>
##$CPDPRG8= <mlev>
##$CPDPRGB= <>
##$CPDPRGT= <>
##$D= (0..63)
0 2 0 0 0 0 0 0 0 0.06 0 0.03 0 0 0 0 0.0002 0 0 0 0 0 0 0 0 0 0 0 0 0 
0 0 0 0 0 0 0 0 0 0 0 0 0 0 0 0 0 0 0 0 0 0 0 0 0 0 0 0 0 0 0 0 0 0 
##$DATE= 1726643349
##$DBL= (0..7)
120 120 120 120 120 120 120 120 
##$DBP= (0..7)
150 150 150 150 150 150 150 150 
##$DBP07= 0
##$DBPNAM0= <>
##$DBPNAM1= <>
##$DBPNAM2= <>
##$DBPNAM3= <>
##$DBPNAM4= <>
##$DBPNAM5= <>
##$DBPNAM6= <>
##$DBPNAM7= <>
##$DBPOAL= (0..7)
0.5 0.5 0.5 0.5 0.5 0.5 0.5 0.5 
##$DBPOFFS= (0..7)
0 0 0 0 0 0 0 0 
##$DE= 6
##$DECBNUC= <off>
##$DECIM= 32
##$DECNUC= <off>
##$DECSTAT= 4
##$DIGMOD= 1
##$DIGTYP= 9
##$DL= (0..7)
0 120 120 120 120 120 120 120 
##$DP= (0..7)
150 150 150 150 150 150 150 150 
##$DP07= 0
##$DPNAME0= <>
$$ [...]
##$SW= 21.9925939549014
##$SWIBOX= (0..15)
0 0 2 0 0 0 0 0 0 0 0 0 0 0 0 0 
##$SW_h= 4401.40845070422
##$TD= 16384
##$TD0= 1
##$TE= 300
##$TE2= 300
##$TE3= 300
##$TEG= 300
##$TL= (0..7)
0 120 120 120 120 120 120 120 
##$TP= (0..7)
150 150 150 150 150 150 150 150 
##$TP07= 0
##$TPNAME0= <>
##$TPNAME1= <>
##$TPNAME2= <>
##$TPNAME3= <>
##$TPNAME4= <>
##$TPNAME5= <>
##$TPNAME6= <>
##$TPNAME7= <>
##$TPOAL= (0..7)
0.5 0.5 0.5 0.5 0.5 0.5 0.5 0.5 
##$TPOFFS= (0..7)
0 0 0 0 0 0 0 0 
##$TUNHIN= 0
##$TUNHOUT= 0
##$TUNXOUT= 0
##$USERA1= <user>
##$USERA2= <user>
##$USERA3= <user>
##$USERA4= <user>
##$USERA5= <user>
##$V9= 5
##$VALIST= <valist>
##$VCLIST= <CCCCCCCCCCCCCCC>
##$VD= 0
##$VDLIST= <DDDDDDDDDDDDDDD>
##$VPLIST= <PPPPPPPPPPPPPPP>
##$VTLIST= <TTTTTTTTTTTTTTT>
##$WBST= 1024
##$WBSW= 25
##$XGAIN= (0..3)
0 0 0 0 
##$XL= 0
##$YL= 0
##$YMAX_a= 481984
##$YMIN_a= -469600
##$ZGOPTNS= <>
##$ZL1= 120
##$ZL2= 120
##$ZL3= 120
##$ZL4= 120
##$ABSF1= 10
##$ABSF2= 0
##$ABSG= 5
##$ABSL= 3
##$ALPHA= 0
##$AQORDER= 0
##$ASSFAC= 0
##$ASSFACI= 0
##$ASSFACX= 0
##$ASSWID= 0
##$AUNMP= <proc_1d>
##$AXLEFT= 0
##$AXRIGHT= 0
##$AXTYPE= 0
##$AXUNIT= <>
##$AZFE= 0.1
##$AZFW= 0.1
##$BCFW= 1
##$BC_mod= 2
##$BYTORDP= 1
##$COROFFS= 0
##$CY= 7568.61572265625
##$DATMOD= 1
##$DC= 2
##$DFILT= <>
##$DTYPP= 0
##$F1P= 17.9538593292236
##$F2P= -4.03888763876832
##$FCOR= 0.5
##$FTSIZE= 32768
##$FT_mod= 4
##$GAMMA= 1
##$GB= 1
##$INTBC= 1
##$INTSCL= 1
##$ISEN= 128
##$LB= 0.05
##$LEV0= 0
##$LPBIN= 0
##$MAXI= 945.577
##$MC2= 0
##$MEAN= 0
##$ME_mod= 0
##$MI= -402.1523
##$NCOEF= 0
##$NC_proc= 0
##$NLEV= 6
##$NOISF1= 8.587773
##$NOISF2= 6.764455
##$NSP= 1
##$NTH_PI= 0
##$NZP= 0
##$OFFSET= 17.95386
##$PC= 1
##$PHC0= 102.1341
##$PHC1= 7.128729
##$PH_mod= 0
##$PKNL= yes
##$PPARMOD= 0
##$PPDIAG= 0
##$PPIPTYP= 0
##$PPMPNUM= 100
##$PPRESOL= 1
##$PSCAL= 0
##$PSIGN= 0
##$REVERSE= no
##$SF= 200.13
##$SI= 32768
##$SIGF1= 18.5376
##$SIGF2= -6.396296
##$SINO= 400
##$SIOLD= 32768
##$SREGLST= <1H.CDCl3>
##$SSB= 3
##$STSI= 0
##$STSR= 0
##$SW_p= 4401.40845070423
##$SYMM= 0
##$S_DEV= 0
##$TDeff= 0
##$TDoff= 0
##$TI= <>
##$TILT= no
##$TM1= 0
##$TM2= 0
##$TOPLEV= 0
##$USERP1= <user>
##$USERP2= <user>
##$USERP3= <user>
##$USERP4= <user>
##$USERP5= <user>
##$WDW= 1
##$XDIM= 8192
##$YMAX_p= 0
##$YMIN_p= 0
$$ End of Bruker specific parameters
$$ ---------------------------------
##NTUPLES= NMR FID
##VAR_NAME=  TIME,          FID/REAL,        FID/IMAG
##SYMBOL=    X,             R,               I
##VAR_TYPE=  INDEPENDENT,   DEPENDENT,       DEPENDENT
##VAR_FORM=  AFFN,          ASDF,            ASDF
##VAR_DIM=   8192,          8192,            8192
##UNITS=     SECONDS,       ARBITRARY UNITS, ARBITRARY UNITS
##FACTOR=    0.0002272,     1,               1
##FIRST=     0,             0,               0
##LAST=      1.8609952,     -124,            -75
##MIN=       0,             -469600,         -469600
##MAX=       1.8609952,     481984,          481984
$$ Real data points
##PAGE= N=1
##DATA TABLE= (X++(R..R)), XYDATA
$$ [...]
2046d27L99m07m17L00K82k37K25L74o02j8J85j43M63m42K84R1l43k5L2J2q6O14
$$ -427 -28 -435 -852 -552 -270 -507 -282 92 -510 -528 -343 -486 -23 -465 -181 -90 -433 -458 -426 -414 -500 114
2068A14j75l26M92r5l4J6k10P85r4j45N75m97k79J36L43l75K01j47K64j37j03
$$ 114 -61 -387 105 10 -24 -8 -218 567 473 328 903 406 127 263 606 231 432 285 549 412 309
2089C09l35K11Q8j80P22m59k04m41K24R7j75J39J69r9l75M52l87n65K78L32Q6
$$ 309 -26 185 273 93 815 356 152 -289 -65 32 -143 -4 165 66 -309 143 -244 -809 -531 -199 -113
2110a13l44R4J73n37L01J53L33j98m73M82j08j61lL49k81L20j3m30j38L59k3j2
$$ -113 -457 -363 -190 -727 -426 -273 60 -138 -611 -129 -237 -398 -401 -52 -333 -13 -26 -456 -594 -235 -258 -270
2132b70M03J6J96n20N5K14j80J02L32L59l09k00l73M22m12J02J51M07l47Pk0m3
$$ -270 133 149 345 -175 -120 94 -86 16 348 707 398 198 -175 247 -165 -63 88 495 148 155 135 92
2154I2l28J21N41L97m46Ln9k76J12j11J78j31J26j4m30l75K57L25k7O4J58l37
$$ 92 -236 -115 426 823 377 380 321 45 157 46 224 93 219 205 -225 -600 -343 -18 -45 19 177 -160
2176a60J57n58L47j29o5N00l46k19j08L93l78k12N30o5J56J03Q0o81rM24P16n82
$$ -160 -3 -561 -214 -343 -408 92 -254 -473 -581 -188 -566 -778 -248 -313 -157 -54 26 -655 -664 -240 476 -106
2198a06M15k11k1j69J8L74o6M20m21J36j71j31l53N37j25J15K06J27o8l05L7K55
$$ -106 309 98 77 -92 -74 300 234 654 233 369 198 67 -286 251 126 241 447 574 506 201 238 493
2220D93k8j89O61l59l26k04P8O1k72m8K85j86k2k96k8j45M68k93K55k8j48k45
$$ 493 465 276 937 578 252 48 126 187 -85 -133 152 -34 -56 -352 -380 -525 -57 -350 -95 -123 -271 -516
2242e16J52l31K70N3j27O9K20l84j01K57R8o5K82K2j9k31M09k23L06N3j34L22
$$ -516 -364 -695 -425 -372 -499 -430 -210 -594 -695 -438 -340 -405 -123 -101 -120 -351 58 -165 141 194 60 382
2264C82N4n00J06L26r8q6M7k99J82J93j49P4K08o1j24m7j39K38m4j40J95l20J28
$$ 382 436 -64 42 368 270 184 231 -68 114 307 158 232 440 379 255 208 69 307 263 123 318 -2 126
2287A26K5j10jJ74n59L21q6q8M46m97L11l01L69k75P3J42n1o4k70j36K95O0j61
$$ 126 151 41 40 214 -345 -24 -110 -198 248 -249 62 -239 130 -145 -72 70 19 -45 -315 -451 -156 -96 -257
2310b57N2m3k03j9L46m26J58L69j45K0r5L67l04L2L7J10K87m04rJ3O2m00M40J66
$$ -257 -205 -248 -451 -470 -124 -550 -392 -23 -168 -148 -243 124 -180 -148 -111 -1 286 -118 -127 -114 -52 -452 -12 154
2334A54M1m7M36J7j46J26n4J00o36M02L56p51L95l75J9k16K16J1P7j11O1J2j73
$$ 154 195 148 584 601 455 581 527 627 -9 393 749 -2 393 18 37 -179 37 48 125 14 75 87 -86
2357h6n4pN69p84n9N21k18j49M90l41k9k78J20K74q2k26K46j82j10L93k46J10
$$ -86 -140 -147 422 -362 -421 100 -118 -267 223 -118 -147 -425 -305 -31 -113 -339 -93 -275 -385 8 -238 -128
2379a28J95k97P5k52M54L5J93k74j51M64l11O6k7J97j06Q6k91N74j20l73j87M09
$$ -128 67 -230 -155 -407 47 82 275 1 -150 314 3 69 42 239 133 219 -72 502 382 9 -178 231
2401B31j76K81K32n02l9n3L06l41J15R0K93l56J44J48l03J53k55J30n43M83K56
$$ 231 55 336 568 66 27 -26 280 -61 54 144 437 81 225 373 70 223 -32 98 -445 38 294
2422B94j68l86K91rj72l6K37J52k48p43P47L41r28K05R2K6N2m7J29l9k11Q6J35
$$ 294 126 -260 31 22 -150 -186 51 203 -45 -788 -41 300 -628 -423 -331 -305 -253 -300 -171 -210 -421 -335 -200
2445b00K08k41J29r3L0J33k7J3rP2o4N5N3r4M64j59P7j97K7n5J3N30m15O5M1K9
$$ -200 8 -233 -104 -197 -167 -34 -61 -48 -57 15 -49 6 59 -35 429 270 347 150 177 122 135 665 250 315 356 385
2471C85m04L24K36n07J3K13l48K65j47l52O46l3l91N3L2j91K82j40q6L6J32j06
$$ 385 -19 305 541 34 47 260 -88 177 30 -322 324 291 -100 -47 -15 -206 76 -64 -150 -114 18 -88
2493h8pj68j79O1q4M13j0m91K43L42R9k14k33K15R6p1J26K18k8o23R1M35M0r1
$$ -88 -95 -263 -442 -381 -465 -52 -62 -553 -310 32 131 -83 -316 -101 -5 -76 50 268 240 -383 -292 143 183 92
2517I2J18J41m49o3K45o2M03l76K17j95M12m13K16k64K93j65N5J4l2k56L29m07
$$ 92 210 351 -98 -161 84 22 425 49 266 71 483 70 286 22 315 150 205 219 187 -69 260 -147
2539a47N59jo09P3L08N4m37J57K98K12l69k2J64q4pl89J43Lj36J28l90Q0J81j04
$$ -147 412 411 -198 -125 183 237 -200 -43 255 467 98 76 240 156 149 -240 -97 -94 -230 -102 -492 -412 -231 -335
2563c35K83J06L04o67N90k84k42M43j8J01p6j13o5l65L88p4k80N28rl90qJ03q8
$$ -335 -52 54 358 -309 281 -3 -245 198 180 281 205 92 27 -338 50 -24 -304 224 215 -175 -183 -80 -168
2586a68K57n9J58L6K8r3r3l66K59l33L73K95l30n18N9J21J31J03O39n34J50R8
$$ -168 89 30 188 224 252 159 66 -300 -41 -374 -1 294 -36 -554 -495 -374 -243 -140 499 -35 115 213
2608B13l13N8K91q5K93l64J97j17n69k14N76P8j65M59n79K73m27l8O81k26K72
$$ 213 -100 -42 249 164 457 93 290 173 -396 -610 -34 44 -121 338 -241 32 -395 -433 248 22 294
2629B94l45PL75n44K1j96J28P6j65Q2l11m0k87O40j34Q96J64o80J88j27J52kL35
$$ 294 -51 -44 331 -213 -192 -388 -260 -184 -349 -267 -578 -618 -905 -265 -399 497 661 -19 169 42 194 192 527
2652E27M96m60J1k37j44k05k71N92J87l36j37Q5k77j15O27P9M03l32J99k73l63
$$ 527 1023 563 574 337 193 -12 -283 309 496 160 23 108 -169 -284 343 422 825 493 692 419 56
2673E6j33r2j79M42N7j16k22k74l51O69m37K73J35L38l78j60K06m67N70m5K81
$$ 56 -77 -169 -348 94 151 35 -187 -461 -812 -143 -580 -307 -172 166 -212 -372 -166 -633 -63 -108 173
2694A73m78j8k55J52k23N47k89L91r8r3L34j4J10j89O49K8m66K73k89q8K26k63
$$ 173 -305 -323 -578 -426 -649 -102 -391 0 -98 -191 143 129 239 50 699 727 261 534 245 157 383 120
2716A20K21lM52q08k73K1O04l79M55J8O8p06L3R6p8J75K83r7j69l66r9K78m99
$$ 120 341 338 790 -18 -291 -270 334 -45 410 428 496 -210 -177 -81 -159 16 299 202 33 -333 -432 -154 -653
2739f53L24j03M16k64j69M53n34o1L06J81L60L3j80p1m29P7M72k22L61l58K60
$$ -653 -329 -432 -16 -280 -449 4 -530 -591 -285 -104 256 289 109 38 -391 -314 158 -64 297 -61 199
2760A99j94m50J77N55n3J78n9k07q9j95L46J59o0k41K65k60o6k76R5j16K84n5
$$ 199 5 -445 -268 287 234 412 353 146 57 -138 208 367 307 66 331 71 5 -271 -176 -292 -8 -63
2782f3k7K31l88j62K25r8N44o1k12j52J81r6j33K15Q7Kj18J29j63k98L99j48L12
$$ -63 -90 141 -247 -409 -184 -282 262 201 -11 -163 18 -78 -211 4 91 93 -25 104 -59 -357 42 -106 206
2805B06k65N9L84l74j89k20N73l44K35R3N1O1o3k27R9k26M11m5l18j40j50k5J77
$$ 206 -59 0 384 10 -179 -399 174 -170 65 158 209 270 207 -20 79 -147 264 219 -99 -239 -389 -414 -237
2828b37K41k12j76L0J14K59k06m01M22M05o23L70J7q4q9j6L73K2J0J72n7o9L8
$$ -237 4 -208 -384 -354 -240 19 -187 -588 -166 239 -384 -14 3 -81 -170 -186 187 209 219 391 334 265 303
2851C03J56m5j86K34n6K81j99J54k93J37j05%k11k49L76k22J02n72j50L48q3K22
$$ 303 459 414 228 462 406 687 488 642 349 486 381 381 170 -79 297 75 177 -395 -545 -197 -280 -58
2873e8J9j54l4k09k47j23K37M70k43j06j28K09k88K21Q4K98k72J8J96K06o1O4
$$ -58 -39 -193 -227 -436 -683 -806 -569 -99 -342 -448 -576 -367 -655 -434 -350 -52 -324 -306 -110 96 35 99
2895I9L01J39l22M2N42k07k75O0O5k24K00J05k28j41O2j35L9k86J15J15o6Q3j95
$$ 99 400 539 217 259 801 594 319 379 444 220 420 525 297 156 218 83 122 -164 -49 66 0 83 -112
2918a12J20n13j49O80J61m09r8K4K29k85j2K47L03l60J26mJ70k98M05o66M56O3
$$ -112 8 -505 -654 26 187 -222 -320 -296 -67 -352 -364 -117 186 -174 -48 -52 118 -180 225 -441 15 78
2940G8l6l3m85O61j59k05R5p3K84m4j94J81m3q9J72L22k49k28K84k45j1qL00k43
$$ 78 42 9 -476 185 26 -179 -84 -157 127 83 -111 70 27 -62 110 432 183 -45 239 -6 -17 -25 275 32
2964C2r4J02j59o76O87L42m75O6L5O74p02J95L63J32k54k3P0n7q3k45K98j47k94
$$ 32 -62 40 -119 -795 -108 234 -241 -175 -140 534 -168 27 390 522 268 245 315 258 175 -70 228 81 -213
2987b13j1L07j79j66J24R4j87M82j01K28n34P9K59nm19N48m17r4J83J15j77k53
$$ -213 -224 83 -96 -262 -138 -44 -231 251 150 378 -156 -77 182 177 -242 306 -111 -205 -22 93 -84 -337
3009c37K97K82l88m00O79J36l95N2K55r0j31L39q3k94j89K22p5l47j40K96K67
$$ -337 -40 242 -146 -546 133 269 -126 -74 181 91 -40 299 216 -78 -267 -45 -120 -467 -607 -311 -44
3030d4o73N60M96j59m76M85M24l75p6J24L86p45K28N01m94k29J96Mj4q8N3K34
$$ -44 -717 -157 339 180 -296 189 613 238 162 286 672 -73 155 656 162 -67 129 133 119 31 84 318
3052C18l04n2M47j63lk66O17n26j01J05J57p03r7M15j45k27M3L48O6l14k00O13
$$ 318 14 -38 409 246 243 -23 594 68 -33 72 229 -474 -571 -156 -301 -528 -485 -137 -71 -385 -585 28
3074B8k98j42M13M82l06j50n5J16o53J31Q35o38j08K86j00l10K46L29M11p15N08
$$ 28 -270 -412 1 483 177 27 -28 88 -565 -434 401 -237 -345 -59 -159 -469 -223 106 517 -198 310
3095C10L11m47J56K38J67l59k51K71k67o8K25l98K79n76P19j49l00j25M92l13
$$ 310 621 174 330 568 735 376 125 396 129 61 286 -112 167 -409 310 161 -139 -264 228 -85
3115h5K8LK13l43k65O71k74J21l52N94m87k09J84K8k69j87N00N50m23l15L22O5
$$ -85 -57 -54 159 -184 -449 222 -52 69 -283 311 -176 -385 -201 -173 -442 -629 -129 421 -2 -317 5 70
3137G0o28J85L62J50J40m4o78m0L6K05o3L75m92N56Nl51L44J08k08Q2K61R1k22
$$ 70 -558 -373 -11 139 279 235 -443 -483 -447 -242 -305 70 -422 134 139 -212 132 240 32 114 375 466 244
3160B44l54M57L67r19M89K87m77L12n47L81m44J51K81j50k14Q8L67O5o73K93L03
$$ 244 -110 347 714 -205 284 571 94 406 -141 240 -204 -53 228 78 -136 -48 319 384 -289 4 307
3181C07l37J33J22j33l65k52M02M2r3M3J10k8J3Q1K79p05M53K55n12M05l83m5
$$ 307 -30 103 225 92 -273 -525 -123 -81 -174 -131 -21 -49 -36 45 324 -381 72 327 -185 220 -163 -208
3203b08J41j6L27k66j50Rn9L5J27P2K91m12M8k6M07j50R3Q8m40J0J6J22l03J92
$$ -208 -67 -83 244 -22 -172 -163 -222 -187 -60 12 303 -109 -61 -87 320 170 263 351 -89 -79 -63 59 -244 -52
3227e2K73L20r34L71o5M28n90m7K52M64j78O8k57j25J35p7K93k32J01N5l10q6
$$ -52 221 541 -393 -22 -87 341 -249 -296 -44 420 242 310 53 -72 63 -14 279 47 148 203 -107 -193
3249a93N35k09k26J62j85J95l91L65l5m44J0M27R3Q2m46J54K19k69J99q7k4K2
$$ -193 342 133 -93 69 -116 79 -312 53 18 -426 -416 11 104 186 -260 -106 113 -156 43 -44 -68 -46
3271d6l9l4J84n20M80K20l81J73K24k55L5J99j58J81n84O03m54L35k21O9K79l01
$$ -46 -85 -119 65 -455 25 245 -136 37 261 6 41 240 82 263 -321 282 -172 163 -58 11 290 -11
3293a1J57J29k23l15J74M50n8k03j19K31k46r2L97o74L83K17k79k5o2J73j86m3
$$ -11 146 275 52 -263 -89 361 303 100 -19 212 -34 -126 271 -403 -20 197 -82 -107 -169 4 -182 -225
3315b25q6M00k10k70L32O8l61J74J40J17K02m63J38J10j6J49o5m24m0N30j95o2
$$ -225 -311 89 -121 -391 -59 9 -352 -178 -38 79 281 -182 -44 66 50 199 134 -290 -330 200 5 -57
3337e7K08j39l59k9L31J44o0j62M78l79j54j31L55K19m05L62l39L20o12L08K40
$$ -57 151 12 -347 -376 -45 99 39 -123 355 -24 -178 -309 46 265 -140 222 -117 203 -409 -101 139
3358A39J6J06K49j2m0m46J68p5k91K94K08j44k0R8m16l57P01k57N10m14K30j74
$$ 139 155 261 510 498 458 12 180 105 -186 108 316 172 152 250 -166 -523 178 -79 431 17 247 73
3380G3k21k20L85j81L13J75n2k27p88J37K91k69N20K79p23K44k24nk29O04l4M67
$$ 73 -148 -368 17 -164 149 324 272 45 -743 -606 -315 -584 -64 215 -508 -264 -488 -493 -722 -118 -152 315
3402C15m1Jo4k28j61L50K05O18j124L13j94L2j14J97J03R1L87l42m20m07OP24
$$ 315 274 275 211 -17 -178 172 377 995 -129 184 -10 22 -92 105 208 299 686 344 -76 -483 -477 247
3424B47k94R1L68l69j33R2K75n19M15j6J78j02m83j81M57m6N2J88k69j03n9k17
$$ 247 -47 44 412 43 -90 2 277 -242 173 157 335 233 -250 -431 26 -20 32 220 -49 -152 -211 -428
3446d28K50J65k4J49Q2j55j17n68M1P1N93M85l51m4j00m02J95K13K47J44k82l
$$ -428 -178 -13 -37 112 194 39 -78 -646 -605 -534 59 544 193 149 49 -353 -158 55 302 446 164 161
3468A61K00n11j67L31k85K24L01r7m25k77K01K30K47J48k26P2Km16O65l99J24
$$ 161 361 -150 -317 14 -271 -47 254 157 -268 -545 -344 -114 133 281 55 127 129 -287 378 -21 103
3489A03K97jp4qn26L33l52M79k49N01p42L46J24m53j32Q8L34k15K07j25k33j76
$$ 103 400 399 325 317 -209 124 -228 251 2 503 -239 107 231 -222 -354 -266 68 -147 60 -65 -298 -474
3511d74K37J06%l5K55j64j36k71O2K90n7N43j95no8m44K19M45J2p1j41k14O0l56
$$ -474 -237 -131 -131 -166 89 -75 -211 -482 -420 -130 -187 356 161 156 88 -356 -137 308 320 249 108 -106 -46 -402
3535d02K92j34O58p3m82Q8j05K01k07K13L42K22m39j65l34j08L46o8J58K84k17
$$ -402 -110 -244 414 341 -141 -53 -158 43 -164 49 391 613 174 9 -325 -433 -87 -155 3 287 70
3556G0j36p7K17k16J11k57L35J53k03Nk6k4j07R9L46k70L4l54L32j77M48k82j15
$$ 70 -66 -143 74 -142 -31 -288 47 200 -3 2 -24 -48 -155 -56 290 20 54 -300 32 -145 303 21 -94
3579i4L07j09j79l55P15J9k19R3l8L4k25j65j10J48j87Q2q8J35R2rj76J86jL06
$$ -94 213 104 -75 -430 285 304 85 178 140 174 -51 -216 -326 -178 -365 -283 -371 -236 -144 -153 -329 -143 -144 162
3603A62K11l57r1j14K2J49J82LO2Nn8k25k04K68K40j51K0r3K43m68M09l16K62
$$ 162 373 16 -75 -189 -167 -18 164 167 229 234 176 -49 -253 15 255 104 124 31 274 -194 215 -101 161
3626A61k45j17L54k79R8M0l66M30k36J70J0j22K30j32nk45L55k21o0J29l12O8
$$ 161 -84 -201 153 -126 -28 12 -354 76 -160 10 20 -102 128 -4 -9 -254 101 -120 -180 -51 -363 -295
3648b95j73K58J37m94K70PJ25K68qN50p37j06L76m16O40l8j1k31KO4M35n14l36
$$ -295 -468 -210 -73 -567 -297 -290 -165 103 95 645 -92 -198 178 -238 402 364 353 122 124 188 623 109 -227
3671b27O24J9k72P3K20l18K38k85o9K57J28n08P0r0L10k43k7K35k09j43N6j04
$$ -227 397 416 144 217 437 119 357 72 3 260 388 -120 -50 -140 170 -73 -100 135 -74 -217 -161 -265
3693b65O0j49M1R8k33J60K8J25n2k60J65J22OK10k15Q0J00l99R2J04L40%j44K55
$$ -265 -205 -354 -313 -215 -448 -288 -260 -135 -187 -447 -282 -160 -154 56 -159 -79 21 -378 -286 -182 158 158 14 269
3717B69q7l25R8K16p1rJ88j55j24L77j0l69J19j56K06j53J54K0J98l85K59%k17
$$ 269 182 -143 -45 171 100 91 279 124 0 377 367 -2 117 -39 167 14 168 188 386 1 260 260 43
3740D3M1j43K31lo7K41j06k20m9J4k38L47j43N6j87l9M91l81l6L11J3P9k75%P2
$$ 43 84 -59 172 169 102 343 237 17 -32 -18 -256 91 -52 4 -183 -222 269 -112 -148 163 176 255 -20 -20 52
3765E2O9m68J87L61k39M0j39k13K25K5p0L99k40m1L1j33k01K08J01O1j08J23J8
$$ 52 121 -347 -160 201 -38 2 -137 -350 -125 -100 -170 229 -11 -52 -21 -154 -355 -147 -46 15 -93 30 48
3788D8rK32k76j27P4J25K52j51n9R5N0J32j48J21l67nK28m36J69L21n3l14n8l92
$$ 48 39 271 -5 -132 -58 67 319 168 109 204 254 386 238 359 -8 -13 215 -221 -52 269 216 -98 -156 -548
3812e48N25j72K76l61K77j44J04j55k69L64j72O17j43l7q5j10J3K22j6Q9l46J95
$$ -548 -23 -195 81 -280 -3 -147 -43 -198 -467 -103 -275 342 199 162 77 -33 -20 202 186 275 -71 124
3834A24j19j45L09k52J77k40O6k6%o2r3L7K68m83K41N31o01N04o8o6j31K0O6Q9
$$ 124 5 -140 169 -83 94 -146 -80 -106 -106 -168 -261 -224 44 -439 -198 333 -268 236 168 102 -29 -9 57 146
3858A46k92J80Jj67K63l72M04l62J68J71k72r7KJ61L46l33J46k12J02P1k20L88
$$ 146 -146 34 35 -132 131 -241 163 -199 -31 140 -132 -229 -227 -66 280 -53 93 -119 -17 54 -166 222
3880B22J49j06M9k88K54l77J81J33j18L5k35k13K1K21j35j35M42ql07j54R0P7
$$ 222 371 265 314 26 280 -97 84 217 99 134 -101 -314 -293 -72 -207 -342 100 92 -215 -369 -279 -202
3902b02q5K09L86l11l43M90q2q9J33M34m61J49J20k13k83L93J57l63L27l1j29
$$ -202 -287 -78 308 -3 -346 144 62 -27 106 540 79 228 348 135 -148 245 402 39 366 335 206
3923B06m33K47j42P3P5J57k8J34R8j025N83R4m8K19M8j9pp22K84J42M97j74J75
$$ 206 -227 20 -122 -49 26 183 155 289 387 -638 -55 39 -9 210 258 239 232 -490 -206 -64 433 259 434
3946D34o15L4j70j57k40P29J45l72p5K4J65j57l43M29R7j7Q2l31J22m3J87k7J40
$$ 434 -181 -147 -317 -474 -714 15 160 -212 -287 -263 -98 -255 -598 -169 -72 -89 -7 -338 -216 -259 -72 -99 41
3969D1J57p2j63P5j89K08n6L53j8l35N3N7j99P0j32M13r5K28l18m34M16K26m47
$$ 41 198 126 -37 38 -151 57 1 354 336 1 54 111 -88 -18 -150 263 168 396 78 -356 60 286 -161
3992a61N16l33K32j70k22k34J67M79k21J67j92n4n6J07J11j11J21k67K46P6p80
$$ -161 355 22 254 84 -138 -372 -205 274 53 220 28 -26 -82 25 136 25 146 -121 125 201 -579
4013e79L60K93j73L49k70J1J04m42k42N59L12l30J21M60n99K12l36L10k95J89
$$ -579 -219 74 -99 250 -20 -9 95 -347 -589 -30 282 -48 73 533 -66 146 -190 120 -175 14
4033A4j32J3J28O5n10L61N16q0m88K18l77K63L0k00M52N3j28J9j43j67N2k51L89
$$ 14 -118 -105 23 88 -422 -61 455 375 -113 105 -272 -9 21 -179 273 326 198 217 74 -93 -41 -292 97
4056I7j60K8J65kJ70n52K8L11j08P9J48k29l3Q7m67J52J93M99m48j74J75j40J18
$$ 97 -63 -35 130 128 298 -254 -226 85 -23 56 204 -25 -58 29 -438 -286 -93 406 -42 -216 -41 -181 -63
4079f3R5j8K41j63j44J3P0L7R3l86O08n54J12K35q6K3j9L87k66l87J33J35m1n7
$$ -63 32 14 255 92 -52 -39 31 68 161 -225 383 -171 -59 176 90 113 94 481 215 -172 -39 96 55 -2
4103bJ69k20J61k79J96p1P4l70R2J66M0j10j8K92o9K09k49L38m92M47l01o2J37
$$ -2 167 -53 108 -171 25 -46 28 -342 -250 -84 -44 -154 -172 120 51 260 11 349 -143 304 3 -59 78
4126G8L1J89m97L65m47L00J04K09N3l27L09j20k14P8m16J75j11K90j61j6J08k65
$$ 78 109 298 -199 166 -281 19 123 332 385 58 367 247 33 111 -305 -130 -241 49 -112 -128 -20 -285
4148b85J15j46K60j95J47J69m68J74L5K24m61K55k20J32k14M94k42q0L98n4k7
$$ -285 -170 -316 -56 -251 -104 65 -403 -229 -194 30 -431 -176 -396 -264 -478 16 -226 -306 92 38 11
4169A1K6l5JO7K62j73J22k95K55N1j49K64L8l69j33N92r6p08K41N67l88R0j88
$$ 11 37 2 3 70 332 159 281 -14 241 292 143 407 445 76 -57 535 439 -269 -28 539 151 241 53
4192E3r4k08q8K38N2k83O76n85p3J17n4L02k10l82L34J68k57J64J28J1n38M47
$$ 53 -41 -249 -337 -99 -47 -330 346 -239 -312 -195 -249 53 -157 -539 -205 -37 -294 -130 -2 9 -529 -82
4214h2O8j07J7p5j4q8K70L05j68k11o9J68Q1k31L34q2N1l39N46l70j5K69j06L7
$$ -82 -14 -121 -104 -179 -193 -281 -11 294 126 -85 -154 14 95 -136 198 116 167 -172 374 4 -11 258 152 189
4238A89j90M57k70k69j48J51J88j94O4j94M10k52j80K17j05L07j47K13m04jk0
$$ 189 -1 456 186 -83 -231 -80 108 -86 -22 -216 194 -58 -238 -21 -126 181 34 247 -157 -158 -178
4259a78Oj76K46K32l4m17R7M71k1m19M30K6p99L67K55R0j83J39J41k18J52q6k41
$$ -178 -172 -348 -102 130 96 -321 -224 247 226 -193 237 263 -536 -169 86 176 -7 132 273 55 207 121 -120
4282a20N3r8M0K60k92R6j90N38m68K91k54k04L72q2K97j57j4j0M0j75K76k90J9
$$ -120 -67 -165 -125 135 -157 -61 -251 287 -181 110 -144 -348 24 -58 239 82 68 58 98 -77 199 -91 -72
4305g2M06k98j87J86Q3l2j09J13j51kn5M1L6L9J07j43J70k46O5j32j31L74j55
$$ -72 334 36 -151 35 118 86 -23 90 -61 -63 -118 -77 -41 -2 105 -38 132 -114 -49 -181 -312 62 -93
4328i3J75j53K4K00k90J51l1M7J57l3l11O18l19J29n22M30j89k94N04k41J69m96
$$ -93 82 -71 -47 153 -137 14 -17 30 187 154 -157 461 142 271 -251 179 -10 -304 200 -41 128 -368
4350c68K58j42k46O68k56P4n5K58j27j72j26L20q3JJ42R7j33P4j61J64k45K06
$$ -368 -110 -252 -498 170 -86 -12 -67 191 64 -108 -234 86 3 4 146 243 110 184 23 187 -58 148
4372A48k35J75k68R7k7J64J2L1l07L64J10k58L90m58J49j14n3J27O4J62Q1p9p6
$$ 148 -87 88 -180 -83 -110 54 66 97 -210 154 264 6 396 -62 87 -27 -80 47 111 273 354 275 199
4395A99j73m0k90R5n6M04l49O4J18m30K02o9nJ96J2J30p65N98L95j83K05m06M7
$$ 199 26 -14 -304 -209 -265 139 -210 -146 -28 -458 -256 -325 -330 -134 -122 8 -757 -159 236 53 258 -148 -101
4418a01K35m02M25L9n27O41j07L1J20q0j34J3p6l3L32l52j2K14j51Rp7j96K92
$$ -101 134 -268 157 196 -331 310 203 234 354 274 140 153 77 44 376 24 12 226 75 84 7 -189 103
4441A03j49o0j62L90J8k10J74qJ49l8k72j7L87m93K53Nk94K75j52M5k92N65l59
$$ 103 -46 -106 -268 122 140 -70 104 96 245 207 -65 -82 305 -188 65 70 -224 51 -101 -56 -348 217 -142
4464a42L60j11m69Q5J33K21j95J00q2K71k69J85n7K19m08K34J66J45k66k92M97
$$ -142 218 107 -362 -277 -144 77 -118 -18 -100 171 -98 87 30 249 -159 75 241 386 120 -172 325
4485C25r9j27j33J90K9N0k02o0J76q0K72m83n6L82k74K03j98M99m05J26k9q9o3
$$ 325 226 99 -34 156 185 235 33 -27 149 69 341 -142 -198 184 -90 113 -85 414 9 135 106 17 -46
4508d6J85%J11J59j45l90K82O0k30J57r0o5l44K76Pq7J15j60J89l3L47p9j31l38
$$ -46 139 139 250 409 264 -126 156 216 -14 143 53 -12 -356 -80 -73 -160 -45 -205 -16 -49 298 219 88 -250
4532b50K92l00J41qM30j61l41J8N8q7J89k59O75m38m7K96j20j02J35k1j97J0J98
$$ -250 42 -258 -117 -125 305 144 -197 -179 -121 -208 -19 -278 397 -41 -88 208 88 -14 121 100 -97 -87 111
4555A11J71l77J9M5j21K20n8l81L90M80l98K3J25k22q1J02K06m3m15O09n41J62
$$ 111 282 -95 -76 -31 -152 68 10 -371 19 499 101 124 249 27 -54 48 254 211 -204 405 -136 26
4577B6j33J07j44O2L08j87k46M16l20K5j5n7J41R6J26k17j46K9J51k8L5j90J99
$$ 26 -107 0 -144 -82 226 39 -207 209 -111 -86 -101 -158 -17 79 205 -12 -158 -129 22 -6 29 -161 38
4600C8N4k04QJ43k17J07K45o4N8J97l63j4J52l63L43j34K44n61K52K18L0j09j95
$$ 38 92 -112 -104 39 -178 -71 174 110 168 365 2 -12 140 -223 120 -14 230 -331 -79 139 169 60 -135
4623a35M99j25j52K98q1k89%l08J76M04o5k17M34j86j7l87oJ80L7kJ39k7j44K03
$$ -135 364 239 87 385 304 15 15 -293 -117 287 222 5 439 253 236 -151 -157 23 60 58 197 170 26 229
4647B29j13j60J86K75l42k10K03j86l8K48k51J96L10n28k00K05K67l57k03J56
$$ 229 116 -44 142 417 75 -135 68 -118 -156 92 -159 37 347 -181 -381 -176 91 -266 -469 -313
4667c13J69K08J22k21j68Q0l2K92jm38K07J14k07L55m21O05p6jk02l69J52M28
$$ -313 -144 64 186 -35 -203 -123 -155 137 136 -302 -95 19 -188 167 -254 351 275 274 72 -297 -145 283
4689B83k70k5L15m36N14j73k03j71L01j55K0L12k95j88J55k0j33j22K14M94p14
$$ 283 13 -12 303 -133 381 208 5 -166 135 -20 0 312 17 -171 -16 -36 -169 -291 -77 417 -297
4710b97j6J58K21k23K47O7k57J89r6m3k43J91L28k49J12j99j51J65k85L7k8J01
$$ -297 -313 -155 66 -157 90 157 -100 89 -7 -50 -293 -102 226 -23 89 -110 -261 -96 -381 -344 -372 -271
4732b71J08N74n42J46J26j15j28K76J9l24k00M17l71K40M04l76L22k57J19l93
$$ -271 -163 411 -131 15 141 26 -102 174 193 -131 -331 86 -285 -45 359 -17 305 48 167 -226
4752b26L53k77K00j27J26L02n01n8K2M05j52j36K11j11l4k00M19j46k28K68M0
$$ -226 127 -150 50 -77 49 351 -150 -208 -186 219 67 -69 142 31 -3 -203 216 70 -158 110 150
4773A50r2p4J64k43n6L19k43M16R2n46Oq4k51N43j89K17j53K5k22l5J33n2N06
$$ 150 58 -16 148 -95 -151 168 -75 341 433 -113 -107 -191 -442 101 -88 129 -24 1 -221 -256 -123 -175 331
4796C31m66P4k44O20m82k26J67J94K27q9K42o50K11J93j27J38K2j9q1M1m14K06
$$ 331 -135 -61 -305 315 -167 -393 -226 -32 195 106 348 -302 -91 102 -25 113 135 116 35 76 -338 -132
4818a32L13k34K61l51M23k59r5L40o34M54j7o7r6r3K02j61q8M86l33j73M42m25
$$ -132 181 -53 208 -143 280 21 -74 266 -368 86 69 2 -94 -187 15 -146 -234 252 -81 -254 188 -237
4840b37K84j08o7M35p9k79k84M85Kk27k08N61l33J01j8k35j1K2K14j03j12J29
$$ -237 47 -61 -128 307 228 -51 -335 150 152 -75 -283 278 -55 46 28 -207 -218 -196 18 -85 -197 -68
4862f8M00m39O7l29J55K73jK62j48l1K60l42M4n17M45L26l53k3J14j23j79L05
$$ -68 332 -107 -40 -369 -214 59 58 320 172 141 401 59 103 -414 31 357 4 -19 95 -28 -207 98
4884I8j28J98n5J52J48k57m2J61j51N7l73N25l34j6k97O91j42k54J19j9K02n85
$$ 98 -30 168 113 265 413 156 114 275 124 181 -192 333 -1 -17 -314 377 235 -19 100 81 283 -302
4906c02M73k15l23J94L26l50RM12o62M37J34k91M04k46j81N2J91j69J56l45M11
$$ -302 171 -44 -367 -173 153 -197 -188 224 -438 -1 133 -158 246 0 -181 -129 62 -107 49 -296 115
4927A15j95J49j61M4J20j2n0L82m60K09k84k63Q48n34M09Mj82k78L50k9P8K7l52
$$ 115 -80 69 -92 -48 72 60 10 392 -68 141 -143 -406 442 -92 317 321 139 -139 211 182 260 287 -65
4950f5N2k66P6K44r3J3n4J28l7k32K85j38K08Pj18J63l0k35O2J50j45J29J00j11
$$ -65 -13 -279 -203 41 -52 -39 -93 35 -2 -234 51 -87 121 128 10 173 143 -92 -30 120 -25 104 204 93
4974I3l09J85J88o4j01J52l43L26J11n00K34k28J02k02K92n0k06K55J43q7k5k9
$$ 93 -216 -31 157 93 -8 144 -199 127 238 -262 -28 -256 -154 -356 -64 -114 -320 -65 78 -9 -34 -63
4996f3K61k12L36o0m05K05k66L89M7j64J04k08J63j55Q0M18o40K67k45K46m5j39
$$ -63 198 -14 322 262 -143 62 -204 185 232 68 172 -36 127 -28 52 470 -170 97 -148 98 53 -86
5018h6J73q4q1O5k9L12l09o1J88j51L55k71L91m75l3J18k39J34M2L3KQ2l24K89
$$ -86 87 3 -78 -13 -42 270 -39 -100 88 -63 292 21 412 -63 -96 22 -217 -83 -41 -8 -6 76 -248 41
5042D1m6Rj83r2L54p4j05N0n0K1j23J31j65K03j75M9O4m2N71l94j58K95m57M40
$$ 41 -5 4 -179 -271 83 9 -96 -46 -96 -75 -198 -67 -232 -29 -204 -155 -91 -133 438 44 -114 181 -276 164
5066A64R7m22M25Q4O7k44J1l8R4j59Qr0q6q7J86P6P1o3J02k15j98M49l55k2P5
$$ 164 261 -161 264 348 415 171 182 144 238 79 87 -3 -89 -176 10 86 157 94 196 -19 -217 232 -123 -145 -70
5091g0O5J42j97l3K73m19J69J21J02k33o7j96J09J22j5j10r4RL46r5q3J71K81
$$ -70 -5 137 -60 -93 180 -239 -70 51 153 -80 -147 -343 -234 -112 -127 -237 -331 -322 24 -71 -154 17 298
5114B98m35L3l8Q2l54M70j51J99k60K50j33L44k06j34K20l85L00j73l39M14J30
$$ 298 -137 -104 -142 -60 -414 56 -95 104 -156 94 -39 305 99 -35 185 -200 100 -73 -412 2 132
5135A32l30J48N8P7j09L6k62L38K14o62J23K85k06L0L09p2k4J7j91K49l56N9M64
$$ 132 -198 -50 8 85 -24 12 -250 88 302 -360 -237 48 -158 -128 181 109 85 102 -89 160 -196 -137 327
5158C27n90N07m6j67j47K14k2j9j77K0K74l23J56J81J2l25j12O1J33O6Q5j74K2
$$ 327 -263 244 198 31 -116 98 76 57 -120 -100 174 -149 7 188 200 -125 -237 -176 -43 23 108 -66 -44
5181d4k65J22K55m66M52J19o6k48J23L71l65K91k91J02J22k27K17K58m33J58J01
$$ -44 -309 -187 68 -398 54 173 107 -141 -18 353 -12 279 -12 90 212 -15 202 460 27 185 286
5202B86j49L8K45k79k17K10j04q5ON2L24l16k09M63j28p8J45J01l10k43N23k39
$$ 286 137 175 420 141 -76 134 30 -55 -49 3 327 11 -198 265 137 59 204 305 -5 -248 275 36
5224C6r8L96j23J59n63L10l76L80k11N5j19K50l99J84K60r9l8k86J99l4q5j23
$$ 36 -62 334 211 370 -193 117 -259 121 -90 -35 -154 96 -303 -119 141 42 4 -282 -83 -117 -202 -325
5246c25L18l3N1k27j1L95J76o90N53n3j6j26K0J7j06q8N06k10K8jnk78K01l8K4
$$ -325 -7 -40 11 -216 -227 168 344 -346 207 154 138 12 32 49 -57 -145 361 151 179 178 173 -105 96 58 82
5271H2j24J50Q2j30L58l66J37k6m15K71R8K12k29P1J38l21j69K68o2j50Q2j00
$$ 82 -42 108 190 60 418 52 189 163 -252 19 117 329 100 171 309 -12 -181 87 25 -125 -43 -143
5293a43K05k03j07J9J35J47m38K05M03m00M05m21l9L36o18M16q5l7J50K45m0P
$$ -143 62 -141 -248 -229 -94 53 -385 -180 223 -177 228 -193 -232 104 -514 -98 -183 -220 -70 175 135 142
5315A42J01n47L79l06J53M37k97j50L24J5R0j90q3M46j87m01K40j10K41j34l3
$$ 142 243 -304 75 -231 -78 359 62 -88 236 251 341 151 68 514 327 -74 166 56 297 163 130
5336A30J57q8Q2J34k24p0k89J00M8O6K27l33r2o0K45r1K15j12j2k30L9O1J15k7
$$ 130 287 199 281 415 191 121 -168 -68 -20 46 273 -60 -152 -212 33 -58 157 45 33 -197 -158 -97 18 -9
5360il02L10M0k7r3r1k74N54m65N39m89J11L39m05Q0L92o85Q4N75j13J32m89K69
$$ -9 -311 -1 39 12 -81 -172 -446 108 -357 182 -307 -196 143 -262 -182 210 -475 -391 184 71 203 -286 -17
5383a7Q1K2K42j40j77O63m99l46K27o4K65l29l0N18j06m90M06r4R4l93J25L57
$$ -17 64 86 328 188 11 674 175 -171 56 -8 257 -72 -102 416 310 -180 226 132 226 -167 -42 315
5405C15n56L59j2R9j71j48J57j26l5K6L18r2k85n0L39j5j15l26n0L11Q2K64k90
$$ 315 -241 118 106 205 34 -114 43 -83 -118 -92 226 134 -151 -201 138 123 8 -318 -368 -57 25 289 -1
5428aj41P7k0L5K3N6j20J55p5j10J2Q0k09J89L04k26L4k10J34r7L07m2K67j58
$$ -1 -142 -65 -85 -50 -27 29 -91 64 -11 -121 -109 -29 -238 -49 255 29 63 -147 -13 -110 197 155 422 264
5452B64k65P09n59k6m89M23k2J20mL53n49M1M32l65l04L09j62O11j27k45M9KR4
$$ 264 -1 708 149 123 -366 57 35 155 151 504 -45 -4 428 63 -241 68 -94 517 390 145 194 196 290
5475B90k93J77m8j39P3N3J29k56K8j69j27K75K23o9j08k82K86k10o1J92l0K7k05
$$ 290 -3 174 126 -13 60 113 242 -14 14 -155 -282 -7 216 147 39 -243 43 -167 -228 -36 -66 -39 -244
5498b44j5K48j92J63j76N69l43k83J42J67j35Q4j64%J56Q1n6K82j88n6j4j70L70
$$ -244 -259 -11 -203 -40 -216 353 10 -273 -131 36 -99 -15 -179 -179 -23 58 2 284 96 40 26 -144 226
5521B26o4J7M9n74L26M5K00l5J24n2l26L58l71L14j88R6L0k14L02j96l44n6J74
$$ 226 162 179 228 -346 -20 25 225 190 314 262 -64 294 -77 237 49 145 175 -39 263 67 -277 -333 -159
5544a59K31m1k28K70o4l48L85o4k4r7j33K37r1M28k91j02m08N90k87J23J97K8
$$ -159 72 31 -197 73 9 -339 46 -18 -42 -139 -272 -35 -126 302 11 -91 -499 91 -196 -73 124 152
5566A52j74Kj35N0l6L1Q3L93k55M6J32r9p7j22k17L30l28L20K21j90j19L6Q8K68
$$ 152 -22 -20 -155 -105 -141 -110 -27 366 111 157 289 190 113 -9 -226 104 -224 96 317 127 8 44 132 400
5590D00k29j41L17j30l5J32p12J27L23L31m12K18k96L06j70k48K28k1k14J75j16
$$ 400 171 30 347 217 182 314 -398 -271 52 383 -29 189 -107 199 29 -219 9 -12 -226 -51 -167
5611a67J37l24N3J62j4R4J17N7j63J07l93L31Mk14J06J56K29k62j08N11p5l48
$$ -167 -30 -354 -301 -139 -153 -59 58 115 -48 59 -334 -3 1 -213 -107 49 278 16 -92 419 344 -4
5633dQ5K65m03J18O2J40k64J38J3k76J67j22L16r7m9n7O2J64l53R7M0l99L47Q5
$$ -4 81 346 -57 61 123 263 -1 137 150 -126 41 -81 235 138 89 32 94 258 -95 2 42 -357 -10 75
5657G5R8J9l81N37k64k3P1R1k33JR1l6j95L07j10K05k31j62n9L69l73L70l21L8
$$ 75 173 192 -189 348 84 61 132 223 -10 -9 82 46 -149 158 48 253 22 -140 -199 170 -203 167 -154 -116
5681a16J31O2m58M23J45k5K6k81n8r2M02m0l48J19J77j81L1K12l21N23l21l82
$$ -116 15 77 -381 42 187 162 188 -93 -151 -243 159 119 -229 -110 67 -114 -83 129 -192 331 10 -372
5703c72K03L53o2n56M22j67J11L0J16j53J03RNj98K20l9j31L61j76L32k72R1l53
$$ -372 -169 184 122 -434 -12 -179 -68 -38 78 -75 28 37 42 -156 64 25 -106 255 79 411 139 230 -123
5726a23p0N3N26m54K61l73J32k0J96j02o38O46J63L98o42N5J16m6Jj10J57n38
$$ -123 -193 -140 386 -68 193 -180 -48 -68 128 26 -612 34 197 595 -47 8 124 78 79 -31 126 -412
5748d12J14J50r0M54k71%J70r1m8KJ11k4r5J96k87k39M50l24J77j11J38K2o3j36
$$ -412 -298 -148 -238 216 -55 -55 115 24 -24 -22 89 65 -30 166 -121 -360 90 -234 -57 -168 -30 -8 -71 -207
5772b07L34j54R1K66j91l21J93N2p4kK9k82N8J48K55j62j06K88j31L2j08j96N52
$$ -207 127 -27 64 330 139 -182 11 63 -11 -13 16 -266 -208 -60 195 33 -73 215 84 116 8 -188 364
5795C64p08M67k11k51L82p2J16l35R1N2o6k0r9K50K38l15j37K79k86J98pK1Q6
$$ 364 -344 123 -88 -339 43 -29 87 -248 -157 -105 -171 -191 -290 -40 198 -117 -254 25 -261 -63 -70 -49 37
5818C7l51j21L85j53L20j50L0J01m40L07L5o8J28p7K05o05L40P8J05K63O1n04
$$ 37 -314 -435 -50 -203 117 -33 -3 98 -342 -35 0 -68 60 -17 188 -417 -77 1 106 369 430 -74
5840g4N1n4M01m81L18j60mM6K05k64k93J71K81k8j55L8O1k08N5j43r5O93j89O8
$$ -74 -23 -77 324 -157 161 1 -3 43 248 -16 -309 -138 143 115 -40 -2 59 -149 -94 -237 -332 361 172 240
5864B40o30M95q8m45N18j82qJ88n40P4M34l12K92k3R9j58j10M04l31R4Q9j31j86
$$ 240 -390 105 17 -428 90 -92 -100 88 -452 -378 56 -256 36 13 112 -46 -156 248 -83 11 100 -31 -217
5887b17J76j48J38J60n6o0J5j23R6Q7kP1Ql22j04M01k04J71RK25j89N1J98j29
$$ -217 -41 -189 -51 109 53 -7 8 -115 -19 68 66 137 145 -177 -281 120 -84 87 96 321 132 183 381 252
5911B52J17k12K2J02l90J71q4k12J34J11R5J0M2l10K03q3m20L74p0j95K82K04
$$ 252 369 157 179 281 -109 62 -22 -234 -100 11 106 116 158 -152 51 -32 -452 -78 -148 -343 -61 143
5933A43k74L33q8l16J48j55L37j42o6r7L28l10Q0K15j51j6J8M1K4L1n6Q4k13J04
$$ 143 -131 202 114 -202 -54 -209 128 -14 -80 -177 151 -159 -79 136 -15 -31 -13 28 52 83 27 111 -102 2
5957BO2k73K22J57k14N4L1J7j69j87M01J19j8O7j50lk80J91j95R2n2N2p0L94l31
$$ 2 64 -209 13 170 -44 10 41 58 -111 -298 103 222 204 271 121 118 -162 29 -166 -74 -126 -74 -144 250 -81
5982h1K44J86l87j5lK53k74J24L67k51n0j45j52K75Mp0L19k15k2O2k75O3q8L39
$$ -81 163 349 -38 -53 -56 197 -77 47 414 163 113 -32 -184 91 95 25 344 129 107 169 -106 -43 -131 208
6006B08j73k37L12j81j40L48k51j4L61k75j42K85l18K25J27k06R9n7j07J44N8
$$ 208 35 -202 110 -71 -211 137 -114 -128 233 -42 -184 101 -217 8 135 -71 28 -29 -136 8 66
6027F6j98j09p5M28m5R5J22k8j89J81J8K41k78l27J4R9J59j62m9K90j46J63k79
$$ 66 -132 -241 -316 112 67 162 284 256 67 248 266 507 229 -98 -84 15 174 12 -37 253 107 270 -9
6050iJ16j33J24J08j60j42K40k02j41P0J49O2k16J84r8k75K72J14l43M22m67L98
$$ -9 107 -26 98 206 46 -96 144 -58 -199 -129 20 82 -134 50 -48 -323 -51 63 -280 142 -325 73
6072G3j63j89L75k40j96K89J51l75L15l97M22J14j39M1j6q6L16K9m96r1mL94j66
$$ 73 -90 -279 96 -144 -340 -51 100 -275 40 -357 65 179 40 81 65 -21 295 324 -172 -263 -267 127 -39
6095c9K85l15j46J58q0L86l64N32l20j74k19R3K71j28L82j61m27N16j92k71L65
$$ -39 246 -69 -215 -57 -137 249 -115 417 97 -77 -296 -203 68 -60 322 161 -266 250 58 -213 152
6116A52m9j08l78K70K56l08K29j48K45n0l38R5Q7k27J55r7k33K60M53j40k0k01
$$ 152 103 -5 -383 -113 143 -165 64 -84 161 111 -227 -132 -45 -272 -117 -214 -447 -187 266 126 106 -95
6138i5J88k67J14k18L83m3j69O5K60k0k57k49M31k2l91K28m4Q5P3Ok29K19Q1j07
$$ -95 93 -174 -60 -278 105 62 -107 -42 218 198 -59 -308 123 101 -290 -62 -106 -21 52 58 -171 48 129 22
6162B2l5PO0k7n7j7L97j63m60J37J03J65q8j07n7J27q1j32P2k34L24r0J51K79
$$ 22 -13 -6 54 27 -30 -47 350 187 -273 -136 -33 132 44 -63 -120 7 -74 -206 -134 -368 -44 -134 17 296
6186B96l81j09j32J16J14J83k34nK93j77k42K82j3j34K18n20M59K55l13Mj69J93
$$ 296 -85 -194 -326 -210 -96 87 -147 -152 141 -36 -278 4 -9 -143 75 -445 14 269 -44 -40 -209 -16
6208a6M37m80l03o9O88m10K03l75M73N3m14L42j40l5P5j95K26j3n5R1j00L08l56
$$ -16 421 -59 -362 -431 257 -153 50 -325 148 201 -213 129 -11 -46 29 -166 60 47 -8 83 -17 291 -65
6231f5M06k95mn9j66K21K93l8n66N95l34M4P1j0Q7J66p5l58q6L53k23j60J07J9
$$ -65 341 46 42 -17 -183 38 331 293 -273 322 -12 32 103 93 180 346 271 -87 -173 180 -43 -203 -96 -77
6255g7L74j13J5l17P8j70L01j16j03pl6N0K40j13J7J09J1k23j40kK84k98L67Q2
$$ -77 297 184 199 -118 -40 -210 91 -25 -128 -135 -171 -121 119 6 23 132 143 -80 -220 -222 62 -236 131 213
6279B13k1k99J8K54j6J52k58j02l8J88k26M81j84j11J86n6m56L38K38l6j78Q6
$$ 213 192 -107 -89 165 149 301 43 -59 -97 91 -135 346 162 51 237 181 -275 63 301 265 87 173
6301A73Lm34M04j28J16k19J73kl0O9k8k6J3j10K52q6k35R0K1k34j95L79P0l37
$$ 173 176 -258 146 18 134 -85 88 86 56 125 97 71 84 -26 226 140 -95 -5 16 -218 -413 -34 36 -301
6325c01M43K1l92N3K89r6l80L82r1j58L60j63j20K23N7q1l1K37O1j70Ok4m38n2
$$ -301 142 163 -229 -176 113 17 -363 19 -72 -230 130 -33 -153 70 127 46 15 252 313 143 149 125 -313 -365
6349c65L24R7R6J40n23M10j02J4L25o92J42QN5L90m2o1j14Nr2J5J43l15J30k70
$$ -365 -41 56 152 292 -231 179 77 91 416 -276 -134 -126 -71 319 277 216 102 107 15 30 173 -142 -12 -282
6373b82J70K37q1m45K78J35Kj75K08q9k8r3L02l62J07j36q8N10j50j85J65l1j65
$$ -282 -112 125 44 -401 -123 12 14 -161 47 -42 -70 -163 139 -223 -116 -252 -340 170 20 -165 0 -31 -196
6396a96J51L04n41M37m62M10J20j80j05N4J64K8o4lP5j74K2j01M31R3m69k96M89
$$ -196 -45 259 -282 155 -307 103 223 43 -62 -8 156 184 120 117 192 18 40 -61 370 463 -6 -302 187
6419A87n3K7m35M98o01N93k09q1J59j39J62k74L23n9j47n2J85LJ21o1J33j82k1
$$ 187 134 161 -274 224 -377 216 7 -74 85 -54 108 -166 157 98 -49 -101 84 87 208 147 280 98 77
6442G7l71N01l18k33J69K85j99k40L36j61K64l09L10K3K6m39J09K40J56j39j79
$$ 77 -294 207 -111 -344 -175 110 -89 -329 7 -154 110 -199 111 134 160 -279 -170 70 226 87 -92
6463i2L34m06L88j31m03M41j27j15J92J1l66M65o9J04o9n7j04OK51j90q7j15L1
$$ -92 242 -164 224 93 -310 131 4 -111 81 92 -274 191 122 226 157 100 -4 2 253 63 -24 -139 -108
6486a08M67m23k31P12l25J0K8r5J64N8p6p6J6j02L16m62L04n85M38j71L60n61
$$ -108 359 -64 -295 417 92 102 130 35 199 257 181 105 121 19 335 -127 177 -408 30 -141 219 -342
6508c42K60j23oJ48O3q2n7K13j51M07m57q8Q9n7J95j21j00K23n26N62q6Q8l86
$$ -342 -82 -205 -211 -63 0 -82 -139 74 -77 330 -127 -215 -126 -183 12 -109 -209 14 -512 50 -36 52 -334
6531c34L52j09K76n7k6LJ50n69M73l10K04m19K45n9L53rj56P6m5k12N00j24l61
$$ -334 18 -91 185 128 102 105 255 -314 159 -151 53 -366 -121 -180 173 164 8 84 39 -173 327 203 -158
6554a58M20m89K65Q8l4j99j76J52k42N36n8j68%J55J3j99j56%P4j76M81m51K29
$$ -158 262 -227 38 126 92 -107 -283 -131 -373 163 105 -63 -63 92 105 -94 -250 -250 -176 -352 129 -322 -93
6577i3j34K33K16k18R9j87n4K38o10J82j12M87Pk14k3J90j00o3r1K85j6m80O48
$$ -93 -227 6 222 4 103 -84 -138 100 -510 -328 -440 47 54 -160 -183 7 -93 -156 -247 38 22 -458 190
6600A90l26K99k0P4k1k15J04p2j10O8K75j88q8L84l93K87j6l6K53m53l7k44K77
$$ 190 -136 163 143 217 196 -19 85 13 -97 -29 246 58 -30 354 -39 248 232 196 449 -4 -41 -285 -8
6623hL01j43l1p7l7j13j28K00j7J80p7l39PL29k02K82n15L95K73o3k52N8j35J19
$$ -8 293 150 119 42 5 -108 -236 -36 -53 127 50 -289 -282 47 -155 127 -388 7 280 217 -35 23 -112 7
6647Gm0L57m65k11J73J34K87j73k64L81k02k51K25K12J24l16k6L20M3km17j36
$$ 7 -33 324 -141 -352 -179 -45 242 69 -195 186 -16 -267 -42 170 294 -22 -48 272 315 313 -104 -240
6669b40L54o0k53N41k66J17J35l16P5o0k23L23n5j03J72l3q4R5o1j27J01j44K78
$$ -240 114 54 -199 342 76 193 328 12 87 27 -196 127 72 -31 141 108 24 119 58 -69 32 -112 166
6692A66m88L47N7qOk60K0J98J00k35k6j81M42j1n06O20o8l01j90J40K65j49l67
$$ 166 -322 25 82 74 80 -180 -160 38 138 -97 -123 -304 138 127 -379 241 173 -128 -318 -178 87 -62 -429
6715d29N4L46j27J50k08K11J29k09L45j30k26L7K39m23M31J32k49m7l0J35j12
$$ -429 -375 -29 -156 -6 -214 -3 126 -83 262 132 -94 -57 182 -241 190 322 73 26 -4 131 19
6736A9R0j15J16Q0k61J13J52J20m27J6L11j88Lk41J92J31k66J14J51q8j65k4J11
$$ 19 109 -6 110 190 -71 42 194 314 -113 -97 214 26 29 -212 -20 111 -155 -41 110 22 -143 -167 -56
6759e6P5o1J06j70P0j73K92P7k61k04l4K58J96j97j06L01l8p8n8J32p3q6k0R9
$$ -56 19 -42 64 -106 -36 -209 83 160 -101 -305 -339 -81 115 -82 -188 113 75 -3 -61 71 -2 -88 -108 -9
6783iP8j44J82K7R9O7k73j71K24NK71k95J22j54j93M09m89K88Jk2J28K01J5k67
$$ -9 69 -75 107 134 233 300 27 -144 80 85 356 61 183 29 -164 245 -244 44 45 23 151 352 367 100
6807A00J47r3Qk39k9K71m8j29K83m03M55r3o2l1O5k10j59K30j53J36K39Q8l36
$$ 100 247 154 162 -77 -106 165 117 -12 271 -132 323 230 168 137 202 -8 -167 63 -90 46 285 373 37
6830C7J18j29k2J07j17j73Q4J14J2l30N35k48j58R5J42j84K60k18j96K55j51J94
$$ 37 155 26 4 111 -6 -179 -95 19 31 -299 236 -12 -170 -75 67 -117 143 -75 -271 -16 -167 27
6852B7K57m64J88j19K11l4JO4K08n52K0K29J27j59QK59j51k52J21p0MP7J27K36
$$ 27 284 -180 8 -111 100 66 67 131 339 -213 -193 36 163 4 12 271 120 -132 -11 -81 -77 0 127 363
6876C63l62L61m2n98O32k06p7K03n36J68K15l69Q0j9J79M3k93J98j11Q5k11K47
$$ 363 1 362 320 -278 354 148 71 274 -262 -94 121 -248 -168 -187 -8 35 -258 -60 -171 -86 -297 -50
6898e0o9P8J03j55J34l32K07K98n44P26m93J10L9j33K49pN3l65OK12j35J88j88
$$ -50 -119 -41 62 -93 41 -291 -84 214 -330 396 -97 13 52 -81 168 161 214 -151 -145 67 -68 120 -68
6921f8O8K28k54j36M09l44k07O41k50k25L99r2J72n00J50j39J43j51L1M02k78
$$ -68 0 228 -26 -162 247 -97 -304 337 87 -138 261 169 341 -159 -9 -148 -5 -156 -125 277 -1
6942an0K5P4r9Q2J23l88N78l86J0J40k68Q2j23K61o0k4l27J77m8rM97J58l10k77
$$ -1 -51 -26 48 -51 31 154 -234 344 -42 -32 108 -160 -78 -201 60 0 -24 -351 -174 -222 -231 266 424 114 -163
6967a63K53j64J02K96l35K83m94K38j3p4j74L75l82J04K10r7K84o72K70J68j24
$$ -163 90 -74 28 324 -11 272 -222 16 3 -71 -245 130 -252 -148 62 -35 249 -423 -153 15 -109
6988a09L73k23k40K00K59nk70K18j8J25l87K13J20j57o9j84J80K29j51q5K6k18
$$ -109 264 41 -199 1 260 255 -15 203 185 310 -77 136 256 99 30 -154 26 255 104 19 45 -173
7010a73L19m79N21k33k9K65J72n92O8J8oJ32M00m60L41l71J48J19l54K35m86M84
$$ -173 146 -333 188 -45 -74 191 363 -229 -161 -143 -149 -17 383 -77 264 -107 41 160 -194 41 -445 39
7032C9p8Pj51K95k97L93k12K8j18J61j61j57J72J46M8j38j12K33j01j05M08k81
$$ 39 -39 -32 -183 112 -185 208 -4 24 -94 67 -94 -251 -79 67 115 -23 -135 98 -3 -108 300 19
7054A9k13J15K15k36J47l61J9K27L03q5j24l78J53K94j9k49R9L44l73j0M25m94
$$ 19 -194 -79 136 -100 47 -314 -295 -68 235 150 26 -352 -199 95 76 -173 -74 270 -103 -113 312 -182
7076a82Q2j54J76k03N05l00k00K82k44J31J61k04K35J08j89k59l3J12N8N7l8m5
$$ -182 -100 -254 -78 -281 224 -76 -276 6 -238 -107 54 -150 85 193 4 -255 -288 -176 -118 -61 -99 -144
7098a44J34M5j80J74m50M98k09J72k1j96L62l46J44L53j78j35J13q3J89j23j29
$$ -144 -10 35 -145 29 -421 77 -132 40 19 -177 185 -161 -17 336 158 23 136 53 242 119 -10
7119a0rL47q2j79MP3R2m7l89M41m10J58J41P7o2k19L11r0O6j35m7j22N6J59j6
$$ -10 -19 328 246 67 71 144 236 189 -200 241 -169 -11 130 207 145 -74 237 147 213 78 31 -91 -35 124 108
7144A08j51m45O68k7k40J0PJ20Lo6j09J48k06K15k55K17m26K77L38m58K07K04
$$ 108 -43 -488 180 153 -87 -77 -70 50 53 -13 -122 26 -180 35 -220 -3 -429 -152 186 -272 -65 139
7166A39m69J62K58n0J47m2j41J22M6j77J89k76L12k13J03J47j80j00K48n26M13
$$ 139 -330 -168 90 40 187 145 4 126 172 -5 184 -92 220 7 110 257 77 -23 225 -301 112
7187A12m25J04J54J64K59l36n7k5m4j13K20l0N6K1k02L78k1l8p6P6o7j18k98L40
$$ 112 -313 -209 -55 109 368 32 -25 -50 -94 -207 13 -17 39 60 -142 236 215 177 101 177 110 -8 -306 34
7211C4N2k44M49m92K38j68J77k76r2M23O5j5k58P3k49M62l71L06J59l35j03J10
$$ 34 86 -158 291 -201 37 -131 46 -230 -322 101 166 151 -107 -34 -283 179 -192 114 273 -62 -165 -55
7233e5l0N6J54k34n6P5L25Ll2k40Q1Q2j23J53mj87j02RJ50j51N8K24o2k04J79
$$ -55 -85 -29 125 -109 -165 -90 235 238 206 -34 47 129 6 159 155 -32 -134 -125 25 -126 -68 156 94 -110 69
7258F9j49j75L78o2L6J30l08j61Q0R4K89j29k27K23M2l94O13n24p5J79j94J86
$$ 69 -80 -255 123 61 97 227 -81 -242 -162 -68 221 92 -135 88 130 -264 349 -175 -250 -71 -265 -79
7280g9j96J40J53r4j10L35m61O4J76N5K13l30K58k01K4J32K47m36K50k74k8K19
$$ -79 -275 -135 18 -76 -186 149 -312 -248 -72 -17 196 -134 124 -77 -53 79 326 -110 140 -134 -162 57
7302E7k43J59L0J68l87K32j22K4j44M15l1l2j00Nj51j30O12o55O18l07l76M50
$$ 57 -186 -27 3 171 -216 16 -106 -82 -226 189 158 126 26 31 -120 -250 362 -293 325 18 -358 92
7324I2r3l26M42j40J61j35K9J81k9j63j0o4J05Rk87K89j81K37K51m63j30J8L06
$$ 92 -1 -327 115 -25 136 1 30 211 182 19 9 -55 50 59 -228 61 -120 117 368 -95 -225 -207 99
7347I9N0j14Kj89K97Q0k85j07R6O2J74m58R5j46J42M05l95J70J99k68j32JK73
$$ 99 149 35 37 -152 145 225 -60 -167 -71 -9 165 -293 -198 -344 -202 203 -192 -22 177 -91 -223 -222 51
7370E1j20K99k27K54k7m4k01L44k66N4K6J45n57j2L9L10L1O9j07J73j54R2j56
$$ 51 -69 230 3 257 230 186 -15 329 63 117 143 288 -269 -281 -242 68 99 168 61 234 80 172 16
7393A6k62J44K99l68J90K4Q2k22L5j36j06K06KQ5P5j3j26j29Q6J34rj09M79m12
$$ 16 -246 -102 197 -171 19 43 125 -97 -62 -198 -304 -98 -96 -11 64 51 -75 -204 -118 16 7 -102 377 -35
7417c5K54j11l51L01j55J45j0L48p67L36m4L15l46K02o8J62l67K39K42j36j48
$$ -35 219 108 -243 58 -97 48 38 386 -381 -45 -89 226 -120 82 14 176 -191 48 290 154 6
7438FM61l42l22K30Q1n9J85j43j26K90j19j17k23N09m92P1KJ77K49m13J6J00j66
$$ 6 467 125 -197 33 114 55 240 97 -29 261 142 25 -198 311 -181 -110 -108 69 318 -95 -79 21 -145
7461a45J22Q5q7K61l85K65j9m28O43n92P5k3L45m14K89j56K61l17PK85l26l1q1
$$ -145 -23 62 -25 236 -149 116 97 -331 312 -280 -205 -228 117 -297 -8 -164 97 -220 -213 72 -254 -285 -366
7484c66K25J37L96o38P6j17M31J59q2l68K81L79m26j9l2MJ88L76l88Lkl85J98
$$ -366 -141 -4 392 -246 -170 -287 144 303 221 -147 134 513 87 68 36 40 228 604 216 219 217 -168 30
7507C0m0N4m4n8k71L07l0K29j33N0m2r8j51M91j86j24K95m31k33L10J13j89r9
$$ 30 -10 44 0 -58 -329 -22 -52 177 44 94 52 -46 -197 294 108 -16 279 -152 -385 -75 38 -151 -250
7530b50J29L0K99M6j00k75J8l8Q5J56J94n21k1K77J09K88n68L4l30M14J60J25
$$ -250 -121 -91 208 254 154 -121 -103 -141 -56 100 294 -227 -248 29 138 426 -142 -108 -438 -24 136 261
7552B61k08J3m72K62L91Q2m13M32k88M3J77k50p5j00M10k2k18mLN7J98k27j43
$$ 261 53 66 -406 -144 247 329 -84 348 60 103 280 30 -45 -145 265 243 25 21 24 81 279 52 -91
7575i1j76P6K28L32j67p9L3j76J26r9R5o5p8J08Q3l12lj13J83K9m5k9J90J26j28
$$ -91 -267 -191 37 369 202 123 156 -20 106 7 102 37 -41 67 150 -162 -165 -278 -95 -66 -111 -140 50 176 48
7600D8P3k36J88l47J94m4P8r2K02r8J91L02l82n02N55m17M66J09l35j24o0M25
$$ 48 121 -115 73 -274 -80 -124 -46 -138 64 -34 157 459 77 -425 130 -287 179 288 -47 -171 -231 194
7622A94j24J91l48J49r7J42J19j95J30R3l11M39j46k50k26L44q6j1j69j7O1K73
$$ 194 70 261 -87 62 -35 107 226 31 161 254 -57 382 236 -14 -240 104 18 7 -162 -179 -118 155
7644A55L74o73N8O4J31j89J44m8j56K50l22J50J37L03k95j97j63K90J33K08m15
$$ 155 529 -144 -86 -22 109 -80 64 16 -140 110 -212 -62 75 378 83 -114 -277 13 146 354 -61
7665f1j71L16P5k77Lk97N82Ll12o7J12l17N29j46k09K01j39J51j77J95l30M04
$$ -61 -232 84 159 -118 -115 -412 170 173 -139 -206 -94 -411 118 -28 -237 -36 -175 -24 -201 -6 -336 68
7687F8l8k55L65J28J20k13k19M04n37J48O5L8K3K81l47j40L07j37k16M1J28l69
$$ 68 30 -225 140 268 388 175 -44 360 -177 -29 36 74 97 378 31 -109 198 61 -155 -114 14 -355
7709c55K56J57R5n3j80k23L75l2MN9j96Q1N6J11o4j67K56l6K6m17L49k46Q7N4
$$ -355 -99 58 153 100 -80 -303 72 40 44 103 -93 -12 44 155 91 -76 180 144 170 -247 102 -144 -57 -3
7733cm1n8O1J71o8J32k59o2K56k6o1j57Jq1P2K99k15n9K77k61J42J80O6l3l03
$$ -3 -44 -102 -41 130 62 194 -65 -127 129 103 42 -115 -114 -195 -123 176 -39 -98 179 -82 60 240 306 273 -30
7758c0k07K39j25k50K41R3J12j6j39L75j08O7k64L4j52J87j40J97k04K3P0l59
$$ -30 -237 2 -123 -373 -132 -39 73 57 -82 293 185 252 -12 22 -130 57 -83 114 -90 -67 3 -356
7780c56M27p2Nk40K62r8J66m04M53k82m8K46k07j00R5M3q3J06M50l34k1j25L12
$$ -356 71 -1 4 -236 26 -72 94 -310 143 -139 -187 59 -148 -248 -153 -110 -193 -87 363 29 8 -117 195
7803A95l02R9j76L51j80j58k3K90J26k22K5k33J01qj02N4j20K24J47R2j74mq0
$$ 195 -107 -8 -184 167 -13 -171 -194 96 222 0 25 -208 -107 -115 -217 -163 -283 -59 88 180 6 2 -78
7826g8%J29M6k01Qn0M05j30m7j5m25L09K82k44j27L2o5K89k5j69P1J58m33K09
$$ -78 -78 51 97 -104 -96 -146 259 129 82 67 -358 -49 233 -11 -138 -106 -171 118 93 -76 -5 153 -280 -71
7850g1p1j3m9K44j55M01n87M31P9rO6l03R9n13N17m0j20M1j13l8M76p2j73J46
$$ -71 -142 -155 -204 40 -115 286 -301 130 209 200 266 -37 62 -451 66 26 -94 -53 -166 -204 272 200 27 173
7874A73k52L96q3k17J16K0o0l01L8N56l66L20j68k72n3j98L25M8k45M54K5n51
$$ 173 -79 317 234 17 133 153 93 -208 -170 386 20 340 172 -100 -153 -351 -26 22 -223 231 256 -295
7896b95K31J97n6j87N8J44l2m0J62k49k86M21l8j28N5q3j37J26K1J18K5j28N9
$$ -295 -64 133 77 -110 -52 92 60 20 182 -67 -353 68 30 -98 -43 -126 -263 -137 -116 2 27 -101 -42
7919d2k03J7J64L85k54J31j87J40k05n2K94k07J73l75J02J25q1J31k31J98L9L27
$$ -42 -245 -228 -64 321 67 198 11 151 -54 -106 188 -19 154 -221 -119 6 -75 56 -175 23 62 389
7941C89m88P6j08K4L57o7j21m8M13m95L4J44J25o1k25N8l4no2O6K29j43k08Q8
$$ 389 -99 -23 -131 -107 250 183 62 14 427 -68 -34 110 235 174 -51 7 -27 -32 -94 -28 201 58 -150 -62
7965f2m9M2Q6P9Q6O4k44j72l7K7J77m1P4J11k73j96K64L98k82k46M56m61M2K02
$$ -62 -111 -69 17 96 182 246 2 -170 -207 -180 -3 -44 30 141 -132 -328 -64 334 52 -194 262 -199 -157 45
7989D5J8p9k96J61K4K02l8k28Q4K38j40J87n1n19L05p0M25Q8m39L4j32j4K72L8
$$ 45 63 -16 -312 -151 -127 75 37 -191 -107 131 -9 178 127 -392 -87 -157 268 356 -83 -49 -181 -195 77 115
8013A15j52P0L57o17K86J60k84P8J36k32N4L00p0R5l39K90k83M2J15m3j02j35
$$ 115 -37 33 390 -227 59 219 -65 13 149 -83 -29 271 201 296 -43 247 -36 6 121 78 -24 -159
8035a59K31J40p5l91K62o9m71M69J98r9M5o3N6j85o4N2K15j60n4J34k32J61O0
$$ -159 72 212 137 -254 8 -61 -532 -63 135 36 81 18 74 -111 -175 -123 92 -68 -122 12 -220 -59 1
8058AN7N6k03K00j93J75j44l0K65n69N10k87J8L79j6l25j40m4L50m5k73L59k71
$$ 1 58 114 -89 111 -82 93 -51 -81 184 -385 125 -162 -144 235 219 -106 -246 -290 60 15 -258 101 -170
8081a70J78j56J80o5L0K9j69R4k31K14jjK92l57J21K65l89k9Q1J20j00J47m34
$$ -170 8 -148 32 -33 -3 26 -143 -49 -280 -66 -67 -68 224 -133 -12 253 -136 -165 -84 36 -64 83 -351
8104c51J28L07j53J24j39J55J66j87K50l47%j10K73j42N4k40M4n4L14K12k17q5
$$ -351 -223 84 -69 55 -84 71 237 50 300 -47 -47 -157 116 -26 28 -212 -168 -222 92 304 87 2
8126BK87l21J41q5j4q0j46K94j39J77j54J23l0k04M24k12j82po4L18j08m1N5L14
$$ 2 289 -32 109 24 10 -70 -216 78 -61 116 -38 85 55 -149 275 63 -119 -126 -190 128 20 -21 34 348
8150C48l38l06K94L9l5N9l53M96m87K78J5k11OK8K68k62K1K46j1j03K19Q2l18
$$ 348 10 -296 -2 37 2 61 -292 204 -283 -5 10 -201 -195 -167 101 -161 -140 106 95 -8 211 293 -25
8173b5K49q9m9m3k21K54n4mj47J04J86k76L60k41k9J91K8l18
$$ -25 224 135 86 43 -178 76 22 18 -129 -25 161 -115 245 4 -25 166 194 -124
8191a24
$$ Imaginary data points
##PAGE= N=2
##DATA TABLE= (X++(I..I)), XYDATA
0@%%%%%%%%%%%%jKl3O4o4O5r7J28j29J61j93K26k58K90l54M19m84N48o14P11q09
$$ 0 0 0 0 0 0 0 0 0 0 0 0 0 -1 1 -32 32 -32 33 -64 64 -65 96 -97 129 -129 161 -193 226 -258 290 -324 387 -422
33d22R06j032J162j312J474j648J841k052K281k528K806l109L434l790M179m604
$$ -422 484 -548 614 -698 776 -872 969 -1083 1198 -1330 1476 -1633 1801 -1989 2190 -2414
49b414N075n593O161o792P492q275R155j0149J1290j2615J4172j6023J8278k1100
$$ -2414 2661 -2932 3229 -3563 3929 -4346 4809 -5340 5950 -6665 7507 -8516 9762 -11338
63a1338K4741k9643L6648m7532O6889j11654M04094J49779o59075K41226L30310
$$ -11338 13403 -16240 20408 -27124 39765 -71889 332205 481984 -177091 64135 394445
74C94445k72228l98987L39669L08472k89397l40948J70587J05314k08669j01442
$$ 394445 122217 -276770 62899 371371 81974 -258974 -88387 16927 -191742 -293184
84b93184K09764R5304q0650o2446j7732n1063M8211P0165k9535J8727J70881p790
$$ -293184 -83420 11884 -68766 -131212 -148944 -200007 -151796 -81631 -111166 -92439 78442 70652
96G0652k33083l3164K23005J1375j62080J08011K36764j07689k37204P4686J64241
$$ 70652 -162431 -195595 27410 38785 -123295 -15284 221480 113791 -123413 -48727 115514
107A15514r0083p0106J73986Q5105j63837p4698Q3646l8300q9875J11143J16285
$$ 115514 25431 -44675 129311 214416 50579 -24119 59527 21227 -68648 42495 158780
118A58780j10485p9833J02497k2550j79269M3321K18546k2060j68962O3060J25264
$$ 158780 48295 -31538 70959 48409 -130860 -87539 131007 108947 -60015 3045 128309
129A28309j44023j62146J34560J53983j01723r4196J00412K9997j48056n0702
$$ 128309 -15714 -177860 -43300 110683 8960 -85236 15176 45173 -102883 -153585
139a53585J13157M4123m0861K5583L5569n2652l1044L9639k105j3664Q1590N7558
$$ -153585 -40428 3695 -37166 -11583 23986 -28666 -59710 -20071 -22176 -35840 45750 103308
151A03308q7472o1895P3982J6692j06267N585J44032J0632j37727j3560J04489
$$ 103308 15836 -46059 27923 44615 -61652 -56067 87965 98597 -39130 -52690 51799
162E1799l0224j10049N4480J31938k9991r9441K9186N8410n6453n2039O0300N5166
$$ 51799 21575 -88474 -33994 97944 67953 -31488 -2302 56108 -345 -52384 7916 63082
174F3082l1911l0960R474j1620k9717M145J8347K921J1647J1037k9185l3283J7096
$$ 63082 31171 211 9685 -1935 -31652 -27507 -9160 -6239 5408 16445 -12740 -46023 -28927
187b8927K1469k2345j316M9266P804n6223j3757M1413m332l4765L1158N1305k3562
$$ -28927 -7458 -29803 -31119 18147 25951 -30272 -44029 -2616 -6948 -41713 -10555 40750 17188
200A7188l9042K6197K4254l2864n219N5071J6574m1883k877L6084j7021m4687
$$ 17188 -21854 4343 28597 -4267 -9486 45585 62159 20276 17399 53483 36462 -8225
212h225K3542M4227k6430l9603K4517J7349m8622k6878L9998J6148l8353r615
$$ -8225 15317 59544 33114 -6489 18028 35377 -13245 -40123 -125 16023 -22330 -31945
224c1945L0164o291l7879J083K8950k560j7319J0219J3318j4600j1589J2734P506
$$ -31945 -1781 -8072 -45951 -44868 -15918 -18478 -35797 -25578 -12260 -26860 -38449 -25715 -18209
237a8209n448R057J4092o457o243J3395O273r424O762K1829O53j3891O030J2742
$$ -18209 -23657 -14600 -508 -6965 -13208 187 6460 -2964 3798 25627 26280 12389 18419 31161
251C1161q755j0891J0481J0644r930r039M891P12j1806m064O140k322n691J977
$$ 31161 22406 11515 21996 32640 22710 13671 18562 19274 7468 3404 9544 7222 1531 3508
265C508j200q643O5N962n966o653J0529N489j3112m729J4113K486j5613O9J8076
$$ 3508 2308 -6335 -6270 -308 -6274 -12927 -2398 3091 -10021 -14750 -637 1849 -13764 -13695 4381
280D381n36j7155K570J6918m745j8090O877J6521q085j4512Q910J1054j0384j0062
$$ 4381 3845 -13310 -10740 6178 1433 -16657 -9780 6741 -1344 -15856 -6946 4108 -6276 -16338
294a6338R743P598q455l720Q643K790o180j114O300J452k486K984M246n62o70
$$ -16338 -6595 1003 -7452 -11172 -2529 261 -5919 -7033 -733 719 -1767 1217 5463 4901 4231
309D231L046R60j666K650M676k700k965K622J615n501l348L207P73n374l814K232
$$ 4231 7277 8237 6571 9221 13897 11197 8232 10854 12469 6968 3620 6827 7600 2226 -1588 644
325F44J98n326l966L283L681k901k736M010L695k170k494L877N590q11l496J050
$$ 644 842 -4484 -8450 -5167 -1486 -4387 -7123 -3113 582 -1588 -4082 -205 5385 4574 1078 2128
341B128N243k017p037J202O746k477q474J155O157m101q124K995O632k636o912
$$ 2128 7371 5354 -1683 -481 6265 3788 -4686 -3531 2626 -1475 -9599 -6604 28 -2608 -9520
356i520J863O773k757o371K660O661k729n359L495M425k699k642L084L308o74
$$ -9520 -7657 -884 -3641 -10012 -7352 -691 -3420 -8779 -5284 -859 -3558 -6200 -3116 192 -482
371d82p94K214K321r5n71Q98J421n42l06n36m99l58J70j263j344R95J620r54o75
$$ -482 -1276 938 3259 3164 2593 3491 4912 4370 4064 3528 3029 2671 2841 1578 234 1229 2849 1895 1220
390A220L037K392m56p42K898K556m12k567N45K082k433n348p91J811l206p356
$$ 1220 4257 6649 6193 5451 8349 10905 10493 7926 8471 10553 8120 2772 1981 3792 586 -6770
406f770p2K818l127n877J089M960j418n267K664O676j194n369L710O947k841m648
$$ -6770 -6842 -4024 -7151 -13028 -11939 -6979 -8397 -13664 -11000 -4324 -5518 -10887 -7177 -230 -3071 -7719
422g719M137N368m247l485M056L589k590k208L990K875k581r52L601K320j919
$$ -7719 -3582 1786 -2461 -5946 -1890 1699 -891 -3099 891 3766 1185 233 3834 6154 4235
437D235o59K019r94j842Q59m20j577L20O56k428j167K093R38j325Q39L743N88
$$ 4235 3576 5595 4601 2759 3618 3198 1621 1941 2597 169 -998 1095 2033 708 1547 5290 5878
454E878k364k50L303J74k022Q1K042j784l872j911M72j558o87l49K38o14n63k173
$$ 5878 3514 3264 6567 6741 4719 4800 6842 5058 1186 -725 -253 -1811 -2498 -2847 -2609 -3223 -3786 -5959
472e959k0K502K097j466k89K961o49n283j030M473J87l566L46M143k213o513J518
$$ -5959 -5979 -3477 -1380 -2846 -3135 -174 -823 -6106 -7136 -2663 -2476 -6042 -5696 -1553 -3766 -10279 -8761
489h761O795M63k569M328N624l896m168L507M686j951m55L745L02o123l319J562
$$ -8761 -1966 -1503 -4072 256 5880 1984 -2184 1323 6009 4058 3603 7348 7650 1527 -1792 -230
505b30N23k057J717L392j376m105m34J741N62J276M573K911k295j803j041j542
$$ -230 293 -1764 -47 3345 1969 -2136 -2570 -829 -267 1009 5582 8493 6198 4395 3354 1812
521A812m05K258K249m99r43k970l339k339J317K001J539J027O95k018n000j406
$$ 1812 1407 3665 5914 5415 4472 1502 -1837 -4176 -2859 -858 681 1708 2403 385 -4615 -6021
537f021L290K230l48J606J996l282o617j041L468J914K76K242L148k655n804j166
$$ -6021 -2731 -501 -849 757 2753 -529 -7146 -8187 -4719 -2805 -2529 -287 2861 206 -5598 -6764
553f764M122K835K03K187K249l609o091l157J948K677J550j05L80p97l334m048
$$ -6764 -2642 193 396 2583 4832 1223 -4868 -8025 -6077 -3400 -1850 -1955 -1575 -2372 -5706 -9754
569i754J678O537M669J199R91J682q45l485J72N980N397k45j497Q2l203o010j618
$$ -9754 -8076 -1539 3130 4329 5320 7002 6157 2672 2844 8824 14221 13976 12479 12561 9358 3348 1730
586A730L595K027J66p25l377n771k666N19r47J017N315K046p607p109K097L267
$$ 1730 5325 7352 7518 6793 3416 -2355 -5021 -4502 -5449 -4432 883 2929 -4678 -11787 -9690 -6423
602f423n141p00J0703N043j1231q553Q484N747q664r76J4948P604j2689q436R046
$$ -6423 -11564 -12264 -1561 3482 -7749 -16302 -7818 -2071 -10735 -11711 3237 10841 -1848 -10284 -1238
617a238P172q931l566J3039Q492j0823j1887N925Q006n408o190Q734J0708m792
$$ -1238 5934 -2997 -6563 6476 14968 4145 -7742 -1817 6189 781 -5409 3325 14033 9241
631I241j3669M34J1184J078r876J871J4551k19j6553n127J2858L135j2505q61
$$ 9241 -4428 -3994 7190 8268 -1608 263 14814 14595 -1958 -7085 5773 8908 -3597 -4458
645d458J4185J464j6817o488J2134M276j1027q29J3173J478j2490m136Q460K058
$$ -4458 9727 11191 -5626 -12114 20 4296 -6731 -7560 5613 7091 -5399 -9535 -1075 983
659I83n004J344P267Q9n798k030R34M25R50K820J40j516M42o24m831r00N413K556
$$ 983 -4021 -2677 4590 4679 -1119 -3149 -2215 -1790 -840 1980 2120 604 1046 422 -4409 -5309 104 2660
677B660m444r61L703j860o110J6M216J953j632M0O03J1o12p92Q5L699M664j942
$$ 2660 -1784 -2745 958 -902 -7012 -6996 -2780 -827 -2459 -2419 -1816 -1805 -2417 -3209 -3124 575 5239 3297
695C297m637K705O173l632p421O056J0379o300j0103O675R084r451j0257R637
$$ 3297 -1340 1365 7538 3906 -3515 2541 12920 6620 -3483 3192 12276 2825 -7432 2205
709B205R674r351r475Q850P617r958q094Q261O720o701m905N867L415n738k981
$$ 2205 11879 2528 -6947 1903 9520 -438 -8532 -271 6449 -252 -5157 710 4125 -1613 -4594
724d594K410K223j56n72j578L59K999k592n765J809P365j993o935L722P077n294
$$ -4594 -2184 39 -117 -689 -2267 -1908 1091 -1501 -7266 -5457 1908 -85 -7020 -3298 3779 -1515
740a515q490O105P760m979n252P080M914q225m241P247K338n791J702O808k708
$$ -1515 -10005 -3900 3860 -1119 -6371 709 5623 -2602 -6843 404 2742 -3049 -1347 5461 2753
755B753o576K476L861m305l66P575J139o665L58M981l265n237N687P070m478m989
$$ 2753 -3823 -1347 2514 -1791 -2157 5418 6557 -108 250 5231 1966 -3271 2416 9486 5008 19
771A9L938J677p503j382P836J636n288P77K559m967m055M010K868k671J476L326
$$ 19 3957 5634 -1869 -3251 4585 6221 933 1710 4269 -698 -4753 -743 2125 -546 930 4256
787D256m083o322K192L847l464n46O853J083q233k342N335m53m808M810P367m263
$$ 4256 173 -6149 -3957 -110 -3574 -4120 2733 3816 -4417 -6759 -1424 -1877 -6685 -1875 5492 1229
803A229o299K085K323n365j56P033J632m652n45J573m043k853N621M826k005k52
$$ 1229 -5070 -2985 -662 -6027 -6183 850 2482 -2170 -2715 -1142 -5185 -8038 -2417 2409 404 152
819A52L844k418n957K302P190J5k277M411K135p046m088M685J998l250J811M465
$$ 152 3996 1578 -4379 -2077 5113 5128 2851 7262 9397 2351 -1737 2948 4946 1696 3507 7972
835G972l108o623q08K881j284j3M503J620m474k835J121r21j300L730L901j556
$$ 7972 4864 -1759 -2567 314 -970 -983 3520 5140 666 -2169 -1048 -1969 -3269 461 4362 2806
851B806l046N13k031l351J649M590p1j670P32q60m992j816L876K489j569N36K138
$$ 2806 -240 273 -1758 -5109 -3460 1130 1059 -611 121 -739 -5731 -7547 -3671 -1182 -2751 -2215 -77
868g7k683m883L07M020N94j46L345J958l932k190J824K282N85K777L123q69k678
$$ -77 -2760 -7643 -7336 -3316 -2722 -2868 477 2435 -1497 -3687 -1863 419 1004 3781 6904 6035 3357
885C357r56l1O2J280K165K07j852j634j080k519j002L003J662j033j134M62j452
$$ 3357 2401 2370 2432 3712 5877 6084 4232 2598 1518 -1001 -2003 1000 2662 1629 495 957 -495
902d95k581N40L072J325k54j19m19j586j825J85J533J615m8n68p52j396j335r
$$ -495 -3076 -2536 536 1861 1607 1488 1069 -517 -2342 -2157 -624 991 943 375 -377 -1773 -3108 -3117
920c117R18J728O55n12j342p25m08m42O45K338J035j134r10r9m49o74Q62K024
$$ -3117 -2199 -471 184 -328 -1670 -2395 -2803 -3245 -2600 -262 773 -361 -1271 -1370 -1819 -2493 -1631 393
938C93J202o0j042K38q53n02Q57J806M66l65q68q74m86p47M30J030K88J75m55
$$ 393 1595 1535 493 731 -122 -624 233 2039 2505 2140 1272 398 -88 -835 -405 625 913 1088 633
957F33r44j40J78L33J265P58k2o6n86j86L52j7O09K70O55j146j493Q0k90m15r1
$$ 633 -311 -451 -273 60 1325 2083 2061 1995 1409 1223 1575 1558 2167 2437 3092 1946 453 533 243 -172 -263
978b63L68L01j006r04K1k81m00k01L45L87k14r26J70J10k09P3O64M86m9l65J36
$$ -263 105 406 -600 -1504 -1483 -1764 -2164 -2365 -2020 -1633 -1847 -2773 -2603 -2493 -2702 -2629 -1965 -1479 -1528 -1893 -1757
999a757O75j37K17K74J076m1m11J80Q56n09m68M55J039p32o49L96Q22j09m13O90
$$ -1757 -1082 -1219 -1002 -728 348 307 -104 76 932 423 -45 410 1449 717 68 464 1286 1177 764 1454
1019A454M08J67O4K7J43n1J98J03J8m69N63m22j517Q18M3r10r37L89O65j542q82
$$ 1454 1862 2029 2093 2120 2263 2212 2410 2513 2531 2062 2625 2203 686 1504 1547 637 -300 89 754 -788 -1670
1040a670J145m2j046p77J707K54k043L18J103k62q93M97J270j344j64N01K03j172
$$ -1670 -525 -567 -1613 -2390 -683 -429 -2472 -2154 -1051 -1313 -2206 -1709 -439 -1783 -1947 -1446 -1243 -2415
1058b415J024J89K27m71Q45K20r33N62O71K00r43P26J291j284r37J879Q67j874
$$ -2415 -1391 -1202 -975 -1446 -601 -381 -1314 -752 -81 119 -824 -98 1193 -91 -1028 851 1718 -156
1076a56K8J847K74j845J51K047n54j657Q37J911j184j481J351J078j412q69J712
$$ -156 -128 1719 1993 148 299 2346 1792 135 972 2883 1699 218 1569 2647 1235 366 2078
1093B078K06j777M82J610j597j090J722K75j939j15K049j342k393J328J850k469
$$ 2078 2284 507 989 2599 1002 -88 1634 1909 -30 -145 1904 562 -1831 -503 1347 -1122
1109a122j695J853O86k351q16K138K4k637M08K578q48k226J277K270j867k96K281
$$ -1122 -2817 -964 -278 -2629 -3445 -1307 -1283 -3920 -3512 -934 -1782 -4008 -2731 -461 -2328 -2624 -343
1126c43L93j690K1K641o65j186J593J159j658m45K044O4k461R19K646j156k746
$$ -343 50 -1640 -1619 1022 357 -829 764 1923 265 -180 1864 1928 -533 386 3032 1876 -870
1143h70K005K297k787j602L451R03l327j62L259n26k804N62K505j217j899J207
$$ -870 1135 3432 645 -957 2494 3397 70 -92 3167 2641 -163 399 2904 1687 -212 995
1159I95J326j615j307J753n46j910M45J843j760j732J871O39k389l45K608o51
$$ 995 2321 706 -601 1152 606 -1304 -859 984 -776 -2508 -637 2 -2387 -2732 -124 -775
1175g75k768J538K466j896k073K621K214l338r58L599N55k976j40K981k91k377
$$ -775 -3543 -2005 461 -1435 -3508 -887 1327 -2011 -2969 630 1185 -1791 -1931 1050 759 -1618
1191a618R02K469j683j830J352J442k032l9K353r73j590J230J182j721k72K532
$$ -1618 -716 1753 70 -1760 -408 1034 -998 -1037 1316 343 -1247 -17 1165 -556 -828 1704
1207A704O57k298L47K237j015k462K059K556k475j417K671O70l290L0K384k39
$$ 1704 2361 63 410 2647 1632 -830 1229 3785 1310 -107 2564 3234 -56 -26 2358 2119
1223B119k898J061K170j833l004K419J227k024q25K558L40k859p07K365n43j936
$$ 2119 -779 282 2452 619 -2385 34 1261 -763 -1588 970 1310 -1549 -2256 109 -434 -2370
1239b370J297K378j867j985J627Q76k220K6K390n48j618Q22Q37j487m94J630J255
$$ -2370 -1073 1305 -562 -2547 -920 -44 -2264 -2238 152 -396 -2014 -1192 -355 -1842 -2336 -706 549
1256E49k065P81J012r50j610J173K290j509l15K178J83k220l11K603q4j796J193
$$ 549 -1516 -735 277 -673 -2283 -1110 1180 -329 -644 1534 1717 -503 -814 1789 1705 -91 1102
1273A102K184j258k380J388J357j606j22K037Jk390j43J198j164p90J039J870
$$ 1102 3286 2028 -352 1036 2393 787 665 2702 2703 313 170 1368 204 -586 453 2323
1289B323j527j668J155K78k454N05K310j37j787L63J306j615j685J683J599j216
$$ 2323 796 -872 283 561 -1893 -1388 922 785 -1002 -639 667 -948 -2633 -950 649 -567
1305e67l79N82m09j982R58J295k13k84Q06J51j752m45J522l9j307J795K038k287
$$ -567 -946 -364 -773 -2755 -1797 -502 -715 -999 -193 -42 -1794 -2239 -717 -756 -2063 -268 1770 -517
1323e17j221J356R56j958N01K964N29k815J9J554n97j254J574K384j002j448M3
$$ -517 -1738 -382 574 -1384 -883 2081 2610 -205 -186 1368 771 -483 1091 3475 2473 1025 1068
1340A068N03r83n51J526R90r89J04j98j774l63J203K17j23M02O62j620j573N77
$$ 1068 1571 588 37 1563 2553 1564 1668 1470 -304 -667 536 753 630 1032 1694 74 -1499 -922
1358i22P92l25m38J748K9k493n77J035K46j098J057J190o01j621o3O75m00l76
$$ -922 -130 -455 -893 855 884 -1609 -2186 -1151 -905 -2003 -946 244 -357 -1978 -2041 -1366 -1766 -2142
1376b142K057K29j055N2J76p69n19J322J276l93m4O59m94j406K58J981N03o61
$$ -2142 -85 144 -911 -859 -683 -1452 -1971 -649 627 234 190 849 355 -1051 -793 1188 1691 1030
1394A030N15N25j294j418J123J085m23Q2J012k94j352j89K91K38k2N17K50q42
$$ 1030 1545 2070 776 -642 481 1566 1143 1225 2237 1943 591 402 693 931 909 1426 1676 834
1412H34q84k57J79m34Q51M12l33o10K08p88q00Q25Q73m46q4K81m23r82j98M10
$$ 834 -50 -307 -128 -562 289 701 368 -242 -34 -822 -1622 -797 76 -370 -454 -173 -596 -1578 -1776 -1366
1432a366J323n50J06O74o22j148k96J614J20m07K23P17p57j242Q00Q65k21k41
$$ -1366 -43 -593 -487 187 -435 -1583 -1879 -265 -145 -552 -329 388 -369 -1611 -811 54 -167 -408
1450d08Q25K48m24l12r6O8N22L30j3N9k49J48o92L39O54L33j92k33J8j23p42P9
$$ -408 417 665 241 -71 -167 -99 423 753 740 799 550 698 6 345 999 1332 1140 907 925 802 60 139
1472A39M93N47p64N33l46m35k75KP65L2m4k65k87k15J28k69n19R09O7n87k41j75
$$ 139 632 1179 415 948 602 167 -108 -106 659 691 647 382 95 -120 8 -261 -780 129 196 -391 -632 -807
1494h07r8l08J93M17K61n57l27L23P4o50J64M31L54n8k64J29J08L46l59M51P28
$$ -807 -905 -1213 -1020 -603 -342 -899 -1226 -903 -829 -1479 -1315 -884 -530 -588 -852 -723 -615 -269 -628 -177 551
1515E51l55o0j23J66j67Q9K27M04L42n23J45Q7k8o7M3J57K86k9l96n0L22m49p5
$$ 551 196 136 13 179 12 101 328 732 1074 551 696 783 755 688 731 888 1174 1145 749 699 1021 572 497
1538D97J55J20j30n60L8K94j74N5l5j08L02j186L86J28j54l55N87k09J25o65J12
$$ 497 652 772 642 82 120 414 240 295 260 152 454 -732 -346 -218 -372 -727 -140 -349 -224 -889 -777
1559g77R8j91N1k08M03m76J85l0K31J0k41J16N03j11o6q5J65J93Q8J08l8L16l22
$$ -777 -679 -870 -819 -1027 -624 -1100 -915 -945 -714 -704 -945 -829 -326 -437 -503 -588 -423 -230 -142 -34 -72 244 -78
1582g8L64K17J08l57p2O03L39o98K15l9J94n6N1J22L00o05l0M2J44n0k97K11k24
$$ -78 286 503 611 254 182 785 1124 426 641 602 796 740 791 913 1213 608 578 620 764 714 417 628 404
1605D04L44l32k60p7J14n8n02O48o31N0L1j55Rm01n9J58L18l98l01K86j11K10
$$ 404 748 416 156 79 193 135 -367 281 -350 -300 -269 -424 -415 -816 -875 -717 -399 -797 -1098 -812 -923 -713
1627g13l81J91P8r8k27O80j07j84J07J06K33K52l22K25K41J70m01M26K89L90n40
$$ -713 -1094 -903 -825 -923 -1150 -470 -577 -761 -654 -548 -315 -63 -385 -160 81 251 -150 276 565 955 415
1648D15r1L81K28k67j63M00k75J98k33J68J22k36j96N83k38j03j65n3K94m69j01
$$ 415 324 705 933 666 503 903 628 826 593 761 883 647 451 1034 796 693 528 475 769 300 199
1669A99k99J24K15k83K6K14m62P8l9L50m60l83Q3L44Q7j79k74J82J19j13m75J63
$$ 199 -100 24 239 -44 -18 196 -266 -188 -227 123 -337 -720 -637 -293 -206 -385 -659 -477 -358 -471 -946 -783
1691g83K41Mj02Q5J77j59k6j18L27k4M5J8L42J5L5J05P0J20j93n9M32j47k34J92
$$ -783 -542 -538 -640 -555 -378 -537 -563 -681 -354 -378 -333 -315 27 42 77 182 252 372 179 120 552 405 171 363
1715C63J90j69Mk73O49j32m12R4M01L68m61J2o8N62p02j1o0K00J59o56L02Q1m88
$$ 363 553 384 388 115 764 632 220 314 715 1083 622 634 566 1128 426 415 355 555 714 58 360 441 -47
1738d7K28j86p5j37l06o3L76J1k49n7L6k58L7r8J67j50oj8J87J20K14l81O52m91
$$ -47 181 -5 -80 -217 -523 -586 -210 -199 -448 -505 -469 -727 -690 -788 -621 -771 -777 -795 -608 -488 -274 -655 -3 -494
1762d94l5J49m0K26k1o1M77m9q0P8j99K19K6J16j88M83m17L14q0L81J3r2l10L36
$$ -494 -529 -380 -420 -194 -215 -276 201 152 72 150 -49 170 196 312 124 607 190 504 424 805 818 726 416 752
1786G52k70j36J24n4K46n6l26J38K01m98j43L85J94j89m40O6m9j71K18l73L34
$$ 752 482 346 470 416 662 606 280 418 619 121 -22 363 557 368 -72 -6 -55 -226 -8 -381 -47
1807d7n22K27k55K1jP6k77J57p3j90L89J09j71q8j99M24K25J94n97O89J1j22P4
$$ -47 -569 -342 -597 -576 -577 -501 -778 -621 -694 -884 -495 -386 -557 -645 -844 -420 -195 -1 -598 91 102 -20 54
1830E4m27N81j62j25n5L71l28K47Q1j34K21J93j93L80j83K48l87K01L10l53j33
$$ 54 -373 208 46 -79 -134 237 -91 156 237 103 324 517 324 704 521 769 382 583 893 540 407
1851D07PM32m16l34J81J31n7j57L0K55m06J47K03J21o99j44L70l24j55K2N7M3
$$ 407 414 846 430 96 277 408 351 194 224 479 73 220 423 544 -155 -299 71 -253 -408 -386 -329 -286
1873b86p4J5l17J90r1m2L96o45L99R7Ll1J25l3r7j3K87k09k03J71K37l16J59m9
$$ -286 -360 -345 -662 -472 -563 -605 -209 -854 -455 -358 -355 -386 -261 -294 -391 -404 -117 -326 -529 -358 -121 -437 -278 -327
1897c27N47j47l30N75J74n01K21J03j32o4K03N03l01p2K39K2m25K32k06K92k04
$$ -327 220 73 -257 318 492 -9 212 315 183 119 322 825 524 452 691 713 288 520 314 606 402
1918D02k47K61k37j57J76MJ06j83K26r0n81J2K36l73J01J65N09n84n23N72L3k43
$$ 402 155 416 179 22 198 202 308 125 351 261 -320 -308 -72 -445 -344 -179 330 -254 -777 -205 -172 -415
1940d15Q0K70m01L30j50J08j43j72R5L72k42n9j20J28k61L94J80k95M0J44o9l24
$$ -415 -335 -65 -466 -136 -286 -178 -321 -493 -398 -26 -268 -327 -447 -319 -580 -186 -6 -301 -261 -117 -186 -510
1962e10M32J51K24m36K61O55q49R0O89k53j32j64M03k53n04N77j47J71k63q1M66
$$ -510 -78 73 297 -139 122 777 -72 18 707 454 322 158 561 308 -196 381 234 405 142 61 527
1983E27J6l91L44j07m10K63J83O4o00L71j74n39J85K31qp53O64J49k25l69K58
$$ 527 543 152 496 389 -21 242 425 489 -111 260 86 -453 -268 -37 -45 -798 -134 15 -210 -579 -321
2004c21K19l42j86N82O6n79M8N10l06k42K62NL36n93O91n3j22n8J71l59j89M36
$$ -321 -102 -444 -630 -48 18 -561 -513 -3 -309 -551 -289 -284 52 -541 150 97 -25 -83 88 -271 -460 -24
2026b4L32m73M48L2l45L08j1J38K7j76M70j73k96k61P91M5o05J64k9M10m96k9
$$ -24 308 -165 283 315 -30 278 267 405 432 256 726 553 257 -4 787 832 227 391 362 772 276 247
2048B47j8M4j96K85K5k47l33L85k56J55j51l19J00l01J03K35m96R7M10k42j76
$$ 247 229 273 77 362 387 140 -193 192 -64 91 -60 -379 -279 -580 -477 -242 -738 -641 -231 -473 -649
2069f49L15l34K17p3L55k5j83J1M3L33l35k02M43M71m57K04j49rj21j42P43rJ52
$$ -649 -334 -668 -451 -524 -169 -194 -377 -366 -323 10 -325 -527 -84 387 -70 134 -15 -24 -145 -287 456 447 599
2092E99p5j84o6k2L43k69J91K08j79j83j27m1K79k56k61M30j26O4n33L49k79q
$$ 599 524 340 274 252 595 326 517 725 546 363 236 195 474 218 -43 387 261 325 -208 141 -138 -146
2114a46N10j84m32J32j81j43J16j02K56L39k70k58L8j9j52J40L36q0N48n83nl44
$$ -146 364 180 -252 -120 -301 -444 -328 -430 -174 165 -105 -363 -325 -344 -496 -356 -20 -100 448 -135 -140 -484
2136d84M21R3j24K27j33j55k32PJ04J02l5J77j41k73q4L56K53J2p1N00O5m24P6
$$ -484 -63 30 -94 133 0 -155 -387 -380 -276 -174 -209 -32 -173 -446 -530 -174 79 91 20 520 585 161 237
2159B37j62J5k6q5N70l45j94J28l41M63r8K65j78L35o0j67m36K36J26j33rk3J11
$$ 237 75 90 64 -21 549 204 10 138 -203 260 162 427 249 584 524 357 -79 157 283 150 141 118 229
2182B29l08l83K54K15j79R3N24l55k30k3K39j81P1K80m60K80j11k73j02n7M6P2
$$ 229 -79 -462 -208 7 -172 -79 445 90 -140 -163 76 -105 -34 246 -214 66 -45 -318 -420 -477 -431 -359
2204c59j0o1jj54J20j07L38J70Pl3L6K33m42n6L36J04l40N12k2J19m12o1J40R7
$$ -359 -369 -430 -431 -585 -465 -572 -234 -64 -57 -90 -54 179 -263 -319 17 121 -219 293 271 390 -22 -83 57 154
2228A54M23k3J52n57M12J49k19M22m01M0rR0p21Q8L29k04j04O3r4K63n21p8N47
$$ 154 577 554 706 149 561 710 491 913 512 552 543 633 -88 0 329 125 21 84 -10 253 -268 -346 201
2251B01j71j91k42M17l6k81n05O00J25n04K31K5J02l84k34M03J38k10K93k51J55
$$ 201 30 -161 -403 14 -22 -303 -808 -208 -83 -587 -356 -331 -229 -613 -847 -444 -306 -516 -223 -474 -319
2272c19K53K00k53oJ18K71J08m66M16j93R8K8Oq7q3j15M02O6k97p8K48K09l53
$$ -319 -66 134 -119 -125 -7 264 372 -94 322 129 227 255 261 174 91 -24 378 444 147 69 317 526 173
2295A73K14J3k79q2L44k02J7lJ39m10LM7L6MJ37l34j56K55K13j14m20K99J24N6
$$ 173 387 400 121 39 383 181 198 195 334 -76 -73 -26 10 14 151 -183 -339 -84 129 15 -405 -106 18 74
2319G4j12l90J10J81l00oM20n31R5J86J8j38j91N84J72qk98J76P6l53M16J18m31
$$ 74 -38 -428 -318 -137 -437 -443 -23 -554 -459 -273 -255 -393 -584 0 172 164 -134 42 118 -235 181 299 -132
2342a32L29l8k14Q2j24M44K7k51k61L39m61K24L49k10J63n3M10l44k17M56J03
$$ -132 197 159 -55 27 -97 347 374 123 -138 201 -260 -36 313 103 266 213 623 279 62 518 621
2363F21n38Q3J59k44j25J27Q2K21n34L14j55j48K49o5J25n25K89j12J1M8l33M10
$$ 621 83 166 325 81 -44 83 165 386 -148 166 11 -137 112 47 172 -353 -64 -176 -165 -117 -450 -40
2385d0l71j81L95m0k96K16q6L40k30j63L04N2k5j29M02l48o7M73l11r9N69q6m11
$$ -40 -411 -592 -197 -237 -533 -317 -403 -63 -293 -456 -152 -100 -125 -254 148 -200 -267 206 -105 -204 365 279 -132
2408a32K64J04N2J2l24J64J17J81l62R7l02N81l34N26n64J6Q4k01QJ57O1k42n2
$$ -132 132 236 288 300 -24 140 257 438 76 173 -129 452 118 644 80 96 180 -21 -13 144 205 -37 -89
2431h9j45K56j09J4j34K29R9M6j19m42R1K00P0J55j34J71k50n3j71M4K11j86K62
$$ -89 -234 22 -87 -73 -207 22 121 167 48 -394 -303 -103 -33 122 -12 159 -91 -144 -315 -271 -60 -246 16
2454A6L1p6m26L59K5j55J04K17k26m6K68J74j60l75N45l61j14k32M21J53k36j7
$$ 16 47 -29 -455 -96 -71 -226 -122 95 -131 -177 91 265 105 -270 275 -86 -200 -432 -11 142 -94 -111
2476a11L57j0k01J37o1o6K91j26k85M87n56N53K80k61j65O9L9k11J45k50K33j89
$$ -111 246 236 35 172 111 45 336 210 -75 412 -144 409 689 428 263 332 371 160 305 55 288 99
2498I9J81j15l09J18J04j4k81J24N5k52K23k03o5k45NJ72K0j27n3K22l38J39J90
$$ 99 280 165 -144 -26 78 64 -217 -93 -38 -290 -67 -270 -335 -580 -575 -403 -383 -510 -563 -341 -679 -540 -350
2521c50L18j1l84K04J49K1k72M07k78J87L05l82K84J55l15J9K7k8J26R7k42N2
$$ -350 -32 -43 -427 -223 -74 -53 -325 82 -196 -9 296 -86 198 353 38 57 84 56 182 279 37 89
2543H9l7K97K73n4l69j66j59n4J42L65m75J48K32n64M31j04k11P5K07M7J78J1
$$ 89 52 349 622 568 199 33 -126 -180 -38 327 -148 0 232 -332 99 -5 -216 -141 66 113 291 302
2565C02k22l16K13j89L1M1L3m7l67l3k52M48l9N52J4l03j35P9N7M84K1rj60K27
$$ 302 80 -236 -23 -212 -181 -140 -107 -154 -521 -554 -806 -358 -397 155 169 -134 -269 -190 -133 351 372 363 203 430
2589D30q27J87p0J78r6K01P7j57N5n90M54L92J45n70L87J29l01j97N33k97J19
$$ 430 -397 -210 -280 -102 -198 3 80 -77 -22 -612 -158 234 379 -191 196 325 24 -173 360 63 182
2610A82K58J44o85L17k67J91o01N88M17O7l67M8J63o80M13K09k63J07O2o55K28
$$ 182 440 584 -101 216 -51 140 -461 127 544 611 244 292 455 -225 188 397 134 241 303 -352 -124
2631a24n49L36J28J32R1l40J47J7j37K6K44L04k09J94m40J2K9n8L5O3K34l41j81
$$ -124 -673 -337 -209 -77 14 -326 -179 -162 -299 -273 -29 275 66 260 -180 -168 -139 -197 -162 -99 135 -206 -387
2654c87k98K73l1J81K51J54p2L0k08J4k83M63M17R4k20l06J72j77O5N3J13O3J99
$$ -387 -685 -412 -443 -262 -11 143 71 101 -107 -93 -376 87 504 598 378 72 244 67 132 185 298 361 560
2677E60m12k46K12oK37J54k60M37j69m07o9j43J08J59O6k77K71o12p2q6l7M53
$$ 560 148 -98 114 108 345 499 239 676 507 100 31 -112 -4 155 221 -56 215 -397 -469 -555 -592 -139
2699a39K16j48r2K12L9l89L82k08J81p8k04K81o05P8P5K69K75N7n49K28k37J82
$$ -139 77 -71 -163 49 88 -301 81 -127 54 -24 -228 53 -552 -474 -399 -130 145 202 -347 -119 -356 -174
2721a74K05L16n4K60M2k10j73m4L7l3N6J15l62n0j80K70K25j82m8J77j2J0l26
$$ -174 31 347 293 553 595 385 212 168 205 172 228 343 -19 -69 -249 21 246 64 16 193 181 191 -135
2744a35R8j51M29L23n17o6j93n39N00l2L19M2j33j35NJ69j94J31J95L74m61R4
$$ -135 -37 -188 241 564 47 -19 -212 -751 -251 -283 36 78 -55 -190 -185 -16 -210 -79 116 490 29 123
2766A23Q5n27M14J95k57K93m53o2n49L98j88M06J47k37n9J59n5J55k28N6M1P90
$$ 123 208 -319 95 290 33 326 -127 -189 -738 -340 -528 -122 25 -212 -271 -112 -167 -12 -240 -184 -143 647
2788F47m98J36n61J8M16j98j09L5L49m57J76j25L32k62K71K79k6k20L2j7Q9j5
$$ 647 149 285 -276 -258 158 -40 -149 -114 235 -222 -46 -171 161 -101 170 449 423 203 235 218 307 292
2810B92K81l13j20Jl97P15m65J03j22Q5R0K7k09q3O4J62k01l2M6j83O1r6p6j95
$$ 292 573 260 140 141 -256 459 -6 97 -25 60 150 177 -32 -115 -51 111 -90 -122 -76 -259 -198 -294 -370 -565
2834e65K04L85N8l97l2J86k6p3r5K23L10l69K96l12J64J65j76L6j74K05kK19p5
$$ -565 -361 24 82 -315 -347 -161 -187 -260 -355 -132 178 -191 105 -207 -43 122 -54 -18 -192 13 11 230 155
2857A55l30O4L23j93J24p2QN8L00k23l5j53J31M3n9K89l83M5k57L07j47K6j64
$$ 155 -175 -111 212 19 143 71 79 137 437 214 179 26 157 200 141 430 47 92 -165 142 -5 21 -143
2880a43kR7l3Q8M7l27M64l9q9j35n3K7J45q4l0N8L4l02J35j9n18L76J53k41K11
$$ -143 -145 -48 -81 7 54 -273 191 152 63 -72 -125 -98 47 -37 -67 -9 25 -277 -142 -161 -679 -303 -150 -391 -180
2905a80J88Q7l19j23M62n0n36P60K64k0k28m3j51J27j95J70N60n25k30J74l87
$$ -180 8 95 -224 -347 115 65 -471 289 553 533 305 262 111 238 43 213 773 248 18 192 -195
2926a95K69K01O4m06M14j74J47k14J65j51k69j62L45P4l00P3k57K75j19RL23k66
$$ -195 74 275 339 -67 347 173 320 106 271 120 -149 -311 34 108 -192 -119 -376 -101 -220 -211 112 -154
2948a54l80N20J25R5n75J10P27l74k60O6n6k50J43K51J12m21J31j50K53j23K78
$$ -154 -534 -14 111 206 -369 -259 468 94 -166 -100 -156 -406 -263 -12 100 -321 -190 -340 -87 -210 68
2969F8J33k23N8M25j94k17K53L69n61k97L30j02k89J70K46J62o60L46M27p64j59
$$ 68 201 -22 36 461 267 50 303 672 111 -186 144 42 -247 -77 169 331 -329 17 444 -320 -479
2990d79M44j43L07k8k6J88l99K96l8j07J40n0K6l15j21K37P0J22p1N22m67j86
$$ -479 -35 -178 129 101 75 263 -136 160 122 15 155 105 131 -184 -305 -68 2 124 53 575 108 -78
3012g8Q8K3L22l48L64m15R6k9pk98o5L82j27k29m23N80o5j29J50K12j31p2j21
$$ -78 10 33 355 7 371 -44 52 23 16 -282 -347 35 -92 -321 -744 -164 -229 -358 -208 4 -127 -199 -320
3035c20L79k85J67J73l90p2P2M50q2n99Q64j38l0j43K69K32k48n9NJ20n07J31
$$ -320 59 -226 -59 114 -276 -348 -276 174 92 -507 357 219 189 46 315 547 299 240 245 365 -142 -11
3057a1K26K11n77O90P8m18m84M39J06j14m09K79L31m66R9R5J14k01M21J5m03k66
$$ -11 215 426 -151 539 617 199 -285 154 260 146 -263 16 347 -119 -20 75 189 -12 409 424 21 -245
3079b45l1P8p89O48K52j90m2M8J31j97J24K63O6j67L70L79n89k87K86j32j71k7
$$ -245 -276 -198 -987 -339 -87 -277 -319 -271 -140 -337 -213 50 116 -51 319 698 109 -178 108 -24 -195 -222
3101b22L24l21j26J67P53o83j98L31L41k17k33M00j12k74L29L62p83K8L8K79n40
$$ -222 102 -219 -345 -178 575 -108 -306 25 366 149 -84 316 204 -70 259 621 -162 -134 -96 183 -357
3122c57M28K09Q8l59O7N06k26m79M17J36l21j64M55l13l45j86K25l5k9j42L07
$$ -357 71 280 368 9 76 582 356 -123 294 430 109 -55 400 87 -258 -444 -219 -254 -283 -425 -118
3143a18l60n6O2L54J22k02K90J44p0JL63o04L61L24Kj071K5L58P6j37L3L01l40
$$ -118 -478 -534 -472 -118 4 -198 92 236 166 167 530 -74 287 611 613 -458 -433 -75 1 -136 -103 198 -142
3166a42k47P67l87k2j83N31M12o37l16N09J86o32K64K17n12j30k0K83j75qK85
$$ -142 -389 378 -9 -31 -214 317 729 92 -224 285 471 -161 103 320 -192 -322 -342 -59 -234 -242 43
3187D3q0k2j75L07j14J12J12N1n72O18P9m64K75n29P38j08l69K06P2j53J48j46
$$ 43 -37 -59 -234 73 -41 71 183 234 -338 280 359 -105 170 -359 379 271 -98 108 180 27 175 29
3209B9M79m30K8K74n29o3L62K17m64r0L55j30p02K09N56m09j14K59r6n9j51L01
$$ 29 508 78 106 380 -149 -212 150 367 -97 -187 168 38 -664 -455 101 -308 -422 -163 -259 -318 -469 -168
3231a68M69j10o5M82n44j35J9N6J28o43O91q9J12k78k9k06L15J95n2j15qL58k00
$$ -168 301 191 126 608 64 -71 -52 4 132 -511 180 91 203 -75 -104 -310 5 200 148 33 25 383 183
3254A83k08N9L67l04k49J73K88j57k10L01m3k54q0M73l20O5o4K50k60j68K24J19
$$ 183 -25 34 401 97 -152 21 309 152 -58 243 200 -54 -134 339 19 84 20 270 10 -158 66 185
3276A85k15J3j1l09j85M31O3l5m79L60N5j70k14N65K45o27J2K88Q4p1o9L5k74
$$ 185 -30 -17 -28 -337 -522 -91 -28 -63 -542 -182 -127 -297 -511 54 299 -328 -316 -28 56 -15 -84 -49 -323
3299c23J73J77K59l29J6L18j93J20k66M54j8k93J99J1l77J44L04K63n44K58K09
$$ -323 -150 27 286 -43 -27 291 98 218 -48 406 388 95 294 305 -72 72 376 639 95 353 562
3320E62m01j39k2M8o0l30K35K25o10j62K96o0k8J62L38K27n75J10k53o9L74r8
$$ 562 161 22 0 48 -12 -342 -107 118 -492 -654 -358 -418 -446 -284 54 281 -294 -184 -437 -506 -132 -230
3342b30M23r3Q9M1j73k97JN83l85J11K83k43K2k32N30J83l22M69n90J75o03L39
$$ -230 193 100 189 230 57 -240 -239 344 -41 70 353 110 132 -100 430 613 291 760 170 345 -258 81
3364H1L35j46J92j86l97J03L52l85l92M86K63j15k11r0k26l28j1O13J78nj70l42
$$ 81 416 270 462 276 -121 -18 334 -51 -443 43 306 191 -20 -110 -336 -664 -675 -62 116 111 -59 -401
3386d01j21m2kJ90L01K41K99r9n89R4M6j53P65o2J01l87k65K15J5J52r7K16J28
$$ -401 -522 -564 -566 -376 -75 166 465 366 -223 -129 -83 -236 529 467 568 181 -84 131 146 298 201 417 545
3409E45q53k15K76m7K31L8J6M1j02l47j06L52j30N87k34K99k25k29k94j96J98
$$ 545 -308 -523 -247 -294 -63 -25 -9 32 -70 -417 -523 -171 -301 286 52 351 126 -103 -397 -593 -395
3430c95N32J82k86m9j64j74M82O4j54jK68k99K08l92k35L22j12P01R8l70n0k95
$$ -395 137 319 33 -16 -180 -354 128 192 38 37 305 6 214 -178 -413 -91 -203 498 596 226 176 -119
3452a19j49L34L00m5J29k39m04J66k22k09N87O7j05k67n7k23j18M0L21L4J56j05
$$ -119 -268 66 366 321 450 211 -193 -27 -249 -458 129 196 91 -176 -233 -456 -574 -534 -213 -179 -23 -128
3474a28l3l02q2L47M31J07r7o0R9o99M4M28J11J12L16l8k41n48M6K6J36K46K9
$$ -128 -161 -463 -545 -198 233 340 243 183 282 -417 -373 55 166 278 594 556 315 -233 -187 -161 -25 221 250
3497B50M7j15k91J09K45J2k5M6k9Pj80k68L1m6P07L0k90k44k87o6J58M18MP5k05
$$ 250 297 182 -109 0 245 257 232 278 249 256 76 -192 -161 -207 500 530 240 -4 -291 -357 -199 219 223 298 93
3522I3N4j93k84R4O5O3r7L64n10l4K45MJ66l92M72j8k68L6K12j68K17oqj16k61
$$ 93 147 -46 -330 -236 -171 -108 -205 159 -351 -385 -140 -136 30 -362 110 92 -176 -140 72 -96 121 115 107 -9 -270
3547b70K25K07n12K27N08m16L78m75M2J0K16l36L85M00l03q9o16L84k7J97O9n9
$$ -270 -45 162 -350 -123 385 -31 347 -128 -86 -76 140 -196 189 589 286 197 -419 -35 -62 135 204 145
3569A45K80O1k85k81l4M73m35P8j54K62l25P7K7k20M49j84O6K46m93l14N18l84
$$ 145 425 486 201 -80 -114 359 -76 2 -152 110 -215 -138 -111 -331 118 -66 0 246 -247 -561 -43 -427
3591d27j28L15K01l22J60K55J62R4k67M96l33N6l70P0K30M5k35K11r6P9l63K67
$$ -427 -555 -240 -39 -361 -201 54 216 310 43 539 206 262 -108 -38 192 237 2 213 117 196 -167 100
3613A00J25j70K90k46k20J10j44J63J36k25j32L14m33K84K28l00k2m1J34J74k00
$$ 100 225 55 345 99 -121 -11 -155 8 144 -81 -213 101 -332 -48 180 -120 -142 -183 -49 125 -75
3634g5p9J71q6J7O6J41m0r0k24R0k77K92J99l52J16J23o6Q4J4J8q3P3K25J76n67
$$ -75 -154 17 -69 -52 14 155 115 25 -199 -109 -386 -94 105 -247 -131 -8 -74 10 24 42 -41 32 257 433 -134
3659a34J53K50o8k21o6J60o04L64L06k53P8j15K72j60N2O4j61r0K9M6J50n1K1
$$ -134 19 269 201 -20 -86 74 -530 -166 140 -113 -35 -150 122 -38 14 78 -83 -173 -144 -98 52 1 22
3682B2P1j73K41J7k17k85K35L1j74L05J38j86j8K8J80kl7Q1j0m9R0j2m0J00m10
$$ 22 93 -80 161 178 -39 -324 -89 -58 -232 73 211 25 7 35 215 213 176 257 247 198 288 276 236 336 -74
3707g4L39l14K16N2k78N5l89O9K58j63J02K31k13J4k63L29R1l23l1J25j55J91
$$ -74 265 -49 167 219 -59 -4 -393 -324 -66 -229 -127 104 -109 -95 -358 -29 62 -261 -292 -167 -322 -131
3729a31K27j40%K0J99k52K9k45K88k93K24j47M15j57O4M3Rj6l08M69n5P2L4r3
$$ -131 96 -44 -44 -24 175 -77 -48 -293 -5 -298 -74 -221 194 37 101 144 153 137 -171 298 243 315 349 256
3753B56k46M14l56j32K62l12L62k05J16q1N9o2R6k45J49k74M12j68J0j39J60K17
$$ 256 10 424 68 -64 198 -114 248 43 159 78 137 75 171 -74 75 -199 213 45 55 -84 76 293
3775B93l29m2j05K15j41L8m3M4J89m32K86k85j1L65k74K29k79R3J9K71j39K25
$$ 293 -36 -78 -183 32 -109 -71 -114 -70 119 -313 -27 -312 -323 42 -232 -3 -282 -189 -170 101 -38 187
3797A87o0l22M51k47J91j99K06k02k19J45N3K97k92J17P1J29m22K39L3K01k25
$$ 187 127 -195 256 9 200 1 207 5 -214 -69 -16 281 -11 106 177 306 -116 123 156 357 132
3818A32r1N5L6k56N48j68l63N3N2J64J6j31q3L6K29o38M02m57J20L90k30j31J57
$$ 132 41 96 132 -124 424 256 -107 -54 -2 162 178 47 -36 0 229 -409 -7 -464 -344 46 -184 -315 -158
3841a58L32m44k67O57N7k55Q9O2n1j45l48P28P2m52L75j24k97n3O6q3K75R6M53
$$ -158 174 -270 -537 120 177 -78 11 73 22 -123 -471 257 329 -123 252 128 -169 -222 -156 -239 36 132 585
3864E85j78l27Q8K22l98K71j15L80n90J48r9j42K43K2k11J12K49m82k2J06J02
$$ 585 407 80 168 390 -8 263 148 528 -62 86 -13 -155 88 110 -101 11 260 -222 -244 -138 -36
3885c6P4R3l47J5N3k13O6K43L44m18K23j94k46k7R2M91m65N57K2j24l88J06J00
$$ -36 38 131 -216 -201 -148 -361 -295 -52 292 -126 97 -97 -343 -370 -278 213 -252 305 327 203 -185 -79 21
3908B1K20o9J26K50m19j71LJ60m08M50j11P6l27Q9M01l90n0K47L2r3k99M94l69
$$ 21 241 172 298 548 129 -42 -39 121 -287 163 52 128 -199 -110 291 -99 -149 98 130 37 -262 232 -137
3931a37L9j07M35r5j85K25j63k50n6K6L70l7K04k31j56j18l19P14k21M32m9l34
$$ -137 -98 -205 230 135 -50 175 12 -238 -294 -268 102 65 269 38 -118 -236 -555 159 -62 370 321 -13
3953a3J32P8K50n34O06k15j69L04l12k40K55m60K48L65J9l92N3l71J45K9J32J69
$$ -13 119 197 447 -87 519 304 135 439 127 -113 142 -318 -70 295 314 -78 -25 -396 -251 -222 -90 79
3975G9j33J90j73n21J20N58k47L1k8K55m59K1j29M03j05r3M87K5l09j93J26J17
$$ 79 -54 136 -37 -558 -438 120 -127 -96 -124 131 -328 -307 -436 -33 -138 -231 256 281 -28 -221 -95 22
3997B2K79k58Q8l9j48l11L47k68M58N99n73r0K34l19j1q9J70L65J87k67l14j69
$$ 22 301 43 131 92 -56 -367 -20 -288 170 769 196 106 340 21 10 -79 91 456 643 376 62 -107
4019a07J79l97L06L84k80l39N0K96k63j81J55J93j8J11l93k7k03L04P4J3L38k39
$$ -107 72 -325 -19 365 85 -254 -204 92 -171 -352 -197 -4 -22 89 -304 -331 -534 -230 -156 -143 195 -44
4041d4l2n6K78j71O0Q9K32n01N04k02Ql32k2N21M3q6P3l63j9R2R5n5J00j59m14
$$ -44 -76 -132 146 -25 35 124 356 -145 359 157 165 -167 -189 332 375 289 362 -1 -20 72 167 112 212 53 -361
4066c61N69k48j84L02J06J1j27k42M36l79l5L17k96K56l7K94m33r1J41K69k63
$$ -361 208 -40 -224 78 184 195 68 -174 262 -117 -152 165 -131 125 88 382 -51 -142 -1 268 5
4087Er3K33j58l87J80O0J78m7J82J7L7p5k56NK47k22J18k82J40R4L3L7o1j22J76
$$ 5 -88 145 -13 -400 -220 -160 18 -29 153 170 207 132 -124 -119 128 -94 24 -258 -118 -24 9 46 -15 -137 39
4112C9P3N1K23p75L70J66N3j99K80j07l11O06n03L55k11j91J43j80K67j77K19
$$ 39 112 163 386 -389 -19 147 200 1 281 174 -137 469 -34 321 110 -81 62 -118 149 -28 191
4133A91j83J87k9j4o4k76K2L26o43P59l08l04J81L63N6l60K88l77K24J14m72M70
$$ 191 8 195 166 152 88 -188 -166 160 -483 276 -32 -336 -155 208 264 -96 192 -185 39 153 -319 151
4155A51o3k95K13K32l54j5J74l95L12j39L29m52K00N0L43n08J17M5J76j74K3J22
$$ 151 88 -207 6 238 -116 -131 43 -352 -40 -179 150 -302 -102 -52 291 -217 -100 -55 121 -53 -30 92
4177I2k33Nk60K91L24k28J02j11k85M25J36n8m36J84M1%J00j36k88K04K60j43
$$ 92 -141 -136 -396 -105 219 -9 93 -18 -303 122 258 200 -236 -52 -11 -11 89 -47 -335 -131 129 -14
4199a4l74Q8O30j89J9J11n6j89k9N9J77m0k15J88K9J53n24K6L15j84l0J62J41
$$ -14 -388 -300 330 141 160 271 215 26 -3 56 233 193 -22 166 195 348 -176 -150 165 -19 -49 113 254
4222B54m27K09l73L96r8q1j55K95J9m14J60k58O15m45M24k47p7N08k81k33K74
$$ 254 -173 36 -337 59 -39 -120 -275 20 39 -375 -215 -473 142 -303 121 -126 -203 305 24 -209 65
4243F5J91m62M07K9k94N1k21O48n68K40j61M90l76k5n1j83L41j24K99k63k93P11
$$ 65 256 -206 201 230 -64 -13 -234 414 -154 86 -75 415 39 14 -37 -220 121 -3 296 33 -260 451
4265D51m34l34O70j71j1k24J00j08L14m79M97j94j94K14k15k77L5J02L57l19P1
$$ 451 17 -317 353 182 171 -53 47 -61 253 -226 271 77 -117 97 -118 -395 -360 -258 99 -220 -149
4286a49Q2r2L90l04J7L3j48l5M19j97k79L52k55K63k61L65m47M13k30J79k70k7
$$ -149 -67 -159 231 -73 -56 -23 -171 -206 213 16 -263 89 -166 97 -164 201 -246 167 -63 116 -154 -181
4308a81J91j60M10k46J42o3OJ39L0l69j26K57J37k67M1L10j5o6m3k4k64L51p5
$$ -181 10 -150 260 14 156 93 99 238 268 -101 -227 30 167 -100 -59 251 236 170 127 103 -161 190 115
4331A15K9k23j2K78L7Q8l38j17K65j91P7k01j69K9M04j36P7j41N0J75k67o9O2
$$ 115 144 -79 -91 187 224 312 -26 -143 122 -69 8 -193 -362 -333 71 -65 12 -129 -79 96 -171 -240 -178
4354a78P9k11M10Q6N2l18Kj14J57J73j7K68n03J52j67n3K20K4J72%n8J57l05K8
$$ -178 -99 -310 100 186 238 -80 -78 -192 -35 138 121 389 -114 38 -129 -182 38 62 234 234 176 333 28 56
4378E6J99r6k03LK88j53q5M03l30J53J7m71L22J55l31Q4l4K70p0k64K50p7nl2
$$ 56 255 159 -44 -41 247 94 9 412 82 235 252 -219 103 258 -73 11 -23 247 177 -87 163 86 81 49
4402D9qj83O14m68O2m33N19J7l62j00M42k80J60P5J5m09L19j3j24L40l33L81o06
$$ 49 41 -142 472 4 66 -367 152 169 -193 -293 149 -131 29 104 119 -290 29 16 -108 232 -101 280 -326
4425c26N61l09Q2j34j78J13M38o23M34J56j59j72N8J27L03m20J47rk30J47j37
$$ -326 235 -74 8 -126 -304 -191 247 -376 58 214 55 -117 -59 68 371 -49 98 89 -141 6 -131
4446a31K86k64O30k59j53M7M3K63k54l8j50j57O8J15j84jJ97j00J84k27K15n54
$$ -131 155 -109 521 262 109 156 199 462 208 170 20 -137 -69 46 -138 -139 58 -42 142 -85 130 -424
4468d24Q45l61L9L8J10j30l92L55o2k6j79K51q3P2k59L17l3q1j89K30J39l86K84
$$ -424 421 60 99 137 247 117 -275 80 18 -8 -187 64 -19 53 -206 111 78 -3 -192 38 177 -209 75
4491G5j71J48J2j66J08m30J41l3J80M7m6J29k08K53k50M76l27J53k87L03j25L18
$$ 75 -96 52 64 -102 6 -424 -283 -316 -136 -89 -135 -6 -214 39 -211 265 -62 91 -196 107 -18 300
4513C00k28j47K61p8k23J05k32M00q0J01J32m54M35l1j98j1J30k22J79q5N9k91
$$ 300 72 -75 186 108 -115 -10 -242 158 78 179 311 -143 292 261 63 52 182 -40 139 54 113 -178
4535a78K1J15J4l32K48k3J85J71l29p8M02k22j83mJ97k63K21M3k51J82J64n65
$$ -178 -157 -42 -28 -360 -112 -135 50 221 -108 -186 216 -6 -189 -193 4 -259 -38 5 -246 -64 100 -465
4557d65P45j54k60J09K72l86o5L69k68M0n1K26%O3rP2l11j6J97J7q6k2K24k59
$$ -465 280 126 -134 -25 247 -139 -204 165 -103 -63 -114 112 112 175 166 238 -73 -89 108 125 39 17 241 -18
4581a8j72J96J58R4k11p6Oo9M3j39J82j25K60M4l27L97o7l05N6K7o0O4K54p15
$$ -18 -190 6 164 258 47 -29 -23 -92 -49 -188 -6 -131 129 173 -154 243 176 -129 -73 -46 -106 -42 212 -503
4605e03M29m34L50J38k2J23m0J6k59J84l31M60j60k6L26j5m66N2k20O97j58o0
$$ -503 -74 -508 -158 -20 -42 81 41 57 -202 -18 -349 111 -49 -75 251 236 -230 -178 -398 299 141 81
4627H1K35k8R7n23L21P0m30N53l69J2L0k6J75j74M17k82j14l1R7k22M5M2J50l82
$$ 81 316 288 385 -138 183 253 -177 376 7 19 49 23 198 24 441 159 45 14 111 -111 -66 -24 126 -256
4651b56L36m48N23k94M0j4jL41p9l16o3K53j94O6K01J6l26J77j81O8J68O1k16
$$ -256 80 -368 155 -139 -99 -113 -114 227 148 -168 -231 22 -172 -106 95 111 -215 -38 -219 -151 17 78 -138
4674a38K15j55J73n7J4J15M3j0j71J36j04K22j98j02R4K47k35j99K50j18kJ19
$$ -138 77 -78 95 38 52 167 210 200 29 165 61 283 85 -17 77 324 89 -110 140 22 20 139
4696A39k18k8j8j03L2j3J3jJ30J60m6K6k83M47k91O2RJ83O0k79N1K7k63K60k52
$$ 139 -79 -107 -125 -228 -196 -209 -196 -197 -67 93 47 73 -210 237 -54 8 17 200 260 -19 32 59 -204 56 -196
4721a96N68M1p74N98j29j46p7K64k53J53K59l54j0L27m53J69k52N0J50Kl49M48
$$ -196 372 413 -361 237 108 -38 -115 149 -104 49 308 -46 -56 271 -182 -13 -265 -215 -65 -63 -412 36
4743C6j86J74j99r5K74j67K30n7J8n8J40k89K96j56m04M99j89mk7M1L73j28j0
$$ 36 -150 24 -175 -270 4 -163 67 10 28 -30 110 -179 117 -39 -443 56 -133 -137 -164 -123 250 122 112
4766A12l58K12O6m3L3K16R8k73L0j2K14q2l07J32j9l31M64k05j27K59J24p0O3
$$ 112 -246 -34 32 -11 22 238 336 63 93 81 295 213 -94 38 19 -312 152 -53 -180 79 203 133 196
4789A96l98K33j09JP2r2M30m96O6J90j38l45K71K48n1j81K84l22n6k4Q2L9k1L45
$$ 196 -202 31 -78 -77 -5 -97 333 -163 -97 93 -45 -390 -119 129 78 -103 181 -141 -197 -221 -139 -100 -121 224
4813B24o28M47m87N77k22r8M04m24L07j67l76O07j70K22n9L28n42Q2K08m19L52
$$ 224 -404 43 -444 133 -89 -187 217 -207 100 -67 -443 164 -6 216 157 485 -57 25 233 -186 166
4834A66j18Q4J27J12l1l17O2j23m5K84P8m76n0r6L09J43k12J09J60j52o6j01K39
$$ 166 48 132 259 371 340 23 85 -38 -83 201 279 -197 -247 -343 -34 109 -103 6 166 14 -52 -153 86
4857H6J9p7l07J69m8Q3R9n36K37J30J52r0J26j74J57l23L47K63m41K44l82K51
$$ 86 105 28 -279 -110 -158 -75 24 -512 -275 -145 7 -83 43 -131 26 -297 50 313 -128 116 -266 -15
4879a5k47K88P6l53K08O5j15L76k83k11L76o2K74m71J23k36nJ54J68n4N1k91M55
$$ -15 -262 26 102 -251 -43 22 -93 283 0 -211 165 103 377 -94 29 -207 -212 -58 110 56 107 -184 271
4902B71k72j45Mj62M72p3j15J86K2l34J14J80l4J07K59o20k1KM5K28j58R8l06
$$ 271 -1 -146 -142 -304 168 95 -20 166 188 -146 -32 148 114 221 480 -140 -161 -159 -114 114 -44 54 -252
4925b52M9J24j73L06K5j90J41M8o7pk70K42j06m5M9jO3K6J73m69L76K43k23q1
$$ -252 -203 -79 -252 54 79 -111 30 78 11 4 -266 -24 -130 -175 -126 -127 -64 -38 135 -334 42 285 62 -19
4949a9J15p3k05K11k44K07K05J39k46k32p5j63M06j82N17m26J04j65K36k14J87
$$ -19 96 23 -182 29 -215 -8 197 336 90 -142 -217 -380 26 -156 361 -65 39 -126 110 -104 83
4970H3P6j77L78m53M8K71J97m20jj90J16J51J78j00m32N9J82l63K87m5LK8L73
$$ 83 159 -18 360 -93 -45 226 423 3 2 -188 -72 79 257 157 -275 -216 -34 -397 -110 -155 -152 -124 249
4993B49n02L0J77L89k22l20L90O1l74K1J50l3k07MjJ93n8j5J03j87J18J06r3o1
$$ 249 -253 -223 -46 343 121 -199 191 252 -122 -101 49 16 -191 -187 -188 5 -53 -68 35 -152 -34 72 -21 -82
5017h2K89m8l68M17k71JK51k09J62m2K44k20j32K5M7J68k99K79k63N2K09j41l60
$$ -82 207 159 -209 208 -63 -62 189 -20 142 100 344 124 -8 17 64 232 -67 212 -51 1 210 69 -291
5040b91M61k87L08j56L1l8l05M95o7k43l83L97j82L19r3r4m5K26k38rO2r7M12
$$ -291 170 -117 191 35 66 28 -277 218 151 -92 -475 -78 -260 59 -34 -128 -173 53 -185 -194 -132 -229 183
5063A83j14Om10M58j82l8J49m30J65J80j43L79j64L9j38j74N89n61jR3N8K70k17
$$ 183 69 75 -335 123 -59 -97 52 -378 -213 -33 -176 203 39 78 -60 -234 355 -206 -207 -114 -56 214 -3
5086cj32J6k23O02j45N9L99m96K80j90j22j77J15J67k27M66j03n41K02k09N06
$$ -3 -135 -119 -342 260 115 174 573 77 357 167 45 -132 -17 150 -77 389 286 -255 -53 -262 244
5107B44l12J47J13l23J78k87L07j72J75l92K65p2K2j41j04K63L19m10N34l58O4
$$ 244 -68 79 192 -131 47 -240 67 -105 70 -322 -57 -129 -107 -248 -352 -89 230 -180 354 -4 60
5128F0n12K92M52k90J06k57J22K60j56kK6J9P2m20K22j2M3K07K77m66J91j70k3
$$ 60 -452 -160 292 2 108 -149 -27 233 77 75 101 120 192 -228 -6 -18 25 232 509 43 234 64 41
5151D1j25K42P7j27l70L74L51j99k26j91L19r6l5j21J94j40j26J9l2K37k01l01
$$ 41 -84 158 235 108 -262 112 463 264 38 -153 166 70 35 -86 108 -32 -158 -139 -171 66 -135 -436
5173d36N42r7k62K45l9k59J50L62k01o1J69j72K40j29J19j76Kj66K84k22k08K57
$$ -436 106 9 -253 -8 -47 -306 -156 206 5 -56 113 -59 181 52 171 -5 -3 -169 115 -107 -315 -58
5195e8K6K69k41K62l93M22j46n8K41q5o91L52R3j52o4K41j27K02j52K50l84L86
$$ -58 -32 237 -4 258 -135 287 141 83 324 239 -452 -100 -7 -159 -223 18 -109 93 -59 191 -193 193
5217A93%KJ26n43K04O9K42k16j3j25L05k67L85m76j52J97K51l79J75J4K36l66
$$ 193 193 195 321 -222 -18 51 293 77 64 -61 244 -23 362 -114 -266 -69 182 -197 -22 -8 228 -138
5239a38o3P4J12K02j01J25k67Pk9O2J57l40K74j20K66j98m6l8r0k22J96M16n21
$$ -138 -201 -127 -15 187 86 211 -56 -49 -78 -16 141 -199 75 -45 221 23 -23 -61 -151 -373 -177 239 -282
5262b82k5L40J31j32K53l53N06k49j07n9O1j77J44R3j61p3K90j79K52j74p0K94
$$ -282 -307 33 164 32 285 -68 438 189 82 23 84 -93 51 144 -17 -90 200 21 273 99 29 323
5284C23o54Q8K33j63K48lK09n34J2M25l22K56Q3k53J31K09j35l95R4J89K28m47
$$ 323 -331 -243 -10 -173 75 72 281 -253 -241 184 -138 118 201 -52 79 288 153 -242 -148 41 269 -178
5306a78O1J27M1k75L63j10K49j82j10J9o7J29l55K81j9M7M9P6k32J88j01k15L08
$$ -178 -117 10 51 -224 139 29 278 96 -14 5 -62 67 -288 -7 -26 21 70 146 -86 102 1 -214 94
5329I4j26J80oO9j63J90k22J41p2K2l72K29L53L5l94K76L1m20L77j44P4q9J20
$$ 94 -32 148 142 211 48 238 16 157 85 107 -265 -36 317 352 -42 234 265 -155 222 78 152 63 183
5352A83l02J31M25l4m34q3O7r2j42M62j88J29q7l35K49P4K69j88K65l64k87L17
$$ 183 -119 12 437 403 -31 -114 -47 -139 -281 181 -7 122 35 -300 -51 23 292 104 369 5 -282 35
5374C5M7l89M19m18L86M0j87J10N9l99M35o4n48K87K43j32L30l13O6jm4k58K35
$$ 35 82 -307 112 -306 80 120 -67 43 102 -297 138 74 -474 -187 56 -76 254 -59 7 6 -38 -296 -61
5397f1QK39M0m06O1L11k40q0P1J75l42M80k50k43L01j23K38J02k14J44L50k21
$$ -61 -53 186 226 -180 -119 192 -48 -128 -57 118 -224 256 6 -237 64 -59 179 281 67 211 561 340
5419C40k22j81k8K49q2kL02n19L02j24K66l33J35j07K01q9j05o9l19K16N2j3k17
$$ 340 118 -63 -91 158 76 74 376 -143 159 35 301 -32 103 -4 197 108 3 -66 -385 -169 -117 -130 -347
5442c47J25L23j41K05k99Q9r4n1J94j09L61j74j99l02L55o3N9J85l81M20k02L16
$$ -347 -222 101 -40 165 -134 -45 -139 -190 4 -105 256 82 -117 -419 -64 -127 -68 117 -264 156 -46 270
5464B70r2N0j80k78L71k41L21J44k0p8k28M6K6r6O15m78k54k40N78m20K37j01
$$ 270 178 228 48 -230 141 -100 221 365 345 267 39 85 111 15 630 152 -102 -342 236 -184 53 -48
5486d8j08J67r6K3r7L23n8j1J09j83J61j53N5J03l78K15j54K61k90r5K5L76k43
$$ -48 -156 11 -85 -62 -159 164 106 95 204 21 182 29 84 187 -191 24 -130 131 -159 -254 -229 147 -96
5509i6P7l18L67P3O1J1m25J31J50m7q9K47m2k60L08k40l49L20J39j01n4k6J13
$$ -96 -19 -337 30 103 164 175 -250 -119 31 -16 -105 142 100 -160 148 -92 -441 -121 18 -83 -137 -163 -50
5532e0J78J4J40j6k42J74j00k07PJ19j3r1r4M70j30L0J7j92J56p8p9j32j18Q5
$$ -50 128 142 282 266 24 198 98 -109 -102 17 4 -87 -181 289 159 189 206 14 170 92 13 -119 -237 -152
5556a52J22r5k8K36p9m8J20j07l3k16L30K66m00j41J66M7J49q9l67M15k84J77
$$ -152 -30 -125 -153 83 4 -44 76 -31 -64 -280 50 316 -84 -225 -59 -12 137 48 -319 96 -188 -11
5578a1J91m88K23P4Q1k00J05j81K01K0L0R1P2j92k7k3j5P9j91L73l81J16J35j76
$$ -11 180 -308 -85 -11 70 -130 -25 -206 -5 15 45 136 208 16 -11 -34 -49 30 -161 212 -169 -53 82 -94
5602i4j1j62K81k7j18K88J07j49Q5k05L41l80J48M5J47Mj26j76j80J51K16m5R4
$$ -94 -105 -267 14 -13 -131 157 264 115 200 -5 336 -44 104 149 296 300 174 -2 -182 -31 185 140 234
5625B34n3j26K3J87k75O5J2k9kj43j49j46N89j23o1q1J3j70L43r2Q1j97l01K87
$$ 234 181 55 78 265 -10 55 67 38 36 -107 -256 -402 187 64 3 -78 -65 -235 108 16 97 -100 -401 -114
5649a14j12k24M57K91n2o12L41l1j56K88k13K96n8J10R7j88k97N43m27O9L76j78
$$ -114 -226 -450 7 298 246 -366 -25 -56 -212 76 -137 159 101 211 308 120 -177 366 -61 8 384 206
5671B06j0Kj34r8J23k60k5K39m17J26R8M3L21j24m2J91j16P7j60j47K94k89J56
$$ 206 196 198 64 -34 89 -171 -196 43 -374 -248 -150 -107 214 90 48 239 123 200 40 -107 187 -102 54
5694E4o07L97J68%J07l45K21l81M50j48O7r4J7K2J38j91K70k28j36K00j69L22
$$ 54 -553 -156 12 12 119 -226 -5 -386 64 -84 -17 -111 -94 -72 66 -125 145 -83 -219 -19 -188 134
5716A34r7k06j21O10k53l26M87n1J12n06N98k45k83J87j03K86l49L4N0R1J63n29
$$ 134 37 -169 -290 320 67 -259 228 177 289 -217 381 136 -147 40 -63 223 -126 -92 -42 49 212 -317
5738c17M47J08K48m28J62R1O2j2m14J30j90J61J61M7l50j31K69mk01q9J50j72
$$ -317 130 238 486 58 220 311 373 361 -53 77 -113 48 209 256 -94 -225 44 40 -161 -250 -100 -272
5760b72K56L38p79K99M51m51k15Q8j24O02J73m75K00m8l0K69o98J37l6M36k60
$$ -272 -16 322 -457 -158 293 -158 -373 -285 -409 193 366 -109 91 43 13 282 -416 -279 -315 121 -139
5781a39K32j85K48r6k6K5J35j81q2J07j26R4P4P2l30N36l35L35j12K5m0l65M39
$$ -139 93 -92 156 60 34 59 194 13 -69 38 -88 6 80 152 -178 358 23 358 246 271 231 -134 305
5804C05r6N9k11R6J2r4L0k03K5L4M7k32K05J85M1Q8p0k55L9k16K28k27P4K2P1
$$ 305 209 268 57 153 165 71 101 -102 -77 -43 4 -228 -23 162 203 291 221 -34 5 -211 17 -210 -136 -114 -43
$$ [...]
8191g5
##END NTUPLES=NMR FID
##END=
