##TITLE=1H ikalashn
AM_NV 16823
19.9.2024
##JCAMPDX= 6.0         $$ Bruker NMR JCAMP-DX V2.0
##DATA TYPE= NMR FID
##DATA CLASS= NTUPLES
##ORIGIN= UXNMR, Bruker Analytische Messtechnik GmbH
##OWNER= root
$$ TOPSPIN		Version 1.3
$$ 2024-09-19 13:39:34.765 +0400  Irina@DPX200
$$ Compression mode = diff/dup
##.OBSERVE FREQUENCY= 200.131392401
##.OBSERVE NUCLEUS= ^1H
##.DELAY= (6, 6)
##.ACQUISITION MODE= SIMULTANEOUS
##.ACQUISITION SCHEME= undefined
##.AVERAGES= 16
##.DIGITISER RES= 18
##SPECTROMETER/DATA SYSTEM= spect
##.PULSE SEQUENCE= zg
##.SOLVENT NAME= CDCl3
##.SHIFT REFERENCE= INTERNAL, CDCl3, 1, 17.95386
##AUDIT TRAIL= $$ (NUMBER, WHEN, WHO, WHERE, WHAT)
$$ ##TITLE= Audit trail, TOPSPIN		Version 1.3
$$ ##JCAMPDX= 5.01
$$ ##ORIGIN= Bruker BioSpin GmbH
$$ ##OWNER= Irina
$$ $$ F:/spectra/data/iren/nmr/1H/4/audita.txt
$$ ##AUDIT TRAIL=  $$ (NUMBER, WHEN, WHO, WHERE, VERSION, WHAT)
(   1,<2024-09-19 13:37:48.453 +0400>,<Irina>,<DPX200>,<TOPSPIN 1.3>,
      <created by zg
	started at 2024-09-19 13:36:40.515 +0400,
	POWCHK disabled, PULCHK disabled
       configuration hash MD5:
       BE 6D 3F 07 2A EA 11 49 91 17 2B D3 AF B3 58 0D
       data hash MD5: 16K
       9A 9E 84 3A FD 85 A3 0E 67 9C 8C 7C 45 59 B0 58>)
$$ ##END=
$$ 
$$ $$ hash MD5
$$ $$ A8 8D B8 BA 29 7C 48 1E 99 A3 78 66 0D CE E3 2F
##$RELAX= 
##$RELAX= 
##$RELAX= 
##$RELAX= 
##$RELAX= 
##$RELAX= 
##$RELAX= 
##$RELAX= 
##$RELAX= 
$$ Bruker specific parameters
$$ --------------------------
##$DU= <F:/spectra>
##$EXPNO= 4
##$NAME= <1H>
##$PROCNO= 1
##$TYPE= <nmr>
##$USER= <iren>
##$AMP= (0..31)
100 100 100 100 100 100 100 100 100 100 100 100 100 100 100 100 100 100 
100 100 100 100 100 100 100 100 100 100 100 100 100 100 
##$ANAVPT= -1
##$AQSEQ= 0
##$AQ_mod= 1
##$AUNM= <au_zg>
##$AUTOPOS= <>
##$BF1= 200.13
##$BF2= 200.13
##$BF3= 200.13
##$BF4= 200.13
##$BF5= 200.13
##$BF6= 200.13
##$BF7= 200.13
##$BF8= 200.13
##$BYTORDA= 1
##$CFDGTYP= 0
##$CFRGTYP= 5
##$CHEMSTR= <none>
##$CNST= (0..63)
1 1 145 1 1 1 1 1 1 1 1 1 1 1 1 1 1 1 1 1 1 1 1 1 1 1 1 1 1 1 1 1 1 1 
1 1 1 1 1 1 1 1 1 1 1 1 1 1 1 1 1 1 1 1 1 1 1 1 1 1 1 1 1 1 
##$CPDPRG= <>
##$CPDPRG1= <>
##$CPDPRG2= <>
##$CPDPRG3= <>
##$CPDPRG4= <mlev>
##$CPDPRG5= <mlev>
##$CPDPRG6= <mlev>
##$CPDPRG7= <mlev>
##$CPDPRG8= <mlev>
##$CPDPRGB= <>
##$CPDPRGT= <>
##$D= (0..63)
0 2 0 0 0 0 0 0 0 0.06 0 0.03 0 0 0 0 0.0002 0 0 0 0 0 0 0 0 0 0 0 0 0 
0 0 0 0 0 0 0 0 0 0 0 0 0 0 0 0 0 0 0 0 0 0 0 0 0 0 0 0 0 0 0 0 0 0 
##$DATE= 1726738665
##$DBL= (0..7)
120 120 120 120 120 120 120 120 
##$DBP= (0..7)
150 150 150 150 150 150 150 150 
##$DBP07= 0
##$DBPNAM0= <>
##$DBPNAM1= <>
##$DBPNAM2= <>
##$DBPNAM3= <>
##$DBPNAM4= <>
##$DBPNAM5= <>
##$DBPNAM6= <>
##$DBPNAM7= <>
##$DBPOAL= (0..7)
0.5 0.5 0.5 0.5 0.5 0.5 0.5 0.5 
##$DBPOFFS= (0..7)
0 0 0 0 0 0 0 0 
##$DE= 6
##$DECBNUC= <off>
##$DECIM= 32
##$DECNUC= <off>
##$DECSTAT= 4
##$DIGMOD= 1
##$DIGTYP= 9
##$DL= (0..7)
0 120 120 120 120 120 120 120 
##$DP= (0..7)
150 150 150 150 150 150 150 150 
##$DP07= 0
##$DPNAME0= <>
$$ [...]
##$SW= 21.9925939549014
##$SWIBOX= (0..15)
0 0 2 0 0 0 0 0 0 0 0 0 0 0 0 0 
##$SW_h= 4401.40845070422
##$TD= 16384
##$TD0= 1
##$TE= 300
##$TE2= 300
##$TE3= 300
##$TEG= 300
##$TL= (0..7)
0 120 120 120 120 120 120 120 
##$TP= (0..7)
150 150 150 150 150 150 150 150 
##$TP07= 0
##$TPNAME0= <>
##$TPNAME1= <>
##$TPNAME2= <>
##$TPNAME3= <>
##$TPNAME4= <>
##$TPNAME5= <>
##$TPNAME6= <>
##$TPNAME7= <>
##$TPOAL= (0..7)
0.5 0.5 0.5 0.5 0.5 0.5 0.5 0.5 
##$TPOFFS= (0..7)
0 0 0 0 0 0 0 0 
##$TUNHIN= 0
##$TUNHOUT= 0
##$TUNXOUT= 0
##$USERA1= <user>
##$USERA2= <user>
##$USERA3= <user>
##$USERA4= <user>
##$USERA5= <user>
##$V9= 5
##$VALIST= <valist>
##$VCLIST= <CCCCCCCCCCCCCCC>
##$VD= 0
##$VDLIST= <DDDDDDDDDDDDDDD>
##$VPLIST= <PPPPPPPPPPPPPPP>
##$VTLIST= <TTTTTTTTTTTTTTT>
##$WBST= 1024
##$WBSW= 25
##$XGAIN= (0..3)
0 0 0 0 
##$XL= 0
##$YL= 0
##$YMAX_a= 334143
##$YMIN_a= -354902
##$ZGOPTNS= <>
##$ZL1= 120
##$ZL2= 120
##$ZL3= 120
##$ZL4= 120
##$ABSF1= 10
##$ABSF2= 0
##$ABSG= 5
##$ABSL= 3
##$ALPHA= 0
##$AQORDER= 0
##$ASSFAC= 0
##$ASSFACI= 0
##$ASSFACX= 0
##$ASSWID= 0
##$AUNMP= <proc_1d>
##$AXLEFT= 0
##$AXRIGHT= 0
##$AXTYPE= 0
##$AXUNIT= <>
##$AZFE= 0.1
##$AZFW= 0.1
##$BCFW= 1
##$BC_mod= 2
##$BYTORDP= 1
##$COROFFS= 0
##$CY= 7568.61572265625
##$DATMOD= 1
##$DC= 2
##$DFILT= <>
##$DTYPP= 0
##$F1P= 17.9538593292236
##$F2P= -4.03888763876832
##$FCOR= 0.5
##$FTSIZE= 32768
##$FT_mod= 4
##$GAMMA= 1
##$GB= 1
##$INTBC= 1
##$INTSCL= 1
##$ISEN= 128
##$LB= 0.02
##$LEV0= 0
##$LPBIN= 0
##$MAXI= 945.577
##$MC2= 0
##$MEAN= 0
##$ME_mod= 0
##$MI= -402.1523
##$NCOEF= 0
##$NC_proc= 0
##$NLEV= 6
##$NOISF1= 8.587773
##$NOISF2= 6.764455
##$NSP= 1
##$NTH_PI= 0
##$NZP= 0
##$OFFSET= 17.95386
##$PC= 1
##$PHC0= 304.8422
##$PHC1= 5.478228
##$PH_mod= 0
##$PKNL= yes
##$PPARMOD= 0
##$PPDIAG= 0
##$PPIPTYP= 0
##$PPMPNUM= 100
##$PPRESOL= 1
##$PSCAL= 0
##$PSIGN= 0
##$REVERSE= no
##$SF= 200.13
##$SI= 32768
##$SIGF1= 18.5376
##$SIGF2= -6.396296
##$SINO= 400
##$SIOLD= 32768
##$SREGLST= <1H.CDCl3>
##$SSB= 3
##$STSI= 0
##$STSR= 0
##$SW_p= 4401.40845070423
##$SYMM= 0
##$S_DEV= 0
##$TDeff= 0
##$TDoff= 0
##$TI= <>
##$TILT= no
##$TM1= 0
##$TM2= 0
##$TOPLEV= 0
##$USERP1= <user>
##$USERP2= <user>
##$USERP3= <user>
##$USERP4= <user>
##$USERP5= <user>
##$WDW= 1
##$XDIM= 8192
##$YMAX_p= 0
##$YMIN_p= 0
$$ End of Bruker specific parameters
$$ ---------------------------------
##NTUPLES= NMR FID
##VAR_NAME=  TIME,          FID/REAL,        FID/IMAG
##SYMBOL=    X,             R,               I
##VAR_TYPE=  INDEPENDENT,   DEPENDENT,       DEPENDENT
##VAR_FORM=  AFFN,          ASDF,            ASDF
##VAR_DIM=   8192,          8192,            8192
##UNITS=     SECONDS,       ARBITRARY UNITS, ARBITRARY UNITS
##FACTOR=    0.0002272,     1,               1
##FIRST=     0,             0,               0
##LAST=      1.8609952,     -4,              21
##MIN=       0,             -354902,         -354902
##MAX=       1.8609952,     334143,          334143
$$ Real data points
##PAGE= N=1
##DATA TABLE= (X++(R..R)), XYDATA
0@%%%%%%%%%%%%%%j6L2l2L2l3L4m9O5p8R4j05J21j46J71j88K12k45K87l35L75
34A96m24M86n44O10o83P59q45R41j047J161j286J419j566J728j906K101k314K551
52A337k812L099l420L784m192M658n197N824o568P471q591J0018j1912J4570j8599
67a0530K5513m0653J35411o0122m9523K87081m8568j99085O7809K26810j04876
78B29267k19927J8453J20330q3037r3835O5630O9467p4245p0786j5515j7830q014
90h0042M2874M819k0331L9878L1688r1091o1393R6741Q0493o4118j3772J09168
102G4914J0243j31957k5015J05470J4847o7056L5562O9286n8200q3700K8680L0396
114C470m1661J6071Q2319j2921p5114K3383M9264n9606l5881J06955O7454q6234
$$ y = [0, 0, 0, 0, 0, 0, 0, 0, 0, 0, 0, 0, 0, 0, 0, -16, 16, -16, 16, -17, 17, -32, 33, -45, 49, -56, 65, -81, 90, -98, 114, -131, 156, -179, 196, -228, 258, -286, 324, -359, 400, -445, 496, -551, 610, -676, 743, -823, 905, -1001, 1100, -1214, 1337, -1475, 1624, -1796, 1988, -2204, 2454, -2743, 3081, -3487, 3984, -4607, 5411, -6501, 8069, -10530, 14983, -25670, 109741, 49619, 96, 287177, 238609, 39524, 107333, 334143, 229267, 9340, 27793, 148123, 65086, -28749, 36881, 106348, 32103, -38683, -54198, -72028, -80042, -37168, -32349, -52680, -12802, 18886, -72205, -133598, -36857, 43636, -20482, -34254, 74914, 85157, -46800, -71815, 33655, 48502, -18554, 17008, 86294, 28094, -55606, -26926, 3470, -38191, -22120, 60199, 47278, -27836, -4453, 44811, -14795, -50676, 56279, 123733, 37499]
126C7499m7196P4207j71j10276o502J09153R596r4511j4782M6780l9862p4957
138a11022K0478N8673n093k2326Q101q570k4277J0075J5853p909K6606N5714j5587
151G16o2812J5696N7655k8704m8731O2967P6782n5176p8207M3513N3979n8768
163b1090m4261P7487N6919o4931n0855M6987K5138m8103q845O0334K5515l1138
175B3157j0837J7645j131q740J2278J5462O236Q765m020l0023j5931J6909L1k7840
189A961K644K7656k1232n3972k772K7761j6558k6305K7991K9212k7015k3972K5663
202b8938J6577j6444J0559M0171N978j8561J3274K0096j7688j0122L3619J7125
214F5646k7318n408K7437j1953m2729O578L4893j4936l3576J5172J9088l3654
$$ y = [37499, -9697, 64510, 64339, -45937, -52439, 56714, 66310, -28201, -42983, 3797, -36065, -111022, -90544, -31871, -36964, -59290, -51189, -59759, -84036, -73961, -58108, -66017, -39411, 16303, 716, -62096, -46400, 11255, -17449, -66180, -3213, 73569, 18393, -59814, -16301, 37678, -21090, -65351, 12136, 69055, 4124, -46731, 256, 25394, -22709, -31554, 28780, 54295, 23157, 12320, 29965, 28834, 20094, 32372, 47834, 54070, 62835, 58815, 28792, 12861, 29770, 29801, 1961, 4605, 32261, 11029, -42943, -45715, -17954, -34512, -60817, -32826, -3614, -30629, -54601, -28938, -12361, -28805, -18246, 21925, 27903, 9342, 22616, 42712, 25024, 14902, 48521, 65646, 38328, 32920, 60357, 48404, 5675, 12253, 47146, 32210, -1366, 13806, 32894, -760]
226g60l0568K2038J7751k4094j1981K1865J931k7407n347J8204r91j1671R372
239b1658J1725j0057p499Q333n93q683R062J3997o231p164J0230L412j3142P77
253a7491J8756M747r946M067J2318m615r368Q383J1420l690l157P626Q64r164
267A0750r17M220n246m109O396j30j1309k196N666p167j0350P514R818q490q834
282a4384Q531N197j1451m389J4265N894j1431k241J1689k81j2139J301J1046k202
296e95q198M000O435n358o187M009M435k354J55N871K093l543K94M879J715o42
312G009L995M813k000l439K146K235l339k525K350P44m607m396J61J69m561m361
328e606J870K971l438m559K008K556l818l207M473M544k807l928K227L025k549
$$ y = [-760, -31328, -9290, 8461, -15633, -27614, -5749, -3818, -31225, -36572, -18368, -19359, -31030, -21658, -9933, -19990, -27489, -19156, -19749, -28432, -19370, -5373, -11604, -18768, -8538, -5126, -18268, -17491, 1265, 6012, -3934, 133, 12451, 7836, -1532, 6851, 18271, 14581, 11424, 19050, 19914, 10750, 9833, 14053, 8807, 4698, 11094, 10964, -345, -2541, 3125, -4042, -14392, -6878, 2940, -5550, -14384, -5853, -656, -12107, -16496, -2231, 3663, -7768, -10009, 1680, 1399, -10740, -9439, 1607, -595, -8793, -4793, 1642, -3716, -9903, -5894, -1459, -3813, -3658, 2213, 4306, 763, 1057, 5936, 7651, 7009, 11004, 15817, 13817, 10378, 12524, 14759, 11420, 8895, 11245, 11989, 7382, 2986, 3147, 3316, -1245, -5606, -3736, -765, -4203, -8762, -6754, -4198, -8016, -11223, -6750, -2206, -5013, -8941, -6714, -3689, -6238]
343f238k876L488M192k657l585K958L328k275j506L600K886j365k36K928J746
358D388j102j66K498J853l68L88J726k94j814R05K067j463j818J022j46m134k529
375A013J316o68m722k966J056l04m524k100L031R13l917m97N523K522k606J032
391e898N491J904k260J104M859J107l581j288K782K09m007k073K215n11l958o84
407d589K972L64k116O81L178J149k52J696K860K83j270J453K130j298j734J354
423F861k10m152j564K513q50m737m08K583k217m351J356M017j902m266K180M269
439h78k526l776L973M810k893k633N233L737l605j581M846K451k567r4L218m68
455G247l959j156J691n00k431JK85k759k297J200P84m50J742K708k20q38J839
$$ y = [-6238, -9114, -5626, -1434, -4091, -7676, -4718, -1390, -3665, -5171, -1571, 1315, -50, -286, 2642, 4388, 3286, 3120, 5618, 7471, 7103, 7491, 9217, 8923, 7109, 8014, 10081, 8618, 6800, 7822, 7676, 3542, 1013, 2329, 1661, -3061, -6027, -4971, -5275, -9799, -11899, -8868, -7955, -11872, -12369, -6846, -4324, -6930, -5898, -407, 1497, -763, 341, 5200, 6307, 2726, 1438, 4220, 4429, 422, -1651, 564, 53, -3905, -4589, -1617, -1253, -3369, -2688, 490, 1639, 1387, 3083, 5943, 6226, 4956, 6409, 8539, 7241, 5507, 6861, 6651, 2499, 935, 3448, 2598, -2139, -2547, 36, -2181, -6532, -5176, -1159, -3061, -7327, -5147, -878, -3404, -7180, -3207, 1603, -1290, -3923, 1310, 5047, 1442, -139, 4707, 7158, 4591, 4497, 7715, 7247, 3288, 2132, 3823, 3323, 892, 893, 1178, -1581, -3878, -2678, -1894, -2344, -602, 2106, 1886, 1048, 2887]
472B887J131p69O53K197M6k282j844j799l201k450p84n32j340j126j389l032j718
489a5352K116K445N35K535M461m44l447K416N555j97j265N291L482n472n038L379
505A000J704n218q32O765Q23q220l066M759j207n597L635Q452j814p084J324L681
521h95l738j756P460N642k886k106K251n29l196K364N396R31j309P13j755o070
537E17j667M188J06k560L581L218o767o825M887N971k133J248J0109L454q278
552I049l570P015L492l826J931P552j921j0613n040J152k372m153J077J606l418
567b039n454l957l359r8M040K943O48K690K122m143m190M578P538J279O9N083
583G750J247p852m988M805L063k588J867M253n310r273K33J798m980l18R546R93
$$ y = [2887, 4018, 3249, 3902, 6099, 6145, 3863, 2019, 220, -2981, -5431, -6215, -6747, -8087, -9213, -10602, -13634, -15352, -13236, -10791, -10256, -7721, -3260, -3704, -7151, -4735, 820, 623, -642, 4649, 8131, 2659, -2379, 1000, 2704, -2514, -3346, 3419, 4242, -3978, -7044, -2285, -3492, -9089, -5454, 2998, 1184, -5900, -4576, -895, -4633, -6389, 1071, 6713, 3827, 1721, 3972, 3443, 247, 2611, 8007, 8938, 7629, 8342, 6587, 517, -1150, 3038, 3144, 584, 4165, 7383, 616, -6209, -1322, 4649, 2516, 3764, 13873, 17327, 9049, 5479, 12494, 15986, 12160, 14091, 21643, 19722, 9109, 4069, 5221, 2849, -1304, -227, 1379, -2039, -7493, -11450, -14809, -14907, -10867, -7924, -7276, -4586, -2464, -6607, -10797, -6219, 1319, 2598, 2667, 7750, 8997, 1145, -3843, 962, 4025, 1437, 3304, 7557, 2247, -7026, -6793, -4995, -9975, -10293, -747, 246]
599B46j1610k822Q024k564j0117P689J7447k863j4696M696J2877q480j2924J3053
613b044J8122r044j6084O463R082j2842j2458J0664J2532p775j1988K881N415
626g076n558p205N039J1183M232n024l795N316O373l967m928J0998J4670n763
640A4495j4296N201J2263r055j3333J1929J6186j0787j6489P365J0201j1835j0130
653h285J3377J1470r537p502Q228K736q929L04J0273J890l501L411J326p923k312
668E026O624k01o160L622N812q979j1727L190N006p766m968P888K651j0021m604
683a4607N053m14l906M952O134k316l2N676k735o514P705J0809n488n989J1492
698I820O347j6231r043J5844P169j6571n081J7591J210k2130n063J7534J659j5989
$$ y = [246, -11364, -14186, -6162, -8726, -18843, -11154, 6293, 3430, -11266, -6570, 6307, -2173, -15097, -2044, 16078, 7034, -9050, -2587, 6495, -6347, -18805, -8141, 4391, -3384, -15372, -12491, -7076, -12634, -19839, -14800, -3617, 615, -4409, -8204, -2888, 3485, -482, -5410, 5588, 20258, 14495, 199, 5400, 17663, 8608, -4725, 7204, 23390, 12603, -3886, 3479, 13680, 1845, -8285, 5092, 16562, 7025, -477, 7751, 10487, 1558, 1862, 12135, 14025, 10524, 13935, 15261, 7338, 5026, 11650, 11449, 5289, 8911, 14723, 5744, -5983, -2793, 2213, -5553, -10521, -2633, 18, -10003, -14607, -9554, -9968, -13874, -8922, -2788, -5104, -5136, 540, -2195, -8709, -1004, 9805, 4317, -1672, 9820, 16167, -64, -9107, 6737, 13906, -2665, -7746, 9845, 11055, -11075, -16138, 1396, 3055, -12934]
712a2934J679J5753k270j4620J44R706l23m747L576N776l55l297l571k437K940
727d980M598k507m005N245L487j1000q872R438Q155q846m116J2969L827j4711
741a1318m096J3865M071q707M407J3669k435j1121L226P922l952k431J0092M699
755A7891r084l339N128l790q239O398R723o074q243N077J276j2179l298J1991
769C238M058q619k74P017n148j0387L574R597j184k637N881J284r071l610N646
784f35J193k070N762M634p055p024K902J031m670L371R851o01q053j89L294m149
800b408k762Q852P010l885l171K744k779p353K318Q122m20l488K731j119j0030
815e638m058O485K027l776K936N090o789r647K522N594k596m99Q253K416r402
$$ y = [-12934, -11255, 4498, 2228, -12392, -12248, -2542, -2865, -7612, -4036, 1740, 1385, -1912, -5483, -7920, -4980, -382, -2889, -6894, -1649, 1838, -9162, -18034, -8596, -441, -9287, -13403, -434, 3393, -11318, -15414, -1549, 2522, -6185, -1778, 11891, 9456, -1665, 1561, 9483, 5531, 3100, 13192, 17891, 8807, 5468, 10596, 6806, -1433, 4965, 14688, 8614, 371, 5448, 6724, -5455, -8753, 3238, 7296, -1323, -1597, 5420, 272, -10115, -6541, 3056, 1872, -765, 5116, 6400, -2671, -6281, -635, 558, -1512, 4250, 8884, 1829, -5195, -2293, -1262, -5932, -2561, 7290, 6689, -1364, -1553, 1741, -2408, -5170, 3682, 10692, 6807, 3636, 6380, 3601, -3752, -1434, 6688, 6268, 2780, 5511, 4392, -5638, -9696, -3211, -1184, -4960, -2024, 3066, -3723, -13370, -10848, -5254, -7850, -8349, -96, 2320, -7082]
830g082m162N199M55l400N699R072k938o562J820J993m316R94R617L848m766j337
846D134K121m262m781N010P019j151k868J476j712p249j616N645K609j689J565
861D251J229n744n268J617K507m87J852L405k301n949j689R50p90R73M767K279
877A602l323k906P9o01q26L693N215J75j921j61j264l083R47M824J864q82R84
894D416J49m134k604L177L368j31R35K531j455n123j263K875O36j018K046J490
910E895m000m951j66R10j357N30K837r2l531j912L39j86J1K482K931k31j831m30
928b752K2q19M62K723K074m42j012l91p47q53P17K234J627K34p93p86n60m73K08
947F73J515J776Q2j184p34l79p20k22J066J433K9j056o89l68j186p32Q73R60p22
$$ y = [-7082, -11244, -6045, -5590, -8990, -3291, 5781, 2843, -3719, -1899, 94, -4222, -3228, 6389, 10237, 5471, 4134, 6255, 1993, -2788, 2222, 9241, 8090, 5222, 6698, 4986, -2263, -3879, 1766, 4375, 2686, 4251, 5480, -264, -5532, -3915, -1408, -1895, -43, 3362, 1061, -4888, -6577, -5627, -6417, -5444, -677, 1602, -1721, -4627, -4548, -5149, -5975, -2282, 2933, 3108, 1187, 1026, -238, -3321, -2374, 2450, 4314, 3432, 4416, 4565, 431, -2173, 1004, 4372, 4241, 5176, 7707, 6252, 1129, -134, 2741, 3377, 2359, 4405, 5895, 1895, -3056, -3222, -2312, -3669, -3139, -302, -394, -3925, -5837, -5498, -5684, -5673, -3191, -260, -491, -2322, -2752, -2730, -3549, -3087, -364, 1710, 1268, 256, -135, -882, -1735, -1018, 1216, 2843, 3077, 2284, 1498, 938, 465, 673, 2188, 3964, 4046, 2862, 2128, 1749, 1029, 807, 1873, 3306, 3335, 2279, 1590, 1222, 36, -696, 177, 1137, 415]
966D15j174m45j325j897k72J035K10n80J59K16r20o44J144J864O12N27J567J099
984A591p62k53J676J233o04N27J277l09j626m30L79l70o77K36L31p94j068n08
1002a51K31k29l7L17K03n17k46q7j73K5L92j29j73M80j03p94JO38l42m24O51M85
1024A8r00n32P03K80j049J58J455l1j519N37J659p10j177J666J668j428r53K257
1042B102P90k243j28K383l95k446N68K039j544k394J240J569k203j485K285Q30
1058I68k891n16K985l54k560R31K853j687k249J986J631k585j193K463K08k826
1074b836m9K057r47k242R37J786j787j235K178O22k325N34K595n02j757K167K060
1091A256k142p54L397P11k524O97L419r74k756K154K761k454k130L305J466l867
$$ y = [415, -759, -1204, -2529, -4426, -4698, -3663, -3453, -4033, -3874, -3658, -4578, -5222, -4078, -2214, -1602, -1075, 492, 1591, 829, 576, 2252, 3485, 2881, 3408, 4685, 4376, 2750, 2320, 2699, 2329, 1652, 1888, 2219, 1425, 357, -151, 80, -149, -186, 131, 334, -183, -429, -516, -689, -664, -272, -401, -574, -94, -197, -991, -990, -352, -694, -1118, -467, 18, -882, -1414, -711, -431, -1480, -1322, 133, 102, -1417, -880, 779, 69, -1108, 558, 2226, 798, -155, 2102, 2892, 649, 521, 2904, 2509, 63, 631, 2670, 1126, -1268, -28, 1541, -662, -2147, 138, 968, -1923, -2439, 546, 192, -2368, -1437, 1416, -271, -2520, -534, 1097, -1488, -2681, -218, -10, -2836, -2885, -828, -1775, -4017, -3080, -1294, -3081, -4316, -2138, -1516, -3841, -3307, -712, -1214, -2971, -804, 1256, -886, -1640, 1757, 2468, -56, 641, 4060, 3086, 330, 2484, 5245, 2791, 661, 3966, 5432, 1565]
1107A565p92L867o41m205J285L756k611l481L074K144m252j522M302L02m681N63
1123a327M209k204m107K837L311l904k450M429J296n261j81N330j071m965K661
1138a397M920l525l809M658L165m897j302N807Q85n545O40N265j752m664L120
1153A569M043l705l200L583J457m710q60M207q56m154J725K518l865k380L674
1168i54N50m324R45M342k784m669L268L707m506k440O112J966o678r53O810o82
1184b90o453L010P110l315n817M537M481n330k694O811K309n487k32N359j823
1199B176n178L066M978l291k905M484R36o214p40N693p21m894K836M277m978m699
1215e174M489K518m920k81O336p00o306J165M759k870l262N798M035n024k258
$$ y = [1565, 773, 4640, 3999, -206, 1079, 4835, 2224, -1257, 1817, 3961, -291, -1813, 2489, 2791, -1890, -1327, 2882, 678, -3429, -592, 2719, -1185, -3635, 794, 2090, -3171, -3352, 1978, 907, -4058, -1397, 3523, -2, -3811, 847, 4012, -885, -2187, 3620, 4505, -1040, -400, 4865, 3113, -1551, 1569, 5612, 1907, -1293, 2290, 3747, -963, -1823, 2384, 1528, -2626, -901, 1617, -2248, -4628, -954, -404, -4728, -3783, 559, -2225, -6894, -3626, 81, -4425, -6865, -753, 1213, -5465, -6418, 392, -290, -6743, -3733, 3377, 62, -5755, -1218, 3263, -2067, -4761, 2050, 4359, -1128, -1360, 3999, 2176, -3002, 64, 5042, 1751, -1154, 3330, 4266, -1948, -2688, 3005, 2284, -2610, 226, 4503, -475, -5174, -685, 1833, -3087, -3368, 2968, 2268, -4038, -2873, 1886, -984, -4246, 1552, 5587, 563, -1695]
1230a695N420J44o172K224P881j576n966L132M332n903m576O395M387n433k098
1245D96M941q61o904P8N482l90l020K273J618m461k437K578J16j773L212K643
1261C591m486l514L256m4n195J847P644j493p453J416M738m845n235O903O845
1276C975n204m678N292J565p061p55Q788K512m967J012M360l602n233M132N106
1291E242j980o89L966j253o491p39M055o61k193L573K326n809m834K270R99l056
1307e274J456N109q84n271n15J317k237j64N324K657k872n47J345k847k659M516
1323a546M916j309j077K998j021o161k06O567J692k804K304L331m458n999K788
1338A5M521j401l48M405N9o169k555K617J23j239L164K986l467m542J52k42k690
$$ y = [-1695, 3725, 3869, -2303, -79, 7802, 6226, 260, 3392, 7724, 1821, -2755, 3640, 8027, 2594, 496, 5437, 4576, -2328, -2250, 3232, 2842, -178, 2095, 3713, -748, -3185, -607, -491, -2264, 948, 3591, -895, -4409, -1153, -1197, -6392, -4545, 3099, 1606, -5847, -4431, 307, -4538, -9773, -2870, 3975, -1229, -5907, -615, 950, -6111, -6866, 1922, 4434, -533, 479, 4839, 1237, -3996, 136, 5242, 3262, 2573, 6539, 5286, -1205, -1944, 2111, 1450, -743, 2830, 5156, -653, -5487, -3217, -2218, -5274, -3818, 1291, 407, -4864, -5379, -4062, -6299, -6463, -1139, 1518, -1354, -1901, -556, -3403, -6062, -1546, 3370, 2061, 984, 3982, 2961, -3200, -3406, 3161, 4853, 2049, 4353, 7684, 3226, -2773, 15, 4536, 3135, 2787, 7192, 7251, 1082, -1473, 1144, 1267, 28, 3192, 6178, 2711, -1831, -1679, -1921, -4611]
1355d611J306N286M6m285j011O09k955j810M334M383j317j532J134j242l359J066
1371c958M692J920k40J332kl798j795K584K017r8J842K134k907m849P0J941j046
1388a61J95L802P70m650l209J020k30j255K251L690n77l365j112j69j270K19L355
1405f96K294r94j093o09k062j454J977K640N79oN76j722k910l9K292J211O43J876
1423B503M80k580j919R24J240M05K076K321p87k882m60P76j042J90L029J635k521
1440C388k303K59r05k353N99L035M31k819j462m0j533j872J125K587L93j393l30
1457c193k18j056m37J552J948J235M02k45p06l76M32P86J198J588M85o87j053
1474A655l58o6K7O25J364L53r49j135o36m25j57Q98Q08r8l75n24j203r49K71Q94
$$ y = [-4611, -3305, 1981, 2027, -2258, -3269, -2660, -5615, -7425, -3091, 1292, -25, -1557, -423, -1665, -5024, -3958, 734, 2654, 2414, 3746, 3744, -54, -1849, 735, 2752, 2654, 4496, 6630, 3723, -1126, -1056, 885, -161, 34, 3836, 4606, -44, -3253, -2233, -2463, -3718, -1467, 2223, 1646, -1719, -2831, -3000, -4270, -4051, -696, 1598, 604, -489, -1098, -3160, -4614, -2637, 3, 582, 576, 1152, -570, -3480, -3519, -1227, -16, 627, 2503, 2983, 403, -1516, -592, 648, 1053, 3129, 5450, 4663, 1781, 1321, 2097, 1055, 1245, 4274, 5909, 3388, 1085, 1344, 439, -1914, -1315, 1720, 2151, -668, -2130, -2170, -3703, -5575, -4450, -1863, -1470, -2863, -3193, -3411, -4467, -4904, -3352, -1404, -169, 233, -12, -718, -1094, -662, 124, 1322, 2910, 3395, 2708, 1655, 1297, 1231, 1258, 1883, 3247, 3600, 2651, 1516, 880, 455, 298, 1196, 2004, 1906, 1531, 1007, -196, -1145, -874, 20]
1494B0L3j88K53k02j638j118O51Q10l76j28Q01O0j613p65R17O69m4M79J061J23
1514a95q51r2N82N88M96Q00N74J86j87k55j62P0O26N16j40m66J21l92j278m73
1534F8P33M70p45l65K41l47j115n80P08O33k75k55M45K4p37o30N32O88l6q8K9
1555f02K48m03q73p5Q03M97k67q7L98q7p32k15Q74O71J03Q9M00l3k70k64N97N63
1577A335M92R6j26j54j99p2l39J95O03K24p21n90J36m28q91r8R18R0r77m74L29
1598f51l69j055Q5J177L08r51j06M45r6q09N27R95K65j08K03K70k75n9L05N03
1618F04N20K78j34j71j43R1R7r3M63L01k63p57J9m1m78q6M47N9n43l61k77l76
1640h44m00J51k4j07O7j35n31m10K32L96l23J2P57P5r93p3Q30J31p00M54J147
$$ y = [20, 53, -135, 118, -84, -1722, -2840, -2189, -1379, -1755, -1883, -1082, -1022, -2635, -3400, -2483, -1814, -1858, -1379, -318, -195, -1046, -1138, -556, 32, 528, 1328, 1902, 2088, 1901, 1646, 1484, 1554, 2180, 2696, 2556, 2090, 2211, 1819, 541, 68, 801, 1271, 526, 161, 402, 55, -1060, -1640, -932, -299, -574, -829, -384, -360, -1097, -1727, -1195, -507, -543, -631, -602, -354, -757, -1630, -1705, -902, -405, -672, -759, -361, -448, -1180, -1395, -521, 150, 253, 342, 742, 709, 439, 175, 772, 1335, 1827, 1923, 1797, 1643, 1444, 1372, 1033, 1228, 1831, 2055, 1334, 744, 880, 452, -439, -537, 381, 471, -506, -980, -651, -1020, -2075, -1990, -813, -505, -1456, -1562, -1117, -1213, -2022, -1495, -500, -235, -343, -140, 130, -145, -204, 101, 604, 1124, 1402, 1268, 1097, 954, 1045, 1142, 1049, 1512, 1813, 1550, 793, 812, 771, 293, 207, 654, 713, 170, -191, -468, -844, -1244, -1093, -1117, -1224, -1157, -1292, -1823, -2233, -2001, -1605, -1928, -1916, -1159, -1084, -2077, -2150, -1320, -1189, -1889, -1435, -288]
1661b88l11r59N96R26l27l53J054Q93o21j96Q19L75n71K37J028r3o43M25M12q30
1681A573n24Q16J68q93j42P12m72j140L33P66o11p57P30L66j101n39P95J67q79
1700f32q1Q32k72r05M11M67m87l07P45K19n72L52O13n34m26R45M32q63%J011k6
1721I22j225M05J291o00j043J067J173j171q69J516N32j621q1J731l02j886K69
1738A08J315j131j590R63P27j571j088J201J12j791J4J495o02j420P90J267j393
1755b594p55J621P21j561QJ776k30j664J062J792q33q38J695J114j544l20K216
1772A666L46j601N65J849q41j824J009J306j742r92J719O9k186k52J633o94j519
1789a489R66J418j377j025J373N86j578J22J959l31j677R14J390j419j026K157
$$ y = [-288, -599, -1558, -962, -36, -363, -716, 338, 1231, 610, 414, 1233, 1608, 1037, 1274, 2302, 2209, 1566, 1991, 2403, 1573, 1049, 1865, 2033, 1140, 998, 1710, 1238, 98, 431, 1197, 586, -171, 559, 925, -176, -715, 80, 247, -632, -713, 119, -153, -1058, -647, -180, -667, -974, -229, -10, -582, -230, 383, -151, -577, 368, 800, -63, -63, 948, 922, -303, 102, 1393, 793, -250, 817, 1990, 819, -50, 1466, 1998, 377, 296, 2027, 1725, -161, 108, 1423, 292, -1298, -335, 392, -1179, -2267, -1066, -954, -2745, -2731, -1236, -1838, -3258, -2468, -1201, -2594, -3349, -1728, -1007, -2568, -2560, -784, -1014, -2678, -1616, 176, -657, -1495, 200, 1314, -230, -550, 1666, 2012, 411, 976, 2825, 1984, 160, 1169, 2475, 733, -259, 1460, 1529, -657, -909, 724, 30, -1489, -523, 895, -482, -1507, -134, 452, -1126, -1004, 955, 624, -1053, -139, 1251, -168, -1194, 963]
1805I63Q00j964O9K240o81k268J409K512j540j789K225J451k922j109K846N74
1821B816k876J21K920q94l184R90K564j629j765J992J343k417j221J929k7k148
1837a486P30J665j395j772J183L99j906j85K415j58k168R94J767j466j588K544
1853d27J829k039o75K733n5l023M80K948o99k323J511J842k357j885K191J178
1869A229k340O3K706o66k673P59K236j548j447K500J289k774q99K391j74k503
1885a851J056K773j386k134J368J385k486r18K712N19k377J23K137j543k330J663
1901a289K031j818j033K574M85k977J41L052l11k035J791K520k029j886K154J385
1917B755k226m66K884p0k832o3K045j283k023J690J698k073j255J911n3k540M98
$$ y = [963, 1763, -201, -132, 2108, 1427, -841, 568, 3080, 1540, -249, 1976, 3427, 505, -604, 2242, 2816, -60, 61, 2981, 2087, -1097, -107, 2457, 828, -937, 1055, 2398, -19, -1240, 689, 662, -1486, -756, 909, -486, -2258, -1075, -676, -2582, -2767, -352, -510, -2678, -1684, 83, -1383, -2971, -427, 1402, -637, -1312, 1421, 1366, -1657, -1177, 1771, 1072, -1251, 260, 2102, -255, -2140, 51, 1229, -1111, -1048, 1658, 992, -1681, -922, 1314, -234, -1681, 819, 2108, -666, -1565, 826, 652, -1851, -795, 1978, 592, -1542, -174, 1211, -1275, -2193, 519, 1038, -1339, -1216, 921, -622, -2952, -1289, 742, -1076, -2109, 465, 950, -2027, -1886, 1166, 855, -1180, 611, 3131, 1102, -784, 1370, 2755, 529, 63, 2947, 2877, 45, -18, 2027, 744, -1279, 411, 2109, 36, -1219, 692, 639, -1901, -1403]
1934a403K428o25j936J359J451k201j261K335Q29k019J02K307n93k444P02K090
1950A121j292j299K057J085k242o03J672k17j813J158J941j159j550J681N09k108
1966a059j83K515J38k086R45K025j574k131J708J891k010j078K595M40l022o77
1982a563K423l72k252J185K090j341k170J048J141j517n52K244O53j603j60J179
1998D33p22j124J303J587p74o11J034k52j835K89J631m18p29J228L24j808r86
2015a430J377L24j093Q88J775j013j984O25J033j049m45K242P51k031p60J223
2031D33o92j673J029K042p81j556M47K14j717n88J833R67q21j84Q29r90j423P91
2049a840J562L1R5J241j21j581k30J291L54j0J423R48j352j236M35J50o06N14
$$ y = [-1403, 1025, 400, -1536, -177, 1274, -927, -2188, 147, 976, -1043, -941, 1366, 773, -1671, -969, 1121, -171, -1470, 587, 1672, -570, -1173, 499, 282, -1531, -373, 1568, 409, -1141, 540, 1049, -1059, -1242, 1273, 1411, -675, 270, 2295, 721, -1410, 298, 2189, 179, -899, 1696, 2136, -886, -1563, 860, 488, -1764, -579, 1511, 170, -2000, -952, 189, -1328, -1880, 364, 1017, -586, -746, 433, -289, -1413, -110, 1477, 703, 92, 1126, 874, -961, -672, 959, 541, -188, 1040, 1364, -444, -1430, -53, 271, -822, 66, 1841, 828, -1156, -531, 502, -547, -992, 1250, 2001, -30, -790, 433, -259, -1932, -903, 1139, 358, -1198, -751, -537, -2254, -2842, -1009, -42, -863, -1047, -218, -1208, -2631, -1840, -278, -247, -152, 1089, 968, -613, -843, 448, 802, 792, 2215, 3163, 1811, 575, 1010, 1160, 554, 1068]
2067A068J695j47j897n59K74r57q05J499J494q80j059K78o22j209L31J760O26
2084H90n16j5l40j343o58P38Q85J89M38K73j071j490K32P72J51P10J360J03j435
2103a27o94O32P4J40J359J351p11j157k68k51o27N86J584K95p85o13m07j029o18
2122a266J055J177k28l76k4j115j609K0J258M88j19M81M6j403j050N73J057N16
2140e19O14Q13l08j251o14M03L73N02R03M05p62q59n42k01N2J013J068R1m63j06
2160F12n95m67L18J390P43j26Pl62j005p91L98Q08K69O0j23o72j242k79L73K39
2180d45M29O54q9j025q16J33J2m2Q65P97m92q37k28m5l59K52J346P85m51m63J02
2201H3k06l58N65J304L32m44j70k38q12k90N75L65J33L5j98p07p12J60K63K45
$$ y = [1068, 2763, 2616, 719, 160, 434, -523, -1328, 171, 1665, 785, -274, 4, -618, -1827, -1496, 264, 890, 374, 359, 19, -1324, -1982, -1244, -359, -170, 268, 541, -530, -2020, -1788, -1016, -865, -155, 1205, 1308, -127, -821, -189, -115, 25, 1384, 2735, 2024, 867, 599, 348, -279, 307, 1891, 2186, 1401, 788, 381, -648, -1266, -211, 966, 738, 362, 338, -777, -2386, -2366, -1108, -620, -739, -258, -212, -1615, -2665, -2092, -1035, -519, 95, 908, 600, -651, -1265, -862, -489, 13, 916, 1321, 559, -300, -842, -1043, -991, 22, 1090, 1181, 718, 612, 17, -450, -132, 1258, 2001, 1875, 1882, 1520, 515, -276, 122, 930, 1199, 1259, 1136, 464, -778, -1057, -684, -445, -16, 638, 549, -476, -1292, -1159, -1147, -1189, -324, 473, -19, -856, -1084, -1129, -1488, -1236, 110, 895, 444, -19, 83, -123, -481, 84, 1388, 1720, 1276, 1106, 868, 56, -234, 341, 706, 839, 874, 676, -31, -743, -583, -320, -75]
2221g5K93L37l28r54m49J68j97l2M97K50o87o23j88r1j35L92P93J43k66J90qj92
2243a162L91Q65L67J81K60J88m33m33N58P05q9JN99l6q69k47Q55jm59M93L73n86
2265A521r55N7J70m43k44L52j0q99l41K17k63k86M01N00k73k11L09P9l49K14O66
2286B12L9l27K11K74l73l82L72M05l55n0M50j14l74l3N10J00j86L83K95n00j44
2307D13K30j1l33J21K59m43m74K94L2o23j14L58R4o16l9M93l96n83K63L57m40
2328a158l01L96J03n95p1O09K3m46L86N13k48k43N40M62l98R6N70J52n37J28N28
2349E09j48o31L39N08l47m47N56K35o01rN64J30o21K90N59l62k99L17L13l97k59
2370A99M74n6m93r0L83j87l72J94K77l32j78L90J39m43J77N49j57l11K95K96k34
$$ y = [-75, 218, 555, 227, -727, -1176, -1008, -1205, -1237, -740, -490, -1177, -1800, -1988, -2079, -2214, -1822, -1029, -886, -1152, -962, -970, -1162, -771, 94, 461, 642, 902, 1090, 657, 224, 782, 1487, 1398, 1399, 1998, 1962, 1093, 846, 1701, 1700, 1241, 1734, 2107, 1521, 566, 623, 793, 350, 106, 458, 448, -451, -792, -575, -838, -1124, -723, -223, -496, -707, -398, -319, -668, -454, 212, 251, -76, 135, 409, 36, -346, 26, 431, 76, 26, 476, 362, -12, -45, 465, 565, 379, 762, 1057, 557, 413, 643, 632, 299, 420, 679, 236, -238, 56, 88, -535, -649, -291, -197, -813, -852, -359, -755, -1338, -1075, -718, -1158, -1459, -1063, -960, -1555, -1626, -1017, -994, -1440, -1054, -541, -789, -1032, -492, -30, -428, -332, 238, 390, -147, -19, 509, 361, -270, 69, 577, 230, -217, 339, 574, -27, -36, 528, 658, 37, 327, 886, 524, 225, 542, 855, 458, 199, 673, 617, 124, 34, 417, 230, -142, 52, 329, -3, -181, 209, 348, -95, 82, 631, 474, 163, 458, 754, 520]
2391E20j63L68J98m27j8L94q0n87J98L79l59l57K95J33n49o8L60m8n14N5M60l06
2413a16m55L58K91m10j98N45J26m98R3N03j96n50K14O17l96m82L64K43o48l93
2433i88N95J64o45r5N54n0n98Q3N64j32k85K41M46j16j80L79K59j66J33L25K4
2454E12j97K01R5k37K6K54j21k85O0J08l57k99K53J97k91k50K52M6n29P7M58j41
2476a68l15J50K15l02l37L63K84m12mM16k7m45OO13j06k50L24M12k32l82L43J70
2498C16p2pM87M9l21n2K96p0j14M85K51j79k13K16j60n37J19M63q7p73J07N2o30
2521c74o16L18L33m04k12J92N1n70j37O60L04j25K69K15j00k75Q5N17L0J73J59
2542D93m0k94j86P6q0L61N50k1l70j51P1k76j58N26N54k21m49Q8j47n21j5O80
$$ y = [520, 357, 725, 923, 496, 478, 872, 792, 205, 403, 782, 423, 66, 361, 494, -55, -123, 237, 189, -325, -270, 190, -116, -571, -213, 78, -332, -530, 15, 141, -357, -264, 239, 43, -507, -293, 324, -72, -554, -190, 53, -595, -988, -393, -229, -874, -969, -415, -465, -1063, -980, -416, -548, -833, -592, -146, -262, -442, -63, 196, 30, 163, 488, 512, 315, 516, 611, 374, 400, 654, 533, 248, 308, 416, 59, -240, 13, 210, -81, -331, -79, -33, -562, -485, -27, -168, -483, -333, -118, -420, -757, -394, -110, -522, -526, -110, -137, -582, -576, 37, -69, -319, 5, 417, 185, -197, 146, 316, 244, 237, 724, 773, 452, 400, 696, 626, 512, 997, 1248, 1069, 856, 1072, 912, 375, 494, 957, 870, 97, 204, 256, -374, -990, -672, -339, -743, -955, -763, -712, -1282, -1419, -759, -455, -580, -311, -96, -196, -471, -386, 131, 161, 334, 493, 453, 159, -27, 49, -31, 330, 880, 859, 489, 338, 409, 133, -25, 501, 1055, 834, 385, 473, 326, -195, -210, 470]
2564D70L64l24j50K58n10o97M39O29o4k02J8j28r18n54L70K13k06J63K01m24o43
2585a695n0M28M33J96Q04K49l43k34K84J85J23O86M70k33m34k97k66n17K48P47
2605G84n1n16o4j74q38l25P30N78ol96K73j57q62k41Q63L86j50K33J27n33o08
2626i47R9M47L86J96L85j63n88l37m3J71J55P15J85m97m93l8l26l0P66R21P4l04
2648G34M2pm13K45Q51N32k25m1k73o89o66K47K78j10p9L6n72j068k96M65K38r2
2670h63L68N90o56p71J58M78j2K90P02J99n75n51J54J52p4M78O20J9m93j42k19
2691a48j15L35M82L55j70j11k05n56k21N29L95j25O2J76m80o44n9N52J95L1K11
2712D89K9n22o09r7J28j16J80J47m06n25j97p1j23K59P62P1j55Q0L61j52m5P94
$$ y = [470, 834, 510, 360, 618, 108, -589, -150, 479, 415, 213, 231, 103, -815, -1369, -999, -786, -992, -829, -628, -1052, -1695, -1745, -1317, -884, -688, 116, 365, 22, -212, 72, 257, 380, 1066, 1536, 1303, 869, 572, 306, -211, 37, 784, 733, 217, 153, -21, -859, -1184, -454, 124, 118, -278, -5, -162, -1024, -1265, -402, -16, -166, 67, 194, -339, -947, -848, -401, -15, 181, 566, 403, -185, -522, -565, -394, -239, 476, 661, 164, -329, -367, -693, -723, 43, 964, 1038, 734, 776, 769, 356, 601, 1452, 1984, 1759, 1718, 1445, 756, 90, 337, 615, 505, 426, 462, -110, -1178, -1474, -1009, -771, -863, -495, 95, -561, -1332, -1174, -696, -708, -418, 284, 483, -92, -643, -489, -337, -411, 67, 687, 706, 213, 71, -148, -263, 72, 554, 909, 739, 628, 423, -133, -354, 175, 570, 445, 507, 683, 203, -441, -500, 52, 247, 278, 489, 518, -4, -613, -710, -582, -698, -518, -371, -777, -1302, -1499, -1570, -1693, -1434, -672, -601, -756, -676, -315, -467, -512, 282]
2734B82O82P4j72K65O9n07j04N95L08k85o1j6m30n23L8K24l6m3R4j21o71p4o9
2757d81J5qL49J42m60k09J87K4l41K81O85O0m15O5J50j76j88M23L61j02q3Nk59
2780B5j94K5J47J40k7K20J13l09p7K18j4j30L26L51l12l33L4J3l19J5K43p0m75
2803c90r5L7l59l66J62L31j94MK15j23k31m5M49J31r3L57L17l02j91L54J89j47
2825A0K25M75o0l51J3J66k01j68M08L02l32k06J55j10k48R1L98Q4j42k7R2m02
2847A72j46L53K7N2LR9k84l90K7P4k38N4M12k95l96j87J46j27k42M68L60j80l04
2870e42K26Oj75K45N78J34k72K11J12l60j01N22J57k25R2K49l88n28L7K15m9j95
2892e1K98k8m08l00K99J47l51K31M48j62n55J29J99k29lL48J29l70j96P9k86k55
$$ y = [282, 964, 1038, 866, 1131, 1200, 693, 589, 1184, 1492, 1207, 1146, 1130, 700, 177, 215, 439, 403, 360, 454, 333, -338, -412, -481, -466, -474, -125, 17, -443, -652, -465, -441, -782, -501, 184, 244, -171, -106, 44, -132, -320, 103, 464, 362, 279, 284, 25, -169, -144, 3, 143, 116, 336, 449, 140, 63, 281, 267, 137, 463, 814, 502, 169, 203, 216, -103, -88, 155, 85, -390, -485, -448, -807, -1173, -1011, -680, -874, -870, -655, -778, -1009, -1054, -605, -474, -567, -210, 107, -195, -386, -32, 157, 10, 235, 710, 650, 299, 312, 478, 277, 109, 517, 819, 487, 281, 436, 326, 78, 169, 567, 651, 509, 482, 574, 172, 26, 379, 406, 458, 461, 560, 276, -114, -87, -13, -251, -197, 215, -80, -476, -663, -517, -644, -886, -418, -58, -238, -542, -316, -310, -485, -240, 338, 472, 200, 411, 523, 163, 62, 584, 741, 516, 608, 857, 469, -59, -22, 193, 144, -51, 247, 219, -189, -489, -190, -43, -394, -163, 285, 123, -432, -303, -104, -333, -336, 12, 141, -229, -425, -346, -632, -887]
2914h87J94L17p6l43J07J35m55l5N00K05r0J80K21k94j89K91M07j23N4L67m3l77
2936F6K09J25j24Q5M51J44m61j59L53j46m98J67M93j43n34J48Q8m58kN04R6m27
2958b3K3L35m4n08J95M25k22k97L06J11n55q5K79k3l40K17L19l20l00K86L77k35
2980g9j34O30J44l29O1L01j12k79K81L22l09k10J68J36n81r7L13n9l09J91J03
3001A52l36l56K50J88n18K5K39j22n77K61J23j38k27M47K97l73j8M62K6j82K66
3022a11M76o5l30K69K98l37k30M72J01n54l3L95j36m36J73L94l05k63M45K07m59
3043b9j69L93M1m18J33L41k89m83K90J57l66j07L47J55n23J38L89k53k84L38L27
3064A28l30k68M28J57n10P6N13j12l59L61K86j88k06M47K87k34R3M33m2m59K56
$$ y = [-887, -693, -376, -452, -795, -688, -553, -1008, -1043, -543, -338, -428, -248, -27, -321, -510, -219, 188, 65, 119, 486, 443, 66, 275, 400, 276, 361, 812, 956, 495, 336, 689, 543, 45, 212, 705, 562, 28, 176, 264, -194, -196, 308, 404, -23, 0, 335, 291, -217, -22, 403, 181, -116, 190, 301, -254, -339, -60, -83, -423, -206, 113, -207, -507, -221, 156, -79, -213, 417, 561, 232, 293, 594, 482, 203, 484, 806, 497, 287, 455, 591, 10, -87, 226, 167, -142, 49, 152, -184, -540, -290, -102, -620, -595, -356, -478, -1055, -794, -671, -809, -1036, -589, -292, -665, -683, -221, -195, -377, -111, 365, 300, -30, 239, 537, 200, -30, 442, 543, -11, -44, 351, 215, -221, -48, 346, 41, -222, 223, 430, -29, -198, 195, 236, -182, -49, 292, 3, -480, -190, -33, -399, -506, -159, -4, -527, -389, 0, -253, -537, -199, 128, -202, -470, -42, 115, -395, -319, 194, 82, -277, 84, 370, 182, -24, 423, 710, 476, 569, 1002, 960, 501, 757]
3085G57K05j37l10K24Q5m26l65K62j08m00N7L45k92l41R7L29k70k29N79N1m45
3106c32K3L19l08k30J70L45l10k89J71K56m24j88N62O2l91J57L83k22k20K79M73
3127B86l10j20N43p1k41N9M56M1l09K13L33k60k02K27J93l70j93L49k14m61j13
3148a64J15l07l11J84J4m81o0K41o2l24K21M69k10p0L53J44j27M5L29J07k37J74
3170D3L17j84j84K44J90l25m5L07N2m11L3L93r4l77L43J84j69k73J93K53k71j69
3192E0L95o7k18p2K44j52l55K65J12l05j14J38j25k93L9K29j04k76J61J68k05
3213d85j18L17J60j30K7M14K6j48K09K13o7l5M21n2k32l6K49k72k98J74J46k54
3235B29k32J10J12m37m6K65Q9k64N2K18j39k30R7K22m7j4K08q5k70l6L1Oj44K53
$$ y = [757, 962, 825, 515, 739, 824, 398, 33, 295, 187, -213, -156, 189, -103, -444, -347, -18, -288, -517, 62, 113, -332, -309, 10, -298, -528, -358, -13, -323, -612, -441, -185, -609, -797, -235, -173, -564, -407, -24, -246, -466, -187, 286, -24, -144, 399, 328, 87, 146, 602, 643, 334, 547, 880, 620, 418, 645, 838, 468, 275, 624, 410, -51, -164, -49, -356, -667, -483, -469, -950, -1010, -769, -831, -1155, -934, -465, -675, -745, -392, -248, -375, -330, -1, 106, -131, 43, 360, 176, -8, 236, 426, 101, 56, 363, 415, 4, 37, 430, 336, -41, 302, 486, 317, 44, 237, 490, 219, 50, 445, 378, 160, 88, 332, 180, -175, 90, 202, -103, -217, -79, -204, -497, -458, -229, -333, -609, -448, -280, -485, -603, -286, -126, -256, -229, 185, 211, 63, 272, 485, 418, 383, 804, 752, 520, 484, 733, 461, 163, 337, 483, 229, -3, 107, 219, -218, -264, 1, 90, -174, -122, 96, -43, -273, -176, 46, -1, -15, 193, 108, -162, -198, -167, -161, -305, -52]
3259e2J03l23k42K05L1l96L6M64K2l26M9J92P4j73K48L14j7M4N6nj72kJ98J28
3283D56l0J07j77k95k35J78j14q6J52J90l01m24jK18k39Q5L15K97k52k38M1K78
3305g5o6J44L57Q8r1j68o4j43J07n9K77l2l5j92l03k41K86J19l8J16J61l7n62
3328d51LL94K51pK75K14j09l71j42J04J45J74J44Pk15l00k04j37J54K89J02j69
3350A51j14q5l31j22K14N05J11j97K7J3l08k03K91L29K04j62j59k4k54k16N2K35
3372d3J45J25l25j83l10j11M1K65L58J45k47j73j35J20q8L71L95J93j79k36l7
3393I1k21QJ33L47O3j36l80l11j01j5J07K56J87l2k11k64p4J14K02L50K01K08
3415E22j67m65K4J91J89J64J87N8k04m44j50M4Q1J94K49l0k22l45k14M0J98l5
$$ y = [-52, 51, -272, -514, -309, -278, -674, -638, -174, -152, -478, -429, -237, -163, -336, -88, 226, 209, 253, 309, 304, 132, 130, 328, 456, 426, 533, 356, 61, -174, 4, -110, -196, -44, 146, -155, -579, -580, -362, -601, -516, -201, 96, -156, -394, -353, -75, -141, 3, 360, 448, 357, 189, 125, -18, 89, 30, 307, 275, 240, 48, -255, -496, -210, -91, -129, -13, 148, 111, -451, -448, -54, 197, 190, 465, 679, 570, 199, 57, 161, 306, 480, 624, 631, 416, 116, -88, -225, -71, 218, 320, 151, 37, -48, -379, -501, -287, 218, 329, 132, 159, 172, -136, -339, -48, 281, 485, 323, 164, 140, -114, -330, -278, -43, 102, 227, -98, -281, -591, -702, -661, -396, -38, 107, -140, -313, -448, -328, -416, -45, 350, 543, 364, 128, 91, -130, -122, 11, 358, 421, 285, -95, -406, -507, -522, -415, -159, 28, -4, -215, -479, -553, -439, -237, 113, 314, 522, 355, -110, -86, 105, 294, 458, 645, 703, 499, 55, -95, -51, 30, 224, 473, 443, 221, -124, -338, -298, -100, -135]
3437a35J78J75j18l88k06k6J58L76J63k6K3j57k92m6J70K59J49R3j20j78l54n9
3459c61J48J49K66k3K5p0k31j98N7K87M27K9j29p4j11o3K9P5L04n6j59r0k33k41
3483b43j16K77J60p9j12j06j00k09r0J76K32K3J0r2j89k53J01J14J87J11M0o3
3505b21o1j81J68Q0K05K01J95k47j02L6oP2J50R1J49j68j33Pj52KJ89K95m2j77
3529C50j91k2p9K9J67N8n2j5j03k05o0N7O2P2J6p7Nj79r1P2L1pJ69J5r4p8J2j06
3557b44j5K28J72j02n8l1L1n2J13R8J80j24L0P2J6k59J38N3Q6j51n7j9j45j05
3581a45j4K8j68L8RK8k76Q4J06K7j17J43R4rj03J49m8k5RJ36l7on6L4r0N7M7L2
3609g3l6j27K55j81L1R3R3k5o5L8K29j06jJ81k1r3J19M1n4j43R3j7o8o0j21P4
$$ y = [-135, 43, 218, 100, -288, -494, -520, -362, 14, 177, 151, 174, 17, -275, -321, -151, 108, 257, 350, 230, 52, -302, -361, -213, -64, 202, 179, 204, 134, -97, -295, -238, 49, 476, 505, 376, 302, 191, 128, 157, 232, 536, 480, 321, 231, -2, -243, -359, -82, 78, -1, -113, -219, -319, -528, -618, -442, -210, -187, -177, -269, -458, -711, -610, -496, -309, -198, -158, -221, -282, -463, -295, -215, -10, 191, 386, 139, 37, 73, 67, 139, 289, 380, 529, 361, 228, 235, 83, 85, 274, 569, 527, 350, 159, 137, 58, 87, 254, 312, 260, 245, 142, -63, -123, -66, -4, 68, 84, 7, 12, -167, -258, -186, -155, -162, 7, 22, -72, -150, -138, -244, -259, -31, 141, 39, -19, -50, -19, -71, 42, 140, 320, 196, 226, 298, 314, 55, 193, 246, 332, 181, 124, 105, -40, -145, -159, -131, -299, -261, -252, -224, -500, -416, -310, -283, -400, -257, -163, -172, -275, -126, -174, -199, -190, -54, -91, -97, -153, -119, -209, -152, -105, -73, -109, -236, 19, -162, -131, -38, 55, 30, -35, 3, 232, 126, 125, 306, 285, 192, 311, 352, 298, 155, 248, 231, 163, 103, -18, 56]
3635E6j05j23J1j17NN7q2L1m5O7P3j30J51J82j05K2K69Q6j4oJ53l4j10J14J81
3660E87n7j92L7J55j59k12J06Q3j36k00L1P8j43n3M2O8j21Q0L0j13m8J41k2q2
3684a00m7O2r8m3N5o4j07n1L4q0m1L2K3j6m2J59J27p1j21K91M8j35J57J56O9r3
3710A04N2J99l2q4n9K58k29j02J47n2j94j18J51K5k41jQ4k6k37J28O0l9p0J28
3734a48O4k5p2J95j24m5J00J11j46j03Q6Rk23J50Qn0j8J20O3j61m3J61L6L2N4
3759C1K06K0q1O6K23O3j54J32J12j52p2J36r8j33j0k1k4j96Ol2j67LL7kn6n8J07
3786a14j14o3J67KJ2l0J57j35Pk1J14k3j03P1O6j49k6K18r0j00o0K22j5l05J32
3811a80K72j16j20L00K24j77j07J50P5r0N6K26p4j95j07J28q9j11M3p4j65m1j36
$$ y = [56, -49, -172, -161, -278, -273, -216, -298, -267, -312, -245, -172, -302, -151, 31, -74, -52, 217, 303, 289, 283, 436, 402, 292, 406, 587, 530, 338, 375, 530, 371, 159, 265, 348, 212, 12, 43, 121, -22, -75, -33, 35, -86, -6, 24, -89, -137, 4, -18, -100, -147, -85, -183, -226, -171, -235, -342, -393, -359, -439, -480, -448, -425, -441, -483, -324, -197, -268, -389, -98, -50, -185, -28, 128, 197, 104, 156, 355, 323, 239, 180, 438, 209, 107, 254, 202, 8, -110, 41, 66, -175, -176, -92, -118, -355, -227, -167, -206, -276, -148, -84, -109, -181, 14, -110, -155, -55, 56, -90, -193, -107, -98, -321, -171, -163, -213, -231, -111, -48, -209, -252, -91, -55, -23, 31, 237, 257, 176, 242, 465, 528, 374, 506, 618, 466, 394, 530, 432, 299, 289, 268, 244, 48, 54, 22, -145, -142, -105, -107, -163, -221, -114, -228, -291, -124, -122, -110, -140, 17, -118, -111, -132, -18, -41, -144, -73, -7, -156, -182, 36, -54, -154, -214, 8, -7, -312, -180, 92, -24, -144, 156, 380, 203, 96, 246, 321, 231, 287, 513, 439, 244, 137, 265, 176, 65, 108, 34, -131, -172, -308]
3834c08o2j8M5M4j59qQ2O5k75J78K23j3m1J29M6j09j28K59K11j14rQ2o6j11P8
3859B1k6K7OJ49L8j04k10K15l8l9K72O6k2j84J02P3j63OL31n2j90k22Q8p6k83
3884b15O1M0L4k27q0j01n2K2J07j18K0K44L5j55o7K85O0o1J26L10j4j69m0K24
3908B69J10j86J67K10n9k46j7R8j67P2M7O4j03r5pk79J65K52j45r6P8J5k17j56
3932b26K37K05j64r1P4j1l46j34K03J4m9J2K6j8j45JJ02M8J15J69q2K6n5Q4r1
3957i6J31K73j0r3K6O6K2l39J80K50rl05l4R9r6j91j6K70P9k34j04P2j76k7qJ30
3983a40N4L3j39k1K2Q1j14m3K13J52q1k06J52K4k3j14K52J15j04m3nLm0O4J1K26
4009C29p2r5q1P8l7q5J10lL9M1l51M6J42n7p1qJ59q7k15j8J43K5k60J78J87o4
$$ y = [-308, -370, -388, -343, -299, -458, -466, -384, -319, -594, -416, -193, -206, -247, -118, -72, -181, -309, -50, 161, 47, 38, 120, 54, -57, 21, -5, 22, 28, 177, 215, 111, -99, 116, 78, 39, 311, 377, 355, 171, 273, 346, 183, 189, 520, 468, 278, 56, 144, 68, -215, -154, -114, -80, -307, -387, -488, -540, -518, -411, -529, -509, -265, -230, -385, -452, -167, -107, -168, -42, 268, 254, 85, 45, 269, 379, 193, 360, 570, 511, 265, 248, 346, 179, 251, 298, 362, 259, 164, 157, -122, 43, 295, 150, 54, 132, 147, -70, -226, 11, 216, 52, -39, 35, 24, -322, -456, -253, -239, -288, -276, -250, -268, -413, -412, -310, -262, -147, 22, -60, -34, -89, -5, -96, 35, 308, 298, 205, 231, 297, 319, -20, 160, 410, 401, 96, 62, 161, 65, -126, -142, 128, 207, -27, -131, -59, -235, -262, -270, -140, -86, -53, -192, -213, -191, -110, -224, -267, -54, 98, 17, -189, -37, -13, -36, -150, 102, 217, 113, 70, 65, 68, 28, 92, 103, 329, 257, 162, 81, 159, 122, 37, 147, 144, 183, 224, -127, -81, 61, 4, -67, -75, 84, -3, -218, -236, -93, -68, -328, -150, 37, -27]
4035b7j38q9Q7O1l8N3Q2%q2L9p1J36Qq2J81R4R4p1j46J48R8q9M1M3P3k12j08J02
4063A87J7j16j30J8O2k56m9K6m3J0j8P4l1n5n3O3j30J46NJ21N8J07k7j43J13J75
4089A31l9l8Q5L6n6j62J06J12r1J8J20n2j6r0K6K5M2J12J5No7J5oq0J9J21M4j24
4117B11j6j18k7j25m7P1m0r5M8j09q6o5L3O7Q4P7M6j8j01J08J26K6M0J02lj3r4
4144H2K2j36J05J32L7p1j9j14j2j65J40M4j9m6J03j45j02l1R4J41oM6k6j7k06
4169a69R1N4L1J14j25L9j42k7j35L0L0Q9N7j10Mj16Rj50J54K86J5n6m5K1n6N5
4195e2K56oP1m6Q4r9q9n9Q6J35k28O9j03lj61L4N5k3J6K6j5j71R9n0J94RR9K2
4223A50qq1k4j5Q6P3n1%l8L3q4j03L7N8J76k25k8R3l2j73J08J34J11k4P8q5j31
$$ y = [-27, -165, -254, -167, -106, -144, -91, -9, -9, -91, -52, -123, 13, 21, -61, 120, 214, 308, 237, 91, 239, 337, 248, 289, 332, 405, 193, 85, 187, 204, 88, -42, -24, 38, -218, -267, -241, -284, -274, -292, -218, -249, -304, -357, -294, -424, -278, -273, -152, -94, 13, -14, -157, -44, 131, 92, 54, 139, 175, 119, -43, 63, 175, 84, 102, 222, 170, 154, 64, 90, 115, 157, 269, 284, 289, 222, 237, 231, 151, 170, 291, 335, 211, 195, 77, 50, -75, -122, -51, -91, -186, -138, -247, -333, -398, -365, -298, -214, -137, -91, -109, -210, -102, 24, 50, 90, 192, 189, 176, 82, 104, -32, 73, 205, 242, 171, 152, 38, 26, -139, 1, 45, 26, -20, 83, -62, -164, -195, -101, 40, 34, 80, 54, 37, -169, -78, -24, 7, 121, -4, 35, -107, -134, -269, -239, -209, -120, -63, -173, -169, -285, -276, -426, -272, 14, 29, -27, -72, -51, -107, -52, 204, 198, 269, 223, 307, 208, 119, 60, 146, 281, 53, 122, 19, 16, -145, -111, -56, -79, -63, -37, -52, -223, -124, -174, 20, 29, 128, 150, 142, 61, 37, 22, 108, 181, 130, 130, 92, 125, 41, -62, -25, 33, 209, -16, -44, 49, 17, -156, -48, 86, 197, 173, 251, 166, 35]
4250C5O3J5j4NJ92j61r8r5Pj5N1nj0j01k9q0q1L4m4J55J2q4O8j06J29m8OJ64J02
4279F7r0J4rJk5N4P9J1K7n8l3j18l2J37r0m1J19NNm5L9J8p1J75Q9p8l2N8j44Q1
4309A13n1N0l0k4pj28l9j07j5n5R2n3P9l6p3R7J01K5j54J50O8m5o6J37P0j1Q9
4336A77L0jNK3L3k2j32J23m6Jp1N5j74J20j81K10j28k5J3qk7K2J7P9J9m1n4N8
4364G5P3j23l9l5P8j26M1j02Q4p6o5q6J86n8j1L0M9ol1Q2J51Pp2J31R1j13nj9
4392A11J65j59O0J5j8j16p7J33m4r8K2Q3o8kl7j1n6Q4q1M0m9K2M5m8O2K3J4m4
4420b9o9O6K0r4LJ07j40K4P2j21J9K1J25o5n0L2Q0O2o5J12N2l0L7O0j6J6k0K5
4448B34J0l5J7q6q4J33k10O4l5r3l8M4m8M3p9k5M0O2r9Oj7O3p6P1k2mP5j41J17
$$ y = [35, 98, 113, 99, 104, 296, 135, 37, -58, -51, -66, -15, -20, -30, -131, -160, -240, -321, -287, -331, -176, -164, -248, -180, -286, -157, -205, -199, -35, 67, -23, -9, -18, -17, -42, 12, 91, 102, 129, 71, 38, -80, -112, 25, -65, -106, 13, 18, 23, -22, 17, 35, -36, 139, 228, 150, 118, 176, 32, 113, 62, 112, 82, 58, 51, -77, -116, -223, -238, -293, -201, -254, -175, -211, -284, -187, -86, -61, -215, -65, 3, -42, -108, 29, 99, 88, 177, 207, 206, 211, 234, 267, 245, 113, 236, 190, 191, 120, 175, 1, 121, -60, 150, 22, -3, 10, 2, -25, -3, 14, 93, 112, 71, 17, 75, 148, 25, -14, -49, 29, -97, -56, -158, -74, -150, -215, -301, -115, -173, -184, -154, -105, -111, -142, -60, 91, 98, 26, 157, 248, 135, 130, 111, 276, 117, 177, 192, 174, 58, -19, 114, 70, -28, -6, 77, 9, 7, -30, -41, -97, -13, -94, -54, -103, -81, -36, -84, -22, 1, 15, -29, -98, -32, -12, -106, -103, 4, -136, -112, -40, -161, -142, -121, 4, -61, -111, -79, 1, 63, -2, 110, 162, 132, 169, 229, 213, 229, 209, 234, 244, 209, 226, 140, 56, 189, -21, 43, 8, -85, -123, -79, -127, -84, -163, -188, -148, -86, -185, -179, -196, -133, -209, -138, -160, -164, -89, -230, -113]
4477a13m8O5O0l2J02L8r4N8O9j16L4P6R6m0L4o5P3M9qn8m3M9m6M8j00n0J71j48
4505F1j20J26k0j90L3l9P3p1Jj9M0r4K2J7M5k4l1P7o2J07L3K2j22R5K0rQ0L1L3
4534A15n1J5R2n8p9J61j6ok5l3J15q2o9J49J9j30N3l6j20K0p5OK5K1Pj19o3Q7
4562g7Pm2J5r8J16j4n2Q2J0j0j9K6L1k0m7Q1M2k2PQ3K5j12p7M2o7Q6k0J08k0j22
4592e8N4q3M0Q4l2J02q1k3qj18N8J06l7p5O3M6j22p1N0RL6L5p9Q3j0j72O3P2J5
4621e3K1J0L8o4N1LkQ1o4R8K0n5Mm3l2R3n2J28j40m2j7j9l4O8L1K8K8j05J8j51
4651a53J32qJ78j31KK7p1l9N3l8N9J47k23oQ7j04K0N1l3R8lm7m3N5n7R5n3J78
4679A73q2J7L5j31qJ14Q2L9j07n4M9j96P7K1J07%l5m5j25m5RN4k9J7M5M1j13J6
$$ y = [-113, -161, -96, -36, -68, 34, 72, -22, 36, 105, -11, 23, 99, 195, 155, 189, 124, 197, 246, 238, 180, 137, 186, 140, 188, 88, 38, 209, 61, -59, 67, 47, -143, -110, -149, -76, -147, -146, -165, -125, -219, -197, -180, -135, -159, -190, -113, -175, -68, -35, -13, -135, -40, -20, -29, 51, 82, 115, 64, 79, 171, 113, 34, 195, 179, 173, 148, 115, 230, 148, 79, 228, 247, 117, 170, 134, 14, 34, -41, -35, -10, 11, 18, -101, -164, -77, -70, -112, -97, -195, -79, -93, -145, -63, -53, -63, -82, -56, -25, -45, -92, -11, 31, 9, 16, 99, 124, 12, -65, -23, -90, -4, -24, 84, 64, -58, -4, -87, -47, 37, 5, 107, 26, 3, -5, -123, -65, 41, 4, -71, -8, 38, -84, -155, -105, -96, -60, -25, -104, -21, -31, -203, -140, -68, -53, -32, -22, 16, -48, 3, 6, 4, 85, 21, 119, 139, 84, 88, 45, 13, 106, 54, 182, 42, 0, -17, -36, -70, -2, 29, 57, 85, -20, -2, -153, -21, -29, 149, 18, 20, 47, -24, -63, -10, -48, 11, 158, -65, -71, 16, -88, -68, -17, -50, 48, 45, -2, -45, 10, -47, 48, -5, 173, 91, 108, 143, 12, 4, 118, 200, 239, 132, 78, 127, -69, 8, 29, 136, 136, 101, 56, -69, -114, -105, -51, -80, -63, -18, 23, -90, -74]
4707g4l6K3K7J1J46l8j39rk8J12o9N1L2j6j25Q1q9n4J08K0J30j40M9Kp8J8J85
4734A00rR6j6lj22q4P1J26j26O1mkj45m0P7l6K5m4M7J9p8p6L6l3l6J84q2Rn0K8
4764a07j7nQ4O4K8K4r4M4kq0J43j9ol0l8k7J2K3pn4J47rn5q3J51M2l4L3J41m2
4794B27p4n7K8o5Q1K1q7l2o3j08Ro6J05N0N1o6j9l7J2J4L3L6nJ11j10k7RK8P3
4823G2j3K9M1n0j00m1pN5M2p9jlp0jrj2N1J28m9l1K5Kmo8L2J24ko4kp8M7l9K2
4856e3m0j7O7L6m9p8P0j4p6J22j8o3PK5N8L0K0J40o0j6M4K4p4k8N9K8p6n0L0k3
4886B5M9j54J20J7j23O5m9L6j2L4m8K7j08Q1J54j23j28J51n7K7l0QN9m7l1L6r
4913c0j5n7OR4m9R3j04j5N8Ljk8N1K3r8J30Q7l6O6J7p0pJk7R8j71J0M8r2N1j2
$$ y = [-74, -110, -87, -60, -49, 97, 59, -80, -89, -117, -5, -74, -23, 9, -7, -132, -51, -140, -194, -86, -66, 64, -76, -27, -25, -103, -85, 100, 91, 187, 171, 168, 46, -38, 33, 159, 33, 94, 90, 88, -57, -97, -20, -56, -31, -75, -28, -9, -87, -163, -127, -160, -196, -12, -94, -85, -135, -107, -124, -129, -45, 19, 47, 71, -23, 21, 19, -61, 82, 63, 57, 27, -11, -38, -26, -3, -10, -64, 83, 74, 19, -64, 87, 129, 95, 128, 269, 227, 153, 96, 124, 59, 140, 161, 74, 42, -21, -129, -120, -186, -81, -31, 20, -46, -65, -102, -90, -76, -43, -7, -12, 99, -11, -38, -29, -1, 72, 59, 88, 129, 79, -21, -62, -69, -14, 28, -51, -52, -55, -125, -126, -135, -147, -96, 32, -17, -48, -23, -21, -25, -93, -61, 63, 61, -3, -5, -83, -36, -75, -53, -93, -110, -43, -7, -56, -134, -64, -78, -154, -32, -50, -113, -106, -81, -23, 7, 27, 167, 107, 91, 135, 159, 85, 57, 116, 144, 68, 18, 48, 25, 74, -80, 40, 57, -66, -1, -50, -14, -26, 8, -40, -13, -121, -40, 114, -9, -137, 14, -43, -16, -46, -38, 21, -26, -57, -21, -30, -45, -102, -96, -2, -51, 42, -62, -77, -19, -16, -17, -45, 6, 29, -69, 61, 148, 112, 178, 195, 125, 118, 119, 92, 190, 19, 29, 77, -15, 36, 24]
4944B4r8J9n5L4k5n7J7J5l5J06o2O2l3%J19p2j14O2M5n8lN2J10p7oo0J33P4j28
4973a1Q7K0r0Q3n6Q3l3m6O3n2O3J9n9l0L7k1j07P1ml8M3j00LJ1M8p6R0j17j3O5
5003f7n2K6m2R3P0j11K6Q8l0k4N3qM0n4N6J0K6j1lO0j28j6J37l2m8J0k5n1L2J27
5033A52j20N0j12Qk1Q0m3r0Q7n1pJ3l5l1%k2M6n1M3oJ0k7J19o9N1R2o2j3Q2o1
5063A2J13m7k4k5K2LK3%R%O2j22m2J21p5k6M8rkrL2k7p8j5M6l6l4J8j20O4O0R5
5095C7j53Q8r6Q0r0J20m6M6plM4n1lL9O3o3j8J37j20K4L4M4o9M1m9Q6O2q6JJ6
5125A08m3l8O4l5r8J49j10L2no0j20J02J15o6j44P7M2L3j8j4O0j17J3N9l4Qp1
5152a11k6J17j15J13j14N6N6O1q4L9P8j25j2P6m6R0L4p2N0o7pn1J09n4K0l8Nl4
$$ y = [24, -74, -55, -110, -76, -101, -158, -141, -126, -161, -55, -117, -55, -88, -88, 31, -41, -155, -93, -48, -106, -109, -57, 53, -24, -30, -90, 43, 117, -11, 76, 96, 6, 89, 33, 116, 83, 37, 100, 48, 111, 130, 71, 41, 78, 57, -50, 21, 17, -21, 22, -78, -75, -64, -16, -92, -2, -119, -132, -67, -119, -93, -135, -42, 28, -83, -57, 31, 1, -23, 30, 22, 62, 8, 64, 74, 100, 89, 86, 146, 18, 2, 139, 107, 59, 69, 44, -7, 25, 152, 32, 82, -30, -22, -43, 37, -6, -96, -9, -60, -67, -54, -89, -120, -120, -142, -96, -147, -104, -110, -100, -127, -8, -77, -26, 66, 4, -9, 73, 12, 125, 78, 54, 29, 51, 54, 77, 77, 86, 86, 148, 26, -16, 105, 30, 4, 52, 43, 41, 32, 64, 37, -41, -56, -10, -46, -80, -62, -182, -118, -58, 37, -116, -28, -124, -44, -134, -14, -60, -14, -21, -24, 20, -31, -34, 5, 68, 5, -13, 124, 4, 28, 62, 106, 37, 78, 29, 115, 177, 91, 92, 108, 65, 27, 91, 56, -42, 107, -3, 29, 24, -36, -156, -54, 61, -5, -149, -72, -30, 3, -15, -29, 31, -86, -73, -14, -48, -40, -111, -137, -20, -135, -22, -136, -80, -24, 37, -47, -8, 70, -55, -67, 9, -37, 53, 87, 15, 65, -2, -9, -60, 49, -5, 15, -23, -18, -52]
5180e2R7q5J5L0l9Q4j04N1k4K8ql6K3qq0P7No8lJ03N2o0q4R0k1k6N4k3j2J13o0
5211B9j9k3M3j60J39j0JK9jJ9l3m5O3K9M5qm7L2o7n1K4M2l2j6j8k7J8J58k20J03
5241cn9J34j1m7r3L8J6K9N7p3K7K7o3LJ2k4O2J0k1K8m0Q9M9n1j9K2k3l3n1l5O1
5272A8q2N5j5Q5q6q3N1k5R9Ll8Q%pO6m4r3LJ2J9l5P6r7K0J8L9j32J28o1K9O6m3
5304d6O9n4N7N0j0l9R2j19r0J22O4n1L3K5k0n1l4M3M4n1j16L1L3n3l7J41n1ql0
5333e6R9r1K6J06j02OK7R8o2k6pK0o4M7l3L6L9j01J2j2L8qO0J6p4P8o6J12j07
5362A1O3ll9J9P8po3J69j27p0M4K9q7O3l9r2M3m1J07n3N9nr8L1l1K6N3n0k3O6
5392C3n4%ml5m9J4L3K2J7Jqp4J98j83M6Q1Mn8r6O0k5J36k5L0n9J4K3p8Q9nM1l6
$$ y = [-52, 45, -40, -25, 5, -34, 50, -54, -3, -27, 1, -7, -43, -20, -28, -108, -31, -26, -94, -97, 6, 58, -2, -86, 4, -17, -43, 11, -12, -24, 89, 29, 10, -13, 30, -130, 9, -1, 0, 29, 28, 47, 14, -31, 32, 61, 106, 98, 51, 83, 16, -35, -11, 31, -1, -17, -35, -62, -44, 114, -106, -3, -62, 72, 61, 14, -79, -41, -25, 4, 61, -12, 15, 42, -21, -18, -6, -30, 32, 42, 21, 49, 9, 98, 147, 96, 77, 99, 76, 43, -8, -43, 18, -64, -9, -24, 61, -25, -108, -57, -82, 17, 20, -18, -10, -10, -17, 49, 5, -88, -85, -73, -54, -89, -13, -110, -90, -72, -33, -165, -37, -98, -69, -3, -46, 23, -31, 26, 76, 66, 27, 119, 0, -90, 32, 96, 45, 78, 103, 83, 32, -2, 41, 85, 34, -82, -51, -18, -71, -108, 33, -18, -26, -56, 43, -48, -22, 84, -18, -12, 15, 113, 51, 25, 18, 38, -26, 21, -12, 24, 63, -38, -26, -38, 0, -8, 52, 68, -6, 72, 6, 118, 11, 74, 71, 32, 51, 129, 122, 59, 228, 101, 31, 75, 104, 17, 80, 41, -51, -8, -49, 58, 5, 64, 59, -39, -8, -39, -13, 40, -10, -33, 33, -21, -21, -25, -60, -109, -95, -62, -40, -23, -22, -30, -104, 94, -89, -43, 38, 42, -16, -112, -52, -77, 59, 34, 64, 5, 19, 42, -36, 53, 48, 89, 53]
5424E3r3m5R6n0M6ql9L8l7q3j9K4l6Q5N8r3J18l8p7J07r4O4N6k0L4m6qL8j0Q0
5454A01K5o9l2L4OK7j09K00j02qm2J2L8q4P4m1Q3j5p1j6mm5j5Q6l7l0R2k2j22
5483h6J2K0JK9M7q8k0J1Q6q7M7j1O4O0m6n3L8oK5M2M9j23M1Kj5J37q5L1j2qN3
5514A55q3n3J6j0q9J13k2m0j09L5L3j09P3k1K2K8j8K1j00J47Jk5M4jL6r7L1q3
5542a05Q6mL7q9N7J83j05n1QQ5m9n7J01L0n4k2N5K3On7k8o4P5o5KP9n6O3j35j
5572e2P7j74O0R5q5L4k9N2p0m5l6R8o0Q1N9l6k0M1rK9P7o3P8j47J86r5n1N1l5
5601A1k5J37r4%o5nO8N5k2o9Q0Nr0lJ6l2J45m6j21L9j1K8j29J03j6O1j17J08k1
5630a0l3j8M9n8M3L4q6J56Ln7O4K1n7k2QO9j4m6j05J58q1l6N8L3n5J00m5m4m9
$$ y = [53, -40, -85, 11, -39, 7, -1, -40, -2, -39, -122, -141, -117, -153, -68, -10, -103, 15, -23, -100, 7, -87, -23, 33, 13, 47, 1, -7, 31, 21, 101, 126, 57, 25, 59, 65, 92, -17, 183, 81, 73, 31, 43, 81, -3, 71, 30, 113, 98, 27, 11, 7, -38, -53, 33, -4, -34, 58, 36, -86, -74, -54, -53, -24, 23, -65, -85, -74, 12, -75, -28, -39, 25, 85, 39, -14, 24, 18, 43, 85, 134, 11, 52, 54, 39, 176, 91, 122, 110, 102, 155, 72, 19, 35, 25, -64, 49, 27, -13, -122, -87, -54, -163, -90, -111, -89, -61, -79, -58, -158, -11, -10, -35, 9, 8, 44, -53, -22, -105, -19, -23, 14, -75, -18, 165, 60, 9, 17, 102, 53, -4, 97, 127, 73, 51, 106, 129, 135, 78, 50, -14, 61, -4, -2, 77, 21, 84, -51, -52, 25, -149, -89, 6, -79, -45, -74, -22, -92, -137, -173, -75, -135, -54, 5, -31, -51, -10, -19, 10, 87, 24, 102, -45, 141, 46, -5, 46, 11, -14, 123, 29, 29, -36, -41, 27, 82, 60, -9, 71, 76, -14, -17, -1, -33, 112, 66, -55, -16, -27, 1, -128, -25, -41, 20, -97, 11, -10, -43, -61, -12, -70, -27, 7, -79, 77, 80, 23, 87, 108, 51, 29, 37, 106, 92, 46, -59, 99, 18, -18, 40, 73, 18, 118, 73, 29, -20]
5659b0k1M7kj59J43k6n5M2L7o0Pm1P1rk8N4m0O1L3q6L4J9o5J7JnO2j9j04R1O3
5690D2l6k6L4L8K7o4K1L8l4K4M9o9L4m0K3o7j0K3O2p6m5J44l0j58L0R4m8J7n9
5719f2N0m6m8L2k9K9J9j29J25m4P0o4L9L3J9J2j10N8qL3K3n1J5O2j22J18R3j7
5747A00ro5o4R2m2OJ00m6r0J13j55kJ54p4q0J3N8O5k3l4k0k8m2R0l8N8q9JJ0m6
5777h7J71j89PRL9M4kk6ONl4R4p0Q4l8O2n4O2l9%P9j5r3l0J08j11K3J4L7L5l3
5808E8m6l4J39r2j1n3PM0p0P7m0R2p9N6k8N1q9Q7J8k1o9N1KL3j15R0m4p4Q8j1
5838A3p9J16o2J5l3Q1K5r1R0k1q9J68j08O2j02K3N1j6K7j31RK4l5o2L5k7N9j8
5866g6Mm7M8n4m5J59n5K9j0n7K2m0J20K2k4jl1J50j01J7K1n0kP8k0l9l4J5L9l5
$$ y = [-20, -41, 6, 4, -155, -12, -38, -93, -51, -14, -74, -67, -108, -37, -46, -74, -20, -60, 1, 34, -52, -18, 1, -64, -47, -46, -51, 11, -8, -112, -21, 42, 6, -20, 14, 52, 79, 15, 36, 74, 40, 64, 113, 44, 78, 38, 61, -6, -16, 7, 69, -7, -52, 92, 62, -96, -66, 28, -20, -3, -62, -12, -58, -106, -74, -103, -74, -55, -184, -59, -103, -33, -97, -58, -25, -6, 6, -104, -46, -54, -21, 2, -49, -34, 28, -94, 24, 117, 100, 91, 26, -38, 54, 12, 18, 118, 72, -18, 95, -60, -62, 92, 18, -62, -49, 9, 74, 51, 17, -3, -31, -73, 17, -21, 37, -52, -51, -41, -87, 84, -105, -98, -89, -50, -6, -8, -34, -28, -23, -57, 37, -33, 51, 13, 75, 21, 83, 44, 44, 123, 108, 15, -15, 93, -18, 5, 19, 56, 91, 58, 12, -22, 117, 25, 14, -39, -32, 8, -62, 15, -25, 67, -12, 44, 16, 67, -22, 65, 83, 62, -7, 44, 46, 79, -36, 54, 10, -64, 24, 13, -66, 50, -12, 3, -30, 51, 76, -15, 75, 54, -35, 133, 25, 87, -15, 8, 59, 43, 70, -61, -52, -28, -63, -125, -90, -117, -58, -76, -72, -119, -71, -125, -170, -11, -66, -37, -47, -104, -82, -122, -2, 20, -4, -5, -36, 114, 13, 30, 51, 1, -1, 77, 57, 18, -16, -1, 38, 3]
5896CM8j0mk4k3P6o1o6P2o5O8p1K1nL2m3J39j14N5m9o6O2k8R0k2j0LJ5q3L8lJ2
5928a3J2j1P8p8J62j75L4Q1k8P9j05N2J6o0m4KP8K3n0o0L4qm9L0m8O6no1Lm4R1
5959BPj15P1n3J05n9K2p4o2N9l8j4N4N6l3J5j03J31j6O8J2j63J63j45J17j28J27
5986Fq0J38m7K9l5Q2j5JK3m8j47R4n2K3J7J6Oj17M0l0J6QL1K5K4K6j35M7L9J6
6016AQ6M3j12K6j2q5O2rK0R9q5n7L3J43j43rJ10o9Q5j26J33p9j0O3p0K5PK1l2
6045E9q5j2Q5l2K6l7M3l3L2j09l9J04n1jRm0m3Q4n1l8Q1k4QL0j2J27j34M0R4n6
6075B5l7K4R4K4j38J45j37P7P7j23k4R5j65J17j05J9j3j5K7p4J16K5j62k9J24
6100c3j7l9M8l3R0o2NJ1q2J29J3r6j5O5K9j00J19J4q1m7P2J05p9P7k8o0l9J34
$$ y = [3, 51, 41, 37, 13, -10, 66, 5, -61, 11, -54, 14, -57, -36, -41, -9, -52, 87, -27, 28, -21, -87, -25, -53, 37, 15, 5, 8, 23, -60, -22, -25, -13, -1, -12, 66, -12, 150, -25, 9, 90, 62, 141, 36, 88, 104, 44, 0, 2, 80, 103, 53, -7, 27, 19, -30, 0, -48, 18, 13, -48, -45, -89, 2, 9, -106, -35, -88, 17, -42, -20, -94, -156, -97, -135, -149, -95, -39, -72, -57, -160, -29, -45, 23, 35, -128, 35, -110, 7, -121, 6, -74, 64, 17, 46, 11, 93, 78, 79, 102, 54, -93, 1, -51, -28, -11, 5, 11, -106, -66, -96, -80, -72, -41, -16, 8, 34, -101, -54, -15, 1, 87, 130, 18, 44, 32, -53, 9, 0, 20, 119, 34, -23, 10, 153, 10, 1, 111, 42, 127, 1, 134, 55, 45, 108, 38, 63, 70, 91, 59, -26, -38, 47, 15, 41, 4, 47, 14, 46, -63, -102, 2, -49, -50, -41, -81, -124, -40, -91, -129, -48, -72, -64, -34, -46, 81, -53, -13, 81, 25, -12, 12, 106, 130, -8, 137, 0, 77, 154, 31, 7, 102, -63, 54, -51, -32, -45, -60, -33, -107, 9, 34, -128, -157, -33, -50, -89, -41, -74, 16, -46, -41, -30, -112, 17, 30, -66, -81, -16, 13, -87, 32, 46, -35, -82, -10, 95, 16, 93, 65, 5, -34, 100]
6128A00n3j3Q0po1N0n5k0n6K6O1L6j07p9R5J8j3n9M4k9L8p7P6rN6Rr8M0o6k2J18
6159B3j21Q2l9K7M3r2M1J02p5p6N0L1m1J31j47L5k0N9M6n2RN4oo5K5R8j01o1L8
6188bl0J15m4l7J52j97j2N2mk6K9M4rp4Qnk9j0R7m7L4m1m9J45l7l6k2l7R9R9o8
6219E8k1qj7N9r0R4n1L3p7M1N2%k3k1J2Q1o0k2M3j28K0J12j29Q0j37J32j04L8
6247c3j3m8M4mm2j4O2m1P3l3m2j0L4j4N9OR3n8kL2Mn6r8J08J7j06M4O6N2l0m7
6278Cm6O3lM8n5K9j9l6N8k6J4J06m8q8Rl9L4l4n5j9O5k1l2K0j5J08l3l8j22K05
6308C3q4m0m6J29j3pJ57j10o5J18L5m4n8J17l0o8J4p6L9J7L1j3j5jJ9j0r6R8r6
6337f5O6K1N8q7k6NK4P7m8n8J2M2n0M2j17J53p3n9J0O3o2j2l4J36j35R7j03K7
$$ y = [100, 47, 34, 114, 107, 46, 96, 41, 21, -35, -9, 52, 88, -19, -98, -3, 15, 2, -57, -13, -42, -4, -81, -5, -14, 42, 51, -47, -7, -73, -95, 23, -98, -16, -55, -28, 15, -77, -36, 66, -9, -85, -35, -4, -45, 86, -61, -26, -46, 13, 59, 7, 16, 70, 64, -1, 24, 122, 21, -40, -2, -32, 83, 39, 2, 154, -43, -55, -3, -7, -33, -4, 40, 31, -43, -35, -40, -69, -79, 18, -29, 5, -36, -85, 60, 23, -13, -35, -72, 27, 126, 58, 37, 29, 12, 71, -19, 75, 24, 57, -20, 21, 73, 73, 50, 29, 41, 122, 62, 40, 83, -45, -25, 87, -42, 38, -99, 33, -71, -33, -46, -94, -50, -54, -96, -110, -48, -89, -16, -49, -91, -101, -67, -81, -22, -16, 77, 19, 17, 49, 53, -3, -101, 7, 24, -82, -38, 28, 80, 50, 3, -43, 20, 17, 65, 10, 39, 20, -16, 42, 16, 30, 136, 88, 0, 9, -30, 4, -30, -85, -104, -39, -60, -92, -72, -87, 21, -12, -50, -172, 33, -51, -91, -137, -8, -21, -28, 129, 19, -46, 72, 107, 63, 5, 122, 92, 24, 38, -38, 1, 18, 49, 36, 21, 20, 39, 29, -67, 31, -65, 1, 22, 80, -7, -33, -28, -4, 73, 25, -33, -21, 21, -29, 13, -104, 49, -24, -83, -73, -10, -72, -84, -118, 18, -117, -20, -123, -96]
6365i6J34q4L2Q7QJ6k9r8J55p0No7Q6NLm6j1K2o8j3nJ01o8J8Kn8M8o5M9M3NQ0
6397A21j95J57q0j9M4l2Qn9K9J2j2k8nnLJ6nQ5mp2M6L6p7Q3L8m6p4P2K1N1J1r8
6429B2pj5pK7q7M0Rl7J21j49J1k3%K4M6r2Q8l8mJ24j42N7K8r7R9r5M7Q2pm2J4
6460cL8m4P9l0J0J7n5O3J6q5j6M7k4L8N8Pq5M2J21j31l0m4R6o2LL6k0m6L1L6m4
6491A9l8K2m1n0Q3kM%p3R0J0r5K5K1Q4J5m3o2J68j15M7k0j1k7M6o1lP5o6k8P5
6522D9lj27L7k2P1j6m6J15j29J9K2J1J2j3mK1q3k0N0N1n1ml0M0n5J00o5Qkj21
6552a85J26M6p3K5N0k0M5M9j07J6R4j1K0M6m6m4R6k7n9R4r8R0n1n6j3q2P8O6n9
6581A0Jo0O1r0J53j22k4P7K1q3J9L1K8l9o7Q8kP5k6j09N3MO1jr8R1PK4p6L0l1
$$ y = [-96, 38, -46, -14, 73, 81, 97, 68, -30, 125, 55, 60, -7, 79, 84, 87, 41, 30, 52, -16, -29, -34, 67, -1, 17, 19, -39, 9, -56, -7, 36, 41, 121, -74, 83, 3, -16, 28, -4, 4, -55, -26, -14, -26, -54, -59, -64, -61, -45, -50, 35, 31, -41, 5, 41, -36, 47, 85, 39, -35, 37, 58, 109, 120, 22, 15, 0, -7, 20, -67, -27, -18, -55, 66, -83, -72, -95, -95, -71, -25, -117, -29, -67, -71, 53, -89, -32, -4, -101, -2, -97, -50, 32, 25, -17, -3, 35, -9, 70, 40, 50, 67, 12, 75, 91, 6, -10, 37, 13, 51, 109, 116, 31, 73, 194, 63, 33, -11, 85, 23, 26, 62, 42, -4, 27, 63, 19, -19, 3, -38, -88, -5, -7, -3, -3, -76, 14, 24, -71, -46, -25, 59, 74, 31, -31, 137, 22, 69, 49, 38, 11, 57, -4, -7, 68, 2, -26, 49, 46, -81, -44, -66, 5, -11, -57, 58, -71, -52, -30, -19, -7, -20, -24, -3, -86, -106, -56, -5, -56, -60, -90, -50, -105, -5, -70, -62, -64, -185, -59, -13, -86, -61, -11, -31, 14, 63, -44, -28, 66, 55, 75, 121, 75, 31, 127, 100, 41, 135, 37, 127, 76, 20, 7, -75, 3, 69, 10, 11, -49, 12, -78, 75, -47, -71, 6, 27, -56, -37, -6, 22, -17, -84, 4, 2, 77, 51, -58, -5, -1, 60, 59, -39, 52, 59, 83, 7, 37, 6]
6612FP5n9JM2n1k1R8L3Om0q9M6j07R3nn4P5p7k3M5j4j0q7P1N1m4n3L3n8N8K0j2
6644e1M9m4j4oN1m6M1M6l1MN9j5j4mkK2m0j6J26j01M6Q%n7j26J97o4M0l7N8r2
6675a3K5o0L5PM9q2P8j32P8j08J07Jj07J34k0j3oN4j44J01O1n9m3P7J6lK7jK3
6704H2k4K7L8k5r4J08j07K5Q8o0K7rl8M8j7m3O0q9O0r8J0J8P2q8m7M6J7m7J4M4
6734bm1j0N6m5J9n5K2m7lN4L9No8J7K0N3j1l2o9O3K8N2J6k8p8Q5p6QJ04n2pr1
6766g4J92k0o8J04j08l8N6J3o5L7J0M8o7k6Q8r2p0N3k1L9k0N5j07J4J7o2J70j12
6794e4R9J5J3m1j3k3O5j8K6m3Q1n0rQ3p2mN7l6l7k8M2j5L2Lm7lm5j6j2K1M1K3
6826C5jK5L8j46J16j13QN4lp5R2j00R5q8P0j51K3P4K5n2O5M4n7R7r2J38q6O4m4
$$ y = [6, 81, 22, 23, 65, 14, -7, 91, 124, 130, 90, 1, 47, -60, 33, 28, -26, 49, -28, -51, -6, -20, -30, -117, -46, 5, -39, -92, -59, -117, -59, -39, -51, -2, -46, -60, -66, -15, -61, -20, 26, -5, -1, 58, 43, 29, 25, 23, 45, 5, -11, 115, 14, 60, 68, 68, 11, -115, 82, 18, 58, 21, 79, -13, 12, -48, -13, -6, 43, -39, 39, -93, -15, -123, -16, -15, -122, 12, -8, -21, -27, 27, -117, -16, 45, -14, -57, 20, 36, 33, 60, 59, 82, 58, 85, 123, 98, 4, 112, 5, 30, 118, 58, 85, 76, 38, 86, 69, 26, 86, -3, 57, -41, -31, -13, 59, -29, -76, -30, -13, -60, -46, -2, -43, -53, 3, -42, -23, -78, -56, -103, -106, -52, -13, -8, -76, -59, -39, 14, 3, -29, -98, -35, -7, 45, 61, 33, -45, 40, -36, -28, 76, 24, 17, -74, 118, 98, 30, 134, 26, -12, 44, 57, -8, 29, 39, 87, 20, -6, 82, -10, -80, -27, -48, -9, -29, 26, -81, -67, -50, -112, 58, -54, 45, 60, 73, 32, 19, -4, 61, 43, 69, 26, 107, 57, 48, 131, 59, 55, 112, 76, 39, 11, 53, 38, 70, 73, 26, 23, -22, -38, -50, -29, 12, 35, 34, 59, 97, -49, 67, -46, -38, 16, 13, -62, 30, -70, 25, -63, 7, -144, -121, -47, -22, -74, -9, 35, -22, 75, -17, 121, 35, 99, 55]
6855E5K5k8nJ7Q3q1P2n2k5k0l0K8m3P5m4M9p8n9l4J15r0P6n4K1r9J31j4Nj04J20
6885A2j1J4o7ML7LloO6j07L9QM0q9L8O8o5PP5r1J22l0Q5lNk8n7J90p6j80J51n7
6917I4j5m5M8n6q3P4m9m0M8n4Jj25Q1R3m8m5L7Q1L2p8n2R0k9Q7N7j73J17lN5r0
6947A0J0N5L0j22p1O8J03J2JJ8j9O5j22J31j55L5J25p8n0l3J16k2l5n5k6P5l7
6974B9pk6j2l9k2k0L2o8P9p0Q7j9jJK9j6m1M6m8K73j78J6m2M1M9m8K7pl9J4mm1
7006b5k2l7J17n4p7J32pRp2J5K7Q2o3pl7O6k8m3oJ34q4k8P0r2J4N3q5q1J32l2
7036b9j3M8k1O0j3m7J18o4Jj0JL5l0NPM8L8q3o6J72j9p7m7M7ml5Q8j70J7Nl4K0
7068e2O8q4M7j6KP5r4J18r7R1j2M0l0o1K6k7kRr5J03n3J20kn9M5n1K5o8Q4m3L8
$$ y = [55, 80, 52, 47, 64, 147, 66, 138, 86, 61, 41, 11, 39, -4, 71, 27, 76, -2, -61, -95, 20, -70, 6, -48, -27, -126, 5, -9, -4, -108, 12, 1, 15, -52, -48, -11, -8, -11, -17, 49, -58, -19, -11, 29, -60, -22, 46, -19, -12, 63, -28, 94, 64, 149, 146, 151, 123, 66, 256, 180, 0, 151, 94, 79, 34, 82, 26, -57, 17, -32, -72, -24, -78, -77, -202, -121, -28, -76, -121, -84, -3, 29, -49, -101, -11, -40, 47, 104, -69, 48, 45, 100, 10, 20, 75, 105, -17, -88, -20, 83, 95, 96, 114, 95, 160, 38, 169, 14, 49, 174, 96, 46, 13, 129, 107, 72, 17, -9, 66, 29, 22, -4, -16, -55, -77, -97, -65, -133, -54, -124, -37, -56, -57, -56, -27, -43, -84, -38, -86, 187, 9, 25, -17, 24, 73, 25, 52, 45, 6, 20, 16, -25, -47, -84, 33, -21, -98, 34, 27, 36, -36, -21, 6, 88, 25, 18, -19, 47, 19, -24, -30, 104, 20, -8, 62, -30, -16, 37, -48, -129, 3, -29, -42, 6, -15, 45, 32, -15, 103, 39, 40, 30, 31, 66, 36, 41, 48, 96, 134, 51, -15, 157, 138, 61, 14, 61, 57, 22, 110, -60, -43, -38, -72, -52, 16, -68, -21, -37, -35, 40, -54, 64, -33, 58, 46, 86, 56, -5, 21, -6, -8, 1, -94, 9, -44, 76, 74, 15, 60, 9, 34, -34, 50, 7, 45]
7099D5J0p9K6m6J6M6JO0o9J43j93K9O1p9m8K1K6l0jk6J8o9K8J05r3lmm5N7n0Q8
7130e5J04j88K01j64K05o9m7M7J8j1J9J08j21j0kn5N3J4K0l2O4m2k3l1N2o5J2
7157BK6n3j7P1Ml8R8n6J9m7pN2q0P2m5m6K0l6l8N6%J70j01m6O3R4o0j9N6l1M7
7188A30j8j6o8O5J0q3N0P0r9J6o0P9n6K4J1o3k9R4K8j65J17l7K5j18kJ1J6j8L7
7217d9K1n1n2P9%j0Q1n6O4p3N7N3r5k9J14r0J9M9K3k9O5n1k0j5N3O9l7k3k5J4
7247E6k5j8J6K4r4O8kk5O3l1k6jk1k6N9j02M1L4J3l1M8J9n2l6M7om3O2k4M5j26
7278i4rJ31l2qO1n4M1Q1p9m2N9k2O0n9R2j7rk2l2q4J0J32j26r2R3o3Q2n3L7k4
7308d2O0q6O6j21J36j58J58q5j5L6M0K3q7J1O8o1qPp2J11J0N9m3n2KQ6k5K5n7
$$ y = [45, 55, -24, 2, -44, -28, 18, 19, 79, 10, 153, -40, -11, 50, -29, -77, -56, -30, -60, -61, -87, -69, -138, -110, -5, -98, -101, -105, -150, -93, -143, -55, 49, -139, 62, -102, 103, 34, -13, 34, 52, 41, 60, 168, 47, 37, 35, -20, 33, 47, 67, 35, 99, 57, 34, 3, 55, -10, 2, 28, -25, -42, 29, 33, -5, 93, 37, 56, 9, 2, 54, -26, 46, 1, -45, -25, -61, -99, -43, -43, 127, 26, -20, 43, 137, 77, 58, 114, 83, 130, 112, 96, 28, 93, 103, 20, 70, 140, 41, 57, -3, 76, 20, 44, 55, -8, -37, 57, 85, -80, 37, 0, 25, -93, -95, -84, -68, -86, -49, -28, -79, -131, -52, -52, -62, 19, -37, 27, -46, 11, 64, -31, -60, 54, -36, -17, 32, 55, 26, 91, 40, 20, 5, 58, 127, 90, 67, 42, 56, 31, 13, 29, 53, -41, 27, 25, 0, 63, 32, 6, 5, -16, -42, 17, -85, -44, -10, 3, -28, 20, 39, -13, -49, -2, -8, -51, 11, -13, 32, -94, -103, 28, -4, -12, 49, -5, 36, 117, 38, -4, 55, 33, 93, 34, 126, 109, 100, 78, 46, -38, -28, 104, -22, -114, -21, -84, -2, -55, -18, -42, 18, -68, -2, -123, 13, -145, 13, -72, -87, -51, -11, 12, -75, -64, 4, -57, -65, -58, -130, -19, -9, 50, 7, -45, -43, 43, 18, 43, -14]
7337a4P3p2J20l5L1k7M3J4k4l2L6jk0j29J14q0j0L0k7Nj17M7o1J14p5P4r8M7Q9
7366A5O4nj19M2J4j3j9k5lj3N0l3M5j4POj07R1M7P8p7J5O3n6Km3P5o3j7O5m5Q0
7398A07l0o9j7k3p9M0O9j2j3N1p3k1kP0r0k3P9j57J23m0R2nl9j0P4j0nP6m9N0
7428F4p1Q0q6K1M4MNm4KL9Jp3J5L9o5L6q2J10J5L5p7j7Q9No6L4o4q3M8p9qQ0p0
7461a19N6l0l1n1J15l9o2Q4K1L1P0ML1p7Q9j05J02k6P7j30R8K5nO5j36noJ1J18
7490A75j94N3j1j03O9j9k8k7K8Qo8Q1j04J49N5k3J2p1J6p8R8Qq3mM1L6N5j45L6
7519c8O6j41J29m7l3R8M0lq2O3p8J6P8N1j2o8J13Ql7N1p2L9r0l4qNm0j7R9q2O5
7550C9k3J1j00on1J35j11N7q2O1L0KK2p9J48j53K3J5J3KJ5K7J2j08M8j2OJ08q0
$$ y = [-14, 59, -13, 107, 72, 103, 76, 119, 133, 109, 77, 113, 112, 92, -37, 77, -3, -13, 17, -10, -5, -122, -75, -136, -22, -97, -23, -121, -74, 15, 79, 74, -45, -3, 11, -2, -21, -46, -49, -62, -12, -45, 0, -14, -7, -1, -108, -17, 30, 108, 31, 46, 109, 53, 55, 12, 87, 24, 7, 72, 27, 107, 77, 8, -9, -32, -111, -71, -2, -14, -27, 24, -49, -70, -72, -2, -92, -115, -36, -193, -70, -110, -18, -23, -62, -72, 2, -8, -13, 63, 14, 64, -7, 73, -13, 8, 52, 56, 61, 17, 19, 58, 59, -14, 1, 40, -25, 11, -71, 39, 54, 89, 12, -5, 84, 89, 23, 57, -7, -90, -42, -121, -129, -49, -119, -63, -93, -124, -175, -60, -99, -161, -77, -56, -25, 45, 49, 80, 3, 92, -13, 89, 63, 140, 10, 108, 133, 128, 193, 57, 52, 46, 57, 175, -19, 34, 23, -80, -11, -30, -58, -85, -57, -49, -117, -36, -140, 9, 64, 41, 53, -18, -2, -80, 18, 26, -57, -61, -20, 16, 71, -74, -38, 28, -113, 16, -31, -64, 34, 74, 71, -11, 52, -26, -10, 68, 119, 107, 39, 152, 160, 123, 174, 102, 141, 51, 17, 9, 14, -26, -43, 56, -26, 39, 16, 27, -73, -79, -130, 5, -106, -49, -131, -70, -40, -38, -16, -95, 53, -100, -77, -62, -49, -47, -32, -5, 7, -101, -53, -65, -59, 49, -31]
7579c1K4p3J07l8o2J11K7o8J0k4J19k6m6j1Q5o6l4R1j28MP2l9l5N0l5j8o1J46
7607E1j22P1n3p0O3J9R8j65J05O3j05M8j8PO8j1o6L8k0NL8N6p9P4j14R2ko0K7
7636C8N4k2o4J2j3RK0j2k6OM3K1jL4j40K0R8j24M8n5K0N3j07J5J25q1J7J5r7R
7666h5K8N0J7o6J28q6R4Lo9k5j7J07o7J7p0M9m5M8l6m2N1J6J6%o5J0K7J2K6j01
7696g5K7K7p4N6L0K3l7n1L8k7m0P2k2R2k3N6p3LO8j24K9J0J02r8M2k1L0K5j0m1
7726A4o7N9N5K7r7L0M7p8J7K5p3M4K0j2Nl6m5O8q0N4L4m4RN3r3J53o6l8lO0Mj05
7758e9P2j0m1M2l5P0o2m9J10km1qJPmJ4p3O5q2O7K9l9Q7k2m1k5J19r4n6J08q6
7789c8p6Q5K1K2J4m9K2J5k3k1J9L9k6%K5l9rOJ1k8L8j12O7m6R4r7Q8n0P2N2q1
$$ y = [-31, -7, -80, 27, -11, -73, 38, 65, -3, 7, -17, 102, 76, 30, 19, 104, 38, 4, 95, -33, -29, 43, 4, -31, 19, -16, -34, -95, 51, -71, 0, -53, -123, -60, -41, 57, -108, -3, 60, -45, 3, -15, -8, 60, 49, -17, 21, 1, 6, 44, 100, 21, 95, -19, 73, 71, 11, 38, 92, 70, 6, 18, 5, 14, 34, 22, -4, 2, 45, 66, 65, 99, -41, -21, 77, -47, 1, -54, -34, 19, -88, -73, 52, -29, -12, 3, -94, -85, -57, -7, 10, -56, 72, -14, 80, 83, 14, -11, -28, 79, 12, 29, -41, 8, -37, 11, -25, -67, -16, 0, 16, 16, -49, -39, -12, 0, 26, -75, -48, -21, -95, -39, -9, 14, -23, -74, -36, -63, -103, -31, -53, 39, 16, 72, -1, 2, 70, -54, -25, -15, 87, -11, 31, 10, 40, 65, 55, 14, -53, 6, 61, 88, -9, 21, 68, -10, 7, 32, -41, 3, 23, 11, 16, -20, -65, 3, -77, -23, 11, -33, -24, 29, -64, 89, 23, -15, -18, 42, 46, -59, 13, 3, -38, 4, -31, 39, -23, -72, 38, 36, -5, -13, -12, -5, -9, 5, -68, -3, -85, -18, 11, -28, 59, 37, -4, -29, 90, -4, -60, 48, -38, -114, -29, -8, 14, 28, -21, 1, 16, -7, -28, -9, 30, 4, 4, 29, -10, -19, -13, -2, -30, 8, -104, -37, -83, 11, -86, 2, -48, 24, 76, -5]
7820eL8Q8j42j3N3N5j18Q6N5n5j6N6pm6j7KR4m9j13R5M0j18k0N4r1L5M0j7J7m6
7850f5JN3Q3j18k6K6k0N5Q1q4J1K7J3k2%K8l3L1r8L0j2N2j6Q3j08oN0J04qp0Q
7881E0L9J6q7N9m5m2p6R4k5l4J16j70K6P0N4r0m6M8J2p1P7L6K8p4R6p1Q2lM9q5
7911C3O0q8O0K3m6K5N8j02P2M7j29p%J03Lj29l5R0q3J39o0M4j27L9J5qjm5J03
7940E4q2L8k3Mmk1L6k1l0P9m8o6JK9k6N9k4j8OK3MN5N5n2k2M5Q8j32M3j9O3j25
7972c1J39j00j24R5M7l6j2L9n5m6L7N4n3lo6R1%O4p3P4o8R5q0ML8p0R1j3j0J0
8002C8M1k4n3j6j4L9m8J00m4J06j54P8Nj04J51n0p4R0k3m9O7p9%P2j9k6N6j9J6
8031F3l8q7P6K6q6q9R2q2O7ql4L5ok2N8P2j05m6J24J9l7K7Pj3l9K1j5J3J5J10
$$ y = [-5, 33, 121, -21, -34, 19, 74, -44, 42, 97, 42, 26, 82, 75, 29, 12, 14, 108, 59, -54, 41, 81, -37, -57, -3, -94, -59, -19, -36, -19, -65, -64, -11, 72, -46, -72, -46, -66, -11, 70, -14, -3, 24, 37, 15, 15, 43, 10, 41, -57, -27, -39, 13, -3, 80, -28, -34, 16, 120, 112, 42, 50, 89, 105, 18, 77, 32, -10, -86, 8, -17, -51, 65, -105, -79, -9, 45, -45, -91, -43, -31, -102, -25, 11, 39, -35, 61, -10, 72, 69, 118, 33, 93, 5, 65, 88, 42, 67, 125, 23, 95, 142, 13, 6, 6, 109, 112, -17, -52, 38, -45, 94, 34, 78, -49, -10, 5, -3, -4, -49, 54, -28, 10, -13, -9, -13, -34, 2, -19, -49, 30, -18, -84, -83, -54, -80, -21, -45, -63, -57, -34, -30, 25, 80, 28, 6, 51, 139, 7, 50, 31, 94, -31, 108, 8, -116, -21, 26, -10, -22, 17, -38, -84, -47, 7, -46, -49, -115, -24, -24, 40, -33, 41, -27, 68, -12, -8, 30, -40, 51, 38, 28, 38, 79, 55, 2, -14, -28, 11, -37, 63, 19, 125, -29, 49, 54, -50, 101, 51, -23, 67, 44, -5, 62, -17, -17, 55, 36, 10, 66, 47, 63, 25, -62, 14, 40, -46, -135, -43, -125, -58, -66, -100, -65, -71, -93, -35, 37, -68, -114, 10, 29, -8, 19, 26, 13, -26, -5, -20, -7, 8, 118]
8061A18Qo4j33N5kL7j2J6L5m4Q8o8n2L4k4l1k4J05L6J4j66L6J8K0n3K3Q5j45K6
8090f4Q6n8j13R9lj4K5m8N0J21r7J2Q5L8j00M8o8K5L3p9J18J0l5N7o5m7J6k1L6
8119D7O9j00km3Q9j10J57l6lj5j32J44q1n7J0P8p0k7o3l3J7M6L9lj34J18Q1r5
8147a09J07o9K0Q2Jj11M6m4J29K9j00P0K7J3j08QO7n8R1n7M5nq2k1K4N8j08P6
8175B1J8p1O5k5n1Q1k7NJ1m5j18J42k7Q6j59R0
$$ y = [118, 126, 62, -71, -16, -18, 19, 7, 23, 58, 14, 102, 34, -18, 16, -8, -39, -63, 42, 78, 92, -74, -38, -20, 0, -53, -30, 55, -90, -64, 22, -36, -149, -50, -53, -67, -42, -90, -40, 81, -16, -4, 81, 119, 19, 67, -1, 24, 57, -22, 96, 106, 71, 128, 63, 16, 32, 11, 47, 116, 16, 14, -29, 60, -50, 107, 71, 68, 53, -79, 65, -16, -73, -63, 15, -55, -82, -145, -178, -161, -115, -76, -79, -213, -95, -14, -109, -2, -71, -51, 31, 32, -79, -33, -77, 52, 81, -19, 51, 78, 91, -17, -9, 58, 0, 91, 34, 79, 74, -8, -29, -5, 53, -55, 21, 39, -32, 33, 8, -43, 38, 11, 16, 27, -18, -136, 6, -21, 65, -94, -4]
8191d
$$ Imaginary data points
##PAGE= N=2
##DATA TABLE= (X++(I..I)), XYDATA
0@%%%%%%%%%%%%%jJ7l2L2l3L4m9O5q1R7j14J30j46J78k11K44k76L09l43L92m56
34b44N08n65O43p17P99q96R94j108J236j367J511j671J842k029K237k466K716
51A423k993L300l640M020m448M934n489O137o900P806q915J0306j2106J4546j8049
66a0068K3546l3461N6878k12328j79469L53373n828j75793P4082K58583p7987
77G1528j92276P5528K04779l2393p8929Q1492Q6958q4853p9851J2474J9624n975
89G8106K7846o339m6274m970Q761q2047n1739R4859P8763p7884m7010Q1826P482
102F1380j24295j3503J27369L0219q1461R871O1148n7331q6038L9541N7449l3146
114h797p398N8059k3540q9390J0822O1370l7008l3816R3147N8264r4344n6495
$$ y = [0, 0, 0, 0, 0, 0, 0, 0, 0, 0, 0, 0, 0, 0, -1, 16, -16, 16, -17, 17, -32, 33, -48, 49, -65, 65, -81, 97, -114, 130, -146, 163, -180, 212, -244, 264, -301, 342, -375, 424, -472, 522, -586, 650, -717, 794, -877, 965, -1064, 1173, -1293, 1423, -1570, 1730, -1910, 2110, -2338, 2596, -2893, 3244, -3656, 4150, -4765, 5541, -6565, 7981, -10068, 13478, -19983, 36895, -175433, -354902, -1529, -7357, -183150, -109068, 149515, 71528, -120748, -45220, 159559, 127166, 48237, 129729, 216687, 131834, 51983, 64457, 84081, 78106, 105952, 99613, 53339, 48369, 57130, -24917, -76656, 18203, 96966, 19082, -27928, 53898, 61380, -62915, -76418, 50951, 81170, -291, 9580, 70728, 13397, -72641, -33100, 24349, -8797, -16195, 41864, 18324, -71066, -60244, 1126, -35882, -69698, 23449, 81713, -12631, -69126]
126f9126Q3843L1449p9497J2935J25023J7726r8621j2242O9629j2332n8124L4139
138D4802O8060j7620n1054p616q352k9531L18J4127j4813k130K2175l2043o9570
151h3247J0166O0609j8065m7738N0944O5053n9907p8924N0172O9660m6161m4293
163g1731P0574M8614p7375o1100N0344L5193m8140j5947N5094J5665m8098j9657
175f6564K5222R401m633J7563K2635N573L734O11j3609J047L2179J6581j6282
188C3458L688K6929j6064m6488M100L6930j1002l2787J4734J8203l8751l7054
200d4104J8105J4634k4669n236K6417m339l1221L522K2036j0284p728L4414K2337
213A3884k2884m704L3637L302k8164J6727M5788n969l2070J5329K5003k6515k6715
$$ y = [-69126, 14717, 46166, -33331, -20396, 104627, 122353, 23732, 11490, 81119, 68787, 10663, 44802, 112862, 95242, 44188, 36572, 28220, -1311, -993, 13134, -1679, -3809, 18366, -13677, -83247, -73081, -12472, -30537, -78275, -27331, 37722, -22185, -101109, -50937, 18723, -27438, -71731, -1157, 47457, -29918, -91018, -40674, -5481, -53621, -69568, -14474, 1191, -46907, -66564, -41342, -31941, -36574, -19011, 3624, 9197, 12931, 13542, -67, 980, 33159, 49740, 33458, 37146, 64075, 48011, 1523, 5623, 42553, 31551, -1236, 13498, 31701, -7050, -44104, -25999, -11365, -36034, -41270, -14853, -19192, -50413, -46891, -24855, -35139, -42867, -8453, 13884, -9000, -13704, 19933, 23235, -4929, 11798, 57586, 51617, 19547, 34876, 59879, 33364, 6649]
226F649K6510K2531k5951j8820J8198J844k9570p141K0386O18j6710L322R334
239A1200j2468j2126P423K332r045M457J0409r550j2900O289L847j2635r25J6860
253f832K550j4066q3J1685l109q681R386J3832l103m749P932L921o669R87Q808
268A1809m74l042O537J766j0012k429P048l921r402O161Q374j0024j1871O392
282c088N393j1026n331J2701N115j3191m360J1554J161j1509J511J2389j238r431
296i350L150O953n315o718M592N164l038k209L763L95m788p47M846J863j423K374
312d88M007k028k988L496M543r90q78M172K589k809k146K462K284k468k500K467
328H725K762l875n403R28K130m475m371K958K717m984n321J483K774k462k928
$$ y = [6649, 33159, 55690, 29739, 10919, 29117, 30961, 1391, -5750, 14636, 15254, -1456, 1866, 11200, -1268, -13394, -5971, -3639, -12684, -8227, 2182, -7368, -20268, -13979, -10132, -22767, -23692, -6832, -4282, -18348, -18431, -6746, -9855, -18536, -9150, 4682, 1579, -3170, 4762, 8683, 2014, 3001, 11809, 11335, 8293, 14830, 16596, 6584, 4155, 11203, 7282, -2120, 4041, 12415, 2391, -9480, -3088, 2305, -8721, -14052, -1351, 3764, -9427, -13787, -2233, -1072, -12581, -11070, 1319, 81, -9350, -6200, 753, -4562, -11280, -6688, -1524, -4562, -6771, -3008, -2613, -7401, -8148, -3302, -1439, -2862, -488, 3519, 1491, -1497, 1999, 6542, 5552, 4674, 8846, 11435, 8626, 6480, 8942, 11226, 8758, 6258, 8725, 11487, 7612, 2209, 3137, 5267, 792, -3579, -621, 2096, -2888, -8209, -6726, -3952, -6414, -9342]
343i342L004L596l046l893K862L485k545k478L034K129k612j664K152J065j696
358e949q2K743K474Q2J060K944J529L16K751M025M44l57K207J350k755j610J893
375A3065m99m834l197M90j336n476l407J437o61n315k052L625P32m552n78M274
391h284J146k948Q01M602J278k769O5M403K156k240j63M097J136k552J74L653
407D555L34k698l31K192l82k066l54J158j000k118P20K065p61j299K116J744j814
424B061K11M069R44l445p2L152j845m618L18K359l656o306n7K436l847n285K462
441a1119M120l121k914N252M615k455n02O619M429j578O45M354R36l072k9K956
457I136J01k638q60L3k895k615Q32Q14j487J2J149j468j816J232J690k56P49K772
$$ y = [-9342, -6338, -2742, -5788, -9681, -6819, -3334, -5879, -8357, -5323, -3194, -5806, -7470, -5318, -4253, -5949, -6031, -3288, -814, -732, 328, 3272, 4801, 5117, 7868, 11893, 12337, 11980, 14187, 15537, 12782, 11172, 13065, 12566, 7732, 4535, 5025, 3689, -1787, -5194, -3757, -4418, -9733, -11785, -8160, -7428, -11980, -12558, -8284, -7138, -10086, -9285, -4683, -3405, -6174, -6109, -1706, 450, -1790, -1953, 2144, 3280, 728, 902, 4555, 4889, 2191, 1860, 4052, 3670, 1604, 1250, 2408, 1408, -710, 10, 2075, 1314, 15, 2131, 3875, 2061, 2272, 6341, 7285, 3840, 3768, 6920, 5075, 457, 775, 3134, -522, -6828, -6885, -4449, -8296, -13581, -11119, -6999, -10120, -13034, -7782, -3167, -5622, -6124, 495, 4924, 3346, 3991, 8345, 9281, 6209, 6180, 9136, 9237, 6599, 5739, 5772, 2877, 262, 1094, 1908, 421, 433, 1582, 114, -1702, -470, 1220, 964, 1713, 4485]
475D485O49j441q7Q86L65O61J986J465m24q72j035k130j308J486Q21k341k206
492I60m48l880o103j76L642j732l514K395K307m930l500N858N270k204P42P560
508B247J817p166j880O674J169n329K016O167m564r877k58L986k902k711N856
523d755L924n079l671L021K083q05L703O629Q52k712K44m39l445K40N381P36m314
540A593l1N36p716o986M563N581l989k728N178N7r980l498Q971N616k751J597
556c987P555j76p329M44Q730M593M79M132M384k020l828n35Q85J815L505O46l650
573A5643k799k251o292n080L472N669k090m375Q25l09o872k411Q007O005j936
588E206K72L286m192p531K421N541k702j603N832j807j3441m722P925q47r356
$$ y = [4485, 5134, 3693, 3606, 4492, 4857, 5518, 7504, 8969, 8545, 7673, 6638, 4508, 3200, 4686, 5507, 3166, 960, 512, -3368, -9471, -9647, -6005, -7737, -11251, -8856, -6549, -11479, -14979, -9121, -3851, -6055, -5313, 2247, 4064, -3102, -4982, 1692, 2861, -2468, -452, 5715, 1151, -8726, -8984, -4998, -7900, -10611, -4755, -831, -5910, -9581, -6560, -4477, -5282, -1579, 5050, 5902, 3190, 3434, 2995, -450, -210, 5171, 5907, 1593, 1562, 2098, -5618, -12604, -8041, -2460, -6449, -9177, -3999, -3942, -13922, -17420, -8449, -2833, -5584, -3987, 3568, 3392, -3937, -3493, 5237, 9830, 10309, 14441, 18825, 16805, 12977, 12442, 13327, 15142, 18647, 19293, 15643, 12844, 10593, 4301, -779, 2693, 8362, 6272, 1897, 2722, 2413, -4459, -6870, 1137, 7142, 5206, 5478, 8764, 4572, -2959, -538, 5003, 2301, 698, 6530, 4723, -8718, -13440, -5515, -6362, -15718]
603a5718N165J3731n797j6522L774J4758m325j0062J3890J8195r156j6072Q836
616F97J3762q067q863J3151J2815j0019j4029L150O385o047p881L772P141l124
630B843j1302p262K442L447n348n689P415R617q770j5100N741J4413n059j0705
644b3317J2614J6441j0502j5987R369J4162q511q899J3517J1154j1853j0403Q534
657c681N041q113M6J1340K311n861J865L569m033L95J0216L946m292L649O812
672B3210o093q775O202Q492n651n925O070J279j2145o980M777J4o651P08L090
687A622n877n197K300k273n996N925J0169n390p402R679P308j2640n742J8293
701D779J0368j4433n089J7688L103k0175l089K0154L412j6942o12J4830l484j6618
$$ y = [-15718, -10553, 3178, -2619, -19141, -15367, -609, -4934, -14996, -1106, 17089, 7933, -8139, 697, 14459, 6392, -2471, 10680, 23495, 13476, -553, 2597, 8982, 2935, -4946, -1174, 5967, 2843, -8459, -15721, -13279, -9832, -15180, -20869, -13454, -3837, -12607, -27707, -21966, -7553, -12612, -23317, -10703, 5738, -4764, -20751, -11382, 2780, -5731, -14630, -1113, 10041, -1812, -12215, -3681, 1360, -6753, -6707, 4633, 6944, 1083, 2948, 6517, 2484, 2879, 13095, 17041, 12749, 16398, 23210, 17117, 8342, 14544, 23036, 17385, 11460, 17530, 18809, 6664, -316, 4461, 4475, -2176, -1468, 1622, -4255, -9452, -7152, -9425, -15421, -9496, 673, -4717, -12119, -2440, 4868, -7772, -13514, 4779, 15147, 714, -4375, 13313, 16416, -3759, -6848, 13306, 16718, -224, -836, 13994, 10510, -6108]
715f108K17J2010k14p007K173M933k472m970j714J006L995M623j938m368L019
730C185K735r075o895J0026Q248r940p426R070J691j5854n408J3600L843j1586
744a3786j69J0338m301j2852L104J0774j718l183Q751M805q807l213Q424J573
758b60m722P333J0452n787r319N020M605q543j809J2655L738j0870l474O607l496
773B130r173M880J0679j793o180K828J131q143k366Q242L513k984K295K781p652
788A88o819M698M559l095J794P164k817j0307r03N150j783k294P369N228o944
803A188o073K515P0m292L982R190m33n517J351Q91o226n63R868M512m326L01L610
820A0048o015q262M525P933k358l362M409n06j0942m822O563K175m054K810N712
$$ y = [-6108, -5891, 6119, 5905, -1102, 1071, 6004, 3532, -1438, -3152, -2146, 1849, 6472, 4534, 166, 3185, 5920, -3155, -10050, -24, 8224, -1716, -9142, -72, 1619, -14235, -19643, -6043, -2200, -13786, -13955, -3617, -7918, -20770, -17666, -6892, -8610, -11793, -3042, 1763, -7044, -10257, -1833, -260, -4982, 2351, 12803, 7016, -2303, 2717, 7322, -1221, -3030, 9625, 13363, 2493, -981, 5626, 2130, -7043, -2163, 8516, 6723, 543, 3371, 4502, -3641, -6007, 2235, 5748, 2764, 5059, 7840, 188, -6631, -1933, 2626, -469, 1325, 8489, 5672, -4635, -5538, -388, -2171, -4465, 2904, 8132, 1188, -4885, -2370, -2300, -6592, -2610, 6580, 6147, 630, 1981, 2872, -3354, -3917, 5951, 10463, 6137, 6438, 10048, 4033, -4229, 296, 8229, 5871, 2509, 6918, 6412, -4530, -9352, -2789, -614, -4668, -1858, 3854]
835C854n520q972J622M342k138P39Q141J872p642l096L277r27k118O104P297k498
851D337n315Q18K59m302R36P617K964l646j067J61m534l841L798M491o45m45J420
868C006l199n512Q8L943J532Q61L428P42m569l134J635J642K34L151L081k309
884D620m676j321l34j767J326M193L87l416j275l25k947j130M438L882q43q47
900c5J195j445l853O24N041K040j205Q09R26l577l585J947L383q0J7J861j008
917C055m050j738J624Q43n3J560J192j934k900o29Q49K26P34K495J205j491j622
934f34OL29K74J406K074N75j326j839j207m28j18J20Q13K57j383k045j017O7O2
953d014N05J400J430j45r18j15R41M50Q36J837J513m79r08j6j10p49N35J420o3
$$ y = [3854, -1666, -10638, -9016, -4674, -6812, -6073, 2068, 3940, -3702, -6798, -3521, -4448, -6566, -462, 6835, 4337, -978, -160, 99, -4203, -3267, 4350, 7314, 3668, 2601, 2762, -1772, -5613, -1815, 2676, 2031, 1586, 3006, -193, -5705, -5617, -1674, -142, 719, 4147, 4889, 320, -2814, -1179, 463, 697, 3848, 6929, 4620, -56, -1377, -1711, -3478, -2152, 2041, 2428, -988, -2263, -2588, -5535, -6665, -2227, 1655, 812, -35, 1160, -285, -4138, -3514, 1527, 3567, 2362, 3171, 4097, 520, -3065, -1118, 2265, 2185, 2202, 4063, 3055, -995, -2733, -1109, -266, -319, 1241, 2433, 499, -2401, -3030, -2181, -1955, -1221, 1274, 2479, 988, -634, -628, -299, -25, 1381, 3455, 4030, 2704, 865, -342, -770, -888, -768, 45, 302, -1081, -3126, -4143, -4076, -4014, -3509, -2109, -679, -824, -1742, -1857, -916, -466, 370, 2207, 3720, 3241, 2333, 2317, 2207, 1458, 1993, 3413, 3350]
972C350j327n67m11j248j156O30J029n39j282jM2j606p41J358R58q37K7J238j8
991a101j072M11J631O57J06O18Q56l53q30L40P25j91j67J05k89r60o29j44k03
1010d90j6K97j71l21K62K11l95K27J039L3j44M96N66p33n13O89O6r73j51Q81l66
1031D94j930l4J388q63j616J001J494j478j283J921J163j931j88K728M22k072
1047g84Q50K657p11j847J783K153j513j299K305J114k629p68K748j28l089M10
1063A252K322j720k996J609J571k689j650K219N50k726l85K248n22k372P39K138
1079d12j450j784J775P97k310m40K525p26k233J293J724k137j295L020J057k775
1095c371M36L410n10k736K029L403k109j894L271K096l414r76M010J26m204Q80
$$ y = [3350, 2023, 1456, 1045, -203, -1359, -729, 300, -239, -1521, -1522, -1480, -3086, -3827, -2469, -1511, -2348, -2321, -1083, -1101, -2173, -1762, -131, 526, 632, 1250, 2106, 1753, 923, 1263, 1988, 1797, 1630, 1735, 1446, 486, -143, -287, -490, -506, -209, -380, -701, -439, -228, -623, -396, 643, 676, 532, 1028, 1594, 861, 348, 1037, 1103, 130, -21, 860, 494, -1436, -1470, -82, -945, -2561, -1560, -66, -1544, -2827, -906, 257, -1674, -1862, 866, 1288, -784, 66, 2723, 2012, 165, 1948, 4101, 2588, 1289, 3594, 4708, 2079, 1311, 4059, 3931, 842, 1252, 3574, 1854, -1142, 467, 2038, -651, -2301, -82, 468, -2258, -2643, -395, -917, -3289, -2550, -412, -1862, -3646, -1871, -1074, -3384, -3824, -1299, -2025, -4258, -2965, -1241, -3378, -4673, -1653, -596, -3371, -2935, 475, -35, -2771, -742, 2661, 552, -1342, 1929, 4025, 611, -365, 3645, 3771, -433, 447]
1111D47L837k097m022K637K462m012k168L924O67m830M4M217j595m310K622L653
1127A476l274k762M195K033m709o05N543j26m962K040N199k988m204M354L642
1142D852m469j983N644J357n581J40N622j032m647K645M544l241l759L723K248
1157F063m267j035M350k73m482R75K838l203k833L396J038m386k05L779k268m998
1173e511K751M093l877l212N218K108o512j407O888L51o391K193P032k881o479
1188e636M002N329m704l300O443K622o115j411N423q10n248K712N385l188m000
1203b496L794J636n518q73O177on351J553M212m471m968M487L687m846j564N162
1219F15q47o755N85N316j931l823M509L709n591l363N350J610n198J825P756j422
$$ y = [447, 4284, 2187, -1835, 802, 3264, -748, -2916, 1008, 1675, -3155, -3111, 1106, -489, -4799, -2177, 1476, -1798, -4560, -365, 1668, -3041, -3646, 1897, 1771, -3191, -1151, 4048, 1060, -3144, 1210, 4852, 383, -1600, 4044, 5401, -180, -40, 5582, 4550, -97, 2548, 7092, 3851, 92, 3815, 6063, 1796, 761, 5111, 4838, 356, 1331, 4169, 966, -1867, 1529, 2567, -1819, -2024, 1755, -513, -5511, -2760, 1333, -2544, -5756, -538, 1570, -4942, -6349, 539, 890, -5501, -3308, 3724, 843, -5636, -1634, 3695, -1009, -4309, 2134, 4756, -1359, -2770, 2653, 1843, -3405, -693, 4692, 1504, -2496, 1298, 2934, -2584, -3457, 2720, 2714, -2637, -1084, 3128, -1343, -6311, -1824, 1863, -2983, -4547, 615, -232, -6987, -6402, -1086, -3017, -6840, -2331, 1378, -4213, -7576, -2226, -616, -5814, -3989, 3767, 2345]
1235B345o737K617N546m032l661P078N170n456l092N200O36n763Q34O617P6m210
1251C168R34J745l850k326L455J503k088J334J804m598l819L541J823m097J061
1266d10O323k163q350R19N871l321m786O252N987o650o464M574K901o228q48Q381
1282A988J835o983j208M237k432m381M656N938k240k678L008l15n281R67O323
1297C434R59k353K429J948n021l849M098L480k173L37L664k112o310p03K887j163
1313d48p62L584Q91n300k825J096j588j901L998M073k881l538J675m95m366J041
1329g746P307J940m215K94K959l524m476M489O436j180k009K991j45n706j242
1344c827N068K199j129K003K011l926m166J685K510p98J562M072q06n538j314
$$ y = [2345, -4392, -1775, 3771, -261, -3922, 3156, 8326, 2870, -222, 4978, 5614, -149, 685, 7302, 7378, 3168, 4102, 5847, 1997, -329, 3126, 4629, 2541, 3875, 5679, 1081, -2738, 803, 2626, -1471, -410, 5913, 3750, -4600, -3681, 2190, -1131, -5917, 335, 6322, -328, -6792, -2218, 683, -5545, -6393, 1988, 3823, -3160, -4368, -131, -2563, -6944, -2288, 3650, 1410, -1268, 1740, 1425, -3856, -2889, 3434, 4393, 2040, 4469, 6417, 1396, -2453, 1645, 5125, 2952, 3289, 6953, 4841, -1469, -2172, 715, -448, -1210, 2374, 3265, -2035, -4860, -3764, -5352, -7253, -3255, 818, -2063, -5601, -3926, -4421, -8787, -7746, -439, 1501, -2714, -2420, 539, -2985, -7461, -2972, 3464, 2284, 275, 3266, 3121, -2585, -3827, 1241, 3440, 2311, 4314, 6325, 2399, -1767, -82, 2428, 1630, 3192, 7264, 6458, 920, -394]
1359c94K001j020j001M062L057l503l939N2q07k535J438M178M38k962q80r41l054
1376e810p98L764K849q31J65R28k620l460J923M396M96j4K789J01m641k193K942
1393a4K133l75J574K527j910m314p23J352J39O55K735Q67k661k315l95o60k59
1410a644K603K540p49j732n20j620k122P83K893Q66j001j42j128l022j628J682
1426c941J826o8N47P85j828k974L30K258P02N33K942J356k785j675J872J361k94
1443I47J690L349K38k962j275J148J1q67J468K168o89k765j387l57q01m86J195
1460F25R86q32j402j504j173k90N15P32N27O38m79j437r82K99R21N70R11J086
1478b89n0j110q32L78N95O65J258P80l40o40k00k86L8J165J380J39m20J54j97
$$ y = [-394, 1607, 587, -414, 3648, 6705, 3202, -737, -685, -1492, -4027, -2589, 1589, 2027, -935, -1815, -2756, -5810, -6608, -2844, 5, -826, -661, 267, -2353, -5813, -3890, 506, 1002, 988, 3777, 3878, -763, -2956, -14, 2119, 1744, 3318, 5845, 3935, -379, -1102, 250, 389, 1044, 3779, 4646, 1985, -330, -725, -1385, -1644, 959, 3499, 2750, 1018, 498, -1122, -3244, -2461, 432, 1298, 297, 155, -973, -3995, -5623, -3941, -2115, -2183, -1636, -851, -2679, -5653, -5323, -3065, -2363, -1830, 1112, 2468, -317, -1992, -120, 1241, 947, 2637, 5986, 6224, 3262, 1987, 3135, 3146, 2279, 3747, 5915, 5226, 2461, 1074, 717, -84, -570, 625, 1611, 779, -623, -2127, -3300, -3590, -3075, -2343, -1816, -1178, -1657, -3094, -4076, -3777, -2856, -2286, -1375, -289, -339, -1449, -2281, -1903, -1308, -643, 615, 1395, 1055, 415, 215, -71, -33, 1132, 2512, 2651, 2231, 2385, 2188]
1497B188j029l09J272J094l58p47K36k85j717p95R60O46p55m99J29p23j349n09
1515b550M94M31N8J2p5l49n61J1J08N40Q52O32k12l06K34K88k91Q2J475P26n74
1536A025k82L95P5q52k5J194O08n55o98K70R3r17l52P04O33j90m67j38O0m89m52
1557c60K03O95L12n73n04J59l12q85N8O47L68l79n78r5j55m94l6M11P01Q4j89
1578i22p0j00j9M16L25N54O09N27o33j49M64K19m08M18J062j3r83o26M84k04q54
1599I7J04R92j48j244o46M47k64p36K91Q75n3p61J2L1p3o4M03N89K50r1j58j45
1621b92J99L05L07K65L92L10l46n21J98L07j18Q4N73L2o14k92Q3k21L4K54J22
1642A061j37l34j45n13j74J90K51m57l66L37j79j218l23P71L2r29Q2Q49n07j086
$$ y = [2188, 1159, 850, 2122, 3216, 2858, 2111, 2347, 2062, 345, -450, 510, 1156, 401, -98, 31, -692, -2041, -2550, -2056, -1625, -1567, -1555, -1630, -1979, -2540, -2529, -2421, -1881, -1029, -397, -609, -915, -681, -393, -684, -602, 873, 1599, 1025, 743, 1138, 1213, 361, 336, 1530, 2138, 1583, 885, 1155, 1248, 331, -21, 683, 1316, 1126, 659, 521, 581, 92, -360, -157, 538, 850, 277, -227, -68, -380, -1265, -1207, -560, -192, -571, -1149, -1244, -1399, -1893, -1929, -1518, -817, -733, -922, -992, -1092, -1111, -695, -370, 184, 793, 1320, 687, 538, 1002, 1221, 813, 1231, 2293, 2280, 1297, 671, 1155, 951, 97, 201, 1193, 1045, -199, -845, -398, -662, -1398, -1107, -232, -285, -1046, -1034, -1003, -1076, -1140, -737, -148, 102, 11, -147, -292, -93, 212, 519, 784, 1176, 1486, 1140, 619, 817, 1124, 1006, 1090, 1663, 1695, 1081, 789, 872, 651, 685, 939, 1061, 924, 590, 445, -68, -242, -52, 199, -258, -624, -287, -466, -1684, -2007, -1236, -1204, -2133, -2051, -1202, -1709, -2795]
1662b795M51J090k44m42R04P36n84m99J056M26l49O1J027o7o78K82N48o08l71
1681e6Q54K66q81j71P39l45r38K56R61n93q38N37M24r39o13Q37M10q96o2Q43K4
1702a81q16L42Q11k21k07P80L77o00J12P18l53m96Q01M31r39j91J003k06j101
1721F4L01J247l83j209Q33J280j111j042J458P00j504m35J639J6j895K16J444
1738A619o95j500J064J140j389j120J420M35j452j31J585l14j711O17J202j246
1754d76j153J430N73j572m69J654j95j745Q25J685q23j220J441R78j552o46J823
1771E58N16j926J06J754p51k038R57J487j435j201J763M77j973k20K017l20j495
1788a724Q42J409j105j345J382P37j509k89J801k65j855N23J509j190j143J923
$$ y = [-2795, -2344, -1254, -1498, -1940, -1036, -300, -884, -1383, -327, 99, -250, -189, 838, 771, 93, 375, 923, 315, -56, 798, 1064, 183, 12, 751, 406, -532, -276, 685, 92, -746, -209, 215, -724, -1337, -500, -90, -986, -1048, -205, -181, -997, -655, 156, -65, -272, 508, 885, 285, 397, 1115, 762, 266, 1067, 1498, 559, 368, 1371, 1165, 64, 365, 1612, 1229, 20, 853, 2133, 1022, -20, 1438, 2138, 634, 199, 1838, 1854, -41, 175, 1619, 924, -576, 488, 1628, 239, -881, 539, 974, -478, -609, 976, 662, -1049, -432, 770, -476, -1629, -199, 374, -1198, -1667, -13, -208, -1953, -1128, 557, -266, -1486, -45, 933, -619, -1265, 558, 1074, -852, -746, 1008, 257, -1781, -824, 663, -772, -1973, -210, 267, -1706, -1926, 91, -229, -1724, -882, 527, -578, -1923, -541, 196, -1313, -1602, 199, -66, -1921, -1398, 111, -1079, -2222, -299]
1804b99J064k029l70K252k95k253J317K554j301k087J899J603k560j026L024R63
1820B456k815j15L016m79k966J164K861j116k092J769J566k563j183K183M74j973
1836A87K11J761j093j958J188R57j600j34K159p8k292M25J898j338j720K002J780
1853B355k427j589K287K29l029J88K991o53k613J006J981k015j837K395J809k063
1869i85n00K428k79k718Q26K700j136j612K102J454k711r91K715L83k266Q62K844
1886C116j160k584J399J687j996j009K472P11k834n83J998j140k562J441K116
1901A072j996j814J945M35l016k65L052k87k501J140K320j905k275K295J958j856
1917a698o12K924M46k549K28K722k89j651J853K222j889j384K072O65k156J38
$$ y = [-299, 765, -1264, -1634, 618, 323, -1930, -613, 1941, 640, -1447, 452, 2055, -505, -1531, 1493, 2456, -359, -474, 2542, 2063, -903, 261, 3122, 2006, -86, 1683, 3249, 686, -497, 1686, 2160, 187, 398, 2159, 1066, -892, 296, 1253, -347, -481, 1678, 1600, -692, -267, 1631, 293, -1427, 575, 2355, -72, -1661, 626, 855, -2174, -1986, 1005, 352, -2261, -1255, 726, -1289, -3126, -731, 1078, -985, -1485, 943, 664, -2054, -1228, 1472, 336, -1276, 826, 2280, -431, -1422, 1293, 1676, -590, 272, 3116, 1956, -628, 771, 2458, 462, -547, 1925, 2636, -198, -781, 1217, 77, -2485, -1044, 1072, -924, -2738, -793, -358, -3374, -3639, -587, -874, -3375, -2235, 85, -1820, -4095, -1800, 158, -1698, -2310, 614, 1060, -1489, -1261, 1461, 1172, -479, 1374, 3596, 1707, 323, 2395, 3060, 904, 1042]
1933A042K483o32k467R16J190j962j640K153R21k369n63K059n60k699O00K239
1949G11j113j636J560J150k340j056J948J22j825Q50J920j206j717J390J072j811
1965a981j37K664L19k013N56K070j009j923K093K330j687j153K260Q29k674o21
1981g7K701L07k354P12J917j525k477R67J491j590q79J667L14k254o95J333n58
1998a000j046R59J383j057j096Q38p0j309O46J886j30r55P28N53j633m92J927
2015A32Q15r77L46J446j000j866Q27J596n83m76J957O06k363q81J717J73j168
2032C01J062J902q59j989J18Q05j239n39J905P51j904j009M22j008j365P68J459
2049d19m09j061J87l67j562j23J712N62l27P60N77j408j050J215J228k19O81J633
$$ y = [1042, 3525, 2893, 426, 1342, 2532, 570, -1070, 1083, 2004, -365, -928, 1131, 571, -2128, -1528, 711, -402, -2038, -478, 672, -1668, -2724, -776, -654, -2479, -1629, 291, -915, -2632, -1242, -170, -1981, -2118, 546, 865, -1148, -592, 1478, 469, -1454, 639, 2969, 1282, 129, 2389, 3218, 544, -77, 2624, 2931, 577, 1289, 3206, 1681, -796, 171, 1662, 72, -807, 860, 1174, -1080, -1775, -442, -1000, -2046, -1087, 296, -761, -1857, -1019, -1089, -2398, -1752, 134, 4, -951, -223, 330, -1303, -1795, 132, 947, -30, 316, 1762, 762, -1104, -277, 1319, 736, 260, 2217, 2823, 460, -421, 1296, 1469, 301, 1363, 3265, 2406, 417, 535, 1340, 101, -438, 1467, 2218, 314, -695, -273, -1281, -2646, -1878, -419, -828, -1889, -1702, -2069, -3631, -3754, -2042, -1480, -1807, -1047, -470, -1878, -2928, -1713, -485, -704, -23, 1610]
2067A610l23j862j78J402M5o6J544J339j317j409L88P4o52O40J594L5j281q32
2085G51k60r70k32J205Q12l82n21j89j152j093N60J240K13p8N15p11j668o46J011
2104a595O07K9P58O01j281j425J92O51K76R36J433J47j060n38L11j17M27J533
2122A885J154o75q42j81m74r24N97J503L27p98l11l59j285q35J047J209r6k54
2140F88k07q55j430l82Q83O18K39L35l03j090q79J89M54O84J003O10n17q50k78
2159a088RKP78J197J80p80n91l35m82r7R84J042J03l18j27m97m72L21J033O95
2179A557K04J50n34j107m45N13K77Q8O22J67j058j225LL78j16L53R58J75r74q26
2199h40J91O9o9M21J061j51r15l90k1l60J79R08O28j22k61j95l11k45N75P57J57
$$ y = [1610, 1287, -575, -753, 649, 694, 628, 2172, 3511, 2194, 785, 1173, 1247, 595, 1235, 2829, 2864, 1583, 751, 491, -479, -711, 494, 1306, 924, 403, 214, -938, -2031, -1471, -231, -18, -96, 419, -292, -1960, -2606, -1595, -988, -959, -201, 400, -881, -2306, -2114, -1463, -1187, -251, 1182, 1329, 269, -269, 42, -75, 352, 1885, 3039, 2364, 1522, 1341, 867, -57, 540, 2043, 2370, 1572, 1261, 902, -383, -1218, -171, 1038, 942, 688, 481, -374, -1804, -2186, -1303, -685, -446, -111, -414, -1504, -2383, -2194, -1740, -1056, -53, 557, 40, -810, -1088, -1079, -1077, -299, 898, 1078, 298, -293, -628, -1110, -1207, -223, 819, 922, 604, 477, -20, -492, -171, 862, 1557, 1761, 1911, 1377, 270, -175, 338, 615, 703, 1325, 1492, 434, -791, -788, -410, -526, -173, 785, 960, -14, -840, -649, -580, -649, -228, 833, 682, -233, -623, -644, -1004, -825, 83, 711, 589, 328, 133, -178, -423, 152, 909, 1066]
2220A066R0P4n79q69r4M73K33j28K92Kq63o47K19K12J35L48M57l73m36k47o6k54
2242i55K15N34J04m98k79j02m33j74N42P08j98j94L32J6o27P1Q88L47m70K33L60
2263D20m51q18L32N61j66j81L20J94o15k83O16J52j05M47O32l46l91L70J86k84
2283E90J88N56j42m54r8K30m12k72M17L33l57l77K60K0n38K6M19Q4l85J0J30l55
2305a27l59M96j05m04K63L39k05l74L86L74l51O7P00O4n26J10M19j21n46L95M27
2326I22l88l75L47K44o14j78N50J22o26J56M88l81n27L66K37n68k72L56q9p55
2346i85k04N02l70n79K17L95l44m65M76L63l41r8O86K20l79J30O15m1l08L15M58
2367B63j82k07M08J85m65O9M70o7m50K00L21l22l04K68O8m08j42N29l26m62O2
$$ y = [1066, 1156, 1230, 651, -218, -312, 161, 394, 266, 558, 560, -303, -950, -731, -519, -384, -36, 421, 48, -388, -635, -701, -955, -740, -206, -102, -600, -879, -981, -1414, -1588, -1046, -338, -536, -730, -398, -382, -1009, -938, -50, 297, -173, 60, 420, -31, -849, -517, 44, -122, -303, 17, 211, -404, -687, -71, 81, -24, 423, 1055, 709, 318, 688, 874, 590, 778, 1334, 1192, 738, 640, 870, 458, 186, 603, 936, 579, 202, 462, 482, -56, -30, 389, 473, 88, 98, 228, -127, -486, 10, -95, -499, -236, 103, -102, -476, -90, 284, -67, 0, 700, 764, 238, 348, 767, 646, 100, 495, 922, 534, 159, 506, 750, 136, -42, 508, 630, 4, 160, 648, 267, -260, 106, 343, -225, -497, -141, -230, -985, -1189, -687, -1057, -1636, -1419, -1024, -1368, -1833, -1357, -994, -1335, -1433, -747, -527, -906, -776, -161, -202, -510, -195, 263, 81, -126, 282, 467, 2, 71, 541, 474, 24, 224, 545, 223, -81, 187, 255, -153, -295, 234, -92, -554, -492]
2388d92L26k70k26M51J74l84N8M62P1l62K41N59j68j48L13M33n55j34N90P3m05
2409F07k8N25k51m22K45L35m67j73L31J41m41j88N89k35n77J23N58l12n85L10
2429H5L48n05m78N21K92o34k08M05k9o96J55M24l0m40J66K87k08k75L14K92j02
2450c16n2K96O2j24K02K47j05L2L84J36l59J09L08j61j47K39K16n05k02K37r7
2471D00n54m4L01j45o44N5J86m64l47M04K70k92k84M45N0m52J32N18l0j09J84
2492d20J52j86l23L17K75rp8L42l4l41O4L29O7R5M04L30l88j44L12N1j65J62M19
2515A231j54n06k9J68l48k70L90L83m81m70J08p0m86j60N81P8m22k16O8m05k81
2536a291J03L61J45%nj16j64P4M20M08K95L23j0l83j24J97P8q5N13L97m54m69
$$ y = [-492, -166, -436, -662, -211, -37, -421, -363, 99, 170, -192, 49, 608, 440, 292, 605, 1038, 483, 349, 939, 1012, 607, 579, 1104, 853, 431, 676, 1011, 544, 371, 702, 843, 402, 214, 803, 568, -9, 114, 672, 360, -225, 85, 433, -72, -550, -29, 263, -371, -579, -174, -203, -899, -744, -320, -350, -790, -624, -337, -545, -820, -506, -214, -316, -368, -72, -10, -134, 68, 315, 210, 242, 626, 762, 403, 512, 820, 659, 512, 751, 967, 462, 260, 497, 400, -154, -198, 103, -42, -686, -631, -445, -909, -1256, -852, -582, -874, -1158, -713, -663, -1115, -983, -465, -495, -604, -420, -268, -454, -777, -460, -185, -194, -272, 70, 36, -305, -241, 88, 155, 250, 654, 984, 596, 452, 764, 815, 650, 812, 1231, 1077, 571, 542, 710, 362, 92, 482, 865, 384, -86, 22, -48, -534, -694, -113, -35, -457, -673, -605, -1010, -1291, -1188, -827, -682, -682, -687, -803, -967, -893, -473, -65, 230, 553, 543, 160, 36, 233, 311, 226, 739, 1136, 682, 213]
2558B13J06O7l03J98P70K19m75k57J26j53l51M87P46j32n76j61j09p35l33O68
2578A5L11m18j77j05m76o24J74P30J16k2J56p8n72k87K39L39K50L75K92m22m46
2599f30J25K17K85O04P15k0m01m2Qr8o9P62M49m07o92j50l81p05p4P67K89o04
2621e2l87k3o33n55N30N93J96J7j32l53n82j00L59L32J37M06j98o43l73J42L46
2642i73J17O25O09q6p50K3J75J49L30Q27L63m22l82j10j47r3N22O90o2j31r6l62
2664H16n27rP35L09k62m8l6r04q02J16N64j49j58K99k48r51m18L99M14J67K50
2685d43M29j61n38j51K67L18L35N42K8m99j78j50k03R1N57N34l42j69R5l05l01
2706b44M11P22K96k02J29M9o13k54K42L32l3M2k3n63n92n4O1n6P7L98j58q53k41
$$ y = [213, 319, 386, 83, 281, 1051, 1270, 795, 538, 664, 511, 160, 647, 1393, 1261, 685, 524, 415, -320, -653, 15, 326, -92, -269, -374, -850, -1474, -1300, -570, -454, -476, -320, -398, -970, -1257, -1018, -679, -429, -54, 238, -184, -630, -505, -288, -3, 601, 1316, 1296, 895, 853, 861, 763, 694, 1456, 1905, 1498, 806, 656, 275, -430, -504, 263, 552, -52, -439, -462, -1095, -1650, -1120, -527, -331, -314, -446, -799, -1381, -1481, -1122, -790, -653, -247, -445, -1088, -1461, -1319, -973, -856, -231, 378, 292, -458, -435, -260, -111, 219, 1046, 1409, 987, 605, 495, 348, 255, 777, 1467, 1405, 1274, 1178, 816, 289, 280, 1015, 1324, 1062, 1014, 978, 74, -728, -612, -48, -197, -355, -56, -304, -1255, -1673, -1274, -860, -693, -443, -14, -175, -713, -864, -597, -279, 56, 598, 626, 127, -51, -201, -404, -313, 244, 778, 436, 267, 362, 57, -244, 167, 889, 1185, 983, 1112, 1161, 548, 294, 536, 868, 835, 877, 854, 291, -301, -355, -294, -350, -273, 125, -33, -886, -1127]
2729a127Q3k16p4M91L25l80n17J26R0j90O4Q29M01k46n6K76r4o7L94O64M1r0P8
2752H05j65m04oL14j8m4K96o9m25m00K81K21j24K08L84m6m40j09J47m5j56K80
2774D85K19m24k96p2j69l15J04R6K4j54J1r8m32M3L44O8OL64J62j89k00K86K74
2797A37m7Q9O19R5m07O4K89p5k43L53K82k27k52R2k53k49k07L10P9m51l2L2m30
2820d32l28L05O2j78l0K76j39m83m8K67j49j1K37J92l89k64J58J11j92P3O27L7
2842b98k02O9J83o2R5M71L01O3J46K26j76j67L03L74j00R3J49j48n93j8N2r5k00
2865D66N6K02o22n32O5k6m03M6M57q4m62j59K90k28n3M57K66k24L6K57j18k96
2887f09L58N90M8j14K42J57n15p6N08K85k28J24L29l24m98O9K78j05o4L56j2m97
$$ y = [-1127, -1044, -1260, -1334, -843, -518, -898, -1415, -1289, -1199, -1389, -1325, -496, -95, -341, -397, -121, -215, -282, 112, 776, 817, 727, 805, 640, 236, 230, 544, 526, 482, 778, 709, 284, -116, 165, 386, 262, 470, 854, 808, 368, 259, 406, 361, 205, 485, 704, 280, -16, -88, -257, -572, -468, -372, -348, -502, -491, -589, -1021, -978, -634, -566, -560, -196, -34, -223, -423, -137, 137, 90, 179, 798, 893, 486, 550, 839, 764, 521, 874, 1156, 929, 677, 769, 516, 267, 60, 370, 449, -2, -34, -2, -432, -760, -455, -393, -571, -601, -325, -464, -947, -995, -728, -877, -888, -651, -459, -848, -1112, -954, -843, -1035, -962, -335, -298, -500, -431, -248, -310, -215, 256, 557, 620, 766, 992, 816, 649, 952, 1326, 1226, 1319, 1468, 1320, 727, 709, 761, 666, 466, 522, 724, 102, -430, -365, -391, -794, -748, -291, -375, -837, -996, -706, -934, -987, -530, -264, -488, -452, -195, -313, -609, -251, 339, 387, 273, 515, 672, 157, 81, 589, 874, 646, 770, 1099, 775, 277, 346, 624, 519, 455, 811, 799, 302]
2909C02j86J02R6k84J44L63k75m99J70p6l39m8L31M8m32j34P2k96j73J56M16k20
2931g62L0J06K2l54J81L72J47o9L46J98l95j69M45P6l51K81M13k67n12K66L01
2952C05l09j98O01J41m25j87L21m5l88Q8N96k21l68K08J66m63j41L94K05l93J55
2973D2K85k37k99K60L87l19j26M06m1m14j18L97j05k88K63K92j79m45K77L10k25
2994A23L6N47j6m18J91L54m69k37L51R4m13j14K53j60m20K9L34j92k84K61K40
3015I0l66j81L86J82n21J76M40j87n40L19L91m96j82M99K26m75j3M57j17l20K05
3036b7N80k97l50L11K54m52k03M05J3l26NK95l10l00J37K36k22j47L57K1l95J6
3058c99L54j52l73K91J90k77l56K78K42m50k0M79m6l51J88L26j09k06L98L65k62
$$ y = [302, 116, 218, 314, 30, 174, 537, 262, -237, -67, -143, -482, -530, -199, -151, -583, -717, -645, -941, -1114, -958, -542, -762, -732, -626, -604, -958, -777, -405, -258, -327, 19, 217, -178, -347, 98, 174, -177, 104, 517, 250, -262, 4, 305, -4, -202, 399, 540, 115, -72, 249, 204, -184, -96, 500, 279, -89, 119, 285, -178, -319, 75, 280, -113, 42, 327, 90, -209, 51, 438, 119, -7, 399, 358, -56, -174, 223, 118, -170, 93, 385, 206, -239, 38, 348, 123, 159, 706, 690, 272, 463, 817, 348, 111, 462, 556, 143, 29, 282, 122, -298, -269, 65, -127, -411, -150, 90, -276, -457, -71, 111, -410, -234, 206, 19, -521, -202, 189, -307, -489, 10, 236, -239, -252, 205, 88, -232, -27, 553, 256, -94, 217, 471, 19, -184, 221, 234, -92, -87, 208, -102, -402, -265, -29, -251, -398, -41, -20, -415, -399, -45, -197, -570, -279, -89, -366, -722, -444, -202, -652, -672, -193, -239, -590, -402, -76, -185, -391, 7, 372, 110]
3079A10j34M09ok69RL89j22l46K07K29l16j71M70nk88N7M58k09m01L48J14j96
3101C37k70L88n4m40j94M39k04m40K48L49l51l43L52L04m40q0N57J4l62m2M39
3122B07j66m49L21L49m51r1J90J44l37M1N04j11k77J47L92j67k55M33J12k34j97
3143A05L93m3k93l6L73k29j61J96Q7m46k06K83M9l46K2K59k06k93N6J11k49j7
3165e91K36L4k87P1K13r9j33L82K09k06l8L89J35m84J05M76j09m11K38K70l35
3186F5l34L14R5l01j00L31pl04K0L93j82r8J86L13j76k06J47J61l75K8K25M2l80
3209a43O7Q8j42k24J69J22k60k4J27n7j57O0K12j44L9K86R7k99R7K61q4l5J92
3232B48L58k18j34J52Jj59q0K26Q4k82m5K51j75k72J17J60j7p7J08M7j94r9K76
$$ y = [110, -24, 385, 379, 110, 119, 508, 386, 40, 247, 476, 160, -11, 459, 454, 166, 223, 681, 472, 71, 419, 533, 337, 67, 455, 401, -39, -233, 206, 2, -438, -190, 159, -192, -535, -183, 121, -319, -399, 158, 172, -190, -232, 207, 41, -408, -87, 262, -189, -280, -90, 54, -283, -242, 262, 151, -126, 21, 413, 246, -9, 424, 536, 302, 105, 498, 455, 162, 126, 499, 270, 109, 305, 392, -54, -260, 23, 72, -274, -252, 7, -199, -492, -436, -325, -574, -591, -355, -321, -608, -537, -324, -423, -556, -174, 35, -171, -209, 180, 315, -169, -64, 412, 303, -108, 130, 400, 65, -269, 45, 140, -161, -261, 70, 63, -241, -221, 172, -10, -108, 78, 391, 215, 9, 156, 317, -58, -30, 195, 237, -143, -76, 12, -130, -354, -185, -63, -323, -347, -220, -277, -434, -374, -162, -306, -267, 19, 116, -183, -86, 175, 91, 56, 248, 606, 388, 254, 406, 407, 248, 168, 394, 478, 196, 151, 402, 227, -45, 72, 232, 215, 138, 246, 293, 99, 0, 276]
3255B76M4j31J76Q0k16k35O9L9k98J05J73j27m30j42J09o1k35J16M03j88k37J22
3277e88J25J5J37L20K31j22K89J5j43M1K53J57Lj5J59k64m02oR7k9j47J74m7n53
3301c00j70j5O4m9J35J10kk62j21q0J23J50J27J73j52M6j31k48P5L44K25r1j55
3324b04J20q5l85P6N04J81j88J26J23k40k25J32L60K74p4K39j96k22j47R4J43
3345D06K01K24r1m08j25j50k21r5J24L83j92m17j10j00j23M1K40M65l5k96OO5
3367b08k21J59L28L85Q9j03l01r7LJ39R9J74L21j33m54k39N3Q2J63J12L53j82
3389E22l67l03k3J67m3K55J76p8k87l98j15J24O3K19J33N4l09l09l15R1L41K09
3411a93pO4j61k00m40K14L45J67J09J63Q6l46j40J34M11K32J44J59J7l44k66J
$$ y = [276, 320, 189, 365, 445, 229, -6, 63, 102, -196, -91, 82, -45, -475, -617, -508, -569, -804, -688, -285, -473, -710, -588, -463, -448, -311, 9, 240, 118, 407, 422, 279, 320, 573, 730, 733, 718, 877, 613, 211, 205, 302, 273, 126, 300, 253, -300, -470, -485, -421, -470, -335, -225, -227, -489, -610, -690, -567, -417, -290, -117, -269, -223, -354, -602, -527, -183, 42, -49, -204, -84, -169, -554, -478, 26, 207, 19, 145, 268, 28, -197, -65, 295, 569, 495, 734, 538, 316, 169, 263, 406, 607, 831, 740, 332, 207, 57, -164, -259, -135, 248, 56, -361, -471, -571, -694, -653, -413, 52, 17, -279, -273, -208, -429, -270, 58, 443, 532, 429, 128, 31, 34, 173, 272, 446, 767, 634, 180, -59, -6, 76, 239, 351, 704, 522, 155, -148, -171, -4, -47, 208, 384, 306, 19, -379, -494, -370, -307, -88, 45, 99, -210, -519, -834, -743, -402, -193, -200, -136, -297, -497, -937, -723, -378, -211, -102, 61, 147, -199, -339, -205, 206, 438, 582, 741, 758, 414, 148, 149]
$$ [...]
8191B1
##END NTUPLES=NMR FID
##END=
