##TITLE=1H ikalashn
AM_NV 168 VAP
16.9.2024
##JCAMPDX= 6.0         $$ Bruker NMR JCAMP-DX V2.0
##DATA TYPE= NMR FID
##DATA CLASS= NTUPLES
##ORIGIN= UXNMR, Bruker Analytische Messtechnik GmbH
##OWNER= root
$$ TOPSPIN		Version 1.3
$$ 2024-09-16 11:17:36.265 +0400  Irina@DPX200
$$ Compression mode = diff/dup
##.OBSERVE FREQUENCY= 200.131392401
##.OBSERVE NUCLEUS= ^1H
##.DELAY= (6, 6)
##.ACQUISITION MODE= SIMULTANEOUS
##.ACQUISITION SCHEME= undefined
##.AVERAGES= 32
##.DIGITISER RES= 18
##SPECTROMETER/DATA SYSTEM= spect
##.PULSE SEQUENCE= zg
##.SOLVENT NAME= CDCl3
##.SHIFT REFERENCE= INTERNAL, CDCl3, 1, 17.95386
##AUDIT TRAIL= $$ (NUMBER, WHEN, WHO, WHERE, WHAT)
$$ ##TITLE= Audit trail, TOPSPIN		Version 1.3
$$ ##JCAMPDX= 5.01
$$ ##ORIGIN= Bruker BioSpin GmbH
$$ ##OWNER= Irina
$$ $$ F:/spectra/data/iren/nmr/1H/4/audita.txt
$$ ##AUDIT TRAIL=  $$ (NUMBER, WHEN, WHO, WHERE, VERSION, WHAT)
(   1,<2024-09-16 11:17:09.640 +0400>,<Irina>,<DPX200>,<TOPSPIN 1.3>,
      <created by zg
	started at 2024-09-16 11:15:01.390 +0400,
	POWCHK disabled, PULCHK disabled
       configuration hash MD5:
       BE 6D 3F 07 2A EA 11 49 91 17 2B D3 AF B3 58 0D
       data hash MD5: 16K
       9B BE BD CE DA 7B E7 D5 6F 93 94 D6 A5 BB 4A AD>)
$$ ##END=
$$ 
$$ $$ hash MD5
$$ $$ 8A A1 86 4F 3A 7E A4 45 24 79 F2 11 FB 95 87 7A
##$RELAX= 
##$RELAX= 
##$RELAX= 
##$RELAX= 
##$RELAX= 
##$RELAX= 
##$RELAX= 
##$RELAX= 
##$RELAX= 
$$ Bruker specific parameters
$$ --------------------------
##$DU= <F:/spectra>
##$EXPNO= 4
##$NAME= <1H>
##$PROCNO= 1
##$TYPE= <nmr>
##$USER= <iren>
##$AMP= (0..31)
100 100 100 100 100 100 100 100 100 100 100 100 100 100 100 100 100 100 
100 100 100 100 100 100 100 100 100 100 100 100 100 100 
##$ANAVPT= -1
##$AQSEQ= 0
##$AQ_mod= 1
##$AUNM= <au_zg>
##$AUTOPOS= <>
##$BF1= 200.13
##$BF2= 200.13
##$BF3= 200.13
##$BF4= 200.13
##$BF5= 200.13
##$BF6= 200.13
##$BF7= 200.13
##$BF8= 200.13
##$BYTORDA= 1
##$CFDGTYP= 0
##$CFRGTYP= 5
##$CHEMSTR= <none>
##$CNST= (0..63)
1 1 145 1 1 1 1 1 1 1 1 1 1 1 1 1 1 1 1 1 1 1 1 1 1 1 1 1 1 1 1 1 1 1 
1 1 1 1 1 1 1 1 1 1 1 1 1 1 1 1 1 1 1 1 1 1 1 1 1 1 1 1 1 1 
##$CPDPRG= <>
##$CPDPRG1= <>
##$CPDPRG2= <>
##$CPDPRG3= <>
##$CPDPRG4= <mlev>
##$CPDPRG5= <mlev>
##$CPDPRG6= <mlev>
##$CPDPRG7= <mlev>
##$CPDPRG8= <mlev>
##$CPDPRGB= <>
##$CPDPRGT= <>
##$D= (0..63)
0 2 0 0 0 0 0 0 0 0.06 0 0.03 0 0 0 0 0.0002 0 0 0 0 0 0 0 0 0 0 0 0 0 
0 0 0 0 0 0 0 0 0 0 0 0 0 0 0 0 0 0 0 0 0 0 0 0 0 0 0 0 0 0 0 0 0 0 
##$DATE= 1726471028
##$DBL= (0..7)
120 120 120 120 120 120 120 120 
##$DBP= (0..7)
150 150 150 150 150 150 150 150 
##$DBP07= 0
##$DBPNAM0= <>
##$DBPNAM1= <>
##$DBPNAM2= <>
##$DBPNAM3= <>
##$DBPNAM4= <>
##$DBPNAM5= <>
##$DBPNAM6= <>
##$DBPNAM7= <>
##$DBPOAL= (0..7)
0.5 0.5 0.5 0.5 0.5 0.5 0.5 0.5 
##$DBPOFFS= (0..7)
0 0 0 0 0 0 0 0 
##$DE= 6
##$DECBNUC= <off>
##$DECIM= 32
##$DECNUC= <off>
##$DECSTAT= 4
##$DIGMOD= 1
##$DIGTYP= 9
##$DL= (0..7)
0 120 120 120 120 120 120 120 
##$DP= (0..7)
150 150 150 150 150 150 150 150 
##$DP07= 0
##$DPNAME0= <>
$$ [...]
##$SW= 21.9925939549014
##$SWIBOX= (0..15)
0 0 2 0 0 0 0 0 0 0 0 0 0 0 0 0 
##$SW_h= 4401.40845070422
##$TD= 16384
##$TD0= 1
##$TE= 300
##$TE2= 300
##$TE3= 300
##$TEG= 300
##$TL= (0..7)
0 120 120 120 120 120 120 120 
##$TP= (0..7)
150 150 150 150 150 150 150 150 
##$TP07= 0
##$TPNAME0= <>
##$TPNAME1= <>
##$TPNAME2= <>
##$TPNAME3= <>
##$TPNAME4= <>
##$TPNAME5= <>
##$TPNAME6= <>
##$TPNAME7= <>
##$TPOAL= (0..7)
0.5 0.5 0.5 0.5 0.5 0.5 0.5 0.5 
##$TPOFFS= (0..7)
0 0 0 0 0 0 0 0 
##$TUNHIN= 0
##$TUNHOUT= 0
##$TUNXOUT= 0
##$USERA1= <user>
##$USERA2= <user>
##$USERA3= <user>
##$USERA4= <user>
##$USERA5= <user>
##$V9= 5
##$VALIST= <valist>
##$VCLIST= <CCCCCCCCCCCCCCC>
##$VD= 0
##$VDLIST= <DDDDDDDDDDDDDDD>
##$VPLIST= <PPPPPPPPPPPPPPP>
##$VTLIST= <TTTTTTTTTTTTTTT>
##$WBST= 1024
##$WBSW= 25
##$XGAIN= (0..3)
0 0 0 0 
##$XL= 0
##$YL= 0
##$YMAX_a= 437900
##$YMIN_a= -559532
##$ZGOPTNS= <>
##$ZL1= 120
##$ZL2= 120
##$ZL3= 120
##$ZL4= 120
##$ABSF1= 10
##$ABSF2= 0
##$ABSG= 5
##$ABSL= 3
##$ALPHA= 0
##$AQORDER= 0
##$ASSFAC= 0
##$ASSFACI= 0
##$ASSFACX= 0
##$ASSWID= 0
##$AUNMP= <proc_1d>
##$AXLEFT= 0
##$AXRIGHT= 0
##$AXTYPE= 0
##$AXUNIT= <>
##$AZFE= 0.1
##$AZFW= 0.1
##$BCFW= 1
##$BC_mod= 2
##$BYTORDP= 1
##$COROFFS= 0
##$CY= 7568.61572265625
##$DATMOD= 1
##$DC= 2
##$DFILT= <>
##$DTYPP= 0
##$F1P= 17.9538593292236
##$F2P= -4.03888763876832
##$FCOR= 0.5
##$FTSIZE= 32768
##$FT_mod= 4
##$GAMMA= 1
##$GB= 1
##$INTBC= 1
##$INTSCL= 1
##$ISEN= 128
##$LB= 0.02
##$LEV0= 0
##$LPBIN= 0
##$MAXI= 945.577
##$MC2= 0
##$MEAN= 0
##$ME_mod= 0
##$MI= -402.1523
##$NCOEF= 0
##$NC_proc= 0
##$NLEV= 6
##$NOISF1= 8.587773
##$NOISF2= 6.764455
##$NSP= 1
##$NTH_PI= 0
##$NZP= 0
##$OFFSET= 17.95386
##$PC= 1
##$PHC0= 307.5092
##$PHC1= 3.848699
##$PH_mod= 0
##$PKNL= yes
##$PPARMOD= 0
##$PPDIAG= 0
##$PPIPTYP= 0
##$PPMPNUM= 100
##$PPRESOL= 1
##$PSCAL= 0
##$PSIGN= 0
##$REVERSE= no
##$SF= 200.13
##$SI= 32768
##$SIGF1= 18.5376
##$SIGF2= -6.396296
##$SINO= 400
##$SIOLD= 32768
##$SREGLST= <1H.CDCl3>
##$SSB= 3
##$STSI= 0
##$STSR= 0
##$SW_p= 4401.40845070423
##$SYMM= 0
##$S_DEV= 0
##$TDeff= 0
##$TDoff= 0
##$TI= <>
##$TILT= no
##$TM1= 0
##$TM2= 0
##$TOPLEV= 0
##$USERP1= <user>
##$USERP2= <user>
##$USERP3= <user>
##$USERP4= <user>
##$USERP5= <user>
##$WDW= 1
##$XDIM= 8192
##$YMAX_p= 0
##$YMIN_p= 0
$$ End of Bruker specific parameters
$$ ---------------------------------
##NTUPLES= NMR FID
##VAR_NAME=  TIME,          FID/REAL,        FID/IMAG
##SYMBOL=    X,             R,               I
##VAR_TYPE=  INDEPENDENT,   DEPENDENT,       DEPENDENT
##VAR_FORM=  AFFN,          ASDF,            ASDF
##VAR_DIM=   8192,          8192,            8192
##UNITS=     SECONDS,       ARBITRARY UNITS, ARBITRARY UNITS
##FACTOR=    0.0002272,     1,               1
##FIRST=     0,             0,               0
##LAST=      1.8609952,     84,              281
##MIN=       0,             -559532,         -559532
##MAX=       1.8609952,     437900,          437900
$$ Real data points
##PAGE= N=1
##DATA TABLE= (X++(R..R)), XYDATA
$$ [...]
$$ plain form
1882 -3707 -3597 -157 -1536 -4186 -442 2951 46 -2301 688 817 -2537 -1556 2373 1512 -1530 434
1898 434 1496 -1963 -3094 1116 1826 -978 270 3282 19 -3758 -212 2968 -368 -1697 2667
1913 2667 2424 -3057 -3119 1874 169 -3775 -449 3449 -335 -4023 -412 1231 -2623 -2066 3261 2250
1929 2250 -2966 -1844 2165 -990 -3532 1022 3657 -841 -2399 2447 1868 -3015 -984 4569 2959
1944 2959 -995 1849 4450 3 -2152 2643 4510 -18 -767 2886 1093 -3346 -1697 1452 -870
1959 -870 -2921 -36 383 -3370 -3822 -195 -1018 -3546 -1192 1524 -1841 -3610 -316 881 -2379 -1964
1975 -1964 2610 1732 -2781 -1209 2482 356 -1968 1266 3827 -18 -2035 2025 2756 -882 -443 2955
1991 2955 2087 -476 767 2378 307 -544 1968 2437 352 285 1549 63 -899 1389 2151 -237 -866
$$ packed form
1882c707J10L440j379k650L744L393k905k347K989J29l354R81L929q61l042J964
1898D34J062l459j131M210P10k804J248L012l263l777L546L180l336j329M364
1913B667k43n481o2M993j705l944L326L898l784l688L611J643l854N57N327j011
1929B250n216J122M009l155k542M554K635m498j558M846n79m883K031N553j610
1944B959l954K844K601m447k155M795J867m528p49L653j793m439J649L149k322
1959h70k051K885M19l753m52L627q23k528K354K716l365j769L294J197l260M15
1975a964M574q78m513J572L691k126k324L234K561l845k017M060P31l638M39L398
1991B955q68k563J243J611k071q51K512M69k085o7J264j486r62K288P62k388o29
$$ plain form
2008 -866 1254 472 -2307 -707 2003 -252 -2482 484 1581 -2777 -3809 535 1141 -2462 -1895 1555
2024 1555 -687 -4339 -1517 1968 68 -1863 1115 2591 -1558 -2412 1322 1923 -604 525 3211
2039 3211 1060 -2483 -727 1304 -332 -761 1973 2187 -852 -1421 572 105 -714 1693 3611 1386
2055 1386 -648 899 826 -1045 -144 2530 1831 -759 -367 -141 -2663 -3470 -684 791 -587 -1114 -93
2072 -93 -1718 -3957 -2346 504 598 -135 631 564 -1922 -2693 -661 371 286 1018 2171 444 -1631 -1346
2090 -1346 -124 219 1493 3199 2419 243 -714 -727 -777 -73 1759 2277 322 -702 -754 -2014 -2632 -381
2108 -381 1795 1086 699 1019 42 -2534 -1719 1482 2259 1233 1593 1377 -1587 -3703 -1958 354 -287
2125 -287 -262 967 202 -2745 -3071 -548 702 822 2804 4254 2081 -179 257 1389 1079 1899 3929
$$ packed form
2008h66K120p82k779J600K710k255k230K966J097m358j032M344O06l603N67L450
2024A555k242l652K822L485j900j931K978J476m149q54L734O01k527J129K686
2039C211k151l543J756K031j636m29K734K14l039n69J993m67q19K407J918k225
2055A386k034J547p3j871R01K674o99k590L92K26k522q07K786J475j378n27J021
2072i3j625k239J611K850R4p33P66o7k486p71K032J032q5P32J153j727k075K85
2090a346J222L43J274J706p80k176r57j3n0P04J832N18j955j024n2j260o18K251
2108c81K176p09l87L20r77k576Q15L201P77j026L60k16k964k116J745K312o41
2125b87K5J229p65k947l26K523J250J20J982J450k173k260M36J132l10Q20K030
$$ plain form
2142 3929 3283 129 -1344 -1150 -1749 -1708 470 1819 348 -1318 -1622 -2158 -2992 -1677 963 1444 138
2159 138 -375 -1084 -2762 -3156 -1405 605 784 435 -349 -1514 -2603 -1857 -164 1107 1849 1963 1014 -144
2177 -144 -973 -1111 -699 633 2082 1538 84 -1179 -1697 -1800 -913 1292 2878 1863 1244 968 749 44
2195 44 1144 2865 3042 2254 1899 852 -1414 -2129 -853 265 -24 -216 42 -1380 -3221 -2220 -157
2212 -157 28 324 1784 1851 -311 -1322 8 600 -17 761 2050 665 -1736 -1867 -781 -1197 -1266 406
2230 406 1657 311 -1062 -503 -388 -641 497 1806 1671 317 -183 -197 -889 -939 -36 844 339 107 426
2249 426 -186 -1003 -150 1392 1679 1764 1724 982 -166 -365 351 501 -11 -38 -361 -1255 -1607 -1848 -1892 -1859 -558
2270 -558 -316 -795 -1014 -821 -1168 -1401 -413 602 10 -1108 -874 -655 -1775 -2312 -653 -170 -1318 -1142
$$ packed form
2142C929o46l154j473J94n99M1K178J349j471j666l04n36q34J315K640M81j306
2159A38n13p09j678l94J751K010J79l49p84j165j089P46J693J271P42J14r49j158
2177a44q29j38M12J332J449n44j454j263n18j03Q87K205J586j015o19k76k19p05
2195D4J100J721J77p88l55j047k266p15J276J118k89j92K58j422j841J001K063
2212a57J85K96J460O7k162j011J330N92o17P78J289j385k401j31J086m16o9J672
2230D06J251j346j373N59J15k53J138J309j35j354n00j4o92n0R03Q80n05k32L19
2249D26o12q17Q53J542K87Q5m0p42j148j99P16J50n12k7l23q94l52k41m4L3J301
2270e58K42m79k19J93l47k33R88J015n92j118K34K19j120n37J659M83j148J76
$$ plain form
2288 -1142 290 -229 -1257 -355 1442 1141 752 1744 2151 960 341 1660 1761 495 871 2027 1075
2305 1075 -884 117 1418 199 -320 1126 1624 79 -123 1397 913 -618 49 1449 486 -1113
2321 -1113 -376 110 -1288 -1729 -93 50 -989 -1255 283 153 -462 360 1519 1022 573 1775 1987 700
2339 700 605 1681 1333 503 602 1173 112 -686 139 534 -446 -793 -42 -180 -1100 -634 -243 -1086 -1179 -627
2359 -627 -517 -1263 -1365 -746 -1262 -1608 -945 -309 -934 -1228 43 238 -683 -148 987 508 -18 721 1230
2378 1230 378 8 976 983 -368 -74 1071 316 -951 -85 781 -470 -1075 272 751 -916 -975 479
2396 479 155 -1369 -811 327 -528 -1539 -490 141 -1190 -1782 -277 225 -1095 -910 650 116 -778
2413 -778 297 1685 597 -392 854 1536 441 279 1350 1188 -36 60 1366 714 -468 1 699
$$ packed form
2288a142J432n19j028R02J797l01l89R92M07j191o19J319J01j266L76J156r52
2305A075j959J001J301j219n19J446M98j545k02J520m84j531O67J400r63j599
2321a113P37M86j398m41J636J43j039k66J538j30o15Q22J159m97m49J202K12j287
2339G00r5J076l48q30R9N71j061p98Q25L95r80l47P51j38r20M66L91q43r3N52
2359f27J10p46j02O19n16l46O63O36o25k94J271J95r21N35J135m79n26P39N09
2378A230q52l70R68Pj351K94J145p55j267Q66Q66j251o05J347M79j667n9J454
2396D79l24j524N58J138q55j011J049O31j331n92J505N02j320J85J560n34q94
2413g78J075J388j088r89J246O82j095j62J071j62j224R6J306o52j182M69O98
$$ plain form
2430 699 -110 -524 163 465 -628 -811 181 99 -97 146 112 -131 -97 712 532 129 341 755 229 181 684
2451 684 484 -95 69 994 666 -100 224 905 563 25 880 912 9 -44 480 435 -359 -25 256 -477 -908
2472 -908 -339 -246 -1066 -1149 -406 -834 -1384 -745 -8 -762 -1187 -144 320 -623 -742 30 -118 -1150 -609 550
2492 550 119 -876 -243 366 -227 -533 692 1046 344 282 1276 1105 339 410 1297 837 182 613 1156 -387
2512 -387 -1233 -294 420 -330 -388 136 -140 -657 -499 60 121 18 -1 134 130 -352 -758 -567 -352 -272 -278 -131 -560
2535 -560 -783 -1051 -648 112 552 315 91 441 207 -386 -238 334 286 4 -94 -374 -882 -1275 -1345 -854 -531
2556 -531 -90 70 -245 -382 -35 339 733 1323 2220 1483 435 716 813 -47 -267 959 1123 81 -735
2575 -735 -341 -596 -1137 -620 1104 1460 504 184 501 -111 -613 651 1699 1038 69 34 -313 -1013 -1373
$$ packed form
2430F99q09m14O87L02j093j83R92q2j96K43l4k43L4Q09j80m03K12M14n26m8N03
2451F84k00n79J64R25l28p66L24O81l42n38Q55L2r03n3N24m5p94L34K81p33m31
2472i08N69R3q20q3P43m28n50O39P37p54m25J043M64r43j19P72j48j032N41J159
2492E50m31r95O33O09n93l06J225L54p02o2R94j71p66P1Q87m60o55M31N43j543
2512c87q46R39P14p50n8N24k76n17J58N59O1j03j9J35mm82m06J91K15Q0oJ47m29
2535e60k23k68M03P60M40k37k24L50k34n93J48N72m8k82r8k80n08l93p0M91L23
2556e31M41J60l15j37L47L74L94N90Q97p37j048K81R7q60k20J226J64j042q16
2575g35L94k55n41N17J724L56r56l20L17o12n02J264J048o61r69l5l47p00l60
$$ plain form
2594 -1373 -385 469 218 47 -247 -680 -1480 -1264 -96 790 843 353 -14 -874 -1518 -1341 -406 353 542 357
2614 357 65 -533 -815 -621 835 1890 2136 2029 1799 989 62 244 998 1543 1354 711 -59 -1331 -2479
2633 -2479 -2283 -1282 -760 -568 -162 -391 -1322 -1714 -566 225 880 1620 1999 945 -217 -446 -406 -143 752
2652 752 1575 942 -580 -1188 -1219 -1326 -973 242 1149 296 -492 -453 -828 -1515 -1059 410 1060 62 -252 -622
2672 -622 -1645 -2112 -686 824 1189 769 482 20 -747 -704 366 1513 1406 1437 783 -119 -1283 -1282 -776
2691 -776 49 780 838 -100 -1008 -1247 -741 -93 1152 1846 1910 1552 654 199 120 477 1165 1405 1102 481 -420
2712 -420 -1400 -1683 -906 -99 197 245 291 -735 -1283 -1071 102 412 828 1459 1136 -236 -808 -354 68 -141
2732 -141 775 1397 526 -767 -1213 -767 -482 -236 586 1205 227 -841 -1092 -1099 -1324 -716 222 -111 -1183 -1148
$$ packed form
2594a373R88Q54k51j71k94m33q00K16J168Q86N3m90l67q60o44J77R35P59J89j85
2614C57k92n98k82J94J456J055K46j07k30q10r27J82P54N45j89o43p70j272j148
2633b479J96J001N22J92M06k29r31l92J148P91O55P40L79j054j162k29M0K63Q95
2652G52Q23o33j522o08l1j07L53J215R07q53p88L9l75o87M56J469O50r98l14l70
2672f22j023m67J426J510L65m20k87m62p67M3J070J147j07L1o54r02j164JN06
2691g76Q25P31N8r38r08k39N06O48J245O94O4l58q98m55p9L57O88K40l03o21r01
2712d20r80k83P77Q07K96M8M6j026n48K12J173L10M16O31l23j372n72M54M22k09
2732a41R16O22q71j293m46M46K85K46Q22O19r78j068k51pk25O08R38l33j072L5
$$ plain form
2752 -1148 -1410 -1697 -1444 -214 621 327 271 519 111 -82 512 1722 2285 1790 1521 1208 262 -54 479
2771 479 939 730 454 322 -173 -828 -1022 -707 -233 -6 46 -22 -477 -975 -1015 -684 -281 253 97 -240 -792
2792 -792 -874 -947 -1033 -310 27 -265 -38 -171 -290 -689 -296 524 509 454 691 392 36 -192 649 814 650 961
2814 961 1294 702 47 702 1133 785 695 1284 1157 254 -35 697 92 -568 -79 269 -546 -1139 -811 -564
2834 -564 -1108 -1082 -369 -326 -1180 -1315 -622 -399 -696 30 329 163 -282 203 637 43 182 645 537 -42 27
2855 27 33 -236 -568 199 385 -166 -691 -374 -414 -420 -323 67 127 -353 -155 4 -56 -310 57 115 -3 220 46
2878 46 -483 -392 -2 -128 -180 37 -53 -204 -517 -231 245 -37 49 674 495 -7 217 669 470 332 731 1066
2900 1066 537 156 649 323 -438 56 1006 599 -128 -55 205 -401 -588 255 520 -352 -607 -97 -242 -1081
$$ packed form
2752a148k62k87K53J230Q35k94n6K48m08j93N94J210N63m95k69l13r46l16N33
2771D79M60k09k76j32m95o55j94L15M74K27N2o8m55m98m0L31M03N34j56l37n52
2792g92q2p3q6P23L37k92K27j33j19l99L93Q20j5n5K37k99l56k28Q41J65j64L11
2814I61L33n92o55O55M31l48r0N89j27r03k89P32o05o60M89L48q15n93L28K47
2834e64n44K6P13M3q54j35O93K23k97P26K99j66m45M85M34n94J39M63j08n79O9
2855B7Ok69l32P67J86n51n25L17m0oR7L90O0m80J98J59o0k54L67N8j18K23j74
2878D6n29R1L90j26n2K17r0j51l13K86M76k82Q6O25j79n02K24M52j99j38L99L35
2900A066n29l81M93l26p61M94R50m07p27P3K60o06j87Q43K65q72k55N10j45q39
$$ plain form
2920 -1081 -691 150 -22 -554 -79 457 -103 -720 334 819 370 418 1004 313 -168 6 459 26 -415 -12
2940 -12 514 -418 -1035 -257 -177 -582 -309 453 39 -227 -133 398 4 -310 200 610 6 -244 -116 -65 -591
2961 -591 -366 4 -150 -328 -211 -217 -410 -211 204 110 37 457 433 -85 -253 199 118 -196 15 330 -326 -885
2983 -885 -413 -81 -370 -356 330 239 -449 -278 340 -241 -602 -191 314 -405 -784 -245 -239 -1238 -699 270 -274
3004 -274 -730 -145 624 176 -121 661 1409 610 620 1382 1368 333 431 1105 783 -101 630 926 -210 -533
3024 -533 330 661 -289 -294 504 186 -261 74 618 -111 -828 -80 289 -352 -748 -144 -350 -982 -585 -30 -96
3045 -96 -520 -185 480 153 -23 603 536 33 283 588 293 -228 -152 -43 -441 -604 89 61 -818 -363 -15
3066 -15 -84 -435 353 666 150 106 536 514 -42 219 537 123 -303 -50 -55 -765 -835 -13 -46 -691 -456 226 -441
$$ packed form
2920a081L90Q41j72n32M75N36n60o17J054M85m49M8N86o91m81J74M53m33m41M03
2940a2N26r32o17P78Q0m05K73P62m14k66R4N31l94l14N10M10o04k50J28N1n26
2961e91K25L70j54j78J17oj93J99M15r4p3M20k4n18j68M52q1l14K11L15o56n59
2983h85M72L32k89J4O86r1o88J71O18n81l61M11N05p19l79N39Or99N39R69n44
3004b74m56N85P69m48k97P82P48p99J0P62j4j035R8O74l22q84P31K96j136l23
3024e33Q63L31r50nP98l18m47L35N44p29p17P48L69o41l96O04k06o32L97N55o6
3045i6m24L35O65l27j76O26o7n03K50L05k95n21P6J09l98j63O93k8q79M55L48
3066a5o9l51P88L13n16m4M30k2n56K61L18m14m26K53np10p0Q22l3o45K35O82o67
$$ plain form
3089 -441 -621 69 437 21 -92 562 481 -581 -311 617 101 -756 112 664 -409 -849 -10 386 -428 -263
3109 -263 615 233 -668 -346 517 -146 -590 -94 278 -497 -867 -143 36 -866 -314 584 253 -285 240 827
3129 827 484 9 950 1138 238 -3 558 314 -481 -180 299 -252 -829 -455 -158 -653 -766 139 -62 -284
3149 -284 -138 378 106 -118 317 335 312 206 822 373 -129 168 416 226 17 573 905 -9 53 828 586
3170 586 144 410 760 212 -286 277 137 -605 -588 208 -174 -819 -662 -199 -893 -918 -350 205 -555 -543 99
3191 99 -10 -625 -237 199 179 -281 125 390 -287 -570 181 405 -134 10 632 330 -479 38 747 347 49
3212 49 821 891 144 -168 582 545 -390 88 687 193 -445 -121 385 -260 -487 181 417 -308 -522 -157 -183
3233 -183 -708 -462 -52 -350 -739 -483 -369 -667 -671 -448 -253 -353 -301 -33 -312 -303 172 193 223 305 433 -61 -194
$$ packed form
3089d41j80O90L68m16j13O54q1j062K70R28n16q57Q68N52j073m40Q39L96q14J65
3109b63Q78l82r01L22Q63o63m44M96L72p75l70P24J79r02N52Q98l31n38N25N87
3129H27l43m75R41J88r00k41N61k44p95L01M79n51n77L74K97m95j13R05k01k22
3149b84J46N16k72k24M35J8k3j06O16m49n02K97K48j90k09N56L32r14O2P75k42
3170E86m42K66L50n48m98N63j40p42J7P96l82o45J57M63o94k5N68N55p60J2O42
3191I9j09o15L88M36k0m60M06K65o77k83P51K24n39J44O22l02q09N17P09m00k98
3212D9P72P0p47l12P50l7r35M78N99m94o38L24N06o45k27O68K36p25k14L65k6
3233a83n25K46M10k98l89K56J14k98mK23J95j00N2K68k79RM75K1L0Q2J28m94j33
$$ plain form
3256 -194 110 207 42 -132 -77 -22 -337 -106 133 -94 -191 255 190 34 10 369 384 57 902 987 516 150 610
3279 610 825 427 456 788 540 -123 76 445 122 -474 -195 455 -216 -777 -403 -122 -621 -800 -89 -59 -564
3300 -564 -548 -208 -422 -405 -32 296 -86 -404 60 58 -506 -209 374 380 -247 -38 506 98 -287 324 604 387
3322 387 79 165 339 -55 -210 60 549 402 288 100 45 -102 -111 110 175 406 277 -32 -349 -165 -417 -447
3344 -447 -123 246 -53 -510 -730 -551 -740 -497 -183 114 -32 -211 -339 -518 -131 -22 162 408 499 373
3364 373 -181 -425 -152 178 213 81 538 397 -580 -937 -39 231 113 244 479 270 -542 -407 2 -26 55
3385 55 92 411 -244 -713 -832 -658 -419 42 580 421 -260 -106 -188 -245 134 820 976 805 441 654 138
3406 138 -114 90 562 834 327 287 224 -66 -474 63 588 808 418 119 -42 -538 -454 -281 285 354 120
$$ packed form
3256a94L04R7j65j74N5N5l15K31K39k27r7M46o5j56k4L59J5l27Q45Q5m71l66M60
3279F10K15l98K9L32k48o63J99L69l23n96K79O50o71n61L74K81m99j79P11L0n05
3300e64J6L40k14J7L73L28l82l18M64kn64K97N83Oo27K09N44m08l85O11K80k17
3322C87l08Q6J74l94j55K70M89j47j14j88n5j47rK21O5K31j29l09l17J84k52l0
3344d47L24L69k99m57k20J79j89K43L14K97j46j79j28j79L87J09J84K46R1j26
3364C73n54k44K73L30L5j32M57j41r77l57Q98K70j18J31K35k09q12J35M09k8Q1
3385E5L7L19o55m69j19J74K39M61N38j59o81J54q2n7L79O86J56j71l64K13n16
3406A38k52K04M72K72n07m0o3k90m08N37N25K20l90k99j61m96Q4J73N66O9k34
$$ plain form
3427 120 -366 -646 -632 -875 -671 -180 38 142 -27 -407 -677 -702 -363 112 230 199 56 -367 -547 -527 -265
3448 -265 57 397 408 237 -183 -284 -185 214 484 680 933 868 250 -527 -74 200 134 313 556 410 -440
3469 -440 -739 -489 -305 -246 108 466 60 -371 -580 -477 -315 105 429 515 191 -171 -370 -272 -330 -37 320
3490 320 384 252 -110 -497 -462 -180 190 692 443 224 -9 -45 -523 -448 140 322 273 160 -14 -470 -593 -349
3512 -349 154 521 447 198 186 -134 -140 -49 519 656 613 444 408 45 -361 -258 64 477 131 73 92 -260 -568
3535 -568 -186 62 178 327 116 4 -303 -398 -231 -111 -47 41 240 -217 -540 -458 -239 -143 -125 411 204 -208
3557 -208 -482 -440 -138 -456 -74 176 16 -212 -541 -265 -394 -385 -130 185 -11 -254 -16 40 7 175 407 542
3579 542 296 286 294 195 -9 144 406 311 299 39 86 -300 -258 -109 184 -3 35 180 151 -313 35 76 449 238
$$ packed form
3427A20m86k80J4k43K04M91K18J04j69l80k70k5L39M75J18l1j43m23j80K0K62
3448b65L22L40J1j71m20j01R9L99K70J96K53o5o18p77M53K74o6J79K43j46q50
3469d40k99K50J84N9L54L58m06m31k09J03J62M20L24Q6l24l62j99R8n8K93L57
3490C20O4j32l62l87L5K82L70N02k49k19k33l6m78P5N88J82m9j13j74m56j23K44
3512c49N03L67p4k49j2l20oR1N68J37m3j69l6l63m06J03L22M13l46n8J9l52l08
3535e68L82K48J16J49k11j12l07r5J67J20O4Q8J99m57l23Q2K19R6J8N36k07m12
3557b08k74M2L02l18L82K50j60k28l29K76j29RK55L15j96k43K38N6l3J68K32J35
3579E42k46j0Qr9k04J53K62r5j2k60M7l86M2J49K93j87L8J45k9m64L48M1L73k11
$$ plain form
3603 238 311 216 69 -131 -33 264 226 130 -106 168 -108 -176 -127 -119 59 -66 12 156 -43 -397 -190 66 111 89
3627 89 113 202 131 40 134 281 154 159 368 241 81 108 155 -72 -27 117 5 2 -254 -275 -312 -389 -437 -86 -68 -338
3653 -338 -113 68 18 -151 86 169 32 -102 205 190 182 -70 44 65 19 -173 -125 -90 -18 -371 147 -184 -164 -170
3677 -170 -50 -131 -69 54 155 -19 -97 -118 214 -103 -211 -73 -98 67 -144 -29 114 -174 -298 -388 -22 -111
3699 -111 -446 -430 -68 -99 -475 -41 124 -53 -119 142 313 4 -20 172 528 113 249 633 379 3 210
3720 210 449 358 219 177 170 46 8 268 57 -93 -43 264 141 -115 26 245 49 -48 202 131 1 -203 203
3743 203 92 16 -55 84 -127 -193 79 239 -236 -118 93 -105 -332 -242 -79 -93 -314 -14 26 56 -239 68
3765 68 0 114 136 390 232 152 25 257 181 131 110 238 72 -67 78 -24 -239 -173 -335 -129 -116 -43 -40 -214
$$ packed form
3603B38P3r5j47k00R8K97l8r6k36K74k76o8M9QJ78j25P8J44j99l54K07K56M5k2
3627H9K4Q9p1r1R4J47j27NK09j27j60K7M7k27M5J44j12lk56k1l7p7m8L51J8k70
3653c38K25J81n0j69K37Q3j37j34L07j5qk52J14K1m6j92M8L5P2l53N18l31K0o
3677a70J20q1O2J23J01j74p8k1L32l17j08J38k5J65k11J15J43k88j24r0L66q9
3699a11l35J6L62l1l76M34J65j77o6K61J71l09k4J92L56m15J36L84k54l76K07
3720B10K39r1j39m2pj24l8K60k11j50N0L07j23k56J41K19j96r7K50p1j30k04M06
3743B03j11p6p1J39k11o6K72J60m75J18K11j98k27R0J63j4k21L00M0L0k95L07
3765F8o8J14K2K54j58q0j27K32p6n0k1J28j66j39J45j02k15O6j62K06J3P3Lj74
$$ plain form
3789 -214 -70 -54 -63 -83 201 114 -58 67 399 231 -142 115 502 128 -139 154 278 -391 -292 -82 52 -316
3811 -316 -449 -71 -284 -602 -141 128 -123 -560 -228 20 -94 -244 32 89 43 -93 121 236 -141 157 283
3832 283 156 107 288 110 -221 -174 -12 -64 -110 -47 -104 -266 -425 -26 -30 -1 33 182 165 118 72 104 74 50 299
3857 299 450 30 51 -66 125 64 111 221 40 -195 -96 -39 -393 -396 -175 -165 3 -38 -129 -297 -153 -59 79 148
3881 148 479 254 -70 -33 -99 -25 -1 90 301 -69 -308 -199 -130 -443 -491 -86 312 -182 -666 -366 -131 -448
3903 -448 -181 329 328 109 -10 233 275 227 326 680 525 476 347 192 77 -86 300 135 -27 370 -58 -503
3925 -503 -592 -159 265 -63 -116 62 -44 -662 -503 -56 87 101 7 336 -6 -359 -514 -89 4 -62 170 -85
3947 -85 -113 -252 -609 -481 -137 -60 -57 -185 -111 -291 -460 -409 87 374 171 201 50 184 -85 -88 339 503 702
$$ packed form
3789b14J44J6rk0K84q7j72J25L32j68l73K57L87l74k67K93J24o69R9K10J34l68
3811c16j33L78k13l18M61K69k51m37L32K48j14j50K76N7m6j36K14J15l77K98J26
3832B83j27m9J81j78l31M7J62n2m6O3n7j62j59L99mK9L4J49j7m7m6L2l0k4K49
3857B99J51m20K1j17J91o1M7J10j81k35R9N7l54lK21J0J68m1r1j68J44R4J38O9
3881A48L31k25l24L7o6P4K4R1K11l70k39J09O9l13m8M05L98m94m84L00K35l17
3903d48K67N10jk19j19K43M2m8R9L54j55m9j29j55j15j63L86j65j62L97m28m45
3925e03q9M33M24l28n3J78j06o18J59M47J43J4r4L29l42l53j55M25R3o6K32k55
3947h5k8j39l57J28L44P7Lj28P4j80j69N1M96K87k03L0j51J34k69lM27J64J99
$$ plain form
3970 702 224 264 28 3 165 145 282 429 275 -106 -215 -182 -92 -139 267 506 116 -475 -369 -76 -369 -398
3992 -398 108 513 169 -531 -66 -95 -56 -166 316 324 3 -43 -281 -110 -107 3 194 182 12 -31 -306 -392 -112
4015 -112 138 161 -87 93 202 -393 -623 -87 299 76 -115 76 89 -275 -172 70 207 132 202 214 241 -57
4037 -57 -21 -10 41 261 178 131 -64 -97 -501 -136 86 48 -3 -98 -33 131 -146 -56 52 278 377 174 98 -22 -107
4062 -107 -21 -64 275 260 7 -215 -334 -181 -28 -166 -182 -75 55 -471 -301 -315 -119 -317 -117 274 -149 -156
4084 -156 27 75 -71 16 360 567 300 101 260 353 275 254 485 279 213 228 217 103 -72 119 41 10 -26 111
4108 111 68 -301 -117 45 222 -135 -47 -85 -308 -260 46 116 46 -84 -110 -159 -462 -234 -19 4 -102 -182 -31
4131 -31 -142 -134 -254 48 -87 -97 -100 -66 -58 -90 -160 104 252 139 135 207 138 87 130 196 327 57 -76 -31 -76 -38 -69
$$ packed form
3970G02m78M0k36k5J62k0J37J47j54l81j09L3R0m7M06K39l90n91J06K93k93k9
3992c98N06M05l44p00M65k9L9j10M82Ql21m6k38J71LJ10J91j2j70m3k75q6K80
4015a12K50K3k48J80J09n95k30N36L86k23j91J91J3l64J03K42J37p5P0J2K7k98
4037e7L6J1N1K20q3m7j95l3m04L65K22l8n1r5O5J64k77R0J08K26R9k03p6j20q5
4062a07Q6m3L39j5k53k22j19J53J53j38j6J07J30n26J70j4J96j98K00L91m23p
4084a56J83M8j46Q7L44K07k67j99J59R3p8k1K31k06o6J5j1j14j75J91p8l1l6J37
4108A11m3l69J84J62J77l57Q8l8k23M8L06P0p0j30k6m9l03K28K15K3j06q0J51
4131c1j11Qj20L02j35j0lL4Ql2p0K64J48j13mP2o9n1M3O6J31k70j33M5m5L8l1
$$ plain form
4158 -69 -139 -1 157 -185 -62 -74 -58 -69 -58 -22 58 52 -17 -52 136 197 327 188 60 231 146 -24 72 435 190
4183 190 206 257 175 -6 -186 68 189 55 72 214 -181 -324 -319 160 31 -89 114 118 57 -105 -203 -195 -248 -149 305
4208 305 103 -111 -74 90 -52 -10 -65 187 -57 -322 -51 2 -215 -146 190 278 -41 65 63 26 29 200 387 290
4232 290 297 100 65 -174 -54 37 317 110 72 -8 -27 -167 66 -137 -3 17 -200 -121 -484 -316 -287 -136 24
4255 24 -116 -326 -143 -295 -223 -255 -46 106 -88 -22 15 27 -222 -117 -160 -36 -198 -150 83 -45 -351 -170 -39
4278 -39 -143 -107 98 152 -225 -74 240 202 208 449 103 227 29 156 114 -72 22 144 -103 -170 -35 -58 -181
4301 -181 -170 98 312 35 83 104 118 115 -190 195 177 -75 -27 -9 -125 -218 -16 -119 -56 124 -54 -35 -196 -173
4325 -173 -122 -10 -145 -81 93 -15 -122 -28 141 -29 15 52 5 211 165 343 218 167 266 198 295 169 146 -193
$$ packed form
4158f9p0J38J58l42J23j2J6j1J1L6Q0oo9l5J88O1J30j39j28J71q5j70R6L63k45
4183A90J6N1q2j81j80K54J21j34J7J42l95j43NM79j29j20K03Mo1j62r8Qn3R9M54
4208C05k02k14L7J64j42M2n5K52k44k65K71N3k17O9L36Q8l19J06kl7LJ71J87r7
4232B90Pj97l5k39J20R1K80k07l8q0j9j40K33k03J34K0k17P9l63J68K9J51J60
4255B4j40k10J83j52P2l2K09J52j94O6L7J2k49J05m3J24j62M8K33j28l06J81J31
4278c9j04L6K05N4l77J51L14l8OK41l46J24j98J27m2j86R4J22k47o7J35k3j23
4301a81J1K68K14k77M8K1J4ll05L85j8k52M8J8j16r3K02j03O3J80j78J9j61K3
4325a73N1J12j35O4J74j08j07R4J69j70M4L7m7K06m6J78j25n1R9o8R7j26k3l39
$$ plain form
4349 -193 -48 -79 -85 -59 -200 -232 -298 -234 -106 -122 -241 -48 231 256 -38 5 249 111 84 110 504 119 43 179
4373 179 92 -158 -191 125 -30 -52 -91 -30 -199 -366 94 294 69 27 106 217 -66 19 88 -45 21 53 30 103
4397 103 -101 19 6 -112 -40 97 -39 6 -133 3 -114 -28 80 -50 -42 -47 -112 17 -47 141 269 -31 125
4420 125 98 163 302 95 301 198 304 155 174 -67 178 -39 -77 -41 -44 -147 -133 -6 -286 -105 -78 -35 127
4443 127 30 31 -14 194 -82 -165 114 96 -56 -115 46 -52 -179 -117 -114 -141 -355 -178 26 -126 -309 16 242 -240
4467 -240 -125 -51 60 -41 34 140 -31 41 56 43 -43 46 162 330 135 253 344 301 24 219 382 259 222
4490 222 128 147 119 -64 -83 42 64 -35 -95 35 -67 36 80 -2 349 200 -93 39 -147 -111 38 -89 29
4513 29 -112 -167 -250 -37 -46 -202 -326 -7 -58 -152 -54 -74 -33 52 -46 149 166 -33 36 -62 297 233 130 212 216 92
$$ packed form
4349a93J45l1oK6j41l2o6O4J28j6j19J93K79K5k94M3K44j38k7K6L94l85p6J36
4373A79q7k50l3L16j55k2l9O1j69j67M60K00k25m2P9J11k83Q5O9j33O6L2k3P3
4397A03k04J20j3j18P2J37j36M5j39J36j17Q6J08j30Qno5J29o4J88J28l00J56
4420A25k7O5J39k07K06j03J06j49J9k41K45k17l8L6lj03J4J27k80J81K7M3J62
4443A27r7Jm5K08k76q3K79j8j52n9J61r8j27O2Lk7k14J77K04j52j83L25K26m82
4467b40J15P4J11j01P5J06j71P2J5j3q6Q9J16J68j95J18R1m3k77J95J63j23l7
4490B22r4J9k8j83j9J25K2r9o0J30j02J03M4q2L51j49k93J32j86L6J49j27J18
4513B9j41n5q3K13rj56j24L19n1r4R8k0M1Q5r8J95J7j99O9r8L59o4j03Q2Mj24
$$ plain form
4539 92 -14 63 31 89 196 -62 180 229 48 -181 120 54 -45 -19 -67 -70 -112 -83 -163 9 -11 53 -31 100 -49 -135
4565 -135 11 -86 -99 123 106 65 -35 -118 96 104 97 121 -100 -62 32 -70 -68 -8 116 -63 -10 -105 -51 115 -215 -117
4591 -117 -104 59 -185 -9 -55 -184 -101 -173 -38 -125 -255 -394 -49 108 33 60 93 207 223 0 334 234 340
4614 340 59 118 118 180 239 -99 71 -11 -26 -3 -147 -287 -154 -294 -165 -74 148 -192 -35 136 49 -94 59
4637 59 -56 13 31 -9 171 -76 -3 137 147 187 -71 -75 -48 -216 26 57 -2 61 88 21 -12 -259 -76 31 -41 152
4663 152 -36 165 -3 26 -95 162 97 114 138 61 -2 -325 169 106 -22 -129 -38 -62 -219 -218 -130 -192 55 133 221
4688 221 -74 -61 104 255 294 149 340 200 310 18 11 225 225 -34 -95 -49 -259 -309 -350 -411 -346 -367 -246 -65
4712 -65 -238 -411 -135 -235 -40 22 -101 11 -217 -162 -45 -48 -65 41 10 61 -39 -110 160 5 180 387 261
$$ packed form
4539I2j06P7l2N8J07k58K42M9j81k29L01o6r9K6m8lm2K9q0J72k0O4q4J31j49q6
4565a35J46r7j3K22j7m1j00q3K14QpK4k21L8R4j02KO0J24j79N3r5N4J66l30R8
4591a17J3J63k44J76m6j29Q3p2J35q7j30j39L45J57p5K7L3J14J6k23L34j00J06
4614C40k81N9%O2N9l38J70q2j5K3j44j40J33j40J29R1K22l40J57J71q7j43J53
4637E9j15O9J8m0J80k47P3J40J0M0k58mK7j68K42L1n9O3K7o7l3k47J83J07p2J93
4663A52j88K01j68K9j21K57o5J7K4p7o3l23M94o3j28j07R1k4j57JQ8o2K47P8Q8
4688B21k95J3J65J51L9j45J91j40J10k92pK14%k59o1M6k10n0m1o1O5k1J21J81
4712f5j73j73K76j00J95O2j23J12k28N5J17lj7J06l1N1j00p1K70j55J75K07j26
$$ plain form
4735 261 142 104 -59 -121 -85 -99 327 227 7 68 36 25 -89 147 197 182 179 89 89 -80 -36 42 213 -68 -49 -109
4761 -109 -393 -402 -415 96 -127 -26 -57 -329 -284 -273 -35 -17 223 116 169 66 -48 115 -80 141 243 188 329
4784 329 136 -156 11 33 151 200 439 278 62 109 -19 -19 110 199 215 150 51 -125 -62 78 -200 108 188 146
4808 146 -70 -176 -77 68 10 132 307 41 -42 -85 -135 -178 -171 36 -21 -119 -258 -162 -276 -255 -256 92 5 23 6 -98
4834 -98 -92 -150 211 152 173 117 92 34 -64 -189 67 -1 45 -72 -5 23 -23 -154 60 113 -14 71 104 32 -206 -89
4860 -89 151 -17 -41 -235 27 36 -189 -179 -18 46 -33 45 65 -146 22 110 54 -28 201 159 41 49 -205 -105 140
4885 140 -100 -8 54 115 147 55 5 96 183 237 263 99 106 60 66 3 -191 43 71 -257 -157 -115 -135 -41 -232 -43 -101
4912 -101 -156 -63 -69 -170 -83 -11 2 -158 -36 5 -40 -157 65 7 -18 20 23 3 81 14 376 254 34 181 59 -69
$$ packed form
4735B61j19l8j63o2L6j4M26j00k20O1l2j1j14K36N0j5lr0%j69M4P8J71k81J9o0
4761a09k84rj3N11k23J01l1k72M5J1K38J8K40j07N3j03j14J63j95K21J02n5J41
4784C29j93k92J67K2J18M9K39j61k16M7j28%J29Q9J6o5r9j76O3J40k78L08Q0m2
4808A46k16j06R9J45n8J22J75k66q3m3n0m3PK07n7r8j39R6j14K1jL48q7J8j7j04
4834i8On8L61n9K1n6k5n8r8j25K56o8M6j17O7K8m6j31K14N3j27Q5L3p2k38J17
4860h9K40j68k4j94K62Rk25J0J61O4p9P8K0k11J68Q8n6q2K29m2j18Qk54J00K45
4885A40k40R2O2O1L2r2n0R1Q7N4K6j64Pm6Oo3j94K34K8l28J00M2k0R4j91J89n8
4912a01n5R3oj01Q7P2J3j60J22M1m5j17K22n8k5L8Lk0P8o7L62j22k20J47j22j28
$$ plain form
4938 -69 23 79 -62 -52 -156 133 -84 -45 89 -103 -7 146 -18 128 59 -33 14 -105 -108 3 -59 -84 -134 152 -88
4963 -88 -241 -105 -130 -26 -90 -5 18 37 82 188 -132 -96 -135 99 56 -93 125 138 -38 46 -10 64 -104 -18 172
4988 172 -243 -157 -108 166 23 -77 126 111 46 162 102 31 -20 10 104 120 -128 207 196 -32 -30 -5 27 -225 -104
5013 -104 75 -85 -302 13 -126 4 72 -114 98 102 128 11 34 29 -215 -38 -42 -6 -82 36 -18 -236 -27 -128
5037 -128 -51 -44 -35 148 -82 21 6 109 235 -29 265 148 26 7 155 -21 194 -138 57 163 37 -103
5059 -103 -103 88 195 -27 23 34 -187 -63 -73 97 -69 -127 -145 -88 -174 -101 -206 -48 -80 118 31 79 -15 112 102
5084 102 -19 -68 51 92 73 6 95 -20 -58 16 167 -13 -74 -43 -37 -142 39 -143 101 -104 -202 29 100 -118
5108 -118 -164 39 -22 -102 34 0 -42 -138 -47 145 14 -10 -8 276 98 224 43 189 86 97 41 12 57 -42 108
$$ packed form
4938f9R2N6j41J0j04K89k17L9J34j92R6J53j64J46o9r2M7j19lJ11o2k5n0K86k40
4963h8j53J36k5J04o4Q5K3J9M5J06l20L6l9K34m3j49K18J3j76Q4n6P4j68Q6J90
4988A72m15Q6M9K74j43j00K03j5o5J16o0p1n1L0R4J6k48L35j1k28KK5L2k52J21
5013a04J79j60k17L15j39J30O8j86K12MK6j17K3nk44J77mL6p6J18n4k18K09j01
5037a28P7PRJ83k30J03j5J03J26k64K94j17j22j9J48j76K15l32J95J06j26j40
5059a03%J91J07k22N0J1k21J24j0J70j66n8j8N7q6P3j05J58l2J98q7M8r4J27j0
5084A02j21m9J19M1j9o7Q9j15l8P4J51j80o1L1Oj05J81j82K44k05r8K31P1k18
5108a18m6K03o1q0J36l4m2r6R1J92j31k4KK84j78J26j81J46j03J1n6k9M5r9J50
$$ plain form
5133 108 45 -90 -121 -240 -129 5 -69 15 -43 -29 -44 -60 -11 -88 -191 223 -21 -209 -78 -126 -179 -98 -268 -43
5157 -43 -119 -21 -204 181 -170 -130 32 113 2 28 -111 127 50 -155 50 -14 10 -13 5 194 153 -67 196 -1
5181 -1 197 151 211 126 21 -160 84 -42 -85 -189 -83 -256 -233 -36 -34 9 -231 121 110 62 28 232 2 -102
5205 -102 219 124 99 -8 -17 78 109 -160 132 111 -191 189 -83 -60 -59 201 234 116 -66 9 -63 -46 -73 -102 34
5230 34 -112 -115 -73 -299 -73 21 179 -1 121 217 105 -13 -135 254 198 178 67 26 88 -45 -28 -115 189 88
5254 88 51 104 273 -101 66 68 51 93 293 247 -48 29 97 -28 -10 -19 80 92 -106 -183 -212 -33 -69 -34 97 13 -141
5281 -141 -176 -22 0 -80 109 36 -156 -252 -200 -82 17 -64 -19 162 -85 -96 -25 40 53 18 146 69 8 -21 98 0
5307 0 -49 -1 146 -17 -171 -105 -75 8 -47 -58 81 -51 -52 -13 -85 112 60 185 297 -26 254 81 4 4 -128 94
$$ packed form
5133A08o3j35l1j19J11J34p4Q4n8J4j5j6M9p7j03M14k44j88J31m8n3Q1j70K25
5157d3p6R8j83L85l51M0J62Q1j11K6j39K38p7k05K05o4K4k3J8J89m1k20K63j97
5181aJ98m6O0q5j05j81K44j26m3j04J06j73K3J97KM3k40L52j1m8l4K04k30j04
5205a02L21r5k5j07rR5L1k69K92k1l02L80k72K3JK60L3j18j82P5p2J7k7k9J36
5230C4j46lM2k26K26R4J58j80J22R6j12j18j22L89n6k0j11m1O2j33J7q7L04j01
5254H8l7N3J69l74J67Kj7M2K00m6k95P7O8j25J8rR9J2j98p7k9J79l6L5J31q4j54
5281a41l5J54K2q0J89p3j92r6N2J18R9q1M5J81k47j1P1O5J3l5J28p7o1k9J19r8
5307@m9M8J47j63j54O6L0Q3n5j1J39j32jL9p2J97n2J25J12l23K80j73p7%j32K22
$$ plain form
5333 94 88 144 -94 38 4 -94 -354 -100 -31 -75 -73 -4 -4 -18 59 153 170 21 -29 158 128 -32 -81 11 66 63 206 83
5361 83 107 42 74 31 163 72 233 -71 -92 -4 114 15 37 37 57 92 -71 80 127 124 109 229 -16 85 -133 20
5387 20 114 -75 0 -31 -48 -110 -9 22 -71 2 -146 -81 -62 -40 97 -33 -103 -1 -49 136 0 14 112 187 144 31
5413 31 74 -56 -132 -77 94 20 -175 -53 -145 -132 -198 -163 45 0 -220 129 -99 -139 -173 -8 -35 -82 117 122 235
5438 235 -18 -12 -39 133 6 154 -46 -198 0 119 -35 -48 109 10 -59 -5 88 37 137 -28 34 29 83 115 -80
5463 -80 44 47 121 -40 45 127 10 -72 218 -85 -9 74 -35 151 70 111 38 -126 40 -40 77 109 -49 -6 -91
5488 -91 189 -5 114 227 153 110 91 119 111 0 108 109 25 103 85 19 -18 78 73 79 189 136 -2 -14 64 163 41 85
5516 85 -93 -131 -15 -87 -37 64 65 -73 49 195 105 -161 -9 4 101 136 99 -14 -223 -130 24 29 -88 40 58
$$ packed form
5333I4oN6k38J32l4r8k60K54O9m4KO9%j4P7R4J7j49n0J87l0j60m9R2N5lJ43j23
5361H3K4o5L2m3J32r1J61l04k1Q8J18r9K2%K0L5j63J51M7lj5J20k45J01k18J53
5387B0R4j89P5l1j7o2J01L1r3P3j48O5J9K2J37j30p0J02m8J85j36J4R8P5m3j13
5413C1M3j30p6N5J71p4j95J22r2J3o6L5K08m5k20L49k28m0l4J65k7m7J99NJ13
5438B35k53Ok7J72j27J48k00j52J98J19j54j3J57r9o9N4R3n1J00j65O2nN4L2j95
5463h0J24LP4j61Q5Q2j17q2K90l03P6Q3j09J86q1M1p3j64J66q0J17L2j58M3q5
5488i1K80j94J19J13p4m3j9K8qj11J08Jq4P8j8o6l7R6nOJ10n3j38j2P8R9j22M4
5516H5j78l8J16p2N0J01Jj38J22J46r0k66J52J3R7L5l7j13k09R3J54Nj17J28J8
$$ plain form
5541 58 -78 -216 -132 -146 -33 -197 -71 -14 92 -82 -24 83 -207 50 13 40 14 186 57 88 5 -97 -42 143
5565 143 96 21 50 125 247 187 178 140 1 50 64 -46 20 -22 36 -43 -152 -14 -103 -118 -60 13 7 62 -10 -237 -154 -17
5593 -17 -51 3 41 -13 1 36 -145 -23 7 58 -60 152 56 57 90 122 176 134 57 39 307 97 97 -80 -163 -160 -18 -49
5621 -49 120 -118 -50 66 -201 -76 -19 85 264 34 83 160 239 92 8 6 25 98 -29 12 -31 -220 -143 82 -103
5646 -103 85 218 22 -188 72 61 -15 121 91 -120 -135 94 -146 -75 -93 -78 -54 -58 -8 -92 -2 -32 36 49 -13 105
5672 105 94 -43 116 -39 27 52 94 -53 -103 78 28 9 -13 -22 209 -11 -39 107 68 -66 98 -12 -38 20 -163
5697 -163 71 -22 -43 -141 -69 -165 -33 -51 -115 -138 137 -3 -1 94 154 83 132 -62 126 -12 44 9 -10 -66 47 -81
5723 -81 -169 -125 247 308 22 -127 -5 45 236 227 -104 -115 30 -36 -83 -69 -86 44 -13 -157 24 52 -190 -10 -95
$$ packed form
5541E8j36j38Q4j4J13j64J26N7J06j74N8J07k90K57l7K7k6J72j29L1q3j02N5J85
5565A43m7p5K9P5J22o0rl8j39M9J4j10O6m2N8p9j09J38q9j5N8P3oN5p2k27Q3J37
5593a7l4N4L8n4J4L5j81J22L0N1j18K12r6JL3L2N4m2p7j8K68k10%j77q3LJ42l1
5621d9J69k38O8J16k67J25N7J04J79k30M9P7P9j47q4kJ9P3j27M1m3j89P7K25j85
5646a03J88J33j96k10K60j1p6J36l0k11j5K29k40P1j8J5K4mN0q4R0l0O8J3o2J18
5672A05j1j37J59j55O6K5M2j47n0J81n0j9k2rK31k20k8J46l9j34J64j10k6N8j83
5697a63K34r3k1r8P2r6J32j8o4k3K75j40KR5O0p1M9j94J88j38N6l5j9n6J13j28
5723h1q8M4L72O1k86j49J22N0J91rl31j1J45o6m7J4j7J30n7j44J81K8k42J80q5
$$ plain form
5748 -95 -39 75 -1 108 -103 209 83 -20 -71 -18 -90 52 -22 -76 151 160 72 290 -86 -17 41 134 102 186 12
5773 12 -9 176 143 35 -15 -20 21 -175 -153 21 -46 -115 -92 49 -39 -20 129 -54 -93 -205 -20 -40 -10 -95 -45 -129
5799 -129 -158 -70 -221 -13 36 -103 143 42 -135 -15 238 -19 -121 64 171 155 222 45 314 -18 -36 95
5821 95 191 4 -9 86 -38 -69 15 -25 53 -53 -91 -36 -75 2 35 64 44 -56 1 -96 -183 -44 -21 135 -154 -32
5847 -32 11 -79 6 -65 -18 13 -26 54 -131 -87 -101 45 -56 0 129 -41 24 268 -71 -171 242 -103 -203 41
5871 41 -82 20 99 -18 -51 -10 -26 45 -42 14 -32 154 55 45 -2 -104 -41 -25 39 70 63 -133 -42 37 -306 -87 97
5898 97 142 -84 -16 14 -157 90 167 17 -78 -84 23 130 -15 31 123 82 48 65 6 37 34 -124 33 136 86 51
5924 51 40 -45 -166 8 47 144 96 -104 111 -175 91 127 154 221 193 147 162 52 153 138 1 -17 20 46 84 -68
$$ packed form
5748i5N6J14p6J09k11L12j26j03n1N3p2J42p4n4K27Rq8K18l76O9N8R3l2Q4j74
5773A2k1J85l3j08n0nM1j96K2J74o7o9K3J41q8J9J49j83l9j12J85k0L0q5N0q4
5799a29k9Q8j51K08M9j39K46j01j77J20K53k57j02J85J07j6O7j77K69l32j8J31
5821I5R6j87j3R5j24l1Q4m0P8j06l8N5l9P7L3K9k0j00N7r7q7J39K3J56k89J22
5847c2M3r0Q5p1M7L1l9Q0j85M4j4J46j01N6J29j70O5K44l39j00M13l45j00K44
5871D1j23J02P9j17l3M1j6P1q7N6m6J86r9j0m7j02O3J6O4L1pj96R1P9l43K19J84
5898I7M5k26O8L0j71K47P7j50r5oJ07J07j45M6R2m1l4J7n9L1lj58J57J03n0l5
5924E1j1q5j21J74L9R7m8k00K15k86K66L6K7O7k8m6J5j10J01j5j37j8L7K6L8j52
$$ plain form
5950 -68 -51 50 170 69 45 -52 106 29 67 183 114 247 166 190 3 -85 -48 -18 43 -32 -29 97 -176 115 -128
5975 -128 34 -147 -30 -119 -43 -266 -193 -8 -103 136 41 -57 -51 -69 12 -89 -110 -26 -61 61 122 56 133 -112 167
6000 167 -204 202 -110 -16 -14 37 -66 -115 -38 -95 -71 -79 88 96 -83 -25 118 -18 96 197 258 -48 -72 153 30
6025 30 -24 -5 2 -42 -19 32 -31 9 29 -3 -72 13 208 34 98 -49 -142 -1 272 83 -118 29 -5 55 57 -2 -34
6052 -34 50 -31 86 -178 -46 98 20 2 -94 -6 60 7 -189 -42 109 -7 42 58 -28 -41 -63 65 296 93 8
6077 8 243 -53 -240 67 171 -7 113 108 -26 -41 -139 16 158 -148 -89 -52 13 50 12 -72 -113 23 171 -103
6101 -103 -97 -225 -109 -136 -14 19 3 -70 -102 -133 -152 24 86 0 1 -103 35 17 -21 -197 -20 99 -196 106 30
6126 30 -152 -115 83 -2 -101 -135 113 23 -47 148 203 -4 119 106 34 -86 19 21 109 -221 -47 -12 2 -30 -124 120
$$ packed form
5950f8J7J01J20j01k4r7J58p7L8J16o9J33q1K4j87q8L7L0O1p5LJ26k73K91k43
5975a28J62j81J17q9P6k23P3J85r5K39r5r8Oj8Q1j01k1Q4l5J22O1o6P7k45K79
6000A67l71M06l12R4KN1j03m9P7n7K4qJ67Qj79N8J43j36J14J01O1l06k4K25j23
6025C0n4J9Pm4K3N1o3M0K0l2o9Q5J95j74O4j47r3J41K73j89k01J47l4O0Kn9l2
6052c4Q4q1J17k64J32J44p8j8r6Q8O6n3j96J47J51j16M9J6q6j3k2J28K31k03q5
6077HK35k96j87L07J04j78J20nj34j5r8J55J42l06N9L7O5L7l8q4m1J36J48k74
6101a03Oj28J16k7J22L3j6p3l2l1j9J76O2q6Jj04J38j8l8j76J77J19k95L02p6
6126C0j82L7J98q5r9l4K48r0p0J95N5k07J23j3p2j20J05KQ8l30J74L5J4l2r4K44
$$ plain form
6152 120 -130 -31 27 -38 -59 -106 19 96 -35 -245 9 -45 -72 -188 42 -221 17 81 42 41 -178 -31 -18 -41 -148
6177 -148 90 -115 -111 3 -104 20 -75 -150 -85 -18 -88 97 29 15 -69 -230 43 -19 136 -95 130 -62 116 -153
6201 -153 18 92 100 -137 -2 -98 -249 -89 43 14 102 -37 -186 59 -32 -13 -35 -56 -19 -47 71 148 -52 -90 63
6226 63 59 5 106 88 32 -170 89 -210 -90 139 38 122 63 140 -127 -118 -99 193 -41 -64 108 101 -221 52 75
6251 75 -24 53 -17 11 104 48 -32 78 -10 -74 85 34 -85 -51 -125 -122 -67 161 232 -8 -31 5 -35 -23 55 90 -117 46
6279 46 -102 68 -33 121 83 26 111 109 80 -15 20 -54 31 64 75 15 -64 -127 79 -108 121 28 94 -229 51 47 -122
6306 -122 -38 -150 36 -1 15 -77 127 -112 -33 -182 55 11 58 -74 -71 97 -91 123 28 -112 59 1 -38 31
6330 31 30 21 104 -82 -64 -20 91 103 -45 251 -107 25 56 -38 88 113 205 63 -54 -35 41 -52 46 85 13 -145
$$ packed form
6152A20k50R9N8o5k1m7J25P7j31k10K54n4k7j16K30k63K38O4l9jk19J47J3k3j07
6177a48K38k05MJ14j07J24r5p5O5O7p0J85o8j4q4j61K73o2J55k31K25j92J78k69
6201a53J71P4Qk37J35r6j51J60J32k9Q8j39j49K45r1J9k2k1L7k8J18P7k00l8J53
6226F3mn4J01j8n6k02K59k99J20K29j01Q4n9P7k67RJ9K92k34k3J72pl22K73K3
6251G5r9P7p0K8R3n6q0J10q8o4J59n1j19L4p4LN5K28P1k40k3L6m0J2P8L5k07J63
6279D6j48J70j01J54l8n7Q5kk9r5L5p4Q5L3J1o0p9o3K06j87K29r3O6l23K80mj69
6306a22Q4j12J86l7J6r2K04k39P9j49K37m4M7j32LJ68j88K14r5j40J71n8l9O9
6330C1jrQ3j86J8M4J11J2j48K96l58J32L1r4J26K5R2j42j17J9P6r3R8L9p2j58
$$ plain form
6356 -145 -65 -116 5 -69 -99 -154 -94 61 34 -7 19 -249 -2 -109 82 -163 -31 24 -134 -75 -58 10 117 10
6380 10 92 1 198 -99 39 -97 -36 -93 29 33 53 -99 114 -59 -225 99 78 -11 -90 97 122 47 -166 72
6404 72 79 32 64 43 -57 73 -83 138 -66 116 -59 -110 -212 -66 -125 -6 -50 4 -75 -73 -61 -29 141 81 -102
6429 -102 9 62 34 43 -48 -11 -11 -15 -158 -120 -86 -92 -2 28 -149 28 -24 70 -63 45 -52 58 -91 -10 -118 22 48
6456 48 -41 -72 6 15 -54 11 -24 -176 119 134 -9 35 -20 32 -61 -162 69 -18 -228 -179 -127 7 -95 -134 5 90
6482 90 -56 -52 -23 -95 -3 80 -114 -85 37 141 -17 -72 -80 -118 -149 -44 -37 15 96 -17 51 37 86 -105 70 -15 113
6509 113 123 107 189 123 225 88 232 -112 -5 5 22 196 -100 198 235 68 87 -92 -188 -145 117 417 113
6532 113 21 133 -68 -101 17 -116 56 224 101 -55 93 -5 -29 -105 -64 -53 53 24 135 -42 12 83 140 14
$$ packed form
6356a45Q0n1J21p4l0n5O0J55k7m1K6k68K47j07J91k45J32N5j58N9J7O8J07j07
6380A0Q2r1J97k97J38j36O1n7J22MK0j52K13j73j66L24k1q9p9J87K5p5k13K38
6404G2Pm7L2k1j00J30j56K21k04J82j75n1j02J46n9J19m4N4p9KJ2L2J70o0j83
6429a02J11N3k8Rr1L7%mj43L8L4oR0L0j77J77n2R4j33J08r7J10j49Q1j08J40K6
6456D8q9l1P8Ro9O5l5j52K95J5j43M4n5N2r3j01K31q7k10M9N2J34j02l9J39Q5
6482I0j46MK9p2R2Q3j94K9J22J04j58n5ql8l1J05PN2Q1j13O8j4M9j91J75q5J28
6509A13J0j6Q2o6J02j37J44l44J07J0J7J74k96K98L7j67J9j79r6M3K62L00l04
6532A13r2J12k01l3J18j33J72J68j23j56J48r8k4p6M1J1J06k9J11j77N4P1N7j26
$$ plain form
6556 14 -81 -145 8 148 111 -36 56 -53 -141 -15 -94 -30 -99 -10 47 125 83 41 -32 83 -23 -106 -40 34 94 -36
6582 -36 -144 -66 102 44 -60 61 112 135 -39 -59 132 159 29 -2 75 -67 -1 227 103 -94 -148 -51 56 -116
6606 -116 -94 18 -29 -93 -196 -81 -131 -332 -92 157 -11 65 -95 78 -136 -58 26 -54 -91 -23 82 22 -98 132
6630 132 161 -173 -124 -18 -88 -32 70 127 -139 168 -33 -14 -35 14 41 102 5 -41 86 26 94 2 -21 15 107 25
6656 25 -18 -91 -183 -28 -38 118 159 -55 -83 48 165 -54 67 -42 14 -182 -56 -76 -76 -115 -51 169 42 44 59
6681 59 -191 -60 45 54 -108 -133 -35 133 8 -157 24 -10 11 105 18 -107 6 128 -40 58 -12 -100 35 9
6705 9 124 -119 -3 29 -126 -30 53 -102 106 -151 -40 273 -87 44 -120 -47 -96 15 -93 51 3 57 -23
6728 -23 81 180 -50 -65 9 -35 -21 -104 -92 62 -94 66 -25 9 -24 -129 -115 -54 68 -68 -294 -76 -106 1 -173
$$ packed form
6556A4r5o4J53J40l7j47R2j09q8J26p9O4o9Q9N7P8m2m2p3J15j06q3O6P4O0j30
6582c6j08P8J68n8j04J21N1K3j74k0J91K7j30l1P7j42O6K28j24j97n4R7J07j72
6606a16K2J12m7o4j03J15n0k01K40K49j68P6j60J73k14P8Q4q0l7O8J05o0j20K30
6630A32K9l34M9J06p0N6J02N7k66L07k01J9k1M9K7O1r7m6J27o0O8r2k3L6R2q2
6656B5m3p3r2J55j0J56M1k14k8J31J17k19J21j09N6j96J26k0%l9O4K20j27KJ5
6681E9k50J31J05Rj62k5R8J68j25j65J81l4K1R4q7j25J13J22j68R8p0q8J35k6
6705IJ15k43J16L2j55R6Q3j55K08k57J11L13l60J31j64P3m9J11j08J44m8N4q0
6728b3J04R9k30j5P4m4J4q3J2J54j56J60r1L4l3j05J4O1J22j36k26K18l0J07j74
$$ plain form
6753 -173 12 39 -59 21 -73 44 -54 34 -10 -14 -172 -51 141 133 29 55 27 52 26 129 119 -8 154 186 89 -21
6779 -21 33 -19 -34 13 108 84 -100 -121 37 -35 90 -124 131 15 48 98 -102 40 -258 -71 -114 -199 32 25 167
6804 167 17 -25 171 -108 -28 -103 82 59 -5 36 -83 -46 79 118 -91 166 -75 -40 58 -151 -86 -16 -17 -71 80
6829 80 110 156 -53 -219 -9 -56 -92 -8 -16 74 98 76 88 57 -28 47 -57 46 50 28 -66 -16 -199 -46 27 26 -209 -51
6857 -51 -20 115 -132 -38 57 40 -49 75 53 -7 -89 -33 65 84 -89 106 52 -5 -91 -30 -330 -31 -70 86 40 -135
6883 -135 -1 -4 149 42 258 85 41 88 95 16 -10 -214 144 -115 62 -16 -77 -3 -164 -26 -2 -82 3 22 -58
6908 -58 -118 -15 -19 -4 94 -7 -173 -57 49 -38 38 132 0 -126 102 -164 247 51 -16 171 -5 -40 74 90
6932 90 -148 111 -127 72 -91 -81 -76 -139 -91 156 -42 -141 -59 106 9 -103 14 31 -9 3 -44 55 52 -152 -25
$$ packed form
6753a73J85K7r8Q0r4J17r8Q8m4mj58J21J92qj04K6k8K5k6J03j0j27J62L2r7j10
6779b1N4n2j5M7R5k4j84k1J58p2J25k14K55j16L3N0k00J42k98J87m3q5K31pJ42
6804A67j50m2J96k79Q0p5J85k3o4M1j19L7J25L9k09K57k41L5R8k09O5P0jn4J51
6829H0L0M6k09j66K10m7l6Q4qR0K4k2J2l1q5P5j04J03Mk2r4N0j83J53P3jk35J58
6857e1L1J35k47R4R5j7q9J24k2o0q2N6R8J9j73J95n4n7q6O1l00K99l9J56m6j75
6883a35J34lJ53j07K16j73m4M7Pp9k6k04L58k59J77p8o1P4j61J38K4q0Q5J9q0
6908e8o0J03mJ5R8j01j66J16J06q7P6R4j32j26K28k66M11j96o7J87j76l5J14J6
6932I0k38K59k38J99j63J0No3M8K47j98r9Q2J65r7j12J17J7m0J2m7R9lk04J27
$$ plain form
6957 -25 43 -12 -197 -93 102 -67 -145 -29 -203 -29 -196 29 169 -57 14 92 102 -35 97 69 200 18 45
6980 45 46 -83 98 200 184 -5 -83 -106 131 -82 -78 -12 -42 -82 -154 -5 -91 -103 -108 95 203 -49 102 15 -138 172
7006 172 131 17 -19 7 -34 25 -253 -15 -34 33 -46 -56 66 -30 43 59 25 -77 -37 35 -64 128 175 16 69 221
7032 221 10 2 168 137 -66 -192 -115 -32 -109 -159 -20 73 -196 -43 -90 -195 -78 34 -42 66 -41 92 -25
7055 -25 -4 45 10 45 -53 151 59 11 -163 -89 205 -84 -206 84 -115 44 -28 -115 53 -41 -82 56 -52 13 49
7080 49 116 76 5 42 129 96 39 28 126 -93 1 247 -70 87 -89 19 119 -96 40 -41 20 -24 -3 47 53 -95
7106 -95 121 7 119 108 106 47 -3 141 23 24 52 56 43 -73 -72 -4 -77 71 77 -82 107 59 -91 189 58 9 25
7133 25 3 182 65 -14 1 53 -187 -203 -51 10 28 -141 122 -78 -54 -182 -19 -164 77 -7 -31 29 64 12 128
$$ packed form
6957b5O8n5j85J04J95j69p8J16j74J74j67K25J40k26P1P8J0j37J32k8J31j82K7
6980D5Jj29J81J02j6j89p8k3K37k13MO6l0m0p2J49q6j2nK03J08k52J51q7j53L10
7006A72m1j14l6K6m1N9k78K38j9O7p9j0J22r6P3J6l4j02M0P2r9J92M7j59N3J52
7032B21k11qJ66l1k03j26P7Q3p7n0J39R3k69J53m7j05J17J12p6J08j07J33j17
7055b5K1M9l5L5r8K04r2m8j74P4K94k89j22K90j99J59p2q7J68r4m1J38j08O5L6
7080D9O7m0p1L7Q7l3n7j1R8k19R4K46l17J57j76J08J00k15J36q1O1m4K1N0Oj48
7106i5K16j14J12j1kn9n0J44j18JK8Mj3j16JO8p3J48Oj59J89m8j50K80j31m9J6
7133B5k2J79j17p9J5N2k40j6J52O1J8j69K63k00K4j28J63j45K41q4k4O0L5n2J16
$$ plain form
7158 128 -50 29 -47 -45 3 147 59 73 96 181 31 74 137 0 -50 63 20 12 -90 -156 71 109 -8 -152 -93 19
7184 19 12 67 -96 47 -165 -176 -106 -12 28 -30 -40 173 32 -121 -165 -98 61 -39 45 -20 -49 -44 -174 -134 -218 -70
7210 -70 104 272 -5 -133 72 -66 -29 -55 -8 72 294 62 102 1 -184 -12 142 -69 51 53 102 70 110 185
7234 185 -94 68 -31 190 98 -23 5 -88 108 -18 -44 158 -72 -40 28 29 -107 -39 39 -51 10 162 -70 -26 -118
7259 -118 95 -11 -83 49 75 -190 -122 -10 -146 -82 29 -59 173 6 2 51 73 70 83 -100 46 47 -83 46 105
7284 105 -178 153 -17 109 29 110 140 11 93 95 198 122 113 75 -152 -43 89 -87 -49 -50 -91 -38 16 25 -116 41
7310 41 -146 -137 -75 116 76 -77 -254 -143 -57 -20 57 128 176 -158 -46 -63 75 -67 17 79 147 37 2 86 6 31
7336 31 38 -46 -102 99 -102 -151 0 144 159 -51 4 -18 21 -115 -127 19 38 198 -122 -101 45 -56 3 52 -141
$$ packed form
7158A28j78P9p6KM8J44q8J4K3Q5j50M3O3j37n0J13m3qj02o6K27L8j17j44N9J12
7184A9pN5j63J43k12j1P0R4M0n8j0K13j41j53m4O7J59j00Q4o5k9Nj30M0q4J48
7210g0J74J68k77j28K05j38L7k6M7Q0K22k32M0j01j85J72J54k11J20KM9l2M0P5
7234A85k79J62r9K21r2j21K8r3J96j26k6K02k30L2O8Jj36O8P8r0O1J52k32M4r2
7259a18K13j06p2J32K6k65O8J12j36O4J11q8K32j67mM9K2lJ3j83J46Jj30J29N9
7284A05k83L31j70J26q0Q1L0j29Q2KJ03p6rl8k27J09J32j76L8jm1N3N4Rj41J57
7310D1j87RO2J91m0j53j77J11Q6L7P7P1M8l34J12j7J38j42Q4O2O8j10l5Q4q0K5
7336C1Pq4n6K01k01m9J51J44J5k10N5k2L9j36j2J46J9J60l20K1J46j01N9M9j93
$$ plain form
7361 -141 -141 -116 -28 -26 113 -161 73 164 81 -60 105 -41 -152 0 -4 -5 118 163 -79 27 11 -30 34 -27 -115 -109 2
7388 2 -55 -160 13 3 -46 63 11 22 -44 31 -54 34 87 41 -13 80 16 13 -24 43 -60 -2 72 180 97 12 151 -26
7416 -26 -98 -11 191 -155 -81 -261 271 -94 -36 -22 2 -57 -10 43 -102 -49 -172 131 159 37 246 -8 19 -124
7440 -124 23 169 -171 -119 -15 -161 47 -67 0 7 -18 -57 -72 -77 55 -150 127 78 47 61 36 -231 -134 -41 76
7465 76 6 -67 -4 -112 26 101 71 -16 -49 -65 -30 -26 -1 158 98 -40 -33 -66 -22 124 -3 188 161 74 58 96 211
7492 211 176 113 93 237 17 142 233 37 36 15 101 -13 56 34 -67 -53 -150 41 163 18 4 -112 97 42 211
7517 211 -160 60 -63 -149 71 -46 23 21 3 7 6 49 160 212 109 7 6 -91 -15 -124 22 -7 -72 72 129 40
7543 40 36 135 154 259 38 -71 127 68 -187 -58 74 83 -28 -26 -29 -15 74 -59 -55 42 -73 90 -73 -73 224 143 22
$$ packed form
7361a41%K5Q8KJ39k74K34R1q3j41J65j46j11J52mjJ23M5k42J06j6m1O4o1q8OJ11
7388Bn7j05J73j0m9J09n2J1o6P5q5Q8N3m6n4R3o4ll7O7j03N8P4J08q3q5J39j77
7416b6p2Q7K02l46P4j80N32l65N8J4K4n9M7N3j45N3j23L03K8j22K09k54K7j43
7440a24J47J46l40N2J04j46K08j14O7Pk5l9j5nJ32k05K77m9l1J4k5k67R7R3J17
7465G6p0p3O3j08J38P5l0q7l3j6L5MK5J59o0j38Pl3M4J46j27J91k7q7j6L8J15
7492B11l5o3k0J44k20J25R1j96jk1Q6j14O9k2j01J4r7J91J22j45j4j16K09n5J69
7517B11l71K20j23q6K20j17O9kj8MjM3J11N2j03j02jr7P6j09J46k9o5J44N7q9
7543D0mR9J9J05k21j09J98n9k55J29J32Rj11KlJ4Q9j33MR7j15J63j63%K97q1j21
$$ plain form
7570 22 -102 206 -53 -78 -15 71 55 -90 24 64 -31 -181 0 -53 94 58 -249 -3 27 67 -51 -52 67 120 62
7595 62 92 -2 196 134 0 -2 310 -103 47 -82 14 141 92 -41 19 52 -43 -163 100 9 44 -350 -17 9 -93
7620 -93 -29 -105 -7 99 -108 -66 4 -110 1 -94 -19 -108 69 -37 -48 -45 -90 32 -157 28 40 65 13 -40 -11 54
7646 54 -83 48 159 0 -115 -102 1 42 -104 155 4 -77 -127 48 124 6 -46 -6 -6 80 -20 -115 12 -82
7670 -82 10 26 -65 63 -65 45 -92 89 99 74 78 66 155 146 -91 -48 40 -51 -79 29 6 -99 -27 81 -74 -6
7696 -6 -100 63 87 -24 -17 -146 34 -21 140 84 118 -19 12 -79 28 115 111 96 -12 21 19 -66 253 -20 55 -87 9
7723 9 103 -64 -155 76 -129 -93 -48 -22 52 81 -115 66 11 -73 22 -1 209 -5 104 -30 181 118 -38 0 -20
7748 -20 61 -6 -23 13 102 -60 6 -13 114 -129 40 54 218 169 -16 250 -29 128 114 47 67 27 -66 64 -127
$$ packed form
7570B2j24L08k59k5O3Q6j6j45J14M0r5j50J81n3J47l6l07K46L0M0j18jJ19N3n8
7595F2L0r4J98o2j34kL12m13J50j29R6J27m9j33O0L3r5j20K63r1L5l94L33K6j02
7620i3O4p6R8J06k07M2P0j14J11r5P5q9J77j06j1Lm5J22j89J85J2K5n2n3K9O5
7646E4j37J31J11j59j15J3J03M1j46K59j51q1n0J75P6j18n2M0%Q6j00r5J27r4
7670h2R2J6r1J28j28J10j37J81J0k5Mj2Q9rk37M3Q8r1k8J08k3j05P2J08j55O8
7696fr4J63K4j11Pj29J80n5J61n6L4j37L1r1J07Q7mj5j08L3kq5L19k73P5j42R6
7723IR4j67r1K31k05L6M5K6P4K9j96J81n5q4R5k3K10k14J09j34K11o3j56L8k0
7748b0Q1o7j7L6Q9j62O6j9J27k43J69J4J64m9j85K66k79J57j4o7K0m0r3J30j91
$$ plain form
7773 -127 -130 -39 -48 -219 134 -50 62 -47 -270 65 -180 -104 -44 71 86 13 34 -45 -143 -41 66 82 -154 -154 -82
7798 -82 51 18 -14 69 60 136 -14 45 110 32 90 39 -79 -20 -35 200 -74 -7 200 243 151 -159 113 -26 61 -42
7824 -42 -79 -155 -1 -17 -62 -61 -224 70 -150 1 -224 -103 -160 60 -9 8 130 63 122 47 -5 20 43 115 163 91
7850 91 35 -17 57 -10 13 102 93 -79 41 -83 23 145 126 99 14 -39 65 -40 -31 -13 -22 8 -2 122 -2 190 -142
7877 -142 117 96 -162 -64 47 -43 141 -93 17 -2 -44 -110 -48 -55 -262 -45 -181 -239 28 -96 -187 36 -113 -42
7901 -42 42 31 70 -29 9 -74 183 49 128 -94 -45 65 -82 161 -146 70 112 41 -43 72 43 76 84 43 174 42
7927 42 -98 62 57 107 -55 155 155 -134 -24 -45 32 -78 65 134 -135 -141 48 -6 0 -117 -77 -15 -113 -10 -11 -36 -4
7954 -4 156 94 10 50 14 32 181 42 54 14 -97 181 -114 70 -108 -26 28 -25 24 15 77 15 -147 1 43 -126
$$ packed form
7773a27lR1rj71L53j84J12j09k23L35k45P6O0J15J5p3K1p9r8J02J07J6k36%P2
7798h2J33l3l2Q3rP6j50N9O5p8N8n1j18N9j5K35k74O7K07M3r2l10K72j39Q7j03
7824d2l7p6J54j6m5Jj63K94k20J51k25J21n7K20o9J7J22o7N9p5n2K5K3P2M8p2
7850I1n6n2P4o7K3Q9rj72J20j24J06J22j9k7q5n3J04j05RJ8rL0j0J24j24J92l32
7877a42K59k1k58R8J11r0J84k34J10j9m2o6O2pk07K17j36n8K67j24r1K23j49P1
7901d2Q4j1L9r9L8q3K57j34P9k22M9J10j47K43l07K16M2p1q4J15k9L3Qm1J31j32
7927D2j40J60nN0j62K10%k89J10k1P7j10J43O9k69oJ89n4Oj17M0O2r8J03jk5L2
7954dJ60o2q4M0l6J8J49j39J2m0j11K78k95J84j78Q2N4n3M9rO2o2j62J48M2j69
$$ plain form
7980 -126 -65 189 133 -111 -31 -75 -107 143 -25 13 -35 17 -106 -91 -107 -89 19 -51 1 -101 50 -99 202 -58
8004 -58 -130 83 254 235 -65 39 -16 204 113 204 -53 -36 0 -86 -38 -161 -22 -64 -13 -73 -186 -44 -40 -228 63
8029 63 -55 -58 -41 33 -19 17 79 237 -28 -83 -23 44 9 -86 40 55 45 13 -49 -96 -33 -74 104 0 -67 25 129
8056 129 149 169 -98 -14 65 -85 69 -133 -28 -12 87 5 -37 201 -34 -55 -48 -27 160 -23 94 30 2 -16 -43
8081 -43 -20 -134 -276 -49 47 -109 -168 -33 -39 -37 -46 -83 166 169 -86 -140 -36 -53 113 135 57 0 190 176 39 -56 65
8108 65 -16 -52 47 -41 -71 110 42 -114 -35 103 87 109 59 -47 75 235 13 150 -38 -38 12 139 -129 34 -109
8133 -109 32 -193 57 -76 -72 -28 -53 82 -19 23 -44 -72 -5 -133 41 5 18 75 176 -63 -4 126 -14 -47
8157 -47 95 -114 28 137 169 37 75 141 291 73 13 15 -95 -144 33 139 -74 3 -79 -1 -182 -21 -11 -36
$$ packed form
7980a26O1K54n6k44Q0m4l2K50j68L8m8N2j23J5j6J8J08p0N2j02J51j49L01k60
8004e8p2K13J71j9l00J04n5K20r1R1k57J7L6q6M8j23J39m2N1o0j13J42Mj88K91
8029F3j18lJ7P4n2L6O2J58k65n5O0O7l5r5J26J5j0l2o2m7O3m1J78j04o7R2J04
8056A29K0K0k67Q4P9j50J54k02J05J6R9q2m2K38k35k1PK1J87j83J17o4k8j8k7
8081d3K3j14j42K27R6j56n9J35oKrl7K49Lk55n4J04j7J66K2p8n7J90j4j37r5J21
8108F5q1l6R9q8l0J81o8j56P9J38j6K2n0j06J22J60k22J37j88%N0J27k68J63j43
8133a09J41k25K50j33MM4k5J35j01M2o7k8O7j28J74l6J3N7J01k39N9J30j40l3
8157d7J42k09J42J09L2j32L8O6J50k18o0Kj10m9J77J06k13P7q2P8j81J61J0k5
$$ plain form
8181 -36 125 -9 174 60 -11 -99 -18 16 -54 84
$$ packed form
8181c6J61j34J83j14p1q8Q1L4p0J38
8191H4
$$ Imaginary data points
##PAGE= N=2
##DATA TABLE= (X++(I..I)), XYDATA
$$ plain form
0 0 0 0 0 0 0 0 0 0 0 0 0 0 0 -1 32 -32 32 -32 33 -33 64 -65 65 -97 97 -129 161 -162 194 -226 258 -291 323
33 323 -387 420 -484 548 -613 678 -743 839 -934 1033 -1132 1259 -1389 1528 -1688 1863
49 1863 -2047 2258 -2495 2743 -3029 3349 -3713 4120 -4591 5144 -5802 6593 -7568 8803
63 8803 -10436 12695 -16030 21479 -31885 58979 -279594 -559532 57381 47380 -297442 -192778
75 -192778 249170 101916 -261401 -140363 224451 171069 16751 150505 311097 169615
85 169615 15432 26988 81505 104950 158159 130376 49266 58111 72785 -78156 -144363 56769
97 56769 186333 17504 -64311 97913 98279 -141996 -149100 101856 142268 -30173 -15688 98439
109 98439 -11016 -163819 -70505 51410 -3005 -16299 81144 29454 -123272 -84400 29548
$$ packed form
0@%%%%%%%%%%%%%jL3o4O4o4O5o6R7j29J30j62J94k26K90l23L56m20M84n49O14
33C23p10Q07r04J032j161J291j421J582j773J967k165K391k648K917l216L551
49A863l910M305m753N238n772O378p062P833q711R735j0946J2395j4161J6371
63H803j9239K3131k8725L7509n3364R0864l38573k79938O16913j0001l44822J04664
75a92778M41948j47254l63317J21038L64814n3382j54318J33754J60592j41482
85A69615j54183J1556N4517K3445N3209k7783q1110Q845J4674j50941o6207K01132
97E6769J29564j68829q1815J62224L66k40275p104K50956M0412j72441J4485J14127
109I8439j09455j52803R3314J21915n4415j3294R7443n1690j52726L8872J13948
$$ plain form
120 29548 -34904 -74787 91161 142409 -67866 -147305 24813 54499 -103488 -54036 164086
131 164086 136486 -62965 -46356 95771 52734 -38545 66522 190676 125951 26732 29947
142 29947 31436 3174 27684 49537 15023 20211 45526 -46136 -147580 -67357 34550 -48226
154 -48226 -110387 29116 92317 -89302 -176172 1860 89631 -55537 -82152 89978 92845
165 92845 -105757 -131257 25102 28497 -92674 -57501 54947 5636 -103521 -78590 -14937
176 -14937 -33563 -39185 16899 30829 -5218 -5721 2889 -25666 -14270 54761 61591 4963 13597
189 13597 57040 9131 -52696 4731 74093 26161 -22437 26655 42925 -33431 -57701 5271
201 5271 18883 -26945 -20907 9328 -27095 -70890 -44015 -17283 -38675 -30597 11776 -2591 -46169
$$ packed form
120B9548o4452l9883J65948N1248k10275p9439J72118K9686j57987M9452K18122
131A64086k7600j99451J6609J42127m3037r1279J05067J24154o4725r9219L215
142B9947J489k8262K4510K1853l4514N188K5315r1662j01444Q0223J01907q2776
154d8226o2161J39503O3201j81619q6870J78032Q7771j45168k6615J72130K867
165I2845j98602k5500J56359L395j21171L5173J12448m9311j09157K4931O3653
176a4937j8626n622N6084J3930l6047n03Q610k8555J1396O9031O830n6628Q634
189A3597M3443m7909o1827N7427O9362m7932m8598M9092J6270p6356k4270O2972
201E271J3612m5828O038L0235l6423m3795K6875K6732k1392Q078M2373j4367m3578
$$ plain form
214 -46169 -19935 25471 1331 -16124 43379 74291 21139 2275 53759 56743 5060 15817
226 15817 70685 56365 4452 11155 36554 10037 -13625 15855 33309 4971 -6620 10720
238 10720 1977 -18892 -3589 12122 -8697 -16081 8506 1792 -34182 -28027 3024 -10115 -34249
251 -34249 -10410 11185 -19824 -41025 -7956 12573 -12867 -19290 11339 14610 -12495 -7909 19062
264 19062 11942 -7708 6601 23171 7065 -4392 10108 11654 -4283 819 15969 5333 -10897
277 -10897 -877 8947 -4587 -11087 3919 6827 -10600 -12162 4861 3757 -12007 -7001 8821
290 8821 2864 -10170 -2776 7758 720 -5714 2093 6323 -234 -3279 750 938 -2728 -3005 174
305 174 578 -2281 -5366 -6925 -6933 -5066 -2991 -4540 -7820 -8655 -7703 -6990 -4835 -3746 -4699 -2749 2403
$$ packed form
214d6169K6234M5406k4140j7455N9503L0912n3152j8864N1484K984n1683J0757
226A5817N4868j4320n1913O703K5399k6517k3662K9480J7454k8338j1591J7340
238A0720q743k0869J5303J5711k0819p384K4587o714l5974O155L1051j3139k4134
251c4249K3839K1595l1009k1201L3069K0529k5440o423L0629L271k7105M586K6971
264A9062p120j9650J4309J6570j6106j1457J4500J546j5937N102J5150j0636j6230
277a0897J0020R824j3534o500J5006K908j7427j562J7023j104j5764N006J5822
290H821n957j3034P394J0534p038o434P807M230o557l045M029J88l666k77L179
305A74M04k859l085j559qJ867K075j549l280q35R52P13K155J089r53J950N152
$$ plain form
322 2403 4719 3814 5458 6753 6601 11439 18020 15319 7287 6258 10543 8836 3194 3592 4124 -2812
338 -2812 -9302 -5495 -1842 -9714 -15989 -8370 -748 -6264 -10977 -4749 -1427 -6398 -5240 3073 3482
353 3482 -4217 -5070 1876 2396 -3371 -3493 2914 3616 -383 2678 8120 5908 3595 9539 14067 9688
369 9688 7119 11902 12814 6362 2898 5558 4369 -2160 -3596 -193 -3623 -11536 -10012 -2082 -3734
384 -3734 -11022 -9145 -2165 -4019 -8133 -4943 -2062 -7846 -12135 -6312 -2209 -9031 -15847 -11353 -4950
399 -4950 -7031 -9151 -2682 895 -1811 1761 12768 15717 9563 10609 18460 19971 14665 13594 14834
414 14834 9816 3545 5300 8076 -12 -8139 -3918 843 -5414 -8535 -1358 968 -5775 -4388 4270
429 4270 2474 -7024 -5696 2069 -1568 -10957 -10182 -5629 -11393 -18441 -12616 -6186 -11680 -14266 -5180
$$ packed form
322B403K316r05J644J295j52M838O581k701q032j029M285j707n642L98N32o936
338b812o490L807L653p872o275P619P622n516m713O228L322m971J158Q313M09
353C482p699q53O946N20n767j22O407P02l999L061N442k212k313N944M528m379
369I688k569M783R12o452l464K660j189o529j436L403l430p913J524P930j652
384c734p288J877O980j854m114L190K881n784m289N823M103o822o816M494O403
399d950k081k120O469L577k706L572J1007K949o154J046P851J511n306j071J240
414A4834n018o271J755K776q088q127M221M761o257l121P177K326o743J387Q658
429D270j796r498J328P765l637r389P75M553n764p048N825O430n494k586R086
$$ plain form
444 -5180 -556 -6017 -4317 7087 10252 5691 7270 12307 9396 4706 7507 10436 5911 1354 4006
459 4006 5363 -202 -3398 246 2321 1851 4214 6541 2688 -1618 379 3351 3460 2605 1742 -664
475 -664 -2335 -2694 -3571 -3526 -499 2326 4455 7828 9326 6495 4516 9626 16060 15933 13213 12839 9191
492 9191 -629 -5410 -1140 -2154 -10398 -11190 -6645 -12817 -22513 -18648 -9568 -9847 -8766 2821 8616
507 8616 470 -3583 4276 8828 6116 9269 15847 9872 -2398 -4715 -3180 -8482 -9823 -1194 -303
522 -303 -9762 -11326 -6679 -11987 -16669 -4744 7725 2806 -3637 2000 1850 -10667 -12092 4105 11789
537 11789 978 -4036 2507 -1308 -14327 -12685 1979 6345 -1224 -3654 -1436 -6926 -16194 -17832
551 -17832 -9456 -925 -1767 -9335 -12046 -10022 -13841 -17791 -6047 13104 16664 7739 8640 17991 15939
$$ packed form
444e180M624n461J700J1404L165m561J579N037k911m690K801K929m525m557K652
459D006J357n565l196L644K075m70K363K327l853m306J997K972J09q55q63k406
475f64j671l59q77M5L027K825K129L373J498k831j979N110O434j27k720l74l648
492I191r820m781M270j014q244p92M545o172r696L865R080k79J081J1587N795
507H616q146m053P859M552k712L153O578n975j2270k317J535n302j341Q629Q91
522c03r459j564M647n308m682J1925J2469m919o443N637j50j2517j425J6197P684
537A1789j0811n014O543l815j3019J642J4664M366p569k430K218n490r268j638
551a7832Q376Q531q42p568k711K024l819l950J1744J9151L560q925R01R351k052
$$ plain form
566 15939 9755 20317 37171 34684 21887 19855 19384 6198 -3783 2396 8277 3128 -3326 -8754
580 -8754 -19499 -26851 -21347 -12929 -10558 -6304 -251 -4296 -13851 -11225 324 3960 4182 13250 20654
595 20654 13067 703 -401 4743 8817 13571 16463 14571 11151 5421 -4596 -5666 9614 17776
609 17776 5814 519 13691 11008 -15363 -18930 10857 20537 -3097 -6552 18621 14278 -20197
622 -20197 -19558 17322 23365 -4829 -6293 17502 10023 -22806 -25393 1534 7648 -13131 -21656 -10252
636 -10252 -9397 -28846 -38831 -21420 -2592 -9698 -24598 -15991 1614 -7583 -27921 -13633 19488
649 19488 18155 -7439 -2929 18770 7741 -16450 -2287 24263 12827 -10297 -1629 11714 -4228
662 -4228 -18446 -5235 6799 -1135 -4020 2825 -2933 -13420 -6174 5040 724 283 12242 10153
$$ packed form
566A5939o184J0562J6854k487j2797k032m71j3186r981O179N881n149o454n428
580h754j0745p352N504Q418K371M254O053m045r555K626J1549L636K22R068P404
595B0654p587j2364j104N144M074M754K892j892l420n730j0017j070J5280Q162
609A7776j1962n295J3172k683k6371l567K9787R680k3634l455K5173m343l4475
622b0197O39L6880O043k8194j464K3795p479l2829k587K6927O114k0779q525J1404
636a0252Q55j9449r985J7411J8828p106j4900Q607J7605r197k0338J4288L3121
649A9488j333k5594M510K1699j1029k4191J4163K6550j1436k3124Q668J3343j5942
662d228j4218J3211J2034p934k885O845n758j0487P246J1214m316m41J1959k089
$$ plain form
676 10153 -6683 -3497 14980 11602 -2330 7251 22046 11366 -4582 1844 11008 4497 -423
689 -423 5972 6605 -1184 -4350 -5518 -8735 -3688 4068 -4536 -13985 -1498 8440 -10020 -18888 7961
704 7961 21546 -5135 -15078 15487 23347 -7993 -11458 23722 27132 -7075 -9232 21283 18807
717 18807 -11274 -8752 18234 15372 -8263 -8190 6034 2993 -6820 -2790 5950 5768 553 -4920 -4896
732 -4896 4416 9864 149 -3772 10261 13700 -5735 -12744 5234 9881 -7907 -8709 9747 3759
746 3759 -21392 -19240 1466 -1547 -15497 -6450 4720 -9009 -18985 -6507 -382 -10027 -4404 10642
760 10642 3800 -10690 -4025 3410 -8308 -9512 11293 14752 -6222 -10140 5324 -338 -16531
773 -16531 -3932 17105 7304 -9762 -1134 5900 -10394 -14505 5893 12729 -1073 -2431 6325
$$ packed form
676A0153j6836L186J8477l378j3932R581J4795j0680j5948O426R164o511m920
689d23O395O33p789l166j168l217N047P756q604r449J2487R938j8460q868K6849
704G961J3585k6681r943L0565P860l1340l465L5180L410l4207k157L0515k476
717A8807l0081K522K6986k862k3635P3J4224l041r813M030Q740j82n215n473K4
732d896R312N448r715l921J4033L439j9435p009J7978M647j7788q02J8456n988
746C759k5151K152K0706l013j3950R047J1170j3729r976J2478O125r645N623J5046
760A0642o842j4490O665P435j1718j204K0805L459k0974l918J5464n662j6193
773a6531J2599K1037r801j7066Q628P034j6294m111K0398O836j3802j358Q756
$$ plain form
786 6325 -2928 -14983 -4456 9232 4550 1508 11107 7369 -10055 -10270 5334 6684 223 8296
800 8296 13895 -1753 -13813 -4186 2616 -4136 -539 12757 9614 -4409 -5113 1125 -1705 -311
814 -311 13502 18833 8355 1493 3304 -1435 -6554 2600 12496 5912 -2516 -1024 -4773 -16386 -14261
829 -14261 -345 2507 -2258 1507 3193 -8705 -14595 -3308 5831 3835 6696 12531 4237 -9602
843 -9602 -7915 1185 -146 -1089 7991 8853 -5126 -11870 -5307 -4477 -8100 1058 12584 6522 -4885
858 -4885 -3791 -1561 -6689 -3548 10473 13893 4106 237 2782 -1917 -6774 2502 13150 9807 4263
873 4263 6698 4116 -7041 -8006 3230 6430 927 628 1749 -7845 -17339 -13004 -4388 -4064 -4533 -375
889 -375 -1570 -9547 -12170 -5153 813 2695 6540 9691 5620 -306 -1339 352 743 3685 7303 5872
$$ packed form
786F325r253j2055J0527J3688m682l042R599l738j7424k15J5604J350o461Q073
800H296N599j5648j2060R627O802o752L597J3296l143j4023p04O238k830J394
814c11J3813N331j0478o862J811m739n119R154R896o584q428J492l749j1613K125
829a4261J3916K852m765L765J686j1898n890J1287R139j996K861N835q294j3839
843i602J687R100j331r43R080Q62j3979o744O563Q30l623R158J1526o062j1407
858d885J094K230n128L141J4021L420r787l869K545m699m857R276J0648l343n544
873D263K435k582j1157r65J1236L200n503k99J121r594r494M335Q616L24m69M158
889c75j195p977k623P017N966J882L845L151m071n926j033J691L91K942L618j431
$$ plain form
905 5872 228 -4137 -6702 -8107 -4867 1330 4347 2496 -134 -1510 -2707 -2020 2148 6384 7726
920 7726 7374 6473 3515 -619 -1508 1131 3778 5262 5711 2585 -2705 -4842 -2984 -1687 -155 2362
936 2362 2094 -1360 -4167 -4176 -4991 -6054 -3514 550 246 -3244 -4716 -4550 -5292 -4628 572 4634 3078
953 3078 926 2197 2036 -354 596 4717 5707 3220 1839 1103 -1768 -3826 -2246 -45 -481 -1535
969 -1535 -975 -852 -3063 -3392 -921 684 1248 3069 3886 1029 -1448 -447 1357 1052 1012 1316 532 -1614
987 -1614 -1807 -721 -816 -1840 -855 1819 2563 876 -232 138 550 1447 2721 2887 1615 -21 -637 -71
1005 -71 549 -345 -1503 -515 661 -257 -1300 -730 -398 -1307 -444 1413 1002 -1861 -2383 -730 -1236 -3091
1023 -3091 -2681 -1294 -3045 -4855 -2626 -1123 -3740 -4435 -70 879 -2258 -1007 3159 2244 -761 1938
$$ packed form
905E872n644m365k565j405L240O197L017j851k630j376j197O87M168M236J342
920G726l52r01k958m134q89K639K647J484M49l126n290k137J858J297J532K517
936B362k68l454k807rq15j063K540M064l04l490j472J66p42O64N200M062j556
953C078k152J271j61k390R50M121R90k487j381p36k871k058J580K201m36j054
969a535N60J23k211l29K471J605N64J821Q17k857k477J001J804l05m0L04p84k146
987a614j93J086r5j024R85K674P44j687j108L70M12Q97J274J66j272j636o16N66
1005g1O20q94j158R88J176r18j043N70L32r09Q63J857m11k863n22J653n06j855
1023c091M10J387j751j810K229J503k617o95M365R49l137J251M166r15l005K699
$$ plain form
1039 1938 5415 2415 243 4318 6232 1054 -982 4328 5397 26 -65 5033 3261 -2261 947
1054 947 5414 858 -3617 1052 4193 -1358 -3664 763 457 -4902 -3220 2497 -448 -5810 -2523
1069 -2523 2351 -797 -3339 1383 3133 -1291 -567 5403 4156 -1026 1266 5643 2799 -57 3640
1084 3640 4409 -943 -1086 3567 2134 -2788 -1205 1817 -1752 -4373 -539 130 -5216 -5254 -135 -1861
1100 -1861 -6808 -3932 -52 -4595 -6801 -608 768 -5429 -4400 2288 254 -4981 244 5640 -155
1115 -155 -3546 3783 6118 -1605 -1551 6515 4057 -4484 115 7383 409 -6182 2204 6221 -3956
1130 -3956 -5377 5502 3823 -7536 -3418 7620 1446 -8129 -58 7714 -2742 -7825 4018 6524
1144 6524 -6379 -7590 4733 2389 -9354 -4975 4763 -2826 -10881 -1874 3637 -6294 -8954 1917
$$ packed form
1039A938L477l000k172M075J914n178k036N310J069n371r1N098j772n522L208
1054I47M467m556m475M669L141n551k306M427l06n359J682N717k945n362L287
1069b523M874l148k542M722J750m424P24N970j247n182K292M377k844k856L697
1084C640P69n352j43M653j433m922J583L022l569k621L834O69n346l8N119j726
1100a861m947K876L880m543k206O193J376o197J029O688k034n235N225N396n795
1115a55l391P329K335p723N4Q066k458q541M599P268o974o591Q386M017j0177
1130c956j421J0879j679j1359M118J1038o174r575Q071P772j0456n083J1843K506
1144F524j2903j211J2323k344j1743M379R738p589q055R007N511r931k660J0871
$$ plain form
1158 1917 2330 -6424 -2601 6105 760 -4670 4628 9753 1259 10 10333 9095 -1126 4054 14154
1173 14154 6751 -2479 6520 12645 598 -4593 7156 8169 -4783 -3408 8147 2960 -8967
1186 -8967 -3609 5473 -1482 -6937 1788 4277 -5663 -5968 3061 1282 -5545 295 6251 -1811 -5492
1201 -5492 3302 3013 -7029 -3395 7789 1853 -8407 -1149 4969 -6126 -10436 3242 6383 -6525
1215 -6525 -6323 5685 885 -11052 -2809 9540 960 -6769 4723 8610 -6228 -8052 7280 6471
1229 6471 -7215 -1388 11235 357 -13798 -3108 7200 -4372 -9860 4904 7248 -9540 -12119
1242 -12119 2152 2145 -8680 -2847 8034 1547 -7762 -1815 2254 -4865 -3315 6821 5798 -1701
1256 -1701 1064 3228 -5485 -5442 7759 9064 -2516 -182 9326 561 -11548 -850 11389 2208
$$ packed form
1158A917M13q754L823Q706n345n430R298N125q494j249J0323j238j0221N180J0100
1173A4154p403r230Q999O125j2047n191J1749J013j2952J375J1555n187j1927
1186h967N358R082o955n455Q725K489r940l05R029j779o827N840N956q062l681
1201e492Q794k89j0042L634J1184n936j0260P258O118j1095m310J3678L141j2908
1215f525K02J2008m800j1937Q243J2349q580p729J1492L887j4838j824J5332q09
1229F471j3686N827J2623j0878j4155J0690J0308j1572n488J4764K344j6788k579
1242a2119J4271pj0825N833J0881o487r309N947M069p119J550J0136j023p499
1256a701K765K164q713M3J3201J305j1580K334R508q765j2109J0698J2239r181
$$ plain form
1270 2208 -5507 6542 10112 -7382 -12475 3508 8023 -2743 -604 9684 2622 -10131 -4988
1283 -4988 4089 334 -1387 7072 6911 -3463 -5000 400 -2510 -4264 5247 9682 -249 -5013 938
1298 938 -1034 -9527 -2960 9331 5763 -3504 -52 2299 -7488 -9321 3511 8778 1641 1582 6048
1313 6048 -1208 -8389 -221 7994 3783 3222 11628 8335 -5921 -6007 5489 4256 -1775 7088 13452
1328 13452 -1386 -13258 -4671 1851 -6314 -6182 6184 4839 -9502 -12141 -4572 -6746 -10962 -1615
1342 -1615 7510 1015 -6650 -4585 -4487 -8668 -3532 7310 7282 746 1525 1509 -6190 -7206 2627 7174
1358 7174 3002 2991 5269 -1790 -9880 -5836 2574 3013 2711 6272 4424 -4459 -6747 -906 1821 2610
1374 2610 8588 10889 3098 -3067 -507 356 -1107 4195 11477 7196 -1598 -2341 -1359 -6047 -6433 2285
$$ packed form
1270B208p715J2049L570j7494n093J5983M515j0766K139J0288p062j2753N143
1283d988R077l755j721Q459j61j0374j537N400k910j754R511M435r931m764N951
1298I38j972q493O567J2291l568r267L452K351r787j833J2832N267p137n9M466
1313F048p256p181Q168Q215m211n61Q406l293j4256q6J1496j233o031Q863O364
1328A3452j4838j1872Q587O522q165J32J2366j345j4341k639P569k174m216R347
1342a615R125o495p665K065R8m181N136J0842k8o536P79j6p699j016R833M547
1358G174m172j1K278p059q090M044Q410M39l02L561j848q883k288N841K727P89
1374B610N978K301p791o165K560Q63j463N302P282m281q794p43R82m688l86Q718
$$ plain form
1390 2285 7244 1282 -3930 -3793 -6562 -10694 -6215 2447 3747 38 -1171 -2989 -7684 -7179 -1131
1405 -1131 2439 2826 5097 4409 -2217 -6096 -2212 1077 1419 5240 9022 4048 -4076 -4279 -205 -589
1421 -589 188 6304 8273 1192 -3573 -1175 -777 -3180 1225 8710 6848 252 -607 6 -3848 -4153
1437 -4153 3063 7362 2790 -1432 -1257 -3218 -7521 -5465 1358 2947 -866 -2267 -1946 -5387 -7838
1452 -7838 -4455 965 2104 1261 1045 -164 -3055 -3658 -1105 3120 5583 5242 3362 1390 354 -483
1468 -483 571 3752 6040 4872 2243 777 -383 -2458 -2611 281 2328 620 -1221 -2275 -4201
1483 -4201 -6175 -4599 -1298 -76 -363 -710 -1831 -3719 -3333 -713 1221 1910 2737 2803 948 -766 222
1500 222 1375 1329 2180 4114 3362 -242 -1767 -252 297 -83 1687 3140 1058 -1714 -1300 534 91
$$ packed form
1390B285M959n962n212J37k769m132M479Q662J300l709j209j818m695N05O048
1405a131L570L87K271o88o626l879L884L289L42L821L782m974q124k03M074l84
1421e89P77O116J969p081m765K398L98k403M405P485j862o596q59O13l854l05
1437d153P216M299m572m222J75j961m303K056O823J589l813j401L21l441k451
1452g838L383N420J139q43k16j209k891o03K553M225K463l41j880j972j036q37
1468d83J054L181K288j168k629j466j160k075j53K892K047j708j841j054j926
1483d201j974J576L301J222k87l47j121j888L86K620J934O89Q27O6j855j714R88
1500B22J153m6Q51J934p52l604j525J515N49l80J770J453k082k772M14J834m43
$$ plain form
1517 91 -606 1370 2559 458 -918 -422 15 -1232 -770 1473 1586 -393 -1844 -1515 -1662 -1894 -968 -143
1535 -143 -577 -1765 -2080 -1848 -1899 -1833 -1180 -230 -383 -597 -131 -454 -922 30 1385 1546 738 814 1317 465
1555 465 7 595 1976 1715 446 304 943 364 -692 557 2242 994 -526 434 1583 751 139
1572 139 978 2034 1232 333 843 1331 -24 -588 863 1276 -9 -1093 -1346 -1610 -1734 -1157 -768 -1804
1590 -1804 -2306 -1908 -1617 -2007 -1456 -826 -934 -1011 -4 677 -663 -1532 -451 1447 1020 -214 135 167 -985
1609 -985 -1222 -221 563 -316 -1115 -502 219 -656 -1208 -170 1109 1179 860 1332 1666 800 614 1652 2391
1628 2391 1994 1366 1373 1477 455 -153 290 1037 404 115 72 -226 -996 -564 13 -336 -276 600 631 -228 -40
1649 -40 220 432 61 828 2238 1441 -635 -106 1492 923 -212 549 1097 -413 -1789 -435 -51 -2106
$$ packed form
1517I1o97J976J189k101j376M96M37j247M62K243J13j979j451L29j47k32R26Q25
1535a43m34j188l15K32n1O6O53R50j53k14M66l23m68R52J355J61q08P6N03q52
1555D65m58N88J381k61j269j42O39n79j056J249J685j248j520R60J149q32o12
1572A39Q39J056q02q99N10M88j355n64J451M13j285j084k53k64j24N77L89j036
1590a804n02L98K91l90N51O30j08p7J007O81j340q69J081J898m27j234L49L2j152
1609i85k37J001P84q79p99O13P21q75n52J038J279P0l19M72L34q66j86J038P39
1628B391l97o28PJ04j022o08M43P47o33k89m3k98p70M32N77l49O0Q76L1q59J88
1649d0K60K12l71P67J410p97k076N29J598n69j135P61N48j510j376J354L84k055
$$ plain form
1667 -2106 -3029 -1207 -841 -2447 -2782 -1532 -1832 -2283 -782 1126 565 -212 1382 2184 1798 1906 3188
1684 3188 3164 1992 2317 3355 1821 365 757 1258 -406 -773 -159 -684 -2015 -2207 -1202 -1447 -2380 -1634
1702 -1634 -906 -1331 -1943 -1361 -1015 -1648 -1401 -1021 -1367 -1296 -741 -1198 -1937 -1257 -224 -871 -1074 182 476
1721 476 -1317 -995 800 682 -1100 -406 891 -263 -1564 -175 1041 -592 -1298 1198 2204 2
1737 2 155 2531 1931 140 2075 4043 1729 -166 1952 2540 -362 -859 1306 101 -2628 -1677 653
1754 653 -1551 -3549 -950 1037 -1258 -1772 1880 2029 -1290 145 4240 2961 145 2110 4527 1589
1770 1589 -272 3103 4227 406 -418 3283 2686 -748 -127 2601 819 -1665 531 2203 -1332 -3338
1786 -3338 -748 -445 -3177 -2531 -445 -1927 -4094 -2348 -609 -2046 -2380 663 908 -893 300 2016
$$ packed form
1667b106r23J822L66j606l35J250l00m51J501J908n61p77J594Q02l86J08J282
1684C188k4j172L25J038j534j456L92N01j664l67O14n25j331j92J005k45r33P46
1702a634P28m25o12N82L46o33K47L80l46P1N55m57p39O80J033o47k03J256K94
1721D76j793L22J795j18j782O94J297j154j301J389J216j633p06K496J006k202
1737BJ53K376o00j791J935J968k314j895K118N88k902m97K165j205k729R51K330
1754F53k204j998K599J987k295n14L652J49l319J435M095j279k816J965K417k938
1770A589j861L375J124l821q24L701n97l434O21K728j782k484K196J672l535k006
1786c338K590L03k732O46K086j482k167J746J739j437l34L043K45j801J193J716
$$ plain form
1802 2016 526 -693 1884 2758 -141 -893 1364 -151 -3532 -1541 1226 -1319 -3568 -283 852
1817 852 -3356 -3467 1858 2284 -1634 -298 3867 1525 -2378 626 3451 429 -1289 2266 2694 -2141
1833 -2141 -2612 810 -248 -2537 228 2302 -1724 -3660 38 530 -2996 -1891 2654 287 -3735
1848 -3735 -872 2328 -2194 -4500 1426 4094 -1402 -2277 2881 2153 -3228 -371 5557 2988 -1932
1863 -1932 1162 4018 -833 -3456 1315 2712 -1772 -1684 1981 -192 -4617 -2322 1806 -243 -1675
1878 -1675 2516 3005 -1256 -1493 2931 2511 -406 2151 5124 1550 -1731 904 1986 -1020 -635 3102
1894 3102 2029 -1575 -387 1528 -1200 -2048 1944 3122 -273 -263 2203 -406 -3880 -507 3150 -413
1910 -413 -2832 598 651 -4394 -4231 826 346 -3807 -1041 2662 -1307 -5068 -1207 1582 -1622 -1975
$$ packed form
1802B016j490j219K577Q74k899p52K257j515l381J991K767k545k249L285J135
1817H52m208j11N325M26l918J336M165k342l903L004K825l022j718L555M28m835
1833b141m71L422j058k289K765K074m026j936L698M92l526J105M545k367m022
1848c735K863L200m522k306N926K668n496q75N158p28n381K857N928k569m920
1863a932L094K856m851k623M771J397m484Q8L665k173m425K295M128k049j432
1878a675M191M89m261k37M424m20k917K557K973l574l281K635J082l006L85L737
1894C102j073l604J188J915k728q48L992J178l395J0K466k609l474L373L657l563
1910d13k419L430N3n045J63N057m80m153K766L703l969l761L861K789l204l53
$$ plain form
1926 -1975 2610 1828 -3811 -2763 1965 232 -2478 1187 3963 -635 -2470 2182 2738 -1814 -235
1941 -235 5276 3524 -1438 597 3781 9 -2356 2403 4396 -405 -1928 1816 953 -3029 -1470
1956 -1470 2647 611 -2392 -29 1258 -2476 -2997 864 636 -2495 -945 1368 -1526 -4025 -600
1971 -600 1088 -2286 -2161 1811 1137 -3435 -2205 2327 1144 -1946 785 3482 -113 -2494 1454 2692
1987 2692 -747 -1183 2184 1550 -1709 -1008 1099 -475 -1601 675 1313 -1065 -1485 199 -280 -1188 578
2004 578 1765 -632 -1234 1347 1250 -1294 222 3020 940 -1328 925 2149 -1359 -2340 2067 2893
2020 2893 -1265 -1520 1605 186 -3350 -755 3017 770 -2214 318 1934 -1811 -2995 1220 2120
2035 2120 -1051 -933 1738 -171 -3244 -1126 1689 395 -573 1771 1999 -1373 -1582 1150 1581 459
$$ packed form
1926a975M585p82n639J048M728j733k710L665K776m598j835M652N56m552J579
1941b35N511j752m962K035L184l772k365M759J993m801j523L744q63l982J559
1956a470M117k036l003K363J287l734n21L861k28l131J550K313k894k499L425
1971f00J688l374J25L972o74m572J230M532j183l090K731K697l595k381L948J238
1987B692l439m36L367o34l259P01K107j574j126K276O38k378m20J684m79r08J766
2004E78J187k397o02K581r7k544J516K798k080k268K253J224l508r81M407Q26
2020B893m158k55L125j419l536K595L772k247k984K532J616l745j184M215R00
2035B120l171J18K671j909l073K118K815j294r68K344K28l372k09K732M31j122
$$ plain form
2051 459 1885 3235 525 -1707 -39 865 -547 -154 2290 1129 -1744 -1679 -384 -1609 -2137 909
2067 909 2367 30 -1405 -385 -1113 -2299 -574 2289 1809 -376 -323 -182 -1739 -2255 263 1732 839
2084 839 820 1150 -368 -1843 -693 1251 1647 2124 2639 999 -1413 -1785 -474 -117 415 1925 1584 -1057
2102 -1057 -2334 -1435 -1451 -1251 1015 2577 1046 -1059 -810 -1165 -2908 -1697 1272 1379 -1065 -1943 -1866
2119 -1866 -3974 -4721 -1834 987 18 -906 135 -178 -2328 -1499 1984 3468 2793 3502 3674 1127 -758
2136 -758 509 2403 2541 2489 3294 1718 -1343 -2112 -416 221 537 2206 2542 355 -1639 -1362 -870 -1020
2154 -1020 -89 1918 1211 -1083 -2147 -2087 -2661 -2077 341 1744 1350 -270 -959 -1519 -1331 19 1571
2171 1571 2108 1418 420 -1116 -2027 -2114 -1549 -925 102 241 -701 -2555 -3099 -2156 -1104 117 1856 2592
$$ packed form
2051D59J426J350k710k232J668R04j412L93K444j161k873O5J295j225n28L046
2067I09J458k337j435J020p28j186J725K863m80k185N3J41j557n16K518J469q93
2084H39j9L30j518j475J150J944L96M77N15j640k412l72J311L57N32J510l41k641
2102a057j277Q99j6K00K266J562j531k105K49l55j743J211K969J07k444q78P7
2119a866k108p47K887K821r69r24J041l13k150Q29L483J484o75P09J72k547j885
2136g58J267J894J38n2Q05j576l061p69J696O37L16J669L36k187j994K77M92j50
2154a020R31K007p07k294j064O0n74N84K418J403l94j620o89n60J88J350J552
2171A571N37o90r98j536r11q7N65O24J027J39r42j854n44R43J052J221J739P36
$$ plain form
2189 2592 939 -326 -85 266 387 1527 2799 2289 480 -201 -672 -1699 -1393 695 1780 936 276
2206 276 220 -839 -1984 -236 1973 1804 715 1082 583 -1807 -2474 -612 467 -437 -306 528 -680
2223 -680 -2786 -2069 -49 536 103 1427 2058 74 -1145 -441 579 101 666 1541 695 -1299 -1381 -613
2241 -613 -909 -262 1068 1639 879 586 1223 842 625 1621 2973 2513 1761 1282 469 -674 -631 263 370
2260 370 -526 -1026 -1352 -2164 -2281 -1847 -1512 -1085 -349 297 -745 -1206 -593 -400 -392 505 1411 866 -630 -159
2280 -159 819 227 57 1402 2148 1049 560 1540 1129 -221 330 1520 799 -909 -582 -442 -2120 -2854
2298 -2854 -1723 -1310 -2628 -2519 -1430 -1906 -3065 -1859 -51 -646 -972 440 1151 -243 -564 998 944
2315 944 -577 -71 1244 438 -1157 -407 543 -259 -705 1027 1685 115 177 1673 1756 944 1616 2499 1681
$$ packed form
2189B592j653j265K41L51J21J140J272n10j809o81m71j027L06K088J085q44o60
2206B76n6j059j145J748K209j69j089L67m99k390o67J862J079r04J31Q34j208
2223f80k106P17K020N85m33J324O31j984j219P04J020m78N65Q75q46j994q2P68
2241f13k96O47J330N71p60k93O37l81k17R96J352m60p52m79q13j143M3Q94J07
2260C70q96n00l26q12j17M34L35M27P36O46j042m61O13J93QQ97R06n45j496M71
2280a59R78n92j70J345P46j099m89R80m11j350N51J190p21j708L27J40j678p34
2298b854J131M13j318J09J089m76j159J206J808n95l26J412P11j394l21J562n4
2315I44j521N06J315q06j595P50R50q02m46J732O58j570O2J496Q3q12O72Q83q18
$$ plain form
2334 1681 932 1679 1983 475 88 1097 951 -186 24 517 -364 -1179 -34 258 -624 -1154 -160 -186 -881
2353 -881 -833 -126 -626 -1111 -454 200 -511 -533 338 198 -188 509 1525 606 446 1347 1494 671 559 1504
2373 1504 814 -121 385 783 -219 -1091 -311 -73 -1056 -986 104 -427 -1544 -690 535 -495 -1301 207
2391 207 831 -877 -910 495 528 -846 -768 597 -83 -1228 -461 651 -767 -1366 260 666 -556 -561 866
2410 866 587 -648 106 1388 507 -885 453 1065 -378 -687 456 480 -1044 -1070 253 -171 -1597 -1192
2428 -1192 -158 -899 -1614 -572 -188 -1253 -1226 -255 -73 -422 -387 308 15 -148 390 477 42 290 617 542
2448 542 374 878 1086 449 563 1369 1136 449 738 1524 1067 445 1107 1151 164 -157 508 197 -319 -279 117
2469 117 -314 -921 -479 -65 -407 -599 98 86 -782 -317 498 -159 -675 69 513 -508 -785 -15 187 -653
$$ packed form
2334A681p49P47L04j508l87J009j46j137K10M93q81q15J145K92q82n30R94k6o95
2353h81M8P07n00m85O57O54p11k2Q71j40l86O97J016r19j60R01J47q23j12R45
2373A504o90r35N06L98j002q72P80K38r83P0J090n31j117Q54J225j030q06J508
2391B07O24j708l3J405L3j374P8J365o80j145P67J112j418n99J626M06j222nJ427
2410H66k79j235P54J282q81j392J338O12j443l09J143K4j524k6J323m24j426M05
2428a192J034p41p15J042L84j065K7R71J82l49L5O95k93j63N38Q7m35K48L27p5
2448E42j68N04K08o37J14Q06k33o87K89P86m57o22O62M4r87l21O65l11n16M0L96
2469A17m31o07M42M14l42j92O97j2q68M65Q15o57n16P44M44j021k77P70K02q40
$$ plain form
2489 -653 -490 791 417 -748 25 869 313 142 1084 1246 216 67 1016 575 -598 -388 602 -132 -913
2508 -913 -488 -196 -1324 -1705 -393 517 -161 -451 37 238 -331 -100 557 873 343 184 387 99 -365
2527 -365 -524 -82 193 502 408 131 -24 -56 -94 505 1275 1030 542 4 52 -388 -693 -756 94 -69 -562 -873
2549 -873 -997 -1310 -1137 -357 40 466 613 472 -86 -29 401 757 618 765 1012 -160 -1295 -1263 -849 -1005
2569 -1005 -1253 -219 -153 -1465 -1783 -767 -402 -797 10 1512 1030 -51 -706 -149 28 -241 723 1668
2587 1668 872 -557 -351 -197 -359 -67 1218 1791 1320 785 513 403 19 405 1408 1816 1141 -68
2605 -68 -719 -1043 -1102 -656 379 453 301 -387 -776 -951 -958 -305 579 1254 575 -256 -827 -1458 -1967 -1272 -198
2626 -198 43 -654 -1162 -1526 -1797 -2010 -640 776 1416 1314 1267 840 261 457 1660 2372 2430 2343 1765 366
$$ packed form
2489f53J63J281l74j165P73Q44n56j71R42J62j030j49R49m41j173K10R90p34p81
2508i13M25K92j128l81J312R10o78k90M88K01n69K31O57L16n30j59K03k88m64
2527c65j59M42K75L09r4k77j55l2l8N99P70k45m88n38M8m40l05o3Q50j63m93l11
2549h73j24l13J73P80L97M26J47j41n58N7M30L56j39J47K47j172j135L2M14j56
2569a005k48J034O6j312l18J016L65l95Q07J502m82j081o55N57J77k69R64R45
2587A668p96j429K06J54j62K92J285N73m71n35k72j10l84L86J003M08o75j209
2605f8o51l24n9M46J035P4j52o88l89j75pO53Q84O75o79q31n71o31n09O95J074
2626a98K41o97n08l64k71k13J370J416O40j02m7m27n79J96J203P12N8q7n78j399
$$ plain form
2646 366 -520 -255 269 581 1133 1286 287 -1040 -1084 -404 71 413 1440 1468 162 -1047 -1341 -992 -1373
2665 -1373 -720 394 209 -1200 -1793 -1975 -2183 -1730 -292 1042 599 -629 -661 -953 -893 -607 675 1352
2683 1352 743 197 -571 -930 -1376 -663 570 1132 1237 593 -252 -610 -704 477 988 1751 1659 819 95 -688
2703 -688 -785 -380 140 641 621 -102 -774 -1340 -1269 -703 451 1181 1194 495 22 -447 -901 -163 1088 1037 641
2724 641 440 -75 -1190 -1729 -590 464 335 512 708 439 -768 -413 716 1038 1274 1604 1631 269
2742 269 -811 -239 195 376 340 702 100 -1126 -1355 -935 -897 -506 419 613 32 -516 -486 -519 -637 -80 1038
2763 1038 862 31 -319 -681 -819 -626 266 622 275 -187 -299 -372 -879 -623 113 516 417 199 -237 -637
2783 -637 -909 -573 -63 157 288 225 -362 -384 -197 171 575 1142 1139 821 500 503 413 300 542 1025 641 283
$$ packed form
2646C66q86K65N24L12N52J53r99j327m4O80M75L42J027K8j306j209k94L49l81
2665a373O53J114j85j409n93j82k08M53J438J334m43j228l2k92O0K86J282O77
2683A352o09n46p68l59m46P13J233N62J05o44q45l58r4J181N11P63r2q40p24p83
2703f88r7M05N20N01k0p23o72n66P1N66J154P30J3o99m73m69m54P38J251n1l96
2724F41k01n15j115n39J139J054j29J77J96k69j207L55J129L22K36L30K7j362
2742B69j080N72M34J81l6L62o02j226k29M20L8L91R25J94n81n48L0l3j18N57J118
2763A038j76q31l50l62j38J93Q92L56l47m62j12p3n07K56P36M03r9k18m36m00
2783f37k72L36N10K20J31o3n87k2J87L68M04N67ll18l21Lr0j13K42M83l84l58
$$ plain form
2805 283 -8 -471 -984 -911 -342 -341 -604 -822 -636 -1064 -1337 -790 -101 -567 -602 -224 -192 -782 -747 332 301 -433
2827 -433 -23 720 106 -580 168 776 569 569 1196 1081 331 352 1307 1450 1021 1042 1470 1005 553 807 980
2848 980 507 401 907 607 -92 -311 -119 -241 -517 -274 39 -703 -1166 -715 -774 -1103 -1236 -776 -1007 -1167
2868 -1167 -1219 -912 -1059 -1055 -530 -457 -397 -438 -275 -345 -127 371 571 639 769 885 615 451 706 1131 973 746
2890 746 808 483 -90 -95 238 147 -347 -208 -82 -665 -1187 -604 -304 -945 -618 46 -124 -778 -449 -101 -195 -653
2912 -653 268 516 -153 -550 267 379 -304 28 895 824 59 352 947 393 -275 596 1003 531 -99 262
2932 262 177 -706 -389 467 194 -391 -111 449 -190 -650 200 617 -125 83 657 419 -337 -218 271 71
2952 71 -500 19 118 -434 -800 -260 -167 -286 -179 460 390 19 522 520 152 337 968 814 173 527 131 -460
$$ packed form
2805B83k91m63n13P3N69Jk63k18J86m28k73N47O89m66l5L78L2n90L5J079l1p34
2827d33M10P43o14o86P48O08k07%O27j15p50K1R55J43m29K1M28m65m52K54J73
2848I80m73j06N06l00o99k19J92j22k76K43L13p42m63M51n9l29j33M60k31j60
2868a167n2L07j47MN25P3O0m1J63p0K18M98K00O8J30J16k70j64K55M25j58k27
2890G46O2l25n73nL33r1m94J39J26n83n22N83L00o41L27O64j70o54L29L48r4m58
2912f53R21K48o69l97Q17J12o83L32Q67p1p65K93N95n54o68Q71M07m72o30L61
2932B62q5q83L17Q56k73n85K80N60o39m60Q50M17p42K08N74k38p56J19M89k00
2952G1n71N19R9n52l66N40R3j19J07O39p0l71N03kl68J85O31j54o41L54l96n91
$$ plain form
2974 -460 -318 157 136 -308 -422 -42 -364 -881 -318 236 -184 -327 295 180 -425 -325 175 -439 -683 -225
2994 -225 98 -494 -972 -247 -145 -726 -417 549 202 -648 -25 776 42 -344 403 897 -206 -526 245 170
3014 170 -978 -862 122 -237 -826 -172 357 -329 -772 230 569 -8 -154 763 682 -194 227 809 365 -405
3034 -405 404 631 137 -362 339 518 -255 -32 804 636 -56 335 695 72 -93 432 555 -284 -319 -34
3054 -34 -337 -758 -526 8 -308 -300 234 92 -352 -7 739 755 108 730 859 183 -239 350 422 -457 -353 140
3076 140 -490 -837 -564 -309 -620 -785 160 207 -172 -14 648 148 -257 527 706 -48 -216 518 298 -410
3096 -410 -356 567 235 -720 -200 498 4 -808 166 576 -173 -296 531 314 -668 -597 334 170 -649 -163 442
3117 442 -294 -510 237 461 -196 -97 808 645 -222 -81 531 75 -536 -149 66 -759 -1135 -579 -529 -1131 -901
$$ packed form
2974d60J42M75k1m44j14L80l22n17N63N54m20j43O22j15o05J00N00o14k44M58
2994b25L23n92m78P25J02n81L09R66l47q50O23Q01p34l86P47M94j103l20P71p5
3014A70j148J16R84l59n89O54N29o86m43J002L39n77j46R17q1q76M21N82m44p70
3034d05Q09K27m94m99P01J79p73K23Q36j68o92L91L60o23j65N25J23q39l5K85
3054c4l03m21K32N34l16QN34j42m44L45P46J6o47O22J29o76m22N89P2q79J04M93
3076A40o30l47K73K55l11j65R45M7l79J58O62n00m05P84J79p54j68P34k20p08
3096d10N4R23l32r55N20O98m94q12R74M10p49j23Q27k17r82P1R31j64q19M86O05
3117D42p36k16P47K24o57R9R05j63q67J41O12m56o11L87K15q25l76N56N0o02K30
$$ plain form
3138 -901 -153 -401 -967 -402 84 -265 -244 522 710 355 521 677 375 -91 343 592 218 -28 146 -31
3158 -31 -551 -360 173 57 -39 304 264 -151 -87 486 555 216 399 720 337 -227 141 340 -114 -76 585 270
3180 270 -381 -277 174 -5 -411 283 366 -248 -604 42 -8 -691 -736 79 -29 -877 -118 256 -403 -549 171
3201 171 725 263 192 677 397 -160 142 729 295 -254 299 343 -387 -601 21 178 -423 -214 376 71 -837
3222 -837 -208 408 70 25 598 805 -90 -191 474 441 22 89 592 291 -406 -177 220 -69 -339 158 126
3243 126 -328 -174 -84 -263 -316 -179 165 -227 -380 -254 -269 -413 -62 89 -236 -194 -259 -135 -301 -228 -75 -162
3265 -162 -242 16 70 -227 -389 50 95 -279 46 351 -70 -478 85 383 130 -38 470 482 -47 -179 477
3286 477 412 -85 68 761 160 -368 -1 406 -97 -296 96 162 -324 -485 -366 -116 -444 37 304 -187 -465
$$ packed form
3138i01P48k48n66N65M86l49K1P66J88l55J66J56l02m66M34K49l74k46J74j77
3158c1n20J91N33j16r6L43m0m15O4N73O9l39J83L21l83n64L68J99m54L8O61l15
3180B70o51J04M51j79m06O94Q3o14l56O46n0o83m5Q15j08q48P59L74o59j46P20
3201A71N54m62p1M85k80n57L02N87m34n49N53M4p30k14O22J57o01K09N90l05r08
3222h37O29O16l38m5N73K07q95j01O65l3m19O7N03l01o97K29L97k89k70M97l2
3243A26m54J54R0j79n3J37L44l92j53J26j5j44L51J51l25M2o5J24j66P3J53q7
3265a62q0K58N4k97j62M39M5l74L25L05m21m08N63K98k53j68N08J2n29j32O56
3286D77o5m97J53O93o01n28L67M07n03j99L92O6m86j61J19K50l28M81K67m91k78
$$ plain form
3307 -465 11 190 204 232 834 897 207 294 760 461 144 454 865 381 -60 -123 83 -342 -577 -337 102 -371
3329 -371 -615 -685 -763 -673 -488 -351 -158 53 -256 -434 -340 -238 54 129 416 439 393 32 -133 256 307 513 562
3352 562 776 431 156 -89 -11 320 568 286 409 151 -29 -363 -379 42 456 390 107 242 167 -692 -594 135
3374 135 486 -43 -274 -153 -520 -1207 -1072 -614 -557 -808 -634 -633 -884 -1279 -906 -417 -57 385 550 392 -86
3395 -86 6 192 465 760 1252 1031 475 146 195 72 32 213 892 718 -173 -322 -187 -101 -146 131 779 644
3417 644 42 -297 -241 -275 -107 267 661 711 89 -280 -329 -198 38 248 497 608 382 -184 -464 -377 -472 130
3439 130 255 466 -26 -722 -1044 -922 -478 -98 254 289 -24 10 -315 -459 111 477 720 556 634 295 -364
3460 -364 -635 12 276 206 267 151 -120 -835 -1072 -259 280 185 374 500 47 -369 -272 44 286 381 818 570
$$ packed form
3307d65M76J79J4K8O02O3o90Q7M66k99l17L10M11m84m41o3K06m25k35K40M39m73
3329c71k44p0p8R0J85J37J93K11l09j78R4J02K92P5K87K3m6l61j65L89N1K06M9
3352E62K14l45k75k45P8L31K48k82J23k58j80l34j6M21M14o6k83J35p5q59R8P29
3374A35L51n29k31J21l67o87J35M58N7k51J74Jk51l95L73M89L60M42J65j58m78
3395h6R2J86K73K95M92k21n56l29M9j23m0J81O79j74q91j49J35Q6m5K77O48j35
3417F44o02l39N6l4J68L74L94N0o22l69m9J31K36K10K49J11k26n66k80Q7r5O02
3439A30J25K11m92o96l22J22M44L80L52L5l13L4l25j44N70L66K43j64P8l39o59
3460c64k71O47K64p0O1j16k71p15k37Q13N39r5J89J26m53m16R7L16K42R5M37k48
$$ plain form
3482 570 -118 -501 -295 -225 180 384 641 316 -206 -547 -379 -271 -178 506 470 -82 -288 -384 -528 -527 -429 179
3504 179 273 -93 -283 -380 -548 -426 8 747 544 161 158 147 -52 -70 262 534 617 19 169 -217 -320 -343 -116
3527 -116 403 495 207 -69 -193 -347 -249 57 377 353 217 -160 19 -299 -332 205 404 226 168 42 -82 -306
3549 -306 91 198 344 345 468 341 -123 -458 34 315 -79 102 259 -167 -462 -598 -254 -211 -232 -61 159
3570 159 63 -390 -125 -90 109 50 354 238 -21 -473 -236 -342 -319 -177 -90 -261 -454 -459 -382 -295 -302 -208 -142 28
3594 28 13 -20 -136 -46 -75 231 344 81 134 199 352 188 129 474 321 323 -17 169 250 -31 21 62 162 -74
3618 -74 87 68 7 -328 -147 -54 14 -39 18 -68 -102 -4 109 135 58 175 16 144 -100 -93 158 18 36 6 88 -166
3644 -166 -404 -299 -44 -271 -254 98 -38 -130 -6 173 179 -174 243 139 233 219 195 369 135 185 417 472 181
$$ packed form
3482E70o88l83K06P0M05K04K57l25n22l41J68J08R3O84l6n52k06r6j44JR8O08
3504A79R4l66j90r7j68J22M34P39k03l83lj1j99j8L32K72Q3n98J50l86j03k3K27
3527a16N19R2k88k76j24j54R8L06L20k4j36l77J79l18l3N37J99j78n8j26j24k24
3549c06L97J07J46JJ23j27m64l35M92K81l94J81J57m26k95j36L44M3k1J71K20
3570A59r6m53K65L5J99n9L04j16k59m52K37j06K3J42Q7j71j93nP7Q7pR4O6J70
3594B8j5l3j16R0k9L06J13k63N3O5J53j64n9L45j53Kl40J86Q1k81N2M1J00k36
3618g4J61j9o1l35J81R3O8n3N7q6l4R8J13K6p7J17j59J28k44PK51j40J8l0Q2k54
3644a66k38J05K55k27J7L52j36r2J24J79Ol53M17j04R4j4k4J74k34N0K32N5k91
$$ plain form
3667 181 143 212 140 88 -9 148 137 -84 -65 -137 28 -281 -295 -255 -156 -199 -113 -71 -190 -306 -237 -73 -57 -139 -85 -83 -6
3694 -6 -165 -47 11 22 -169 -246 -9 -136 -104 -166 121 -143 -161 -87 113 -157 -450 14 121 -225 -28 112 -114
3717 -114 -121 -24 276 -49 28 -104 109 49 -76 194 210 -14 -125 47 59 -187 216 192 4 65 164 220 23 -246
3741 -246 39 181 34 222 347 119 92 343 418 177 -36 335 159 -3 9 161 -155 -85 0 133 -158 -275
3763 -275 -280 4 -259 42 81 -85 -150 -155 105 27 41 -131 249 104 17 -6 98 261 2 -16 -37 251 54 1
3787 1 -108 56 -126 -105 -143 18 -213 -349 -106 131 -238 -211 -2 247 45 -251 117 131 -68 -8 363 199
3809 199 -113 -60 181 92 -181 -74 274 -66 -270 -173 300 -2 -15 217 360 17 -130 234 61 -185 149
3830 149 63 15 100 70 -48 -568 -367 -219 -188 -420 -221 -198 -423 -498 -283 -251 -263 -382 -182 -131 -287 -394 -184
$$ packed form
3667A81l8O9p2n2r7J57j1k21J9p2J65l09j4M0R9m3Q6M2j19j16O9J64J6q2N4KP7
3694fj59J18N8J1j91p7K37j27L2o2K87k64j8P4K00k70k93M64J07l46J97J40k26
3717a14pR7L00l25P7j32K13o0j25K70J6k24j11J72J2k46M03k4j88O1R9N6j97k69
3741b46K85J42j47J88J25k28k7K51P5k41k13L71j76j62J2J52l16P0Q5J33k91j17
3763b75nK84k63L01L9j66o5nK60p8J4j72L80j45q7k3J04J63k59j8k1K88j97n3
3787Aj09J64j82K1l8J61k31j36K43K37l69K7K09K49k02k96L68J4j99O0L71j64
3809A99l12N3K41q9k73J07L48l40k04R7M73l02j3K32J43l43j47L64j73k46L34
3830A49q6m8Q5l0j18n20K01J48L1k32J99K3k25p5K15L2j2j19K00N1j56j07K10
$$ plain form
3853 -184 -179 -41 162 241 65 -67 89 -17 152 325 437 99 70 -19 230 134 197 336 537 415 131 91 111
3876 111 293 435 451 363 333 148 -162 -260 181 115 -66 46 136 -336 -665 -594 -31 -359 -445 -182 -46 -393 -764
3899 -764 -532 1 -358 -137 122 137 -223 -402 20 165 62 402 302 283 25 147 69 195 79 463 464 86
3921 86 120 340 -79 -148 390 625 209 107 559 177 -122 -163 446 517 -126 -106 177 -100 -600 -252 -18 74
3943 74 -159 -231 -286 -366 -653 -318 -182 138 225 -174 -370 -329 -220 -79 -110 310 459 54 -110 -91 -54 -16 -15 271
3967 271 323 294 -49 -147 -94 -89 145 70 286 179 -21 -565 -208 -53 -122 -2 103 532 14 -275 -206 177 72
3990 72 84 476 469 -137 -354 -134 98 -204 172 283 213 -107 -146 -208 -160 65 350 227 72 102 -154 -163 -160 27
4014 27 432 280 206 96 -24 -467 -361 69 379 21 -95 -12 -104 -360 -424 -28 250 48 -177 -97 -180 -480
$$ packed form
3853a84NJ38K03P9j76j32J56j06J69J73J12l38k9q9K49r6O3J39K01j22k84m0K0
3876A11J82J42J6q8l0j85l10r8M41o6j81J12R0m72l29P1N63l28q6K63J36l47l71
3899g64K32N33l59K21K59J5l60j79M22J45j03L40j00j9k58J22p8J26j16L84Jl78
3921H6L4K20m19o9N38K35m16j02M52l82k99m1O09P1o43K0K83k77n00L48K34R2
3943G4k33p2n5q0k87L35J36L20Q7l99j96M1J09J41l1M20J49m05j64J9L7L8JK86
3967B71N2k9l43r8N3NK34p5K16j07k00n44L57J55o9J20J05M29n18k89O9L83j05
3990G2J2L92po06k17K20K32l02L76J11p0l20l9o2M8K25K85j23j55L0k56rLJ87
4014B7M05j52p4j10j20m43J06M30L10l58j16Q3r2k56o4L96K78k02k25Q0q3l00
$$ plain form
4036 -480 -345 -43 197 189 -9 -89 -73 -315 -296 69 138 431 153 -124 62 -21 -12 31 383 249 242 -7 -193 -140
4060 -140 91 159 179 175 169 -4 -162 -139 64 141 64 275 29 75 -208 -108 127 57 -68 56 152 -135 -515 -228
4084 -228 15 -143 -152 13 -56 -329 -495 -68 -151 -47 71 166 75 -168 -148 -159 180 -135 -37 132 -3 78 74 -28
4108 -28 41 18 184 143 180 92 95 -9 -36 254 221 117 68 105 284 159 22 303 395 263 251 424 115 68 -36
4133 -36 174 149 -31 -211 -83 -395 -356 -249 -153 -217 -477 -242 -452 -259 -270 -321 -299 -82 -180 -167 -131 -175 -106 -94 -29
4158 -29 117 26 46 -78 -121 119 248 144 -92 -19 42 -68 39 -36 220 292 -191 82 260 87 -65 301 466
4181 466 325 -68 205 89 -145 -250 -65 151 -90 -282 -115 -328 -327 -517 -149 -187 -348 -171 -41 -270 -187
4202 -187 -10 -103 91 -161 259 118 -25 -25 334 113 246 384 456 214 78 284 194 77 -35 53 90 -23
$$ packed form
4036d80J35L02K40qj98q0J6k42J9L65O9K93k78k77J86q3RM3L52j34pk49j86N3
4060a40K31O8K0moj73j58K3K03P7p7K11k46M6k83J00K35p0j25J24R6k87l80K87
4084b28K43j58rJ65o9k73j66M27q3J04J18R5r1k43K0j1L39l15R8J69j35Q1mj02
4108b8O9k3J66m1L7q8Lj04k7K90l3j04m9L7J79j25j37K81R2j32j2J73l09m7j04
4133c6K10k5j80j80J28l12L9J07R6o4k60K35k10J93j1n1K2K17r8J3L6m4O9J2O5
4158b9J46r1K0j24m3K40J29j04k36P3O1j10J07p5K56P2m83K73J78j73j52L66J65
4181D66j41l93K73j16k34j05J85K16k41j92J67k13Jj90L68l8j61J77J30k29Q3
4202a87J77r3J94k52M20j41j43%L59k21J33J38P2k42j36K06r0j17j12Q8L7j13
$$ plain form
4224 -23 -220 -173 -216 -97 -36 29 -25 -144 -79 -146 -116 -83 -33 374 268 148 0 -36 62 62 32 30 55 -33 -47 -150 -220
4251 -220 -273 69 74 -97 -107 -210 -40 -78 -19 155 288 130 -102 222 30 18 3 -61 148 -93 -141 -47 -319 -372
4275 -372 -89 86 -123 -10 -53 -139 -256 -353 -31 -96 -308 -368 -8 -184 -325 -90 -186 -136 -75 132 276 -24 -73
4298 -73 98 86 61 211 340 -62 83 74 39 -111 -250 -103 -73 -231 73 -47 -90 -154 61 92 149 86 258 164
4322 164 -31 357 93 281 38 31 156 -70 -165 -23 -80 -189 -123 -131 -57 -66 -62 -252 -270 20 4 -192 38 -157 -119
4347 -119 -203 -33 159 48 -234 200 144 -54 63 267 155 142 151 333 331 -108 86 174 -158 80 69 -24 -255
4370 -255 -297 -183 101 -132 -82 232 -99 -150 -132 85 110 -42 163 339 135 58 -45 195 -210 -98 -176 8
4392 8 -92 -18 -238 -63 -196 -58 -114 -56 102 -289 165 -168 -87 52 -1 107 -197 -23 -66 -1 -3 24 -21 156
$$ packed form
4224b3j97M7m3J19O1O5n4j19O5o7L0L3N0M07j06j20j48l6R8%l0kK5q8j4j03p0
4251b20n3L42Nj71j0j03J70l8N9J74J33j58k32L24j92j2j5o4K09k41m8R4k72n3
4275c72K83J75k09J13m3q6j17r7L22o5k12o0L60j76j41K35r6N0O1K07J44l00m9
4298g3J71j2k5J50J29m02J45rl5j50j39J47L0j58L04j20m3o4K15L1N7o3J72r4
4322A64j95L88k64J88k43pJ25k26r5J42n7j09O6qP4rMj90j8K90j6j96K30j95L8
4347a19q4J70J92j11k82M34n6j98J17K04j12j3RJ82km39J94Q8l32K38j1r3k31
4370b55m2J14K84k33N0L14l31n1J8K17K5j52K05J76k04p7j03K40m05J12p8J84
4392Hj00P4k20J75j33J38n6N8J58l91M54l33Q1J39n3J08l04J74m3O5kK7m5J77
$$ plain form
4416 156 13 -146 -33 183 -39 -5 -77 -44 -131 -68 -118 -51 -139 -237 -139 78 2 -28 -97 -145 187 256 56 155 310
4441 310 193 265 20 275 27 141 79 9 46 -224 -5 74 -107 -204 9 172 -126 -139 -228 11 87 -99 -11
4464 -11 -23 -136 -46 -100 39 -81 -130 -203 -278 -5 55 14 -48 193 79 49 16 -60 91 47 -135 -131 55 28 -96 110
4490 110 -59 110 11 -31 197 -51 -118 230 -68 -90 -96 -48 115 96 -214 -124 99 -52 56 -6 -15 39 -8 32 124
4515 124 63 -38 13 217 106 115 1 -37 -61 169 -26 -54 2 4 -57 -113 -151 34 36 -197 56 100 -126 -60 74 76
4541 76 -110 -2 95 -1 138 -93 -24 154 217 -156 11 77 150 111 108 105 98 69 -83 180 54 315 111 201 60
4566 60 63 70 -4 -77 102 -39 76 -52 86 -17 -251 -164 49 164 -12 -93 -199 83 -101 -209 77 116 -106
4589 -106 -234 66 36 -180 -118 15 138 -60 -85 20 138 -102 -37 43 21 151 -85 -100 3 -173 -13 2 106
$$ packed form
4416A56j43j59J13K16k22L4p2L3q7O3n0O7q8r8R8K17p6l0o9m8L32O9k00R9J55
4441C10j17P2k45K55k48J14o2p0L7k70K19P9j81r7K13J63k98j3q9K39P6j86Q8
4464a1j2j13R0n4J39j20m9p3p5K73O0m1o2K41j14l0l3p6J51m4j82MJ86k7j24K06
4490A10j69J69r9m2K28k48o7L48k98k2oM8J63j9l10R0K23j51J08o2rN4m7M0R2
4515A24o1j01N1K04j11Rj14l8k4K30j95k8N6Ko1n6l8J85Kk33K53M4k26O6J34K
4541G6j86J08R7r6J39k31O9J78O3l73J67O6P3l9llpk9j52K63j26K61k04R0j41
4566F0LPp4p3J79j41J15j28J38j03k34Q7K13J15j76q1j06K82j84j08K86L9k22
4589a06j28L00l0k16O2J33J23j98k5J05J18k40O5Q0k2J30k36j5J03j76J60J5J04
$$ plain form
4612 106 -19 -186 3 -55 -172 -133 -85 -19 109 -250 -333 -261 -218 -46 -70 -10 -55 17 0 -11 28 39 -114 -68 99
4637 99 -79 -31 155 431 251 102 249 207 180 152 65 163 190 56 132 227 -224 -165 -131 -242 -27 -196 -22 -122
4661 -122 -191 -168 -253 -374 -148 -135 0 -118 -207 -123 -121 -54 -185 -28 59 32 -14 -44 -187 75 58 211 216 125 214 256
4687 256 198 201 262 275 529 197 282 -3 -256 -273 -11 -23 138 57 -6 -111 -255 -60 -275 -18 -108 43 -70 -66
4711 -66 65 -318 -43 -7 65 82 -26 -3 -286 -394 9 -32 63 245 88 -166 -214 30 38 135 282 86 -42 -131
4735 -131 -29 -68 -98 -319 16 199 25 -56 23 -54 -157 -120 217 240 126 -156 -192 -125 -77 -119 -7 114 34 13
4759 13 15 -197 -65 125 33 214 11 119 -175 -169 -28 71 227 236 75 142 -137 -66 -24 81 41 32 12 28 -128 -186
4785 -186 -131 -21 285 44 87 20 -155 -190 -56 115 -182 -84 -181 -96 -125 -306 -265 -80 -58 74 174 128 82 -98
$$ packed form
4612A06j25j67J89n8j17L9M8O6J28l59q3P2M3J72k4O0m5P2j7j1L9J1j53M6J67
4637I9j78M8J86K76j80j49J47m2k7k8q7R8K7j34P6R5m51N9L4j11K15j69J74j00
4661a22o9K3q5j21K26J3J35j18q9Q4KO7j31J57Q7k7m6l0j43K62j7J53Nr1Q9M2
4687B56n8LO1J3K54l32Q5k85k53j7K62j2J61q1o3j05j44J95k15K57r0J51j13M
4711f6J31l83K75L6P2J7j08K3k83j08M03m1R5J82j57k54m8K44QR7J47j96j28q9
4735a31J02l9l0k21L35J83j74q1P9p7j03L7L37K3j14k82l6O7M8m2J12J21q0k1
4759A3Kk12J32J90r2J81k03J08k94OJ41R9J56Rj61O7k79P1M2J05m0rk0J6j56n8
4785a86N5J10L06k41M3o7j75l5J34J71k97R8r7Q5k9j81M1J85K2J32J00m6m6j80
$$ plain form
4809 -98 272 269 223 162 167 96 22 10 50 -45 36 -19 155 -210 -91 -98 -116 -70 35 101 79 196 -7 220 -21 104 139
4836 139 246 -139 -131 -117 -197 -129 24 -50 297 103 32 11 -198 -136 -38 -76 -87 115 33 -188 -242 -352 -299 -161 91
4861 91 -75 79 -229 -1 -156 -19 124 72 81 205 230 114 -17 -151 167 -9 70 -28 -144 -148 -54 -22 124 -20
4885 -20 127 228 186 52 243 143 173 174 179 272 86 -133 66 57 -45 -133 -7 -174 -225 -103 -98 -135 -237 -60 35
4910 35 -5 -168 -78 121 -104 10 -6 121 -183 -44 110 -1 -89 1 161 92 187 259 161 -117 -96 64 -97 2
4934 2 -154 -51 -49 -316 -41 -3 -16 -166 -159 -228 -178 -10 181 200 51 165 79 5 82 -16 99 43 323 -12 -90 -22
4960 -22 117 100 107 156 87 -123 78 252 -24 -141 15 1 -62 -94 0 -51 -72 -180 -100 -5 -183 -76 138 89 -74
4985 -74 -208 146 63 -141 173 132 -140 -51 -28 -4 -53 206 176 -32 76 -27 250 -7 -63 39 45 117 71 -150
$$ packed form
4809i8L70lm6o1Np1p4j2M0r5Q1n5J74l65J19pj8M6J05O6k2J17k03K27k41J25L5
4836A39J07l85QJ4q0O8J53p4L47j94p1k1k09O2R8l8j1K02q2k21n4j10N3J38K52
4861I1j66J54l08K28j55J37J43n2RJ24K5j16j31j34L18j76P9r8j16mR4L2J46j44
4885b0J47J01m2j34J91j00L0JNR3j86k19J99rj02q8J26j67n1J22Nl7j02J77R5
4910C5m0j63R0J99k25J14j6J27l04J39J54j11q8R0J60o9R5P2r8k78K1J60j61R9
4934Bj56J03Kk67K75L8j3j50Po9N0J68J91J9j49J14q6p4P7r8J15n6K80l35p8O8
4960b2J39j7PM9o9k10K01J74k76j17J56j4o3l2R4n1k1j08Q0R5j78J07K14m9j63
4985g4j34L54q3k04L14m1k72Q9K3K4m9K59l0k08J08j03K77k57n6J02OP2m6k21
$$ plain form
5009 -150 115 -65 -32 16 57 -203 -104 -10 50 17 12 -104 48 -19 47 -79 -33 -112 -19 -3 -38 -289 2 62 56 6 181
5036 181 54 125 91 190 173 69 -192 37 -30 -107 -129 -44 -50 -188 -183 -83 85 -54 -93 25 67 20 -65 -7 33 71
5062 71 -236 21 -109 -127 -44 -44 -33 -163 -9 38 -161 26 -10 66 64 178 153 24 190 88 109 -19 38 31 49 -43
5088 -43 81 -117 -29 -120 118 -2 -69 -101 -19 -35 -81 94 -25 -74 -48 -65 -129 -183 -129 -47 -103 -26 -115 -2 -43 16 91
5115 91 113 212 57 113 218 239 68 86 17 81 -26 120 17 -28 22 -189 -2 98 32 -93 111 -2 76 90
5139 90 122 188 -91 -34 64 -32 -23 85 -151 54 -51 -141 49 -19 -86 70 -68 29 105 -91 143 -24 -59 -16 -40
5164 -40 52 -194 8 -45 -136 -190 -31 68 46 59 -10 -7 34 29 74 78 -177 -151 -163 -53 -163 -250 -187 -195 -251 -156 -63 94 88
5193 88 36 122 -127 403 309 337 90 124 419 85 24 104 159 -29 -103 -155 -30 -289 -143 6 41 -69 -200 -157
$$ packed form
5009a50K65j80L3M8M1k60R9R4O0l3nj16J52o7O6j26M6p9R3J6l5k51K91O0on0J75
5036A81j27P1l4R9j7j04k61K29o7p7k2Q5oj38NJ00J68j39l9J18M2m7q5N8M0L8
5062G1l07K57j30j8Q3%J1j30J54M7j99J87l6P6kJ14k5j29J66j02K1j28N7pJ8r2
5088d3J24j98Q8r1K38j20o7l2Q2j6m6J75j19m9K6j7o4n4N4Q2n6P7q9J13m1N9P5
5115I1K2R9j55N6J05K1j71J8o9O4j07J46j03m5N0k11J87J00o6j25K04j13P8J4
5139I0L2O6k79N7R8r6RJ08k36K05j05r0J90o8o7J56j38R7P6j96K34j67l5M3k4
5164d0R2k46K02n3r1n4J59R9k2J3o9LM1nM5Mk55K6j2J10j10q7O3qn6R5R3J57o
5193H8n2Q6k49N30r4K8k47L4K95l34o1Q0N5j88p4n2J25k59J46J49L5j10j31M3
$$ plain form
5217 -157 -43 -94 87 87 -134 -101 -158 -123 -238 108 -16 -60 -101 -75 -14 -85 -40 203 134 98 70 -27 -10 -35 -42 -48 143
5244 143 12 61 14 88 51 59 46 -43 69 132 -28 101 33 37 39 91 152 -32 -93 -178 -198 -145 14 -62 -36 -79 -136 66
5272 66 25 10 76 96 123 217 114 -1 181 92 150 288 123 110 -35 -77 -171 42 71 81 101 -43 -107 -46 -91 -134
5298 -134 -113 -195 67 -53 -200 17 -55 -185 -79 -183 -127 -218 -326 55 15 -101 34 39 11 98 -60 -27 -63 -211
5322 -211 -85 3 -49 -75 -168 -9 -123 -100 -5 4 32 67 112 3 64 -5 220 138 140 111 -58 -149 120 -23 -178 -28
5348 -28 167 -71 -148 -16 -43 -120 39 35 -88 -83 80 49 -82 -95 98 -158 -136 -95 -152 -86 -77 -30 -129 49 -117 -62
$$ packed form
5217a57J14n1J81%k21L3n7L5j15L46j24m4m1K6O1p1M5K43o9l6k8r7J7k5poJ91
5244A43j31M9m7P4l7Qj3q9J12O3j60J29o8MKN2O1j84o1q5k0N3J59p6K6m3n7K02
5272F6m1j5O6K0K7R4j03j15J82q9N8J38j65j3j45m2r4K13K9J0K0j44o4O1m5m3
5298a34K1q2K62j20j47K17p2j30J06j04N6r1j08L81m0j16J35Nk8Q7j58L3l6j48
5322b11J26Q8n2k6r3J59j14K3R5RK8L5M5j09O1o9K25q2Kk9j69r1K69j43j55J50
5348b8J95k38p7J32k7p7J59mj23NJ63l1j31j3J93k56K2M1n7O6RM7r9J78j66N5
$$ [...]
8191B81
##END NTUPLES=NMR FID
##END=
