##TITLE=1H ikalashn
AM_NV  BSTILBENE
20.12.2024
##JCAMPDX= 6.0         $$ Bruker NMR JCAMP-DX V2.0
##DATA TYPE= NMR FID
##DATA CLASS= NTUPLES
##ORIGIN= UXNMR, Bruker Analytische Messtechnik GmbH
##OWNER= root
$$ TOPSPIN		Version 1.3
$$ 2024-12-20 15:05:48.093 +0400  Irina@DPX200
$$ Compression mode = diff/dup
##.OBSERVE FREQUENCY= 200.131300845
##.OBSERVE NUCLEUS= ^1H
##.DELAY= (6, 6)
##.ACQUISITION MODE= SIMULTANEOUS
##.ACQUISITION SCHEME= undefined
##.AVERAGES= 16
##.DIGITISER RES= 18
##SPECTROMETER/DATA SYSTEM= spect
##.PULSE SEQUENCE= zg
##.SOLVENT NAME= CDCl3
##.SHIFT REFERENCE= INTERNAL, CDCl3, 1, 17.49637
##AUDIT TRAIL= $$ (NUMBER, WHEN, WHO, WHERE, WHAT)
$$ ##TITLE= Audit trail, TOPSPIN		Version 1.3
$$ ##JCAMPDX= 5.01
$$ ##ORIGIN= Bruker BioSpin GmbH
$$ ##OWNER= Irina
$$ $$ F:/spectra/data/iren/nmr/1H/4/audita.txt
$$ ##AUDIT TRAIL=  $$ (NUMBER, WHEN, WHO, WHERE, VERSION, WHAT)
(   1,<2024-12-20 15:05:32.250 +0400>,<Irina>,<DPX200>,<TOPSPIN 1.3>,
      <created by zg
	started at 2024-12-20 15:04:24.140 +0400,
	POWCHK disabled, PULCHK disabled
       configuration hash MD5:
       BE 6D 3F 07 2A EA 11 49 91 17 2B D3 AF B3 58 0D
       data hash MD5: 16K
       53 B2 60 CB A9 C4 63 73 FD 52 C6 BD E3 F1 1C 90>)
$$ ##END=
$$ 
$$ $$ hash MD5
$$ $$ 84 6A 33 28 BF 9E A1 31 19 1A 9C 53 DC B7 79 CF
##$RELAX= 
##$RELAX= 
##$RELAX= 
##$RELAX= 
##$RELAX= 
##$RELAX= 
##$RELAX= 
##$RELAX= 
##$RELAX= 
$$ Bruker specific parameters
$$ --------------------------
##$DU= <F:/spectra>
##$EXPNO= 4
##$NAME= <1H>
##$PROCNO= 1
##$TYPE= <nmr>
##$USER= <iren>
##$AMP= (0..31)
100 100 100 100 100 100 100 100 100 100 100 100 100 100 100 100 100 100 
100 100 100 100 100 100 100 100 100 100 100 100 100 100 
##$ANAVPT= -1
##$AQSEQ= 0
##$AQ_mod= 1
##$AUNM= <au_zg>
##$AUTOPOS= <>
##$BF1= 200.13
##$BF2= 200.13
##$BF3= 200.13
##$BF4= 200.13
##$BF5= 200.13
##$BF6= 200.13
##$BF7= 200.13
##$BF8= 200.13
##$BYTORDA= 1
##$CFDGTYP= 0
##$CFRGTYP= 5
##$CHEMSTR= <none>
##$CNST= (0..63)
1 1 145 1 1 1 1 1 1 1 1 1 1 1 1 1 1 1 1 1 1 1 1 1 1 1 1 1 1 1 1 1 1 1 
1 1 1 1 1 1 1 1 1 1 1 1 1 1 1 1 1 1 1 1 1 1 1 1 1 1 1 1 1 1 
##$CPDPRG= <>
##$CPDPRG1= <>
##$CPDPRG2= <>
##$CPDPRG3= <>
##$CPDPRG4= <mlev>
##$CPDPRG5= <mlev>
##$CPDPRG6= <mlev>
##$CPDPRG7= <mlev>
##$CPDPRG8= <mlev>
##$CPDPRGB= <>
##$CPDPRGT= <>
##$D= (0..63)
0 2 0 0 0 0 0 0 0 0.06 0 0.03 0 0 0 0 0.0002 0 0 0 0 0 0 0 0 0 0 0 0 0 
0 0 0 0 0 0 0 0 0 0 0 0 0 0 0 0 0 0 0 0 0 0 0 0 0 0 0 0 0 0 0 0 0 0 
##$DATE= 1734692729
##$DBL= (0..7)
120 120 120 120 120 120 120 120 
##$DBP= (0..7)
150 150 150 150 150 150 150 150 
##$DBP07= 0
##$DBPNAM0= <>
##$DBPNAM1= <>
##$DBPNAM2= <>
##$DBPNAM3= <>
##$DBPNAM4= <>
##$DBPNAM5= <>
##$DBPNAM6= <>
##$DBPNAM7= <>
##$DBPOAL= (0..7)
0.5 0.5 0.5 0.5 0.5 0.5 0.5 0.5 
##$DBPOFFS= (0..7)
0 0 0 0 0 0 0 0 
##$DE= 6
##$DECBNUC= <off>
##$DECIM= 32
##$DECNUC= <off>
##$DECSTAT= 4
##$DIGMOD= 1
##$DIGTYP= 9
##$DL= (0..7)
0 120 120 120 120 120 120 120 
##$DP= (0..7)
150 150 150 150 150 150 150 150 
##$DP07= 0
$$ [...]
##$SW= 21.9926040160658
##$SWIBOX= (0..15)
0 0 2 0 0 0 0 0 0 0 0 0 0 0 0 0 
##$SW_h= 4401.40845070422
##$TD= 16384
##$TD0= 1
##$TE= 300
##$TE2= 300
##$TE3= 300
##$TEG= 300
##$TL= (0..7)
0 120 120 120 120 120 120 120 
##$TP= (0..7)
150 150 150 150 150 150 150 150 
##$TP07= 0
##$TPNAME0= <>
##$TPNAME1= <>
##$TPNAME2= <>
##$TPNAME3= <>
##$TPNAME4= <>
##$TPNAME5= <>
##$TPNAME6= <>
##$TPNAME7= <>
##$TPOAL= (0..7)
0.5 0.5 0.5 0.5 0.5 0.5 0.5 0.5 
##$TPOFFS= (0..7)
0 0 0 0 0 0 0 0 
##$TUNHIN= 0
##$TUNHOUT= 0
##$TUNXOUT= 0
##$USERA1= <user>
##$USERA2= <user>
##$USERA3= <user>
##$USERA4= <user>
##$USERA5= <user>
##$V9= 5
##$VALIST= <valist>
##$VCLIST= <CCCCCCCCCCCCCCC>
##$VD= 0
##$VDLIST= <DDDDDDDDDDDDDDD>
##$VPLIST= <PPPPPPPPPPPPPPP>
##$VTLIST= <TTTTTTTTTTTTTTT>
##$WBST= 1024
##$WBSW= 25
##$XGAIN= (0..3)
0 0 0 0 
##$XL= 0
##$YL= 0
##$YMAX_a= 105450
##$YMIN_a= -98436
##$ZGOPTNS= <>
##$ZL1= 120
##$ZL2= 120
##$ZL3= 120
##$ZL4= 120
##$ABSF1= 10
##$ABSF2= 0
##$ABSG= 5
##$ABSL= 3
##$ALPHA= 0
##$AQORDER= 0
##$ASSFAC= 0
##$ASSFACI= 0
##$ASSFACX= 0
##$ASSWID= 0
##$AUNMP= <proc_1d>
##$AXLEFT= 0
##$AXRIGHT= 0
##$AXTYPE= 0
##$AXUNIT= <>
##$AZFE= 0.1
##$AZFW= 0.1
##$BCFW= 1
##$BC_mod= 2
##$BYTORDP= 1
##$COROFFS= 0
##$CY= 7568.61572265625
##$DATMOD= 1
##$DC= 2
##$DFILT= <>
##$DTYPP= 0
##$F1P= 17.9538593292236
##$F2P= -4.03888763876832
##$FCOR= 0.5
##$FTSIZE= 32768
##$FT_mod= 4
##$GAMMA= 1
##$GB= 1
##$INTBC= 1
##$INTSCL= 1
##$ISEN= 128
##$LB= 0.02
##$LEV0= 0
##$LPBIN= 0
##$MAXI= 945.577
##$MC2= 0
##$MEAN= 0
##$ME_mod= 0
##$MI= -402.1523
##$NCOEF= 0
##$NC_proc= 0
##$NLEV= 6
##$NOISF1= 8.587773
##$NOISF2= 6.764455
##$NSP= 1
##$NTH_PI= 0
##$NZP= 0
##$OFFSET= 17.49637
##$PC= 1
##$PHC0= 102.9577
##$PHC1= -12.09295
##$PH_mod= 0
##$PKNL= yes
##$PPARMOD= 0
##$PPDIAG= 0
##$PPIPTYP= 0
##$PPMPNUM= 100
##$PPRESOL= 1
##$PSCAL= 0
##$PSIGN= 0
##$REVERSE= no
##$SF= 200.13
##$SI= 32768
##$SIGF1= 18.5376
##$SIGF2= -6.396296
##$SINO= 400
##$SIOLD= 32768
##$SREGLST= <1H.CDCl3>
##$SSB= 3
##$STSI= 0
##$STSR= 0
##$SW_p= 4401.40845070422
##$SYMM= 0
##$S_DEV= 0
##$TDeff= 0
##$TDoff= 0
##$TI= <>
##$TILT= no
##$TM1= 0
##$TM2= 0
##$TOPLEV= 0
##$USERP1= <user>
##$USERP2= <user>
##$USERP3= <user>
##$USERP4= <user>
##$USERP5= <user>
##$WDW= 1
##$XDIM= 8192
##$YMAX_p= 0
##$YMIN_p= 0
$$ End of Bruker specific parameters
$$ ---------------------------------
##NTUPLES= NMR FID
##VAR_NAME=  TIME,          FID/REAL,        FID/IMAG
##SYMBOL=    X,             R,               I
##VAR_TYPE=  INDEPENDENT,   DEPENDENT,       DEPENDENT
##VAR_FORM=  AFFN,          ASDF,            ASDF
##VAR_DIM=   8192,          8192,            8192
##UNITS=     SECONDS,       ARBITRARY UNITS, ARBITRARY UNITS
##FACTOR=    0.0002272,     1,               1
##FIRST=     0,             0,               0
##LAST=      1.8609952,     -27,             -19
##MIN=       0,             -98436,          -98436
##MAX=       1.8609952,     105450,          105450
$$ Real data points
##PAGE= N=1
##DATA TABLE= (X++(R..R)), XYDATA
$$ [...]
1244A151J81j58m28k13J25J30m45m58r6m9k10m74l17K9M2l65l77J79L34nj32J50
$$ 1151 1332 1174 746 533 658 788 343 -115 -211 -260 -470 -944 -1261 -1232 -1190 -1555 -1932 -1753 -1419 -1424 -1556 -1406
1266a406M19N25J34K2M17N41L08J9K38N54L56j54j61K88K22r8n25k55j18l14p04
$$ -1406 -987 -462 -328 -306 111 652 960 979 1217 1771 2127 1973 1812 2100 2322 2224 1699 1444 1326 1012 308
1287C08p30l88l56o93p32m56m3l9l70p7M46P28M78M91P45J210Q64N91O31R26N46
$$ 308 -422 -810 -1166 -1859 -2591 -3047 -3090 -3129 -3499 -3576 -3130 -2402 -1924 -1433 -688 522 1386 1977 2608 3534 4080
1308D080J38k32j15q5n32r11j067o85p60r39j038o10l40l12l99j1N26N52L29M02
$$ 4080 4218 3986 3871 3786 3254 2343 1276 591 -169 -1108 -2146 -2756 -3096 -3408 -3807 -3818 -3292 -2740 -2411 -2009
1328b009P16R84P47L64L17P08L89j63n8K3P8k81n30m44M1jl66n32j00J41J8j22
$$ -2009 -1293 -309 438 802 1119 1827 2216 2053 1995 2018 2096 1815 1285 841 882 881 515 -17 -117 24 42 -80
1350h0k77J32J86l50l79Q4j8j46o03k11N3J07j75p0J26N26K84K41L16P34P62J69
$$ -80 -357 -225 -39 -389 -768 -684 -702 -848 -1451 -1662 -1609 -1502 -1677 -1747 -1621 -1095 -811 -570 -254 480 1242 1411
1372A411K38N63M03Ok10k81M7k44n92o48l67m49o52o40m54J2j00l44j98K96L05
$$ 1411 1649 2212 2615 2621 2411 2130 2177 1933 1341 693 326 -123 -775 -1415 -1869 -1857 -1957 -2301 -2499 -2203 -1898
1393a898K83N8L23N44M18J88K52L79N17O9q3K31L85K08k20l23J36K51k02m00l23
$$ -1898 -1615 -1557 -1234 -690 -272 -84 168 547 1064 1133 1050 1281 1666 1874 1654 1331 1467 1718 1516 1116 793
1414G93Q0k51n38n02k5j59m35p05k09J63o6l58m5J55N52K32J19N12N90M30K60
$$ 793 873 622 84 -418 -443 -602 -1037 -1742 -1951 -1788 -1854 -2212 -2257 -2102 -1550 -1318 -1199 -687 -97 333 593
1435E93L51N93N41P8q6l0J54K9m18m46j09k92n12n31l95o4m12n86k43m4J02j24
$$ 593 944 1537 2078 2156 2070 2040 2194 2223 1805 1359 1250 958 446 -85 -480 -544 -956 -1542 -1785 -1829 -1727 -1851
1457a851l70J28L54K11M9J38N46N22K37K82L93P46L09O9J46L60K80j81l05j67
$$ -1851 -2221 -2093 -1739 -1528 -1479 -1341 -795 -273 -36 246 639 1385 1694 1763 1909 2269 2549 2368 2063 1896
1477A896p4m15p05o08k67l00p25o80k19J14k17l12lM00M61K20J31O84O54M44J03
$$ 1896 1822 1407 702 94 -173 -473 -1198 -1878 -2097 -1983 -2200 -2512 -2515 -2115 -1654 -1434 -1303 -619 35 479 582
1498E82L54M95K90Jj81N2J37k57m62k10M7j59l78l98L6O5j59m00j30K09Nk18l26
$$ 582 936 1431 1721 1722 1541 1593 1730 1473 1011 801 848 689 311 -87 -51 14 -145 -545 -675 -466 -461 -679 -1005
1521a005M4K72k45k03q7J15J09j7j06L42M08J67J44K95N63M27P7J29M60J78p4
$$ -1005 -961 -689 -934 -1137 -1224 -1109 -1000 -1017 -1123 -781 -373 -206 -62 233 796 1223 1300 1429 1889 2067 1993
1542A993j99j30jk76o69m89l05k52o17o41k20k4j66l22rK76L52K28R1N53O94M68
$$ 1993 1794 1664 1663 1387 718 229 -76 -328 -945 -1586 -1806 -1830 -1996 -2318 -2327 -2051 -1699 -1471 -1380 -827 -133 335
1564C35R2L44M89M50R4j40l7J43k5l18l62p9j22m97l63j74%j92l47m18J44J77
$$ 335 427 771 1260 1710 1804 1664 1627 1770 1745 1427 1065 986 864 367 4 -170 -170 -362 -709 -1127 -983 -806
1586h06l17j47j20L42L1j10j28M41K09QJL39M26K03P5J39M75L16J68m6K81P6m0
$$ -806 -1123 -1270 -1390 -1048 -1017 -1127 -1255 -814 -605 -597 -596 -257 169 372 447 586 1061 1377 1545 1499 1780 1856 1816
1609A816l60k00p9k31n68n63k86k89k36o82l67J1o7j77m0L43M54L83R7M29O95
$$ 1816 1456 1256 1177 946 378 -185 -471 -760 -996 -1678 -2045 -2034 -2101 -2278 -2318 -1975 -1521 -1138 -1041 -612 83
1630H3N63K67J69M69N28N5j20p0L6k7l92m52j86k26m69n06n27r1k73m33k35qP9
$$ 83 646 913 1082 1551 2079 2134 2014 1944 1980 1953 1561 1109 923 697 228 -278 -805 -896 -1169 -1602 -1837 -1845 -1766
1653a766j5o3J49L63L38J46K00N48N87L27J08L02L87K53j38r4J7k2l68m29k20
$$ -1766 -1781 -1844 -1695 -1332 -994 -848 -648 -100 487 814 922 1224 1611 1864 1726 1632 1649 1627 1259 830 610
1674F10l31l42m77m37n4P9j30j51K5K54L37o7J28L78L52j9j01N5K00K4l09k10
$$ 610 279 -63 -540 -977 -1031 -952 -1082 -1233 -1208 -954 -617 -684 -556 -178 174 155 54 109 309 333 24 -186
1696a86Kn3k13p2m2M18J07J36J16M82M02K22n1L04K14N8m79l03l68k40n73p42
$$ -186 -184 -237 -450 -522 -564 -146 -39 97 213 695 1097 1319 1268 1572 1786 1844 1365 1062 694 454 -119 -861
1718h61m86k42l90m65k21Q5M00P2K86N39P59N95N01M88O24M71K15n4K10K8l11
$$ -861 -1347 -1589 -1979 -2444 -2665 -2580 -2180 -2108 -1822 -1283 -524 71 572 1060 1684 2155 2370 2316 2526 2554 2243
1739B243n25m26j92n07o22o08l25j11l47k74k23K61M3M4N3K19L81J92L8J71M20
$$ 2243 1718 1292 1100 593 -29 -637 -962 -1073 -1420 -1694 -1917 -1656 -1613 -1569 -1516 -1297 -916 -724 -686 -515 -95
1760i5K88M4K00L24K73J05QJ45K28J57j72k84l1o5k55n23m03j84k90l98m76k8
$$ -95 193 237 437 761 1034 1139 1147 1292 1520 1677 1505 1221 1190 1125 870 347 -56 -240 -530 -928 -1404 -1432
1782a432q3j65m6J76L37J92K23J82N01L72L76q9K41K88K3j12k25nQ6k49m16J1
$$ -1432 -1515 -1680 -1726 -1550 -1213 -1021 -798 -616 -115 257 633 544 785 1073 1096 984 759 754 840 591 175 186
1804A86K05M6k73oR4K85j32j03m6o9q7l79l97q6r4l66k71j21J13L9R1J56M29N67
$$ 186 391 437 164 158 252 537 405 302 256 187 100 -279 -676 -762 -856 -1222 -1493 -1614 -1501 -1462 -1371 -1215 -786 -219
1828b19M36K48M51O44L20k5J37J35p0l81m96l11l53m77p38l09j94k58k37p7J62
$$ -219 217 465 916 1560 1880 1855 1992 2127 2057 1676 1180 869 516 39 -699 -1008 -1202 -1460 -1697 -1774 -1612
1849a612L32J44J87J65N72K58K70O8P0L24j21j16k13J2m3k36n3K4J67J9p3L2K77
$$ -1612 -1280 -1136 -949 -784 -212 46 316 384 454 778 657 541 328 340 297 61 8 32 199 218 145 177 454
1872D54K48L3r8J68O4k19k68k27r7k74l71l94r6Ol30k8p0K36J80K30J91L50M74
$$ 454 702 735 637 805 869 650 382 155 58 -216 -587 -981 -1077 -1071 -1401 -1429 -1499 -1263 -1083 -853 -662 -312 162
1895A62J99P7K57L87K94q3q3J51J37k56k32j79N1j56m10l52j99k61j49l91k94
$$ 162 361 438 695 1082 1376 1293 1210 1361 1498 1242 1010 831 882 726 316 -36 -235 -496 -645 -1036 -1330
1916a330J01j86l04k18J60L29P2K01M00N10L70L27M04N77M84O9J07P4Q6j50m14
$$ -1330 -1229 -1415 -1719 -1937 -1777 -1448 -1376 -1175 -775 -265 105 432 836 1413 1897 1966 2073 2147 2233 2083 1669
1937A669m32k88m96o40n66n13j88l28m25lK35K06K60J88N44N22N69N9L35L66K52
$$ 1669 1237 949 453 -187 -753 -1266 -1454 -1782 -2207 -2210 -1975 -1769 -1509 -1321 -777 -255 314 373 708 1074 1326
1958A326j34j47j3l1j77l49l12o2l1j83k02q7L04P2l1k4K88R6j27j44j6J24j52
$$ 1326 1192 1045 1032 1001 824 475 163 101 70 -113 -315 -402 -98 -26 -57 -81 207 303 176 32 16 140 -12
1981a2k32m37j3o2j84j20N8K30J13Q6N7M85L40O4J61L31K09O8j30p7Q7j44j98
$$ -12 -244 -681 -694 -756 -940 -1060 -1002 -772 -659 -573 -516 -31 309 373 534 865 1074 1142 1012 935 1022 878 680
2004F80k96q7j51j62k20k74J90q3k16j7n2J34j71k2N3O9J74Lr0J75K23R9q5K59
$$ 680 384 297 146 -16 -236 -510 -320 -403 -619 -636 -688 -554 -725 -747 -694 -625 -451 -448 -538 -363 -140 -41 -126 133
2028A33L10J36Q2L8K10J39P3k59kl3j02l46l69j8q3k50l29r2p1O1k66m1J39K34
$$ 133 443 579 661 699 909 1048 1121 862 860 827 725 379 10 -8 -91 -341 -670 -762 -833 -772 -1038 -1079 -940 -706
2052g06L0o7J90L22J26j7qJ70K95Q1j6J46K49K51n9M8J32Q5j09j86j11m9l87l71
$$ -706 -676 -743 -553 -231 -105 -122 -130 40 335 416 400 546 795 1046 987 1035 1167 1252 1143 957 846 797 410 39
2076C9m62k04k92m65k78k60O4j7J7J74L86M97L57L79N91P78L48J14J84J80M2k51
$$ 39 -423 -627 -919 -1384 -1662 -1922 -1858 -1875 -1858 -1684 -1298 -801 -444 -65 526 1304 1652 1766 1950 2130 2172 1921
2098A921m49k50k93n37o04m77k89k50k90j62j8L13K10P0M27L98L28K83J39K09
$$ 1921 1472 1222 929 392 -212 -689 -978 -1228 -1518 -1680 -1698 -1385 -1175 -1105 -678 -280 48 331 470 679
2118F79J88M8j26k27k9j69j83l20j64P3j08k6J5K77J64J02J7K55K56rn2j7N2j36
$$ 679 867 915 789 562 533 364 181 -139 -303 -230 -338 -364 -349 -72 92 194 211 466 722 713 661 644 696 560
2142E60k86l15j61o5l20k49l0R5j59l9JJ86L17P4L9K49L17J65J11N3K66J73kj2
$$ 560 274 -41 -202 -267 -587 -836 -866 -771 -930 -969 -968 -782 -465 -391 -352 -103 214 379 490 543 809 982 980 968
2166I68p2R0j04j82j69j25O2l39k27k55j53k59k57j79k7K8q7o6J11M15J98J92
$$ 968 896 986 882 700 531 406 468 129 -98 -353 -506 -765 -1022 -1201 -1228 -1200 -1287 -1353 -1242 -827 -629 -437
2188d37L43L65M56J89K89J41K69q6j87j69j16k77l47m08l26j73k48k95j09J28
$$ -437 -94 271 727 916 1205 1346 1615 1529 1342 1173 1057 780 433 25 -301 -474 -722 -1017 -1126 -998
2208i98m8J41L7L55K27L02P3O3K06O8Nj99l8j05p9j59k23J08L3o4J12R7M07J18
$$ -998 -1046 -905 -868 -513 -286 16 89 152 358 426 431 232 194 89 10 -149 -372 -264 -231 -295 -183 -86 321 439
2232D39R5K83J58J11r9r8j62l0k85m69l81k79k66k53k54k0kJ58J04J87M94L67
$$ 439 534 817 975 1086 987 889 727 697 412 -57 -438 -717 -983 -1236 -1490 -1510 -1512 -1354 -1250 -1063 -569 -202
2254b02L11K89M14L04K20p0Q3no2l00l54q1k52l10k78k38j15j6j37p9J24K5P8
$$ -202 109 398 812 1116 1336 1266 1349 1344 1282 982 628 547 295 -15 -293 -531 -646 -662 -799 -878 -754 -729 -651
2277f51Q8M8J51R8N5Q1O4J61q6Pj4J91J62p1k4K38Q4j3j42K9J59j17k43k6r5p8
$$ -651 -563 -515 -364 -266 -211 -130 -66 95 9 16 2 193 355 284 260 498 582 569 427 456 615 498 255 229 134 56
2303E6k37j74o8Pm0j99R1O6J02l6K8J27K01J32j2J5J27K0j39p6J54r7Q1k15J27
$$ 56 -181 -355 -423 -416 -456 -655 -564 -498 -396 -432 -404 -277 -76 56 44 59 186 206 67 -9 145 48 129 -86 41
2328D1J38J54n2nL4K07R1j13j04N5m9k10k45j67O9l11k67j27N9j09nm3K07K78
$$ 41 179 333 281 276 310 517 608 495 391 446 397 187 -58 -225 -156 -467 -734 -861 -802 -911 -916 -959 -752 -474
2352d74J72J71J48L20K65N3L3J98J39r0q6j01J1j35k37k20j45n5k28k51j56J67
$$ -474 -302 -131 17 337 602 655 688 886 1025 935 849 748 759 624 387 167 22 -33 -261 -512 -668 -501
2374e01k8j45j07J01R7M9o4k9K92R8M0P4K25K07Q8n7J87J55lPP2l2j2j17j54j28
$$ -501 -529 -674 -781 -680 -583 -534 -598 -627 -335 -237 -197 -123 102 309 397 340 527 682 679 686 758 726 714 597 443 315
2400C15j11j17l62j26o1r5q4j33R0RJ00k7J15J90J30J93L0JJ87P8p7J33O4L6j9
$$ 315 204 87 -275 -401 -462 -557 -641 -774 -684 -675 -575 -602 -487 -297 -167 26 56 57 244 322 245 378 442 478 459
2425D59j64K7R7n2k3j0J9l1k6k22K3o3j20k00j53M6r4j25j63pJ74J8M7O1K69J48
$$ 459 295 322 419 367 344 334 353 322 296 74 97 34 -86 -286 -439 -393 -487 -612 -775 -782 -608 -590 -543 -482 -213 -65
2451f5J52Q7K78J57J34j22RJ80J7j86j68r5j71j31k13j68k3rk31k4J2J14N5o8
$$ -65 87 174 452 609 743 621 630 810 827 641 473 378 207 76 -137 -305 -328 -337 -568 -592 -580 -466 -411 -479
2475d79L1K62K2L6KJ31J16K0r4L9J46P2q7r0Q4J18j75j9M1LP7k50K5L6J8r2j40
$$ -479 -448 -186 -164 -128 -126 5 121 141 47 86 232 304 217 127 211 329 154 135 176 179 256 6 31 67 85 -7 -147
2502a47P0N5N4j15j02J19J39r4j02k4O6l7j04q5n0%K3j92J9J29K41jN2K44L34
$$ -147 -77 -22 32 -83 -185 -66 73 -21 -123 -147 -81 -118 -222 -307 -357 -357 -334 -526 -507 -378 -137 -138 -86 158 492
2527D92J58M2K60L6J53j77q3j01j68j75m47l97j73k61m05j55q3K8L3J6M41L49
$$ 492 650 692 952 988 1141 964 881 780 612 437 -10 -407 -580 -841 -1246 -1401 -1484 -1456 -1423 -1407 -966 -617
2549f17M42J84L30M28L61K05J55L0j8j25j54m15k16l13n18k37k98q9j14j51k2
$$ -617 -175 9 339 767 1128 1333 1488 1518 1500 1375 1221 806 590 277 -241 -478 -776 -865 -979 -1130 -1152
2570a152Q3K51J50J28K12K32J94J65mK01N5p1q5j7Qq0r1j99J61l8m4r1K05j7N5
$$ -1152 -1069 -818 -668 -540 -328 -96 98 263 259 460 515 444 359 342 350 270 179 -20 141 103 59 -32 173 156 211
2595B11l6k6M6op3k68j20J00j98m7r3Q1J4n3J54L4K26M2L3P3J58J17q5j5O7L6
$$ 211 175 149 195 189 116 -152 -272 -172 -370 -417 -510 -429 -415 -468 -314 -280 -54 -12 21 94 252 369 284 269 336 372
2621C72r5j57j35J06r7r0q2J41J21J1q9R5J80kn1j48k0mj78j16j07K2j23j00o5
$$ 372 277 120 -15 91 -6 -96 -178 -37 84 95 6 101 281 279 228 80 60 56 -122 -238 -345 -323 -446 -546 -611
2646f11PJ75N1O5J78K16J95J02J72J01J21J9k27m2j6j60k42k17j21m2rj56k8Q2
$$ -611 -604 -429 -378 -313 -135 81 276 378 550 651 772 791 564 522 506 346 104 -113 -234 -276 -285 -441 -469 -387
2670c87L8Q9j8J18J94n3k5n0P5op2j62R7N8j57M0J01O6Q6Q9M3L36J56M0k6J18
$$ -387 -349 -260 -278 -160 34 -19 -44 -94 -19 -25 -97 -259 -162 -104 -261 -221 -120 -54 32 121 164 500 656 696 670 788
2696G88N6j07k52k79j10j84l04l43j81l8k21L9K0J75K41K18J99L49L49K63J66
$$ 788 844 737 485 206 96 -88 -392 -735 -916 -954 -1175 -1136 -1116 -941 -700 -482 -283 66 415 678 844
2717H44Q2J51M9j21j76j23k48j83m77o8j83j04k03K2j8J90J46L4K36J66J91L8
$$ 844 926 1077 1126 1005 829 706 458 275 -202 -270 -453 -557 -760 -738 -756 -566 -420 -386 -150 16 207 245
2739B45N3R6oj33j91l4k7q7k20j27LQ6N1K1K4K12K20J61L9J66J16j11L3n6q8j54
$$ 245 298 394 388 255 64 30 3 -84 -304 -431 -428 -342 -291 -270 -246 -34 186 347 386 552 668 557 590 534 446 292
2765B92l27j07q8j45j28q1o2%P9M7L0J20J74Q9M0J67K15j23J24j3Q5J37k28k3
$$ 292 -35 -142 -230 -375 -503 -584 -646 -646 -567 -520 -490 -370 -196 -107 -67 100 315 192 316 303 388 525 297 274
2789B74j7M5M3j82mm9J07j57r0p9j7Qj65r4J2n5p8r9L6Q3J54K8L3L42Q0J14K01
$$ 274 257 302 345 163 159 110 217 60 -30 -109 -126 -118 -283 -377 -365 -420 -498 -597 -561 -478 -324 -296 -263 79 159 273 474
2816D74O0O9M3P3j87Q6j11k39k24j36pj73j65l2knK6M9J31L9K01N4K9Q6Q2Q9j29
$$ 474 534 603 646 719 532 618 507 268 44 -92 -99 -272 -437 -469 -471 -476 -450 -401 -270 -231 -30 24 53 139 221 310 181
2843A81o9Lq8j06p3R0n5p1o6O2J25K8J29J15K2J49j8Q6k8Q4j80j57p8q2l2k62
$$ 181 112 115 27 -79 -152 -62 -117 -188 -254 -192 -67 -39 90 205 227 376 358 444 416 500 320 163 85 3 -29 -291
2869b91j20m8j27nJJ30K0P5J52O2J34K12J16p8J21O9J35j02pr8o7q6p3j65R7o1
$$ -291 -411 -459 -586 -591 -590 -460 -440 -365 -213 -151 -17 195 311 233 354 423 558 456 449 351 284 198 125 -40 57 -4
2895dk24k7M0J07r8l9l4J34p0k9j11J04MP4q8R5J17K4Q4l3K20rJ48k2Q7J2Q6k18
$$ -4 -228 -255 -215 -108 -206 -245 -279 -145 -215 -244 -355 -251 -247 -173 -261 -166 -49 -25 59 26 246 237 385 363 450 462 548 330
2923C30P7p0j61j24r9q0o3j34j56k0J7k5K5pJ96J06Q8o4J83O6J62mJ24L2rl8K9
$$ 330 407 337 176 52 -47 -127 -190 -324 -480 -500 -483 -508 -483 -490 -294 -188 -100 -164 19 85 247 243 367 399 390 352 381
2950C81j50N1o2j35j42q1L6Lq9Q9M3J9j46oJ16N9l6K0M4M9k6m9L5J9oj67N9j06
$$ 381 231 282 220 85 -57 -138 -102 -99 -188 -99 -56 -37 -183 -189 -73 -14 -50 -30 14 63 37 -12 23 42 36 -131 -72 -178
2978a78J00J6Oj01J30N5J01m1K2J89P2j03Q8p0j9%j48j11L4j33q6j04k0P4p0j40
$$ -178 -78 -62 -56 -157 -27 28 129 88 110 299 371 268 356 286 267 267 119 8 42 -91 -177 -281 -301 -227 -297 -437
3004d37L1P7Q0L6O9K3K31o9M1nK21M5n5nk6M3j11Lr7J05J8j01j12O2p4p5l0j5
$$ -437 -406 -329 -249 -213 -144 -121 110 41 82 77 298 343 288 283 257 300 189 192 95 200 218 117 5 67 -7 -82 -112 -127
3032a27m5r4k2K4N0o2JKN2RL4J01O2J26M6Q3M5J00L1M4j0jj04O2j08j30j76o0
$$ -127 -172 -266 -288 -264 -214 -276 -275 -273 -221 -212 -178 -77 -15 111 157 240 285 385 416 460 450 449 345 407 299 169 -7 -67
3060f7o6k53j3m9M8o7j42J96J01k4K9J70O0J75j8J60M4M9O5j64R6j5L6j94m2m9
$$ -67 -133 -386 -399 -448 -400 -467 -609 -413 -312 -336 -307 -137 -77 98 80 240 284 333 398 234 330 315 351 157 115 66
3086F6nq7j2j04N4mj03L1J2l1m7o4L2NJ09L9k3n8J65O2j1N0R2P7m3Nm5M2n4p3
$$ 66 61 -26 -38 -142 -88 -92 -195 -164 -152 -183 -230 -294 -262 -257 -148 -109 -132 -190 -25 37 26 76 168 245 202 207 162 204 150 77
3116G7o7n9J2j64j04K6J09Mn9l0K18L2O7R8M7J23P1j76O1p3j06l07J5n4p7j80
$$ 77 10 -49 -37 -201 -305 -279 -170 -166 -225 -255 -37 -5 62 160 207 330 401 225 286 213 107 -200 -185 -239 -316 -496
3142d96K4j48J44R5M4k3K57K29J91J20Q8P3J54N3j23m6j50r9k36k36k22q7k19
$$ -496 -472 -620 -476 -381 -337 -360 -103 126 317 437 525 598 752 805 682 636 486 387 151 -85 -307 -394 -613
3165f13j39q5M6nJ6K25J92K05J44K14K40RQ3Q1L7j6j9k51o7n9p2k64k01J09n8
$$ -613 -752 -837 -791 -796 -780 -555 -363 -158 -14 200 440 449 532 613 650 634 615 364 297 238 166 -98 -299 -190 -248
3190b48j07q6M3J00N3N1l5R1RR5N4L9j18J32q7K9J01j17N6J6PN0P0L5j19M0J41
$$ -248 -355 -441 -398 -298 -245 -194 -229 -138 -129 -34 20 59 -59 73 -14 15 116 -1 55 71 78 128 198 233 114 154 295
3217B95j80N8j45O9r9j33q5k2L6k2m7N1K5M2LL0J55K3R3n3N4n6R2q9m5Pl1k8n9
$$ 295 115 173 28 97 -2 -135 -220 -242 -206 -228 -275 -224 -199 -157 -154 -124 31 54 147 94 148 92 184 95 50 57 26 -2 -61
3246f1o3oJ39J6m0L0Q3R2K2NJ07m4j58k5Q2j85j00k17J0P7j33k7n7J17J08J4J24
$$ -61 -124 -130 9 25 -15 15 98 190 212 217 324 280 122 97 179 -6 -106 -323 -313 -236 -369 -396 -453 -336 -228 -214 -90
3273i0J59j7K54k5J7K8Q3o1p3J3o9j42j74j1o1p3j2l0m7J01P6P1J5R3k3J05l3
$$ -90 69 52 306 281 298 326 409 348 275 288 219 77 -97 -108 -169 -242 -254 -284 -331 -230 -154 -83 -68 25 2 107 74
3300G4MO0l0j13m4PK8j28p4O1P0M9l0J9K60NmO9K0Nj3j25q9jj21j7j91O9o2p2
$$ 74 78 138 108 -5 -49 -42 -14 -142 -216 -155 -85 -36 -66 -47 213 218 214 283 303 308 295 170 81 80 -41 -58 -249 -180 -242 -314
3330c14n9l4L9K21j52J94K7J75J92j05J19l0j2J0k4q6K3k23J14j46Kk5m3LJ7J36
$$ -314 -373 -407 -368 -147 -299 -105 -78 97 289 184 303 273 261 271 247 161 184 -39 75 -71 -69 -94 -137 -134 -117 19
3356A9j08L9M0J29k4l5%r7J1nr1l0l1J8J0m6J21l1J50n5J41Q6Pl4M9P8l3K8mk07
$$ 19 -89 -50 -10 119 95 60 60 -37 -26 -31 -122 -152 -183 -165 -155 -201 -80 -111 39 -16 125 211 218 184 233 311 278 306 302 95
3386I5N3j52o3l3q1Q3j10j9q9J13mJ8J07o8J30J4N5k0P2j9k6L3K3J5K7j36L1Q0
$$ 95 148 -4 -67 -100 -181 -98 -208 -227 -316 -203 -207 -189 -82 -150 -20 -6 49 29 101 82 56 89 112 127 154 18 49 129
3414A29L6j06p2Q2O1j00p2K9J11k24j6k1j4P8r3j22R1n2J41Pm5J27M7m4K01j8
$$ 129 165 59 -13 69 130 30 -42 -13 98 -126 -142 -163 -177 -99 -192 -314 -223 -275 -134 -127 -172 -45 2 -42 159 141
3440A41Q2Q0o9M2j9o0K4m5j52o9M7p2l2J6o5m4o6O1qJ56n8%R8P6KNK4l2J02o4
$$ 141 223 303 234 276 257 197 221 176 24 -45 2 -70 -102 -86 -151 -195 -261 -200 -208 -52 -110 -110 -12 64 66 71 95 63 165 101
3470A01q4R5lj59L2NR4j08M7n2J8N8k1N3q2J61j10l8j21J63Q2j30n4M0J0n4J2
$$ 101 17 112 109 -50 -18 -13 81 -27 20 -32 -14 44 23 76 -6 155 45 7 -114 49 131 1 -53 -13 -3 -57 -45
3497d5j45J54J2j00J02PM4J0n4J0K7k0o7J75n2R9o7j1M3O8P6j48k5j8j5r2J7j10
$$ -45 -190 -36 -24 -124 -22 -15 29 39 -15 -5 22 2 -65 110 58 157 90 79 122 190 266 118 93 75 60 -32 -15 -125
3525a25M9M7j43r4J27Kj5o5O9mR2k3M2J57k5J6j2P2J6%R8l2j08M8p6j5n3k1n0
$$ -125 -76 -29 -172 -266 -139 -137 -152 -217 -148 -152 -60 -83 -41 116 91 107 95 167 183 183 281 249 141 189 113 98 45 24 -26
3554b6p8l2Kn3j3n7kK3J08n4J07J23l0R5nm0J66kn6K9p7J33j83R9o3o7jj28kK8
$$ -26 -104 -136 -134 -187 -200 -257 -259 -236 -128 -182 -75 48 18 113 108 68 234 232 176 205 128 261 78 177 114 47 46 -82 -84 -56
3584e6L5nk5m3N9l9n5K2M7P5j48K6J40j66k3M3M1M3J02r0J5L3P8k5M5J01J3j22
$$ -56 -21 -26 -51 -94 -35 -74 -129 -107 -60 15 -133 -107 33 -133 -156 -113 -72 -29 73 -17 -2 31 109 84 129 230 243 121
3612A21N3N8j63P1Rj29m4k2J2j83j6M6m7K5k2P8N9P9LN2nJ58J18j42o7K01k11
$$ 121 174 232 69 140 149 20 -24 -46 -34 -217 -233 -187 -234 -209 -231 -153 -94 -15 -12 40 35 193 311 169 102 303 92
3639I2L7r9l9M5r4l8n7LQ6m2O9O2k3P7ql2R1l7j1l4j8pQj91j0L0rK6j15L1J26
$$ 92 129 30 -9 36 -58 -96 -153 -150 -64 -106 -37 25 2 79 71 39 130 93 82 48 30 23 31 -160 -170 -140 -149 -123 -238 -207 -81
3670h1l9J15M6J41L6qm6J75l0n1j4m3j00k2j44J9j40j6lr2P4K5M3l5O5J30N8j6
$$ -81 -120 -5 41 182 218 210 164 339 309 258 244 201 101 79 -65 -46 -186 -202 -205 -297 -223 -198 -155 -190 -125 5 63 47
3698D7N4M8l4mL1J39j42%p8m8O3K6J5n6p0K4k8o8N5O0r0p6Q4q%m2Lp2P1J00l3
$$ 47 101 149 115 111 142 281 139 139 61 13 76 102 117 61 -9 15 -13 -81 -26 34 -56 -132 -48 -56 -56 -98 -95 -167 -96 4 -29
3729b9p4N5Q8Q8L8o0J6P0j15r9JJ47p3j19J7L9l4L2p5K3nJ02MLn9J30Ko1Ko9o1
$$ -29 -103 -48 40 128 166 106 122 192 77 -22 -21 126 53 -66 -49 -10 -44 -12 -87 -64 -69 33 37 40 -19 111 113 52 54 -15 -76
3760g6j6PL0q4k0k5o7J56L7p3Q5O4J31p2J99J6J61j42M7j34L2j78J3j63j16Rj00
$$ -76 -92 -85 -55 -139 -159 -184 -251 -95 -58 -131 -46 18 149 77 276 292 453 311 358 224 256 78 91 -72 -188 -179 -279
3787b79o0q2R1QM9n1J63PK09K1Q7P6NJ43j80P5Qq9q8j24M6j17j5r7L9r6J10o1
$$ -279 -339 -421 -330 -322 -273 -324 -161 -154 55 76 163 239 244 387 207 282 290 201 113 -11 35 -82 -97 -194 -155 -251 -141 -202
3815b02M8N8O2J7Q1O9p5N4r7K7M4K7k6j57N5Rj62J0N0N0J1K5l3n0K15o8OL0P6
$$ -202 -154 -96 -34 -17 64 133 58 112 15 42 86 113 87 -70 -15 -6 -168 -158 -108 -58 -47 -22 -55 -105 110 42 48 78 154
3844A54k0j8j95K04j6l6r5L2Qlo5k6P7r4J34j20Mk0Q8p5M4QJ9M3L1MO7Or3pJ06
$$ 154 134 116 -79 125 109 73 -22 10 18 15 -50 -76 1 -93 41 -79 -75 -95 -7 -82 -38 -30 -11 32 63 67 134 140 47 40 146
3875A46N1Qj13O6l4n6L4j03O5j41j5o4p7%M3qK9p1J62NNJ45L3RP3L4p3Q1oJ4j15
$$ 146 197 205 92 158 124 68 102 -1 64 -77 -92 -156 -233 -233 -190 -198 -169 -240 -78 -73 -68 77 110 119 192 226 153 234 228 242 127
3906A27J4k6q7mj39K5Kk5j14J11J08o3p0K10j12N9m9m7J69k2j13L2M3MK0l4j00
$$ 127 141 115 28 24 -115 -90 -88 -113 -227 -116 -8 -71 -141 69 -43 16 -33 -80 89 67 -46 -14 29 33 53 19 -81
3933h1J22M1q9lO3m5R9N8j35J03l7p0J1k2Q6p3o5m6N0j15m4J7O8M3jOQ1l0O6P
$$ -81 41 82 -7 -10 53 8 107 165 30 133 96 26 37 15 101 28 -37 -83 -33 -148 -192 -175 -107 -64 -65 -59 22 -8 58 65
3963F5KL1j7RL1l2Q3j35q4J65q4l4j01J3M2p1jK48j29R1j35k8P8l0Q4p2j4QK1
$$ 65 67 98 81 90 121 89 172 37 -47 118 34 0 -101 -88 -46 -117 -118 130 1 92 -43 -71 7 -23 61 -11 -25 -17 4
3992DJ8q9j9Q3l0j2k3J3KN8L2n0M4J9nMO5mLr8P9om1k2j87J42kJ4lj70O5K2L6
$$ 4 22 -67 -86 -3 -33 -45 -68 -55 -53 5 37 -13 31 50 45 49 114 110 113 15 94 88 47 25 -162 -20 -22 -8 -11 -181 -116 -94 -58
4025e8n5Q8J0o6RQ3k2J15lj5M1k6K8j00J00l4J7O1l0Jo9oj16k4pm3J1q6J28j34
$$ -58 -113 -25 -15 -81 -72 11 -11 104 101 86 127 101 129 29 129 95 112 173 143 144 75 69 -47 -71 -78 -121 -110 -196 -68 -202
4055b02O3q2J01O1KJK8nK08k9j35J09P5M1p0r3J16j05Qj27m5M4K4j29L2l0k2o2
$$ -202 -139 -221 -120 -59 -57 -56 -28 -33 175 146 11 120 195 236 166 73 189 84 92 -35 -80 -36 -12 -141 -109 -139 -161 -223
4083b23J20o4Q8kL0J08O5p3Q4j08L0J49j00M1p3O7K2r3J6j55N0N5j33qR3N7j02
$$ -223 -103 -167 -79 -81 -51 57 122 49 133 25 55 204 104 145 72 139 161 68 84 -71 -21 34 -99 -107 -14 43 -59
4110e9r2J80p5M9Ml6Q4m4O8j29J2J00j7l5q4jJ69o2p2K4M4M4p3O9J0j3k4qM9l
$$ -59 -151 29 -46 3 7 -29 55 11 79 -50 -38 62 45 10 -74 -75 94 32 -40 -16 28 72 -1 68 78 65 41 33 82 79
4140G9j6r9JR8j8o7RrnP5k13J40j3M2j8l3J12p3n0M0N5k4o6P9j22J30Jkm0k6R8
$$ 79 63 -36 -35 63 45 -22 -13 -22 -27 48 -165 -25 -38 4 -14 -47 65 -8 -58 -18 37 13 -53 26 -96 34 35 33 -7 -33 65
4171F5m9mmj8J37M1j84J13ok9Nq2o0O2Nj62M0O7j7J0m4M2JO1K8l6P9R3r6Q4p4
$$ 65 16 12 8 -10 127 168 -16 97 91 62 67 -15 -75 -13 -8 -170 -130 -63 -80 -70 -114 -72 -71 -10 18 -18 61 154 58 142 68
4202F8P4N8p3j48J48j7p6K0p4O2n2L8j18J4m8qP0n1J23q6j9P4j5L9%N2J1L9M8
$$ 68 142 200 127 -21 127 110 34 54 -20 42 -10 28 -90 -76 -124 -132 -62 -113 10 -76 -95 -21 -36 3 3 55 66 105 153
4231A53o5N5nM2r5j9l6Q8o7o6n7N0Nj09m4N9k5K5j31Q1N4M0M0L8J3J24p0k1k5
$$ 153 88 143 138 180 85 66 30 118 51 -15 -72 -22 -17 -126 -170 -111 -136 -111 -242 -161 -107 -67 -27 11 24 148 78 57 32
4260C2K0R7l7K2j13P8j26o4J39j00nj09P4n2N2J77j42J36r2Q2O0j12k1N3L9m0
$$ 32 52 149 112 134 21 99 -27 -91 48 -52 -57 -166 -92 -144 -92 85 -57 79 -13 69 129 17 -4 49 88 48
4286D8n7J7q2Qk6l8J89j24N3m0J0O7K9p3J15L1j1o7J7K4k1k8m5kr9L4j05QJ48
$$ 48 -9 8 -74 -66 -92 -130 59 -65 -12 -52 -42 25 54 -19 96 127 116 49 66 90 69 41 -4 -6 -105 -71 -176 -168 -20
4315b0j31N1qM2M7R5j14J34n0O9m0L0n3l8LNl5QQq3Nj8O6M4j41M3J17o8J05p7
$$ -20 -151 -100 -108 -66 -19 76 -38 96 46 115 75 105 52 14 17 22 -13 -5 3 -80 -75 -93 -27 17 -124 -81 36 -32 73 -4
4345dJ02J5q9M5k3q8J0q6J8L7Po6O1%L0pJ2k6J7K8L9L8m9J48k8q0n5l8J55O2j61
$$ -4 98 113 24 69 46 -42 -32 -118 -100 -63 -56 -122 -61 -61 -31 -38 -26 -52 -35 -7 32 70 21 169 141 61 6 -32 123 185 24
4376B4n3L5j2o7M7n6K8p1m4%M5l1l7J07l3J08l0L0J48r5R1n7O6Q3M4j20k2p2N2
$$ 24 -29 6 -6 -73 -26 -82 -54 -125 -169 -169 -124 -155 -192 -85 -118 -10 -40 -10 138 43 134 77 143 226 270 150 128 56 108
4405A08p9Oj63m6P4n4m1k9J18p5rJ0R6O4J18r4J34Q1n1J03j69J32j20mNq2j4n5
$$ 108 29 35 -128 -174 -100 -154 -195 -224 -106 -181 -190 -180 -84 -20 98 4 138 219 168 271 102 234 114 110 115 33 19 -36
4433c6L2n1m5K7r2K4O9m9N5O9n5P8M1Jrl3J46o5j02J45j66n3M2j67O2K9LP2j1
$$ -36 -4 -55 -100 -73 -165 -141 -72 -121 -66 3 -52 26 67 68 59 26 172 107 5 150 -16 -69 -27 -194 -132 -103 -100 -28 -39
4462c9J06j8n5qJ14M2o4k3L5j7m1O2q3q1j0O7ll6k2M0j03L0rR1pN6kJ2l2M0m7
$$ -39 67 49 -6 -14 100 142 78 55 90 73 32 94 11 -70 -80 -13 -16 -52 -74 -34 -137 -107 -116 -25 -32 24 22 34 2 42 -5
4493eO8j5%k9o3N3L8m0O3q6N9j08O3ql4L7l7k6m8K9o3J08rJ01q4P3j7MJ9M8j33
$$ -5 63 48 48 19 -44 9 47 7 70 -16 43 -65 -2 -10 -44 -7 -44 -70 -118 -89 -152 -44 -53 48 -36 37 20 24 43 91 -42
4524d2k4J23Pj05J20ll8p5R7o8MO1j25R2m1o6J00k2K7M9m0j24P0M3n5M3n7m4j7
$$ -42 -66 57 64 -41 79 76 38 -37 60 -8 -4 57 -68 24 -17 -83 17 -5 22 71 31 -93 -23 20 -35 8 -49 -93 -110
4553a10O9p1JQ9j8O6k9J7J20k4n0O4j2Q9r4M3n2j96J09p4k3n1J21p4j71J29k3
$$ -110 -41 -112 -111 -22 -40 26 -3 14 134 110 60 124 112 201 107 150 98 -98 11 -63 -86 -137 -16 -90 -261 -132 -155
4580a55K9Kj5J35j7M0J33L4P0o7o2P4J23j95k32J98o2Qj76R8m6Po3KL6lO3K1N
$$ -155 -126 -124 -139 -4 -21 19 152 186 256 189 127 201 324 129 -103 95 33 41 -135 -37 -83 -76 -139 -137 -101 -104 -41 -20 -15
4609a5M1n5O4m7J65p4M2j17M8qo1Q2o5OR1r3j8K5r9J08j01K9j4MJ56j10l3K1R0
$$ -15 26 -29 35 -12 153 79 121 4 52 44 -17 65 0 6 97 4 -14 11 -88 20 -81 -52 -66 -62 94 -16 -49 -28 62
4638F2n1m2J01Ro0jN2p8L8K3m4m3mP2o6N5m0pL7r5KQ4k2J4oL5O8Pj05P0k1N4n5
$$ 62 11 -31 70 79 19 18 70 -8 30 53 9 -34 -38 34 -32 23 -17 -24 13 -82 -80 4 -18 -4 -10 25 93 100 -5 65 44 98 43
4671D3N4o0o9J1q4O0o0j8R3j3L7k6N9o6lQ8m6N5n0P7Om7or2J81j08k8Q9j17QM
$$ 43 97 37 -32 -21 -105 -45 -105 -123 -30 -43 -6 -32 27 -39 -42 46 0 55 5 82 88 41 35 -57 124 16 -12 77 -40 -32 -28
4702b8j1k9M2P1Nj40R4j3o2Jl5QQ3l4n2J68r3J1k0M2L9O9j12L7PM6k6j40K03n6
$$ -28 -39 -68 -26 45 50 -90 4 -9 -71 -70 -105 -97 -14 -48 -100 68 -25 -14 -34 8 47 116 4 41 48 94 68 -72 131 75
4732G5q3J8k8J00l3l6m3k0j2p7j5K3j1J43k9%P4n0J22lQL8j50J09l1n3L8k5n3
$$ 75 -8 10 -18 82 49 13 -30 -50 -62 -139 -154 -131 -142 1 -28 -28 46 -4 118 115 123 161 11 120 89 36 74 49 -4
4761dJ8l2P3j44R3k2m1qr3J06P9J2n0j1k5j3J20L1j05P3P7n8m8J02q6NP1j43N
$$ -4 14 -18 55 -89 4 -18 -59 -67 -160 -54 25 37 -13 -24 -49 -62 58 89 -16 57 134 76 28 130 44 49 120 -23 -18
4790a8lo7%P9j3pnm4m1J76q5L4k1J8Q7j16L1O1n5n0P7l5K5K4n8J8n7O9K4j23P1
$$ -18 -21 -88 -88 -9 -22 -29 -34 -78 -119 57 -28 6 -15 3 90 -26 5 66 11 -39 38 3 28 52 -6 12 -45 24 48 -75 -4
4821do8RQ0J3m0L4J9K3r1O5O6r7J03j47N1j7N2n1J5m1j6J09r4k5R5o2L4k0j02
$$ -4 -72 -63 17 30 -10 24 43 66 -25 40 106 9 112 -35 16 -1 51 0 15 -26 -42 67 -27 -52 43 -19 15 -5 -107
4850a07P7J8M4n5N3M5%JM4q3K3L1o7m4N1k8N1J0o4JL5q3O6K7q8OM7o0K6m1K4l0
$$ -107 -30 -12 32 -23 30 75 75 76 120 37 60 91 24 -20 31 3 54 64 0 1 36 -47 19 46 -42 -36 11 -49 -23 -64 -40 -70
4882g0J5N3M3L7o4N2RK5p7L5om9N8m9k1J25p0n5JP1q5J0j49J97r5k3N3o3P6Lo5
$$ -70 -55 -2 41 78 14 66 75 100 23 58 52 3 61 12 -9 116 46 -9 -8 63 -22 -12 -161 36 -59 -82 -29 -92 -16 -13 -78
4913g8N7o4J91k7m0O2l1j9Q6r1K9Nmm5K8j44O3n5K7l0k4J4k2L0M7q5O5L5k4P8
$$ -78 -21 -85 106 79 39 101 70 51 137 46 75 80 76 31 59 -85 -22 -77 -50 -80 -104 -90 -112 -82 -35 -120 -55 -20 -44 34
4943C4Rk4N8P4n7onJ2n0K3j0M0j43l3l7J7O1m1m9rJ05l8lk3M7J49k9q3J09M9n2
$$ 34 43 19 77 151 94 88 83 95 45 68 58 98 -45 -78 -115 -98 -37 -78 -127 -136 -31 -69 -72 -95 -48 101 72 -11 98 147 95
4974I5rj4k8m1J15q5n7j5o1Pl6Km3P7PK5N7n5L8K1K2J05m7R6l1l9J00r1j10J7
$$ 95 86 72 44 3 118 33 -24 -39 -100 -93 -129 -127 -170 -93 -86 -61 -4 -59 -21 0 22 127 80 176 145 106 206 115 5 22
5004B2qp2m3ll4j9K8mJ2M7J7o1K7R0j7R7p1J06nM3q9J61m2l3m5j53K2O8j02p5
$$ 22 14 -58 -101 -104 -138 -157 -129 -133 -121 -74 -57 -118 -91 -1 -18 79 8 114 109 152 63 224 182 149 104 -49 -27 41 -61 -136
5034a36l1M7n3J6pL2L1MK8M9j3P2L6M3j0o4J52r4k8M5q4l2k5k9Jk1J7N3%j10L4
$$ -136 -167 -120 -173 -157 -164 -132 -101 -97 -69 -20 -33 39 75 118 108 44 196 102 74 119 35 3 -22 -51 -50 -71 -54 -1 -1 -111 -77
5065g7j7J02NM5k7r5Q0M6o9R2j6L3j26M7m7km8L3N4Qp7k4R1qN3P5r7r2R7OL5j39
$$ -77 -94 8 13 58 31 -64 16 62 -7 85 69 102 -24 23 -24 -26 -74 -41 13 21 -56 -80 11 3 56 131 34 -58 39 45 80 -59
5097e9L5P2j15O8jl6M9K7o7K8R9o2L7j63Q4k8Q8q6P5j3p9J10o0m3O4l5n6N7N2
$$ -59 -24 48 -67 1 0 -36 13 40 -27 1 100 38 75 -88 -4 -32 56 -30 45 32 -47 63 3 -40 24 -11 -67 -10 42
5126D2J2q1l6m1J60r7J67j92K07j37q7R1n5M9qM0NM8j0n6r0J22j00J51j44j8M
$$ 42 54 -27 -63 -104 56 -41 126 -66 141 4 -83 8 -47 2 -6 34 39 87 77 21 -69 53 -47 104 -40 -58 -54
5153e4L1k5k3N8r0O8J02m9Q4n4Q1q5L4om4j2O7j10J0Oq4Q1j01O0K0p4N9L8O6j23
$$ -54 -23 -48 -71 -13 -103 -35 67 18 102 48 129 44 78 72 28 16 83 -27 -17 -11 -95 -14 -115 -55 -35 -109 -50 -12 54 -69
5183f9J45jL5QlM3k6o5j0oK4rr9Mo5O0j12M7L9j5j2n1l5J31J33p0%R2Kj27J36
$$ -69 76 75 110 118 115 158 132 67 57 51 75 66 -33 -29 -94 -34 -146 -99 -60 -75 -87 -138 -173 -42 91 21 21 113 115 -12 124
5214A24j9l1o3n3O6k4k5pj0k0N3p4QjO5rJ3K2j35J58K2nO3Rk2l8m4j9pn2m3Q4
$$ 124 105 74 11 -42 24 0 -25 -32 -42 -62 -9 -83 -75 -76 -11 -20 -7 15 -120 38 60 55 118 127 105 67 23 4 -3 -55 -98 -14
5246a4P8j44J17p1L7L5n3N9r8J5L1M3q1R6K5p3k4PRj3K7q1O2q0J23j08q4L9K2
$$ -14 64 -80 37 -34 3 38 -15 44 -54 -39 -8 35 -46 50 75 2 -22 -15 -6 -19 8 -73 -11 -91 32 -76 -160 -121 -99
5275i9J06KN1k7q4Q8M5q8P8o9L2M5K9k9o1P2r7l2L4j2n9q0L3M6J0M5k4J17j08
$$ -99 7 9 60 33 -51 37 82 -6 72 3 35 80 109 80 19 91 -6 -38 -4 -16 -75 -155 -122 -76 -66 -21 -45 72 -36
5304c6%O6Ql7O7J46j04rj13jP8k4m2r4R3p1j2m5M5K5lJ6L2P0J3l5MPJ7k3j2K8
$$ -36 -36 30 38 1 68 214 110 101 -12 -13 65 41 -1 -95 -2 -73 -85 -130 -85 -60 -63 -47 -15 55 68 33 37 44 61 38 26 54
5336E4K5k5r9K3j18J35j16kj8J08Lj7K4KO8J8K7p9J38j20j11J86m4m2PJ0Jn4M7
$$ 54 79 54 -45 -22 -140 -5 -121 -123 -141 -33 -30 -47 -23 -21 47 65 92 13 151 31 -80 106 62 20 27 37 38 -16 31
5365C1j04RL6q0J51j15P7j04N7Q9L1L8j09j9N5N6j14R8K0n6q7R3J6r3K4J8j6r7
$$ 31 -73 -64 -28 -108 43 -72 5 -99 -42 47 78 116 7 -12 43 99 -15 83 103 47 -40 53 69 -24 0 18 2 -95
5393i5L2K4R0j75J20q6N0o6Q3M3N6k0n9j1J25j66K7J0P8O7j44M3l0Q1o3j15KK5
$$ -95 -63 -39 51 -124 -4 -90 -40 -106 -23 20 76 56 -3 -14 111 -55 -28 -18 60 127 -17 26 -4 77 14 -101 -99 -74
5421g4R4p0P0r3R7j5j06J07Ql1Q2j31K5O8p5J3m8N6J5M1r0j0L8pN7mn0K6Kj9j18
$$ -74 20 -50 20 -73 24 9 -97 10 18 -13 69 -62 -37 31 -44 -31 -79 -23 -8 33 -57 -67 -29 -36 21 17 -33 -7 -5 -24 -142
5452a42J54q8J29p4Pkn7O1o3K1lM3k8M0m5O4J7KoN3k0l8M4m9l1L1p4N5Q2k05O3
$$ -142 12 -76 53 -21 -14 -16 -73 -12 -75 -54 -57 -14 -42 -2 -47 17 34 36 30 83 63 25 69 20 -11 20 -54 1 83 -122 -59
5483e9K7on9J48j59M1J01m7Q4rM0o2p1O1R1o5l8N6p4nJ4q7k7Q6J4j41O3N2J02
$$ -59 -32 -38 -97 51 -108 -67 34 -13 71 62 102 40 -31 30 121 56 18 74 0 -5 9 -78 -105 -19 -5 -146 -83 -31 71
5512G1j74J73q1O9N0k2q7JP5o9O9n9O8l0o8J4mm7J9n2k5J60Mj51O8LjP9j01J08
$$ 71 -103 70 -11 58 108 86 -1 0 75 6 75 16 84 54 -14 0 -4 -51 -32 -84 -109 51 55 -96 -28 -25 -26 53 -48 60
5542F0n2J45n9rm8P7J8j59P3N7n2j32L5J3rm9k7j2M9L9p6j1J74p6K4M7o6N3K6
$$ 60 8 153 94 85 37 114 132 -27 46 103 51 -81 -46 -33 -42 -91 -118 -130 -81 -42 -118 -129 45 -31 -7 40 -26 27 53
5571E3m8J71j50j6m9J02n9P1n7M2r5r4R1j5k7k5PnJ10j18J07L5m4J28k3L9K1j70
$$ 53 5 176 26 10 -39 63 4 75 18 60 -35 -129 -38 -53 -80 -105 -98 -103 7 -111 -4 31 -13 115 92 131 152 -18
5599a8R8M3o9N6pr4j4j07k2O7l0L0J9L0K1K0p5N2k1P4J6J6K7%r4O8n5k7k5l1O4
$$ -18 80 123 54 110 103 9 -5 -112 -134 -67 -97 -67 -48 -18 3 23 -52 0 -21 53 69 85 112 112 18 86 31 4 -21 -52 12
5630A2l2NNn1J7j4j6J23j65P2j2N9R1Lkqk1Q9q1j63J97j43J22q8J8j05L5j7K9
$$ 12 -20 -15 -10 -61 -44 -58 -74 49 -116 -44 -56 3 94 97 95 87 66 155 74 -89 108 -35 87 -1 17 -88 -53 -70 -41
5659d1J27M4j56L2R1j11l0j9j2J11J5k8O4J6r8o9J07K0p9M3J3j0l8o1JJ22j00
$$ -41 86 130 -26 6 97 -14 -44 -63 -75 36 51 23 87 103 5 -64 43 63 -16 27 40 30 -8 -69 -68 54 -46
5686d6J58p6ol5%J8j12R7oN2n2lM1K5k2k1Km5N7p4K2N0j13O9L5M8jk3K4l0K0n2
$$ -46 112 36 30 -5 -5 13 -99 -2 -8 44 -8 -11 30 55 33 12 14 -31 26 -48 -26 24 -89 -20 15 63 62 39 63 33 53 1
5718Aj0m7J21o2Qk3lJ11r6N5j09O8j4o3j0MQ9K1o4K7o9N0j8N3J6k1j5LN6L0k3
$$ 1 -9 -56 65 3 11 -12 -15 96 0 55 -54 14 0 -63 -73 -69 20 41 -23 4 -65 -15 -33 20 36 15 0 3 59 89 66
5749F6j00R2n0P2m1j57Q8N6L8%k10J36L0J3q0J07K7n0N1j37K1n1Q8L8p6N1j04
$$ 66 -34 58 8 80 39 -118 -30 26 64 64 -146 -10 20 33 -47 60 87 37 88 -49 -28 -79 9 47 -29 22 -82
5776h2k5R6p6Q7L0Jl5j8J4J16p8N1J8L9j12K8m7n8P0j44J65p5MpN7K0L5r1M7k6
$$ -82 -107 -11 -87 0 30 31 -4 -22 -8 108 30 81 99 138 26 54 7 -51 19 -125 40 -35 -31 -38 19 39 74 -17 30 4
5806DKK1j7mK9q4P0n6L3m8o4M8p8O9K9j03K7J23o7M5o1M7Q9p7R9j8LN8r4Q3Lj42
$$ 4 6 27 10 6 35 -49 21 -35 -2 -50 -114 -66 -144 -75 -46 -149 -122 1 -66 -21 -82 -35 54 -23 76 58 61 119 25 108 111 -31
5838c1J3j20N6O9q7N8o9L2M5j4J02j13P3l5L5M6k4P2j6rm2j2lOk8J02k22J35p6
$$ -31 -18 -138 -82 -13 -100 -42 -111 -79 -34 -48 54 -59 14 -21 14 60 36 108 92 83 41 29 26 32 4 106 -116 19 -57
5867e7q6J00ON4o9J01n8L7m3J6P6k6l0N1M0nN8j02j51J21P3p8j8q1N1Q3j20r8
$$ -57 -143 -43 -37 17 -52 49 -9 28 -15 1 77 51 21 72 112 107 165 63 -88 33 106 28 10 -71 -20 63 -57 -155
5895a55N5MKk3M8K7JN5L2N4l4l6K3mJ01r7l8L8k3k6Kj04N0N2m9l3l4Rj0P2RK8
$$ -155 -100 -96 -94 -117 -69 -42 -41 14 46 100 66 30 53 49 150 53 15 53 30 4 6 -98 -48 4 -45 -78 -112 -103 -113 -41 -32 -4
5927dJ03j19M1N2M5l4K5n1p9P3%k3n6k5L3J8l7Kj5l8k9J10N3k9q9Q6K1J5J26j53
$$ -4 99 -20 21 73 118 84 109 58 -21 52 52 29 -27 -52 -19 -1 -38 -36 -51 -89 -118 -8 45 16 -73 13 34 49 175 22
5957B2mM9q0M9l8q2K4L9J6j03P4K5k6N4Ol5L5m5L1Jk8Km3L8j8J11q2j9R4o0N9
$$ 22 18 67 -13 36 -2 -84 -60 -21 -5 -108 -34 -9 -35 19 25 -10 25 -20 11 12 -16 -14 -57 -19 -37 74 -8 -27 67 7 66
5988F6j32M0O7q4J16r5Q4p5K8J0l7k3L5J7m8j3%Lj38J46N7n0M2j07K8J35l9N6
$$ 66 -66 -26 41 -43 73 -22 62 -13 15 25 -12 -35 0 17 -31 -44 -44 -41 -179 -33 24 -26 16 -91 -63 72 33 89
6016H9q2OJ8j0KK6q4j7n2J27K4r7l1M6K4J6K7Pq6J46K2k41J21N8JJ2j16J0L9L7
$$ 89 7 13 31 21 23 49 -35 -52 -104 23 47 -50 -81 -35 -11 5 32 39 -47 99 121 -120 1 59 60 72 -44 -34 5 42
6046D2L9o8M0k8J1Pj05M7L9M4j8%j08N1M%L1j11R7J7j6j08R5pj7M8RJ0j58J24
$$ 42 81 13 53 25 36 43 -62 -15 24 68 50 50 -58 -7 -3 -3 28 -83 14 31 15 -93 2 -5 -22 26 35 45 -113 11
6076A1m2q9J16o3K4J23j55P0p8J2J32n9q3J0nN1j6P7K3l3lM7l1m7jK9J5m0j1j0
$$ 11 -31 -120 -4 -67 -43 80 -75 -5 -83 -71 61 2 -81 -71 -76 -25 -41 36 59 26 23 70 39 -8 -9 20 35 -5 -16 -26
6106b6k8O1j7o6M3Q1n6l9J3J33m5nQ4j23O1j02L2L4n2N3j3q8j8NJ2JJ22j04M2
$$ -26 -54 7 -10 -76 -33 48 -8 -47 -34 99 54 49 133 10 71 -31 1 35 -17 36 23 -65 -83 -78 -66 -65 57 -47 -5
6135em8N5J6o5J17r7M7l1M0qJ4k3K7jQ0r0kn8R6r3j4%O5n4m3J%O8rj5P4o2J07
$$ -5 -53 2 18 -47 70 -27 20 -11 29 21 35 12 39 38 118 28 26 -32 64 -29 -43 -43 22 -32 -75 -74 -74 -6 -15 -30 44 -18 89
6168H9j07L4Q8j40K8qR5p3J4k1O7n3q9M8n4N1OL5J8n2K7K8j0Rj5O5l1k4L0j2K4
$$ 89 -18 16 104 -36 -8 -16 79 6 20 -1 66 13 -76 -28 -82 -31 -25 10 28 -24 3 31 21 30 15 80 49 25 55 43 67
6199F7p7N5J8q5o9Q2k3j2k4j2J15n9rN5J5K7j8J7m6K7M9j55Q9K2jl4l9om0K8N0
$$ 67 -10 45 63 -22 -91 -9 -32 -44 -68 -80 35 -24 -33 22 37 64 46 63 17 44 93 -62 27 49 48 14 -25 -31 -71 -43 7
6230Gn5p1J44p9J5m0KR1o8J6P3n0L1L4p3Q0L3M5p3q2KJ5j2K6k6kj6K6rk8N5p5
$$ 7 -48 -119 25 -54 -39 -79 -77 14 -54 -38 35 -15 16 50 -23 57 90 135 62 -20 -18 -3 -15 11 -15 -17 -33 -7 -16 -44 11 -64
6262f4K3L6OJ01j74J24J05j39J1KJ5o0N5m5ko4K9m1L0M7mn1M3J27q5M2m2p1O0
$$ -64 -41 -5 1 102 -72 52 157 18 29 31 46 -14 41 -4 -6 -70 -41 -82 -52 -5 -9 -60 -17 110 25 67 25 -46 14
6291A4K2j7l2J9qM1p9P6o7L0J02j37O3o6J19j31J2mP6q4l2M1J7P2l2K1Lj06J12
$$ 14 36 19 -13 6 -2 39 -40 36 -31 -1 101 -36 27 -39 80 -51 -39 -43 33 -51 -83 -42 -25 47 15 36 39 -67 45
6320D5po1M5j5j8l7K5K9Q6j13J37q5O0j47P5k5NKn5P8j8Pp2RJ21rl8r4R0M8j38
$$ 45 38 -23 22 7 -11 -48 -23 6 92 -21 116 31 91 -56 19 -6 -1 1 -54 24 6 13 -59 -50 71 62 24 -70 20 68 -70
6351g0O6O6pJ6l2q4J04l7qo5M8k8Nk5M0m7N1J5q7P7K6j9n2O4j7Pm2M7p5J47n5
$$ -70 -4 62 55 71 39 -45 59 22 14 -51 -3 -31 -26 -51 -11 -58 -7 8 -79 -2 24 5 -47 17 0 7 -35 12 -63 84 29
6382B9p9R5r1R8p8P1m1L2o7K4j9M5q0Q9j35O0L8J9n9M4k4O1K1RQl7o3r3J11R8
$$ 29 -50 45 -46 52 -26 45 4 36 -31 -7 -26 19 -61 28 -107 -47 -9 10 -49 -5 -29 32 53 62 70 33 -30 -123 -12 86
6412H6j50J03Lm7r1N2M1r4M4R0r5N0L3O3j71R8k9J21o0l9M3q8O2P4m3k7j3o2O0
$$ 86 -64 39 42 -5 -96 -44 -3 -97 -53 37 -58 -8 25 88 -83 15 -14 107 47 8 51 -37 25 99 56 29 16 -46 14
6441A4j22J14j4r0M8K3n9J6J02n5O6m3L7M0r5N7M7l8m3jP1o7l5l9J7K8q9RM2P1
$$ 14 -108 6 -8 -98 -50 -27 -86 -70 32 -23 43 0 37 77 -18 39 86 48 5 4 75 8 -27 -66 -49 -21 -110 -101 -59 12
6471A2K4n5L1N1p7L8l1L8J8J4J1k1jk6j0Q2j03p4N7p2P2Kq1J15LO5k02J94n0J3
$$ 12 36 -19 12 63 -14 24 -7 31 49 63 74 53 52 26 16 98 -5 -79 -22 -94 -22 -20 -101 14 17 82 -120 74 24 37
6501C7JJk4m1N7j7L5o0m5L6J17k9m2l5NO0r3Lk9N6Kn7J08r3NK4q7N7O4L1l0N7
$$ 37 38 39 15 -26 31 14 49 -11 -56 -20 97 68 26 -9 -4 56 -37 -34 -63 -7 -5 -62 46 -47 -42 -18 -105 -48 16 47 17 74
6533G4o8L0O0o7J9k1l7Mp9M9K7j4L2Q9j43L1l9O2n5N7n1L1K6K8j12O0P6p8N7l0
$$ 74 6 36 96 29 48 27 -10 -6 -85 -36 -9 -23 9 98 -45 -14 -53 9 -46 11 -40 -9 17 45 -67 -7 69 -9 48 18
6563A8L6l6L8n5l3O6K9k4o3K1m6l4O7LK0r3L8n4O5j5R1o4Mjl0O7Mp1R7n9qm9J30
$$ 18 54 18 56 1 -32 34 63 39 -24 -3 -49 -83 -16 -13 7 -86 -48 -102 -37 -52 39 -25 -21 -22 -52 15 19 -52 45 -14 -22 -71 59
6596E9Rj00R4o5K6q3kJ72j03m0jk3O2K0r2J23j02M1P6q4k5J3M3k3J6J8k3J8j3
$$ 59 68 -32 62 -3 23 -60 -62 110 7 -33 -34 -57 5 25 -67 56 -46 -5 71 -13 -38 -25 18 -5 11 29 6 24 11
6625A1Rj2o4M8K1j19Q9Pl7k0Q4l4j01J16j5L7L0j02M1m4k9J37o5j5M8R5j19m7
$$ 11 20 8 -56 -8 13 -106 -17 -10 -47 -67 17 -17 -118 -2 -17 20 50 -52 -11 -55 -84 53 -12 -27 21 116 -3 -50
6653e0Q1mK2o1l0J26r4Q1j05M9m0O0j05P7J2p1J14l6j6o3O2k8J17l9On7j8Q3j18
$$ -50 31 27 49 -12 -42 84 -10 71 -34 15 -25 35 -70 7 19 -52 62 26 10 -53 9 -19 98 59 65 8 -10 73 -45
6682d5O0j7m5R8q6m0j2J7jM0n2J2J00p9L8om1J05j20O7L4J35j00M1p7k8P0p1m1
$$ -45 15 -2 -47 51 -35 -75 -87 -70 -71 -31 -83 -71 29 -50 -12 -18 -59 46 -74 -7 27 162 62 103 26 -2 68 -3 -44
6711d4P3n2pJ5p1Q1lOR9j17R9j04P4o4K5O2j40J66j2o4M0L0q1J4m8k0M8k2J7K4
$$ -44 29 -23 -30 -15 -86 -5 -8 -2 97 -20 79 -25 49 -15 10 72 -68 98 86 22 62 92 11 25 -23 -43 5 -17 0 24
6741B4Qn2%O9o0J0o2M7j7pj1L5N7K7j15qQ3lj2o2L5k1j0K8N1rn2L2lK8r9O9L0
$$ 24 32 -20 -20 49 -11 -1 -63 -16 -33 -40 -51 -16 41 68 -47 -55 28 25 13 -49 -14 -35 -45 -17 34 25 -27 5 2 30 -69 0 30
6774C0j46K00j92J16kj03J10o5K3kj1O8l9j5LR8r4n7R7O3o7j0L1q3m7L8L7O3q
$$ 30 -116 84 -108 8 6 -97 13 -52 -29 -31 -42 26 -13 -28 -25 73 -21 -78 19 82 15 5 36 -47 -94 -56 -19 44 36
6803C6m5Kr7J39j2n5P6l1j6K8j2nOR8j03oK2m4K1m0J24L0j88L2p7J10O0o1j8m
$$ 36 -9 -7 -104 35 23 -32 44 13 -3 25 13 8 14 112 9 3 25 -19 2 -38 86 116 -72 -40 -117 -7 53 -8 -26 -30
6833c0l5J9J8L0l8P1o7O7J5L7m7N2pj1r8m7K1K9j9N5n0J4L3p8N7j7%mN7q2Q9K7
$$ -30 -65 -46 -28 2 -36 35 -32 35 50 87 40 92 85 74 -24 -71 -50 -21 -40 15 -35 -21 12 -66 -9 -26 -26 -30 27 -55 34 61
6865F1pJ4M7p4K9Mn4j46K03q7M4m3R4o7N1j28Rj3mR6n9Q4n2j2qN6N3Mn0r5J52
$$ 61 54 68 115 41 70 74 20 -126 77 -10 34 -9 85 18 69 -59 -50 -63 -67 29 -30 54 2 -10 -18 38 91 95 45 -50 102
6896A02j25O5O1j04P7p5J3q0p4J49ro4J20q9m5P0l2m6J09J4n8rM8M1K9m4Q5j41
$$ 102 -23 42 103 -1 76 1 14 -66 -140 9 0 -64 56 -33 -78 -8 -40 -86 23 37 -21 -30 18 59 88 44 129 -12
6924a2Q7o5Qr3N7k7K3K4J2j41O6O3J5l8L3o7K9K0q0Q8p2J30k4m9J8k8L1L8l8l7
$$ -12 75 10 18 -75 -18 -45 -22 2 14 -127 -61 2 17 -21 12 -55 -26 -6 -86 2 -70 60 36 -13 5 -23 8 46 8 -29
6954b9J10j1n3o2N5J1j80J97m3nj7O6m4l2O3K0j8k2j7J37j31N1o3N7r5N2N9J1
$$ -29 81 70 17 -45 10 21 -159 38 -5 -10 -27 39 -5 -37 26 46 28 6 -11 126 -5 46 -17 40 -55 -3 56 67
6982F7j06M9N7q4m8L3ml2K0Q6m8j1o0L4L7R3o3l8l4N2jR5j08K2JoK5Rp2M2m9M9
$$ 67 -39 10 67 -17 -65 -32 -36 -68 -48 38 -10 -21 -81 -47 -10 83 20 -18 -52 0 -1 94 -14 8 9 3 28 37 -35 7 -42 7
7014Gr4R2N1j29PL5J72j52P2k8l8M4J8p9K9N8j03N7k1j0M1k1j1jp9R2J18j62m0
$$ 7 -87 5 56 -73 -66 -31 141 -11 61 33 -5 39 57 -22 7 65 -38 19 -2 -12 29 8 -3 -4 -83 9 127 -35 -75
7043g5O1M2j7n7N7q6N4Q3j45J30n4Kp6J03M0q0J01r8OQ3m9j06P8r3J05n9M9M9
$$ -75 -14 28 11 -46 11 -75 -21 62 -83 47 -7 -5 -81 22 62 -18 83 -15 -9 74 25 -81 -3 -96 9 -50 -1 48
7071D8j00P1N3p5NK2O2j46J1K0j3L3N6m4RkL7lk6N2r4M2j06Q0L4k6KK4k2No8m
$$ 48 -52 19 72 -3 2 24 86 -60 -49 -29 -42 -9 47 3 12 10 47 44 18 70 -24 18 -88 -8 26 0 2 26 4 9 -59 -63
7103f3J5Q8P2j08N0k9L1n0M1j7OP9j23o3J13j0J2p0N9nJ4k4M6j13P4k0o2J05j06
$$ -63 -48 40 112 4 54 25 56 6 47 30 36 115 -8 -71 42 32 44 -26 33 28 42 18 64 -49 25 5 -57 48 -58
7132e8M4m9Q1Oj13P7rM7J3o0M4Nr8L1M6n6Q9Lm5m0K1J02p7j9L7p6O4r8J15J8j1
$$ -58 -14 -63 18 24 -89 -12 -21 26 39 -21 23 28 -70 -39 7 -49 40 43 -2 -42 -21 81 4 -15 22 -54 10 -88 27 45 34
7163C4m3L3Q9p0M9o6o3N4K1k5O4m0n3k2O0r2J17j5Oj9J7k6J8J2o8O1oRq4P6k6
$$ 34 -9 24 113 43 92 26 -37 17 38 13 77 37 -16 -38 22 -70 47 32 38 19 36 10 28 40 -28 33 27 36 -48 28 2
7194BK5K1K0k3n4K1q6L0J0O3K1r7L1k9j7Q0j14J29o5l5l3N7N2o1R1o0Q8M7q4P
$$ 2 27 48 68 45 -9 12 -74 -44 -34 29 50 -47 -16 -45 -62 18 -96 33 -32 -67 -100 -43 9 -52 39 -21 67 114 30 37
7224C7q2M0n7M9L2Kr8O0nPO9p9Qk3l1rO9K5p6M5O8J0j06qO4p6R6L3j3o2Q2L2l6
$$ 37 -45 -5 -62 -13 19 21 -77 -17 -22 -15 54 -25 -17 -40 -71 -80 -11 14 -62 -17 51 61 -45 -53 11 -65 31 64 51 -11 71 103 67
7257F7k9roq7nP8lp0o4J68Rj2m4J09j1p7k7nL0M9Rj39O3k8l8O3K6l5N0q7K9M8
$$ 67 38 29 23 -64 -69 9 6 -64 -128 40 49 37 -7 102 91 14 -13 -18 12 61 70 -69 -6 -34 -72 -9 17 -18 32 -55 -26 22
7289B2p4R3o9o1M1M8o2L6j6PR3M5p0o0Q6r3j0J19q3J8K3j7jk7J1N8j06L3M5m1
$$ 22 -52 41 -28 -89 -48 0 -62 -26 -42 -35 58 103 33 -27 59 -34 -44 75 -8 10 33 16 15 -12 -1 57 -49 -16 29 -12
7319a2R6j63J12J6j41P2N8o0J2j3R2p4Q2p9Kk2L8On5pO4M5j35L3qm4R2l5N4m6
$$ -12 84 -79 33 49 -92 -20 38 -22 -10 -23 69 -5 77 -2 0 -22 16 22 -33 -40 24 69 -66 -33 -41 -85 7 -28 26 -20
7349b0L8K8n1m0J0O1pJ1K1J3M3q9Q8r7L6k7ko3Q6m0Q2p6M3j21O7lm3J17o8J0J9
$$ -20 18 46 -5 -45 -35 26 19 30 51 64 107 18 106 9 45 18 16 -47 39 -1 81 5 48 -73 -6 -9 -52 65 -3 7 26
7380B6k2O6p5o4k4L4J8Q4r4L9N6m2J05j30J9k6pO1q3pQ3q1R1k5QJ9p8L6kj2N9
$$ 26 4 70 -5 -69 -93 -59 -41 43 -51 -12 44 2 107 -23 -4 -30 -37 24 -59 -66 17 -64 27 2 10 29 -49 -13 -15 -27 32
7411C2L0J8j35ON1Nl0P0o5k7k2K3L3No6ON0L7q7N1N2M0q2K2K5j58J94n6p2kL8
$$ 32 62 80 -55 -49 2 7 -23 47 -18 -45 -67 -44 -11 -6 -72 -66 -16 21 -66 -15 37 77 -5 17 42 -116 78 22 -50 -52 -14
7442a4Q6j5j22Q3rL3r2J8Q2r5L3l5O9No6L5o3Q4k0K5k7K9n7P4j17L0J00O3q7p7
$$ -14 72 57 -65 18 9 42 -50 -32 50 -45 -12 -47 22 27 -39 -4 -67 17 -3 22 -5 24 -33 41 -76 -46 54 117 30 -47
7472d7J01O4r3M2j50J31o5L3n7l9O9J1m5J9q1J35j13Q8o3Q4m0Q2j10j4Q3j02J23
$$ -47 54 118 25 67 -83 48 -17 16 -41 -80 -11 0 -45 -26 -107 28 -85 3 -60 24 -16 66 -44 -58 25 -77 46
7499D6j8k6M1mj9l7K5p7J34l3n3n6j7Q3K2MNKk7K6j5J5j7k9M1j9R3r7N9n9J11
$$ 46 28 2 43 39 20 -17 8 -69 65 32 -21 -77 -94 -11 11 15 20 22 -5 21 6 21 4 -25 16 -3 90 -7 52 -7 104
7530A04j19j09J80q9N8j4L8n6l7O8m0p8MK0M3Q7q2j7R4j0j01l7N2N0L5j18K5Q7
$$ 104 -15 -124 56 -33 25 11 49 -7 -44 24 -16 -94 -90 -70 -27 60 -22 -39 55 45 -56 -93 -41 9 44 -74 -49 38
7558C8l2J0q7Q3n4O1o9P8o2N6o9O0M4l1qL0n5l7L8q3N6J6L9L9o9j4J09q7n8N4
$$ 38 6 16 -71 12 -42 19 -50 28 -34 22 -47 13 57 26 18 48 -7 -44 -6 -89 -33 -17 22 61 -8 -22 87 0 -58 -4
7588dQ8l5p7N9o3R7o4J8k0K0m8O9O3r2J2j02P0l3nM1OL3l5K0l1M2j30J27n3o3
$$ -4 84 49 -28 31 -32 65 1 19 -1 19 -29 40 103 11 23 -79 -9 -42 -47 -6 0 33 -2 18 -13 29 -101 26 -27 -90
7618i0J31K6N6j50l1J29j26N3M3j22J34j21k0J44Kk8j3r6J53j16L1q6P4N0P1j49
$$ -90 41 67 123 -27 -58 71 -55 -2 41 -81 53 -68 -88 56 58 30 17 -79 74 -42 -11 -97 -23 27 98 -51
7644e1MM2L2j7krj7l3M3M3o2O4Jn6M7l4K0K1l2M4%p6N0Om4L1r0L3M8J2Pk1j7n9
$$ -51 -47 -5 27 10 8 -1 -18 -51 -8 35 -27 37 38 -18 29 -5 15 36 4 48 48 -28 22 28 -16 15 -75 -42 6 18 25 4 -13 -72
7678g2l1J46o6jRM9L5j14K00j10j3J5L0o2P2r7L2j6J1Jj5K4l4kJ44j95QNK3K0
$$ -72 -103 43 -23 -24 -15 34 69 -45 155 45 32 47 77 15 87 -10 22 6 17 18 3 27 -7 -9 135 -60 -52 -47 -24 -4
7708dNJ9m4M2q7P9k3k3Q8k1p3L0k6J6p9Q8P1j25N5LM4K5j0p2pN1k1l2R0j86J35
$$ -4 1 20 -24 18 -69 10 -13 -36 52 31 -42 -12 -38 -22 -101 -13 58 -67 -12 -9 35 60 50 -22 -29 22 1 -31 59 -127 8
7739Hm2j1R7o5n7nM9J7R4k6k0p0P9k4l6o1J39n6PN6j20J00j0j7q1Q4J8p4J04m1
$$ 8 -34 -45 52 -13 -70 -75 -26 -9 85 59 39 -31 48 24 -12 -73 66 10 17 73 -47 53 43 26 -55 29 47 -27 77 36
7769C6j07K7M7L0k3J04j09j4L5l9N1k1l8qJ06j20rj0P1m6k9J43j06m5M9K3N2p0
$$ 36 -71 -44 3 33 10 114 5 -9 26 -13 38 17 -21 -29 77 -43 -52 -62 9 -37 -66 77 -29 -74 -25 -2 50 -20
7797b0K5mk1Q0J9q4L4l2OJ7J3o8P7j13N9j5L4K2K8j15M3o7J03n2L1L1Jn3R4q8
$$ -20 5 1 -20 60 79 -5 29 -3 3 20 33 -35 42 -71 -12 -27 7 29 57 -58 -15 -82 21 -31 0 31 32 -21 73 -15
7827a5qR9o3jnJ4k7K8Nq1N8K9r5N6J2qq3Q0J22j47p2J50n3j8p6J23n7m4J12r5
$$ -15 -23 76 13 12 7 21 -6 22 27 -54 4 33 -62 -6 6 -2 -85 -5 117 -30 -102 48 -5 -23 -99 24 -33 -77 35 -60
7857f0J15n6kp9R8l7j5N0j9m1p2J32l3ML2p3p4P7O3P4jJ2k02O7lP4l3L7q1R5j1
$$ -60 55 -1 -3 -82 16 -21 -36 14 -5 -46 -118 14 -19 -15 17 -56 -130 -53 10 84 83 95 -107 -40 -43 31 -2 35 -46 49 38
7888C8o4mN6l2p2O9k9o9l5J29K5j4j3pm7J34j00K6k7R1l7n1j0Qo2J92j18n3L5
$$ 38 -26 -30 26 -6 -78 -9 -38 -107 -142 -13 12 -2 -15 -22 -69 65 -35 -9 -36 55 18 -33 -43 -35 -97 95 -23 -76 -41
7917d1J31j13J9k4j1Q5j9l4k9L1O2j00L4O8l4o1O5p3J10o9o9O5k9nK5J3m0J7O2
$$ -41 90 -23 -4 -28 -39 46 27 -7 -36 -5 57 -43 -9 59 25 -36 29 -44 66 -3 -72 -7 -36 -41 -16 -3 -43 -26 36
7946C6l5qJ9J4M6j09Q4j3M8q6j5M4J07j66km4J09j8l6P9K8p0J6j53O7qjL1JJ1
$$ 36 1 -7 12 26 72 -37 47 34 82 -4 -19 25 132 -34 -36 -80 29 11 -25 54 82 12 28 -125 -58 -66 -67 -36 -35 -24
7976b4R0r8P0j8p6O9No0J17m4p9OJ48r0J1k5n5Q9o9Om5Q3J6o9J18j58J14j8J1
$$ -24 66 -32 38 20 -56 13 18 -42 75 31 -48 -42 106 16 27 2 -53 36 -33 -27 -72 11 27 -42 76 -82 32 14 25
8005B5N1o1j3j4K9P3j30O0l0q9K15j17j2L9q8J52p4n4Rl7Q1p9R1k1J1L1m4ml8
$$ 25 76 15 2 -12 17 90 -40 20 -10 -99 116 -1 -13 26 -62 90 16 -38 -29 -66 15 -64 27 6 17 48 4 0 -38
8034c8M9L2j03K0l8P3N5n3Po5R7o9nK6k9Q8p6KL8l5K2K5qo6N5n0j4R1K0n7J2p6
$$ -38 11 43 -60 -40 -78 -5 50 -3 4 -61 36 -33 -38 -12 -41 47 -29 -27 11 -24 -2 23 15 -51 4 -46 -60 31 51 -6 6 -70
8066g0J09o8nQ4Jk0J7j5MJ5k3l1l6J02o6k1j4R2q8J63r4Jp7l6J36k0m3nn3KL7
$$ -70 39 -29 -34 50 51 31 48 33 37 52 29 -2 -38 64 -2 -23 -37 55 -33 130 36 37 -40 -76 60 40 -3 -8 -61 -59 -22
8097b2K2M4m0M6l0O4j26KP7p4K6L6J5k0K4n2m1KP4j35J30l6k0M8m5L1rj2R1j01
$$ -22 0 44 4 50 20 84 -42 -40 37 -37 -11 25 40 20 44 -8 -49 -47 27 -108 22 -14 -34 14 -31 0 -9 -21 70 -31
8127c1j7L5%k5Q5l7m6J09j03QN5l8O6j1j19Q6o1N7j5p0R6m6rm6J61r1K3mJ7n8
$$ -31 -48 -13 -13 -38 47 10 -36 73 -30 -22 33 -5 61 50 -69 17 -44 13 -2 -72 24 -22 -31 -77 84 -7 16 12 29 -29
8157b9QP2m6O7j52N4P1m9J1M6j01O1O6j49Q7k8MP3j2lp8J5O8o3L8j13N8R2j2j21
$$ -29 -21 51 5 72 -80 -26 45 -4 7 53 -48 13 79 -70 17 -11 -7 66 54 51 -27 -12 56 -7 31 -82 -24 68 56 -65
8187f5m0R6Lk1
$$ -65 -105 -9 -6 -27
8191b7
$$ Imaginary data points
##PAGE= N=2
##DATA TABLE= (X++(I..I)), XYDATA
0@%%%%%%%%%%%%%%%%%%jJ4k9L2l2L2l3L4m9O4o5O6q2R8j14J30j43J60j80K04k21
$$ 0 0 0 0 0 0 0 0 0 0 0 0 0 0 0 0 0 0 0 -1 13 -16 16 -16 16 -17 17 -32 32 -33 33 -49 49 -65 65 -78 82 -98 106 -115
39a15K46k78L10l43L77m20M68n17N68o24O89p60Q38r23J018j125J246j382J536
$$ -115 131 -147 163 -180 197 -223 245 -272 296 -328 361 -399 439 -484 534 -591 655 -727 809
58H09j715J925k178K485k865L358m023M974o447R099j5374O1263N4139l5148j1063
$$ 809 -906 1019 -1159 1326 -1539 1819 -2204 2770 -3677 5422 -9952 51311 105450 70302 59239
73E9239k7920j9639l1125k1091k1507j1402j2699k707K412J2885J2795J6802J7485
$$ 59239 31319 11680 -19445 -40536 -62043 -73445 -86144 -88851 -86439 -73554 -60759 -43957 -26472
86b6472K2521J9311J6388J0489R758N177M16o460q134r734j0788j3912j2628r403
$$ -26472 -3951 15360 31748 42237 51995 57172 57588 51128 42994 33260 22472 8560 -4068 -13471
100a3471n605n218l630j68M607O158N702N268O916O695M060Q79K53n7k000m982
$$ -13471 -19076 -24294 -27924 -28092 -23485 -17327 -11625 -6357 559 7254 11314 12193 12446 12389 10389 5407
116E407o059m135k619k978l564j553J738L173K597K794M596N317L324J352J208
$$ 5407 -652 -4787 -7406 -10384 -13948 -15501 -13763 -10590 -7993 -5199 -603 4714 8038 9390 10598
131A0598J806L56k653l829k276j239k343l175j605J078J544N49R98L035L258J084
$$ 10598 12404 12760 10107 6278 4002 2763 420 -2755 -4360 -3282 -1738 -1189 -191 2844 6102 7186
147G186q23n30J41j659m631n483m068l270m039m007j748J350K321K564M586P341
$$ 7186 6363 5833 5974 4315 -316 -5799 -9867 -13137 -17176 -21183 -22931 -21581 -19260 -16696 -12110 -4769
163d769Q714P257N905O297O250L695n4k448l213m921p858r427q843p564p677p357
$$ -4769 3945 11202 17107 23404 29654 33349 33295 30847 27634 22713 14855 5428 -3415 -10979 -18656 -26013
179b6013n086j323J544K116L271O004Q091Q015O594N953N907M478J380j042j561
$$ -26013 -31099 -32422 -30878 -28762 -25491 -19487 -11396 -3381 3213 9166 15073 19551 20931 19889 18328
194A8328k073l962n783n710l775k452k790k091J28K640L037K908L370M623M041
$$ 18328 16255 12293 6510 800 -2975 -5427 -8217 -10308 -10180 -7540 -4503 -1595 1775 6398 10439
209A0439J673R3n1n28k797n297n782m850m382n059m738k305L26J158J909M028
$$ 10439 12112 12205 12154 11626 8829 3532 -2250 -7100 -11482 -16541 -21279 -23584 -23258 -22100 -20191 -16163
225a6163O718P328O279N890O564O348L755Q22n55j094k891n518o845o036n742
$$ -16163 -9445 -2117 4162 10052 16616 22964 26719 27541 26986 25892 23001 17483 10638 4602 -1140
240a140o480o442m493j828p60n56P15K924M682M198L525L956M450L428J869O67
$$ -1140 -7620 -14062 -18555 -20383 -21143 -21699 -20984 -18060 -13378 -9180 -5655 -1699 2751 6179 8048 8715
256H715Q75N81j187k368j791p12p77j845j516Q6R05M98LR21J535Q67o22p18k47
$$ 8715 9590 10171 8984 6616 4825 4113 3336 1491 -25 61 966 1464 1467 2388 3923 4790 4168 3450 3203
275C203k87j878k999k364j188j430k103j790j84R31O95P29J964L306K951J842
$$ 3203 2916 1038 -1961 -4325 -5513 -6943 -9046 -10836 -11020 -10089 -9394 -8665 -6701 -3395 -444 1398
291A398J869K875K741R77m6k88L94n92j997k172j282j047k143k232j050n5m25
$$ 1398 3267 6142 8883 9860 9814 9526 9920 9328 7331 5159 3877 2830 687 -1545 -2595 -2650 -3075
308c075j158o81O39Q94J1p19P8O00J06p79n38O32O84m35l98P92J982J470N71J027
$$ -3075 -4233 -4914 -4275 -3381 -3370 -4089 -4011 -3411 -3305 -4084 -4622 -3990 -3306 -3741 -4139 -3347 -1365 105 676 1703
328A703K233K207J054N78R82J100Kj229j310o26j379k674l153k363j360j915k251
$$ 1703 3936 6143 7197 7775 8757 9857 9859 8630 7320 6694 5315 2641 -512 -2875 -4235 -6150 -8401
345h401j695l30J36k07K30J475K331J683J304K004K859K598J129P41J276J409
$$ -8401 -10096 -10426 -10290 -10497 -10267 -8792 -6461 -4778 -3474 -1470 1389 3987 5116 5857 7133 8542
361H542L66q53n89l27n62j654j920r63m60j306k126j116j8J8p97r84J51O56q1
$$ 8542 8908 8055 7466 7139 6577 4923 3003 2040 1580 274 -1852 -2968 -2986 -2968 -3765 -4749 -4598 -3942 -4023
380d023n58lP23M16l91l60N95J157K91r0M90J769J652P62Q68J592J749R38K39
$$ -4023 -4581 -4584 -3861 -3445 -3836 -4196 -3601 -2444 -2153 -2243 -1753 16 1668 2430 3298 4890 6639 7577 7816
399G816N85Q30p5j374j759j318j305k338l378k603j617j807k017j455o2O35M46
$$ 7816 8401 9231 9156 7782 6023 4705 3400 1062 -2316 -4919 -6536 -8343 -10360 -11815 -11877 -11242 -10796
416a0796P85K192L036K904J972K176K801K657J361M89M11L39o21j759j723j249
$$ -10796 -10011 -7819 -4783 -1879 93 2269 5070 7727 9088 9577 9988 10327 9706 7947 6224 4975
432D975j407k158k533j430l57n24r84n92M88R29L28k02N05R45K60o33l33M48K98
$$ 4975 3568 1410 -1123 -2553 -2910 -3434 -4418 -5010 -4522 -3593 -3265 -3467 -2962 -2017 -1757 -2390 -2723 -2275 -1977
451a977o49q74J39J057R06K71P78J915J845J053Q97J335J486L26p27q28n14r20
$$ -1977 -2626 -3500 -3361 -2304 -1398 -1127 -349 1566 3411 4464 5361 6696 8182 8508 7781 6953 6439 5519
469E519k352k792k055j303j809j935j306J12J40J18M30J621K256J492P74J124
$$ 5519 3167 375 -1680 -2983 -4792 -6727 -8033 -7921 -7781 -7663 -7233 -5612 -3356 -1864 -1090 34
485C4J735J220L7m81m6J35n69j144o04M43J72o5O1J145J688R21K20M42R21L03
$$ 34 1769 2989 3026 2545 2499 2634 2065 921 317 760 932 867 928 2073 3761 4682 4902 5344 6265 6568
505F568r51j782j432j648k725l268k573j596j448j784r14Q05K019J983K240L298
$$ 6568 5617 3835 2403 755 -1970 -5238 -7811 -9407 -10855 -12639 -13553 -12748 -10729 -8746 -6506 -3208
521c208M167L995K883K607K543J877J03j165j598j604k609m016l936l209k352
$$ -3208 959 4954 7837 10444 12987 14864 14967 13802 12204 10600 7991 3975 39 -3170 -5522
536e522k532k099q61N44J028R19J677K796K965J865J295J416J458K57j033j353
$$ -5522 -8054 -10153 -11014 -10470 -9442 -8523 -6846 -4050 -1085 780 2075 3491 4949 5206 4173 2820
552B820j229j218j931j796j027L6J26J37J038K499K868J995J720K078K046R91
$$ 2820 1591 373 -1558 -3354 -4381 -4345 -4219 -4082 -3044 -545 2323 4318 6038 8116 10162 11153
568A1153m54j326j335j973l467m068l449k833k757l017j794K11R92J210J864L152
$$ 11153 10699 9373 8038 6065 2598 -1470 -4919 -7752 -10509 -13526 -15320 -15109 -14117 -12907 -11043 -7891
584g891M244L963L351L284L374K423Q41j92k06o97k044l208l117k426k297k634
$$ -7891 -3647 316 3667 6951 10325 12748 13589 13397 13191 12494 10450 7242 4125 1699 -598 -3232
600c232k600j394l84j60j79O46J471J581P66Q34J382J581O29m91M3L29K85l69
$$ -3232 -5832 -7226 -7610 -7770 -7949 -7303 -5832 -4251 -3485 -2651 -1269 312 941 450 493 822 1107 738
618G38m84L47M82L19j79N11J148R44j50k73K81K10n66j368j131p09r38j469j259
$$ 738 254 601 1083 1402 1223 1734 2882 3826 3676 3403 3684 3894 3328 1960 829 120 -818 -2287 -3546
637c546k70J52j67k48P62J496J375O25L64J065Q95l3q30q07n45j114j735j469
$$ -3546 -3816 -3664 -3831 -4079 -3317 -1821 -446 179 543 1608 2503 2470 1640 833 288 -826 -2561 -4030
655d030n39pm00l8J002K145K261J991K096K507K538J312N22Q1k81j593l033l346
$$ -4030 -4569 -4576 -4976 -5014 -4012 -1867 394 2385 4481 6988 9526 10838 11360 11441 11160 9567 6534 3188
673C188l239l448m028m021k868j502p79k61R92K697L670L667L927M914M853L943
$$ 3188 -51 -3499 -7527 -11548 -14416 -15918 -16697 -16958 -15966 -13269 -9599 -5932 -2005 2909 7762 11705
689A1705K679J813J635L35j582k681l206l218l909m597m171k915k443k188j354
$$ 11705 14384 16197 17832 18167 16585 13904 10698 7480 3571 -1026 -5197 -8112 -10555 -12743 -14097
704a4097L14J440J715J726K414L301L132K255J652J728J336L75o22q73n54j115
$$ -14097 -13783 -12343 -10628 -8902 -6488 -3187 -55 2200 3852 5580 6916 7291 6669 5796 5242 4127
720D127j820j738r39k93n42o48LQ17R52M65M01Q40Q55O6n57n36j63n92j307j540
$$ 4127 2307 569 -370 -663 -1205 -1853 -1850 -1033 -81 384 785 1625 2480 2546 1989 1453 1290 698 -609 -2149
740b149r87k37p35p95k00P21P14M51O67J357J532J008L58O32J096P45k53n94K4
$$ -2149 -3136 -3373 -4108 -4903 -5103 -4382 -3668 -3217 -2550 -1193 339 1347 1705 2337 3433 4178 3925 3331 3355
759C355J12n14q79l49J61j86q01n30J63J94n07r72n47o6m64j032j182l61j40m95
$$ 3355 3467 2953 2074 1725 1886 1700 899 369 532 726 219 -753 -1300 -1366 -1830 -2862 -4044 -4405 -4545 -5040
779e040m23J59R34R38O76R51J976K145J349J000J281J173P04j67o41n79q42j632
$$ -5040 -5463 -5304 -4370 -3432 -2756 -1805 171 2316 3665 4665 5946 7119 7823 7656 7015 6436 5594 3962
797C962k176j767j247j590j961j366k86P6r0J25R36J296J368Q87J094J534J227
$$ 3962 1786 19 -1228 -2818 -4779 -6145 -6431 -6355 -6445 -6320 -5384 -4088 -2720 -1833 -739 795 2022
814B022M11N7K34M70j37q82o32k05K04n81n22R6N21K14k2J68P21L63l11n74k97
$$ 2022 2433 2490 2724 3194 3057 2175 1543 1338 1542 961 439 535 1056 1270 1248 1416 2137 2500 2189 1615 1318
835A318Np73j380j122p33q60r93r66j21L14K06J20Q37J638J630J148R42J567J814
$$ 1318 1323 550 -830 -1952 -2685 -3545 -4538 -5504 -5625 -5311 -5105 -4985 -4148 -2510 -880 268 1210 2777 4591
854D591R58L84J21L69p5q83j182q75q31j396j834j344m65o09r82q14M6M94K14
$$ 4591 5549 5933 6054 6423 6348 5465 4283 3408 2577 1181 -653 -1997 -2462 -3071 -4053 -4867 -4821 -4327 -4113
873d113n9M72J033P93K53L49R79Q94L36K1L81N89N48m7p9L00M67pl05q3L25k12
$$ -4113 -4172 -3700 -2667 -1874 -1621 -1272 -293 601 937 958 1339 1928 2476 2429 2350 2650 3117 3110 2805 2722 3047 2835
895B835o56q92k54j69q42j210q12l56m69r17o12k2K56L9j10N83J138R13M24O74
$$ 2835 2179 1287 1033 864 22 -1188 -2000 -2356 -2825 -3742 -4354 -4376 -4120 -4081 -4191 -3608 -2470 -1557 -1133 -459
915d59J328J267O62L84N35O99K06m53k90o5j57r64j224o33m59o76j100r66k25
$$ -459 869 2136 2798 3182 3717 4416 4622 4169 3879 3814 3657 2693 1469 836 377 -299 -1399 -2365 -2590
934b590j28m25n10L8N51K12p7K34P79P60K15Q3N19R84M85J10K34N14N69mj37L23
$$ -2590 -2718 -3143 -3653 -3615 -3064 -2852 -2929 -2695 -1916 -1156 -941 -858 -339 645 1130 1240 1474 1988 2557 2553 2416 2739
956B739L49n4n89k47L4j29o87r40m52k79o90j059n19k59k86m96m54K35O01M02
$$ 2739 3088 3034 2445 2198 2232 2103 1416 476 24 -255 -945 -2004 -2523 -2782 -3068 -3564 -4018 -3783 -3182 -2780
976b780m7N26J056J112N01M64Q99Q94M96m4J79L36J05o30o52k64j34o70r14o50
$$ -2780 -2827 -2301 -1245 -133 368 832 1731 2625 3121 3077 3256 3592 3697 3067 2415 2151 2017 1347 433 -217
996b17j79r9o42o26j02K15k59m37LK92J08l44k02L53M87J62j05K87Q66O64L64
$$ -217 -396 -495 -1137 -1763 -1865 -1650 -1909 -2346 -2343 -2051 -1943 -2287 -2489 -2136 -1649 -1487 -1592 -1305 -439 225 589
1017E89M52Q63R72M43Q4L84O04P1n75p46l86n13j083j346j083o91j010j089p82
$$ 589 1041 1904 2876 3319 3403 3787 4391 4462 3887 3141 2755 2242 1159 -187 -1270 -1961 -2971 -4060 -4842
1036d842j4J38K6R8N55J213J083P53P67J148J234O08J64M94M06j2n67m75q2l78
$$ -4842 -4856 -4718 -4692 -4594 -4039 -2826 -1743 -990 -223 925 2159 2767 2931 3425 3831 3819 3252 2777 2695 2317
1056B317o39r98n37J0k44o27m10P9K15k60k80m5K33k1o51j04J92J31k39l21J15
$$ 2317 1678 680 143 153 -91 -718 -1128 -1049 -834 -1094 -1374 -1419 -1186 -1207 -1858 -1962 -1770 -1639 -1878 -2199 -2084
1077b084O49K12K18M80Q37P94L88M22P24P44K71m6k89J5j55q21r08p63l57r11
$$ -2084 -1435 -1223 -1005 -525 312 1106 1494 1916 2640 3384 3655 3609 3320 3335 3180 2359 1451 688 331 -580
1097e80j046p03k04k51m78m34L29O12K62lL47P12P57L48K78N60P04K44o5K58O16
$$ -580 -1626 -2329 -2533 -2784 -3262 -3696 -3367 -2755 -2493 -2496 -2149 -1437 -680 -332 -54 506 1210 1454 1389 1647 2263
1118B263M03j49k12K15L90k92m65l90l2l35q48q54n14m26q15j007m88o6M0l02
$$ 2263 2666 2517 2305 2520 2910 2618 2153 1763 1731 1396 548 -306 -820 -1246 -2061 -3068 -3556 -3622 -3582 -3884
1138c884j34N47Q13P06M83R62J277R84M07N76O34N74n9n34j74k16n63q66r32n56
$$ -3884 -4018 -3471 -2658 -1952 -1469 -507 770 1754 2161 2737 3371 3945 3886 3352 3178 2962 2399 1533 601 45
1158D5l78o88o44k40J95J2j18L3M96N18J00q5J45L11O1m46k81P4J06k60k15J57
$$ 45 -333 -1021 -1665 -1905 -1710 -1698 -1816 -1783 -1287 -769 -669 -754 -609 -298 -237 -683 -964 -890 -784 -1044 -1259 -1102
1180a102M91L29J69M48Q75Q88M58K14N06M63Ll96m23m47n66j198j258q69p88q95
$$ -1102 -611 -282 -113 335 1210 2098 2556 2770 3276 3739 3742 3346 2923 2476 1910 712 -546 -1415 -2203 -3098
1200c098j061o82k2J27K06L02Q43J040J070Q57J086J262J051N87J41L43N76k53
$$ -3098 -4159 -4841 -4863 -4736 -4530 -4228 -3385 -2345 -1275 -418 668 1930 2981 3568 3709 4052 4628 4375
1218D375p18p15m22n75j067q91o02l13n65p91k38R0J96j18j61M66O07K84j6K45
$$ 4375 3657 2942 2520 1945 878 -13 -615 -928 -1493 -2284 -2522 -2432 -2236 -2354 -2515 -2049 -1442 -1158 -1174 -929
1238i29M76L65P6p5M04M58K2k77Q8N46K50r1k36J18L75km29J0N2l3m74n01l5J8
$$ -929 -453 -88 -12 -87 317 775 797 520 608 1154 1404 1313 1077 1195 1570 1568 1139 1149 1201 1168 694 193 158 176
1262A76m60o73k24N5j04l59k98J11J27j2j90K04M08L30m0J35O83O15L86O7L90
$$ 176 -284 -957 -1181 -1126 -1230 -1589 -1887 -1776 -1649 -1661 -1851 -1647 -1239 -909 -949 -814 -131 484 870 937 1327
1283A327P07M23pM1L13J84l34n69j83k33n95j028q25n64l81q02q78l98M6m2o6
$$ 1327 2034 2457 2450 2491 2804 2988 2654 2085 1902 1669 1074 46 -779 -1343 -1724 -2526 -3404 -3802 -3756 -3798 -3864
1304c864K70O64Q08O14O46J086J098R35M46N69O35L26j75l92l38l05p15j084q79
$$ -3864 -3594 -2930 -2122 -1508 -862 224 1322 2257 2703 3272 3907 4233 4058 3666 3328 3023 2308 1224 345
1323C45o01o02r69q12k50N1l3k51L22L83P04K65L22P23O28L42p0L14L52K70k50
$$ 345 -256 -858 -1827 -2639 -2889 -2838 -2871 -3122 -2800 -2417 -1713 -1448 -1126 -403 225 567 497 811 1163 1433 1183
1344A183l09N8J79m5l13j68K26J43j70j74K85J83j08l05k87J11q1n70n36l17o4
$$ 1183 874 932 1111 1066 753 585 811 954 784 610 895 1078 970 665 378 489 408 -162 -698 -1015 -1079
1365a079m13o36j91J49J36j29M0M61P66K39L58N15Q51O47J51J93L25L26j82k27
$$ -1079 -1492 -2128 -2319 -2170 -2034 -2163 -2123 -1662 -896 -657 -299 216 1067 1714 1865 2058 2383 2709 2527 2300
1385B300l51r2k35q03n52l43j95m53o31k41k4P8l66j39K46K33N5k9K26O18K15
$$ 2300 1949 1857 1622 819 267 -76 -271 -724 -1355 -1596 -1620 -1542 -1908 -2047 -1801 -1568 -1513 -1542 -1316 -698 -483
1406d83N3J00M35N22K21k9K11L98K36qNK66J61k74l10k82o1k51o92n38k57j92
$$ -483 -430 -330 105 627 848 819 1030 1428 1664 1656 1661 1927 2088 1814 1504 1222 1161 910 218 -320 -577 -769
1428g69n37n28l09P5o4k16L3L58M84J27J19N87O65N02K23L02M91L40M6l8J30K33
$$ -769 -1306 -1834 -2143 -2068 -2132 -2348 -2315 -1957 -1473 -1346 -1227 -640 25 527 750 1052 1543 1883 1929 1891 2021 2254
1450B254j70m41l13j22n8m48p01k90p5l05p34k31n3o3l35k43J85L41M7p9M24N41
$$ 2254 2084 1643 1330 1208 1150 702 1 -289 -364 -669 -1403 -1634 -1687 -1750 -2085 -2328 -2143 -1802 -1755 -1834 -1410 -869
1472h69N86K85K28O99N97L03O3K44M00J64l77l54j35j74n66o92n57k82m42n06
$$ -869 -283 2 230 929 1526 1829 1892 2136 2536 2700 2323 1969 1834 1660 1094 402 -155 -437 -879 -1385
1492a385n59q6L8o6j79J78M09M93Q7J60N33N50K03O5K48K40K10r9j03J98J25k67
$$ -1385 -1944 -2030 -1992 -2058 -2237 -2059 -1650 -1157 -1070 -910 -377 173 376 441 689 929 1139 1040 937 1135 1260 993
1514I93k13l6J53L8l99j83J11O9j37l03j95N9j78l75l43M4j00k69m19j3J17K28
$$ 993 780 744 897 935 536 353 464 533 396 93 -102 -43 -221 -596 -939 -895 -995 -1264 -1683 -1696 -1579 -1351
1536a351j31N3M46N32K20K90M63O20L64J32J80L15K62j98l58k10j62l21n30o78
$$ -1351 -1482 -1429 -983 -451 -231 59 522 1142 1506 1638 1818 2133 2395 2197 1839 1629 1467 1146 616 -62
1556f2l38k85n10n54j40M1j26j40k8M11N04J15R4M76N15M40J35J50M64J62P8r9
$$ -62 -400 -685 -1195 -1749 -1889 -1848 -1974 -2114 -2142 -1731 -1227 -1112 -1018 -542 -27 413 548 698 1162 1324 1402 1303
1578A303P4J90q8l62k01j2Q5m50k64j32m4j06l28k49lp3k93m07J7K55j73k80L1
$$ 1303 1377 1567 1479 1117 916 904 989 539 275 143 99 -7 -335 -584 -587 -660 -953 -1360 -1343 -1088 -1261 -1541 -1510
1601a510K74L21k4R8L68M65L56R3M19M99L91L4M9K60J41k27m03k52j31l42o29
$$ -1510 -1236 -915 -939 -841 -473 -8 348 441 860 1359 1750 1784 1833 2093 2234 2007 1604 1352 1221 879 250
1622B50o48k45l32m91m95k96J90K7j71R6L40N01K88K56L34P22M45J56J87M19M12
$$ 250 -398 -643 -975 -1466 -1961 -2257 -2067 -2040 -2211 -2115 -1775 -1274 -986 -730 -396 326 771 927 1114 1533 1945
1643A945O8k14M4J03r6n04l97p2k90m00n24l48j30l29n40k11N1R3O6k19K71M57
$$ 1945 2013 1799 1843 1946 1850 1346 949 877 587 187 -337 -685 -815 -1144 -1684 -1895 -1844 -1751 -1685 -1904 -1633 -1176
1665a176L61J39K98O17M18K01J75L13K71R8l28j65J0j26k64n57k09q2k09m15q7
$$ -1176 -815 -676 -378 239 657 858 1033 1346 1617 1715 1387 1222 1232 1106 842 285 76 -6 -215 -630 -717
1686g17J22j1M3p6J72M17J59r3j24K71P0k26l17r0jj81l81r5P3J28n2Q9L40O29
$$ -717 -595 -606 -563 -639 -467 -50 109 16 -108 163 233 7 -310 -400 -401 -582 -963 -1058 -985 -857 -909 -820 -480 149
1710A49L69J91L62N51M26j6l9J79j19l98m71o19m25m53p87o64l24j25k15l38N6
$$ 149 518 709 1071 1622 2048 2032 1993 2172 2053 1655 1184 565 140 -313 -1100 -1764 -2088 -2213 -2428 -2766 -2710
1731b710M36M46J68M70O81P80M77K69L89M55L97p0j42Kql86m24m18j97l09m40
$$ -2710 -2274 -1828 -1660 -1190 -509 271 748 1017 1406 1861 2258 2188 2046 2048 2040 1654 1230 812 615 306 -134
1752a34n04k9o4j85l21k43J58L6o8j95K74K50M5o2L76L71K04J99J32N11M16J69
$$ -134 -638 -667 -731 -916 -1237 -1480 -1322 -1286 -1354 -1549 -1275 -1025 -980 -1042 -666 -295 -91 108 240 751 1167 1336
1774A336RJ93K92K1k40l32o2k15m45n59l70k30o7n30k69J10Jj2n6K72M07L38p7
$$ 1336 1345 1538 1830 1851 1611 1279 1217 1002 557 -2 -372 -602 -669 -1199 -1468 -1358 -1357 -1369 -1425 -1153 -746 -408 -485
1797d85K04L28L44j59o4J10J50O8k53j35J34J62m0oJ37J81K08K8m8J98Rk30l28
$$ -485 -281 47 391 232 168 278 428 496 243 108 242 404 364 358 495 676 884 912 864 1062 1071 841 513
1820E13k34j94l13n93m67j12j35l34k62J89K41L54J21N22O16N73L47K39N23L83
$$ 513 279 85 -228 -821 -1288 -1400 -1535 -1869 -2131 -1942 -1701 -1347 -1226 -704 -88 485 832 1071 1594 1977
1840A977J56k64q7k8l20m46m88l70j61m81n03j39J70n3l3j03K15M72Q1J01J76
$$ 1977 2133 1869 1782 1754 1434 988 500 130 -31 -512 -1015 -1154 -984 -1037 -1070 -1173 -958 -486 -405 -304 -128
1861a28J64R9o0j35R3K3j98j73j32K73O9m3K4K41K71K94m6L25K20J01j35j81j
$$ -128 36 135 75 -60 33 56 -142 -315 -447 -174 -105 -148 -124 117 388 682 636 961 1181 1282 1147 966 965
1884I65R4m69m96k91j84k43l61l35M7k6j18r8J43K52L15J6K58L78M01K49M5J34
$$ 965 1059 590 94 -197 -381 -624 -985 -1320 -1273 -1299 -1417 -1515 -1372 -1120 -805 -789 -531 -153 248 497 542 676
1906F76L16K76j4p9J44J90j43k05j21oj53m59n36Kk71m59m86j89k37j37j96l0
$$ 676 992 1268 1254 1175 1319 1509 1366 1161 1040 1034 881 422 -114 -112 -383 -842 -1328 -1517 -1754 -1891 -2087 -2117
1928b117K80L84J99K07N84O97M80L86L33M87L15M2j42K4j74l66o01n13l77l69
$$ -2117 -1837 -1453 -1254 -1047 -463 234 714 1100 1433 1920 2235 2277 2135 2159 1985 1619 1018 505 128 -241
1948b41o10n98j11K0k1k19J45M00L47J99J65L94M60K04q1M6K27M7j10l38j36O6
$$ -241 -851 -1449 -1560 -1540 -1561 -1780 -1635 -1235 -888 -689 -524 -130 330 534 453 499 726 773 663 325 189 255
1970B55j24k18o3K18Q7k4r5K38L12O3j26m5N6P0k59k44k45l8l18l44j36mpj77
$$ 255 131 -87 -150 68 155 131 36 274 586 649 523 478 534 604 345 101 -144 -182 -500 -844 -980 -984 -991 -1168
1994a168ML11K16K65l7K91L49K14J75O0J51J60l1k40PP4o0l48j45nJj20k46q2
$$ -1168 -1164 -853 -637 -372 -409 -118 231 445 620 680 831 991 960 720 727 801 741 393 248 243 244 124 -122 -204
2018b04R0j55j80j27Q0%j99j34r9K27R6j15o1L16K99M0J56J41M89J28J6KK82K5
$$ -204 -114 -269 -449 -576 -496 -496 -695 -829 -928 -701 -605 -720 -781 -465 -166 -126 30 171 660 788 804 806 1088 1113
2042A113n5k13lk9k74k63k40q2p5k29k59JJ3j12j80n3J17J96j77j03J47J55J22
$$ 1113 1058 845 842 813 539 276 36 -46 -121 -350 -609 -608 -595 -707 -887 -940 -823 -627 -804 -907 -760 -605 -483
2065d83M8O7K10M12MK09L49L98K47j09J37J89j0k47l18k92l03m22n41l68m28l00
$$ -483 -435 -368 -158 254 258 467 816 1214 1461 1352 1489 1678 1668 1421 1103 811 508 86 -455 -823 -1251 -1551
2087a551m16k20J0L06O4J89M62N09O18M53L25N33M13J62J1M0k2k52m53n07k73
$$ -1551 -1967 -2187 -2177 -1871 -1807 -1618 -1156 -647 -29 424 749 1282 1695 1857 1868 1908 1886 1634 1181 674 401
2108D01k24n56l91k15j20J3j91J18K63L92P5J78L27K60J31k7l5j5J07k06l43j76
$$ 401 177 -379 -770 -985 -1105 -1092 -1283 -1165 -902 -510 -435 -257 70 330 461 434 399 384 491 285 -58 -234
2130b34L4q8k60M5R4J71Q9L2K28K90J88Q3L0K52K1j18j63m2k77j05k96k66j24
$$ -234 -200 -288 -548 -503 -409 -238 -149 -117 111 401 589 672 702 954 975 857 694 652 375 270 -26 -292 -416
2153d16r3k29k42L4M1R4q8M7J63K01J93n6L61J87K31J9P7L72J52j4K2Q4K7j10
$$ -416 -509 -738 -980 -946 -905 -811 -899 -852 -689 -488 -295 -351 10 197 428 447 524 896 1048 1034 1056 1140 1167 1057
2177A057k15j46j45o4m32m39k48k03k03l11j80L1Q7J6J57K46M65L30K29L36M49
$$ 1057 842 696 551 487 55 -384 -632 -835 -1038 -1349 -1529 -1498 -1411 -1395 -1238 -992 -527 -197 32 368 817
2198H17K83Q4j8J61R9k37k57l23j60k23m81j58k24l1m2o8L6K47J95KJ01J77K78
$$ 817 1100 1184 1166 1327 1426 1189 932 609 449 226 -255 -413 -637 -668 -710 -778 -742 -495 -300 -298 -197 -20 258
2221B58N1j69n1n6j8l07j63n5Jq6j36J47L23K53N8K45K31M21J95J4O3J26ml60
$$ 258 309 140 89 33 15 -292 -455 -510 -509 -595 -731 -584 -261 -8 50 295 526 947 1142 1156 1219 1345 1341 981
2245I81k60l02j30n91m57l63l3j43k03j93K09L09J64K02L07N05K74K86J25K64
$$ 981 721 419 289 -302 -759 -1122 -1155 -1298 -1501 -1694 -1485 -1176 -1012 -810 -503 2 276 562 687 951
2265I51J41J25k03l1Rj96k26k51r4j69j15k67K2Ko6r2K0P6J44j20q2lN0Mj47N8
$$ 951 1092 1217 1014 983 992 796 570 319 225 56 -59 -326 -304 -302 -368 -460 -440 -364 -220 -340 -422 -425 -375 -371 -518 -460
2291d60K19R4mn9K54J04K33r8J37J68N0Lp7L3K2k09k31j47l2q3j12r3j12O4L4
$$ -460 -241 -147 -151 -210 44 148 381 283 420 588 638 641 564 597 619 410 179 32 0 -83 -195 -288 -400 -336 -302
2316c02j36kK73jJ4p6J21J09n0j49r8P0Pq0j7J01J10J30l0J63L08N6O5O8j0K56
$$ -302 -438 -440 -167 -168 -154 -230 -109 0 -50 -199 -297 -227 -220 -300 -317 -216 -106 24 -6 157 465 521 586 654 644 900
2342I00n9j41j69j04m9m44j96k19j12j85k16ORmJ5J34K51L02K08O2J94K60K60
$$ 900 841 700 531 427 378 -66 -262 -481 -593 -778 -994 -988 -979 -983 -968 -834 -583 -281 -73 -11 183 443 703
2365G03Mj5J28N5p2j09o4p5r5k49p8lj00p3k69r7p5J5j74q3N4O4j41K3J42K06
$$ 703 707 692 820 875 803 694 630 555 460 211 133 130 30 -43 -312 -409 -484 -469 -643 -726 -672 -608 -749 -726 -584 -378
2391c78O9nJ53K76J82J73QR6J80J52j15j37K2J2j42k00j22j15j85k18k26Q1M1
$$ -378 -309 -314 -161 115 297 470 478 574 754 906 791 654 676 688 546 346 224 109 -76 -294 -520 -439 -398
2414c98j75l6rJ41M8p6J33J90J06m5q6J92R4J20j23L1J42J28k8P6J9J46j2r2K9
$$ -398 -573 -609 -618 -477 -429 -505 -372 -182 -76 -121 -207 -15 79 199 76 107 249 377 349 425 444 590 578 486 515
2439E15j16J40k77q7j36j17j38k68j09M7p5k02j2KK70J0O9J80K67J40J85P6J53
$$ 515 399 539 262 175 39 -78 -216 -484 -593 -546 -621 -823 -835 -833 -563 -553 -484 -304 -37 103 288 364 517
2462E17J69k7k7K2k4j4k02j15j61j0j39j90j42O1L4j14Q0l5j0Q5q9L5K46M4j57
$$ 517 686 659 632 654 630 616 414 299 138 128 -11 -201 -343 -282 -248 -362 -282 -317 -327 -242 -331 -296 -50 -6 -163
2487a63MQ5Q9op5Q0J28L5j15L9O5Q0j19q5N4Q5L2j37j09M4P9n2q8J13J97m6m9
$$ -163 -159 -74 15 9 -66 14 142 177 62 101 166 246 127 42 96 181 213 76 -33 11 90 38 -50 63 260 214 165
2514A65j19K28j21l4l00j22l6l8k14j50KQ1n2o6J27L65K03Q4K74L49K60J80J09
$$ 165 46 274 153 119 -181 -303 -339 -377 -591 -741 -739 -658 -710 -776 -649 -284 -81 3 277 626 886 1066 1175
2537A175R4J41j29k46k12k88l23l58m20l61j73j95k68k6N9J83J25L31L47N24L67
$$ 1175 1269 1410 1281 1035 823 535 212 -146 -566 -927 -1100 -1295 -1563 -1589 -1530 -1347 -1222 -891 -544 -20 347
2558C47K20L05K96K10q0Mr1j17k26m24k28k34j74l37j98Q2j70P2LN4K73N8O6R8
$$ 347 567 872 1168 1378 1298 1302 1211 1094 868 444 216 -18 -192 -529 -727 -645 -815 -743 -740 -686 -413 -355 -289 -191
2582a91K32P2J35j80k2P5ro2j26M0J48p5k8P9Q8J20K9l0M9J11J1j93j29KK0k48
$$ -191 41 113 248 68 46 121 112 50 -76 -36 112 37 9 88 176 296 325 295 344 455 466 273 144 146 166 -82
2608h2k06j10O0n8r2l4J63KJ13j3J55J84K6J9MO4m9n4J9j7p6kj67N8J46J03m8
$$ -82 -288 -398 -338 -396 -488 -522 -359 -357 -244 -257 -102 82 108 127 131 195 146 92 111 94 18 16 -151 -93 53 156 108
2635A08L6J47R9n6m3J31J7j01j20l43k0j36k28n6j20J6L3k0L4J70J70J33J18K06
$$ 108 144 291 390 334 291 422 439 338 218 -125 -145 -281 -509 -565 -685 -669 -636 -656 -622 -452 -282 -149 -31 175
2659A75J96J67l8l0J77j6j42j36j07o6j34j37j06j6l2O4n1M7J17J12n8j5KJ19
$$ 175 371 538 500 470 647 631 489 353 246 180 46 -91 -197 -213 -245 -181 -232 -185 -68 44 -14 -29 -27 92
2683I2j46j61n4m5j05n2q9mJ41O2J22J45K95K63L6J07K95J86m4k57L6p0k43m47
$$ 92 -54 -215 -269 -314 -419 -471 -560 -564 -423 -361 -239 -94 201 464 500 607 902 1088 1044 787 823 753 510 63
2707F3j68k70k41k08k81k16J57O0Q0J84K72L95J72L32J52K95J53r4oQ3j28k58
$$ 63 -105 -375 -616 -824 -1105 -1321 -1164 -1104 -1024 -840 -568 -173 -1 331 483 778 931 837 831 914 786 528
2729E28j98k28q8k67j74n6r6J98p9j3K47J42J28O3Q5J79N2j46k8j17n3k28k42
$$ 528 330 102 14 -253 -427 -483 -579 -381 -460 -473 -226 -84 44 107 192 371 423 277 249 132 79 -149 -391
2752c91m8L4k4r5l0J35J99J57P5J63K48R1O8M6J05q2j07k40l5n2j34k51j31j34
$$ -391 -439 -405 -429 -524 -554 -419 -220 -63 12 175 423 514 582 628 733 651 544 304 269 217 83 -168 -299 -433
2776d33pm7j11O0J12lN2P5J25O8J13J6M3J51j18O3l6J77K2O1l3jJ5m4k0kQ2j44
$$ -433 -440 -487 -598 -538 -426 -429 -377 -302 -177 -109 4 20 63 214 96 159 123 300 322 383 350 349 364 320 300 298 380 236
2804B36j21o7j84j12m8k10k0l4K5j21J05J10O7J45RJ01L88J04J10lJ64Rj05j19
$$ 236 115 48 -136 -248 -296 -506 -526 -560 -535 -656 -551 -441 -374 -229 -220 -119 269 373 483 480 644 653 548 429
2828D29r9o2p5j80j52l6r0j05n3J17kJ73k2J04N6J28P5j3j9rJ9j98p7m0Kj60o3
$$ 429 330 268 193 13 -139 -175 -265 -370 -423 -306 -308 -135 -157 -53 3 131 206 193 174 165 184 -14 -91 -131 -129 -289 -352
2855c52q9J66j1J00J9J51K27N2N6K7K10P5j35K0q4q5k14j14j71l0p9k41j7K3j5
$$ -352 -441 -275 -286 -186 -167 -16 211 263 319 346 556 631 496 516 432 347 133 19 -152 -182 -261 -502 -519 -496 -511
2880e11o5J40L9K64K0K1J33R3J33K4K6P6p9J58j87o0J33m3j49k1m2Mj0j35ql3
$$ -511 -576 -436 -397 -133 -113 -92 41 134 267 291 317 393 314 472 285 225 358 315 166 145 103 107 97 -38 -46 -79
2906g9k1q5K9o7M4j34n1j2j3M6O2k1J5K74pJ66P9K4J54K6Q1J9K3j0j13p3j55L
$$ -79 -100 -185 -156 -223 -179 -313 -364 -376 -389 -343 -281 -302 -287 -13 -20 146 225 249 403 429 510 529 552 542 429 356 201 204
2934B04j27k52j17k5o0Lk05J44O4j1R0P9M7R5P9J07K11K5l2r9qN0L9j51q8O6m2
$$ 204 77 -175 -292 -317 -377 -374 -579 -435 -371 -382 -292 -213 -166 -71 8 115 326 351 319 220 212 262 301 150 62 128 86
2961H6q9k6l6M7j01J3m6Q0L0N0j07J36K1k2l2n2J14o3j21j18R3M4m6J3j25J88
$$ 86 -3 -29 -65 -18 -119 -106 -152 -72 -42 8 -99 37 58 36 4 -48 66 3 -118 -236 -143 -99 -145 -132 -257 -69
2987f9L9p6Q4J21J11M3k8J35nJM1j01L3j94J4j79j1K5n2k31k0o7Q0N1j86J67N9
$$ -69 -30 -106 -22 99 210 253 225 360 355 356 397 296 329 135 149 -30 -41 -16 -68 -299 -319 -386 -306 -255 -441 -274 -215
3014b15L7K2P5L5Q3Mk0J23R7P6j61M3Q0l4q6P3k43L00r0j44Nj4mj13r9j8p6Mj17
$$ -215 -178 -156 -81 -46 37 41 21 144 241 317 156 199 279 245 159 232 -11 289 199 55 60 46 42 -71 -170 -188 -264 -260 -377
3043c77K0o1Q3Mk1J7J54k2Q2J87R4M5J49j2L4J47n4q8l0o8kk00q1j34k6p7j72
$$ -377 -357 -418 -335 -331 -352 -335 -181 -203 -121 66 160 205 354 342 376 523 469 381 351 283 281 81 0 -134 -160 -237 -409
3070d09l4L6oj9k3P0R5J57J7M1J99P3J2m5R2l0l5k2Q6l0Kl8j43R9n9N3j90L6R5
$$ -409 -443 -407 -413 -432 -455 -385 -290 -133 -116 -75 124 197 209 164 256 226 191 169 255 225 227 189 46 145 86 139 -51 -15 80
3099H0k03N0j09J9o9M4j67J15Q3N1j8kJ85RP4j0R3O7m3j42k9q5K4K6j17r7j7L2
$$ 80 -123 -73 -182 -163 -232 -188 -355 -240 -157 -106 -124 -126 59 68 142 132 225 292 249 107 78 -7 17 43 -74 -171 -188 -156
3127a56j58J30m8Q8Q9J78n7K04P8K1J5M7L1k08j04q0q3j90j48j57j19J36j26J9
$$ -156 -314 -184 -232 -144 -55 123 66 270 348 369 384 431 462 254 150 70 -13 -203 -351 -508 -627 -491 -617 -598
3151e98OJ86J84R9J63K34K56M2J26N2P5j3j78j63m4k77k33k00j69p6j73j34%J43
$$ -598 -592 -406 -222 -123 40 274 530 572 698 750 825 812 634 471 427 150 -83 -283 -452 -528 -701 -835 -835 -692
3175f92J25K2J61J6L04K32N1K4K48k9J32p4n3j4j10o9j09q2r0p8n2j4K0r2L7O3
$$ -692 -567 -545 -384 -368 -64 168 219 243 491 462 594 520 467 453 343 274 165 83 -7 -85 -137 -151 -131 -223 -186 -123
3201a23j29J70m5P5k7Qm2J9j01J12k9Om9P8K21k7p8J24O9P2r5k6qR6q5j41q5m6
$$ -123 -252 -82 -127 -52 -79 -71 -113 -94 -195 -83 -112 -106 -155 -77 144 117 39 163 232 304 209 183 175 271 186 45 -40 -86
3229h6rM1j87rR7j03L3M0J68J2M0p7J97j00N6q1l1K5j0lj97P6qO0j28J23R9j1
$$ -86 -95 -54 -241 -250 -153 -256 -223 -183 -15 -3 37 -40 157 57 113 32 1 26 16 13 -184 -108 -116 -56 -184 -61 38 27
3257B7J79q9J63oo7J29j8r9o3j62K8k28L7j15j48m6J19M8q6M9K10P0J07NJ73M
$$ 27 206 117 280 274 207 336 318 219 156 -6 22 -206 -169 -284 -432 -478 -359 -311 -397 -348 -138 -68 39 44 217 221
3283B21J52n9K3L0r2r9r9l5Ln1j21o5K0O4rn2R1Q6J8Rk8Q5N1k02K8J5n2Kj89P0
$$ 221 373 314 337 367 275 176 77 42 45 -6 -127 -192 -172 -108 -117 -169 -78 8 26 35 7 92 143 -59 -31 -16 -68 -66 -255 -185
3313a85k7J5N9O5j3O7K09lJ6Q1J05n1o5Q0k2j79p7q8K9j42j39q1mL8m0R6L1M7
$$ -185 -212 -197 -138 -73 -86 -19 190 187 203 284 389 338 273 353 331 152 75 -13 16 -126 -265 -346 -350 -312 -352 -256 -225 -178
3341a78M7Q9P2J36RJ7k1J7%j9n2l0k7j9j00p9J04NN7M5p6N4Q3l0l2o8J5m2q4O7
$$ -178 -131 -42 30 166 175 192 171 188 188 169 117 87 60 41 -59 -138 -34 -29 28 73 -3 51 134 104 72 4 19 -23 -107 -40
3371d0j40J31j17j53R1N6l4oPJ20J07P8N1o3J79M0j16J17o6J30j75n2j65L7n0
$$ -40 -180 -49 -166 -319 -228 -172 -206 -212 -205 -85 22 100 151 88 267 307 191 308 242 372 197 145 -20 17 -33
3396c3q1pm7q8MQ2JL3J7j6l2P9R6j08N8K2k2J20l8m3O7j8L9J30p2jko5Q2k6K2
$$ -33 -114 -121 -168 -256 -252 -170 -169 -136 -119 -135 -167 -88 8 -100 -42 -20 -42 78 40 -3 64 46 85 215 143 142 140 75 157 131 153
3427A53m9q6L7n6j22m7Lj01j1N0j2l1l3J56N0Q9O9L6QP0M4J76j41Nj02O8L9r6
$$ 153 104 18 55 -1 -123 -170 -167 -268 -279 -229 -241 -272 -305 -149 -99 -10 59 95 103 173 217 393 252 257 155 223 262 166
3455A66j90N0n6j24j3r5M4M5Rm3N2MJ59n3J0J29o3o5J28j1N8r7q4J00M4n0k8o2
$$ 166 -24 26 -30 -154 -167 -262 -218 -173 -164 -207 -155 -151 8 -45 -35 94 31 -34 94 83 141 44 -40 60 104 54 26 -36
3483c6j0R2m1P7q3R6j8op5P7M9m8o7J3M8J23k09m4J8pn2L9q5J32j07j3j8M3kJ10
$$ -36 -46 46 5 82 -1 95 77 71 -4 73 122 74 7 20 68 191 -18 -62 -44 -51 -103 -64 -149 -17 -124 -137 -155 -112 -114 -4
3513dl3q0J28MO6kQ4j4o0NK3Q1l6j61P1N3m2j54pm3k2Q7p6q4O2l3m1J8k0J06O6
$$ -4 -37 -117 11 15 81 79 163 149 89 94 117 198 162 1 72 125 83 -71 -78 -121 -143 -56 -132 -216 -154 -187 -228 -210 -230 -124 -58
3544e8l0K1J52M2j4N6R9JL2j56M3KK9q4j23j49J56q3j86NKN4m3N3j22N4J37L1
$$ -58 -88 -67 85 127 113 169 268 269 301 145 188 190 219 135 12 -137 19 -64 -250 -245 -243 -189 -232 -179 -301 -247 -110 -79
3572g9p8J27L2M7n0J08R0j3q5j18J02J3o3lk9Q9n4K4q1N0k3j1m7P5J9l0q2Rj4
$$ -79 -157 -30 2 49 -1 107 197 184 99 -19 83 96 33 30 1 90 36 60 -21 29 6 -5 -52 23 42 12 -70 -61 -75
3601g5LP4j28J7L2k2j2j06J63j2J70j25J16J05K1j08P1K2j8r3K3n9Rl9q4mj44
$$ -75 -72 2 -126 -109 -77 -99 -111 -217 -54 -66 104 -21 95 200 221 113 184 206 188 95 118 59 68 29 -55 -59 -203
3628b03j8o1j01J61J35o3k9R6J30k6M6OL9J10p1r7K2M1j35o4j7Q8J2j8l6j3L3
$$ -203 -221 -282 -383 -222 -87 -150 -179 -83 47 21 67 73 112 222 151 54 76 117 -18 -82 -99 -11 1 -17 -53 -66 -33
3655c3J8M9q8J04N8Ok2N4o0r0mp5q2ll9J4l2m4jM3N7J19J24Mk8J07N1J08j70P1
$$ -33 -15 34 -54 50 108 114 92 146 86 -4 -8 -83 -165 -168 -207 -193 -225 -269 -270 -227 -170 -51 73 77 49 156 207 315 145 216
3685B16O8j62N3j27m6l9o7J5n8p4J9PL6o1J09L0MR4O5O3o1j17N0J33j14m5J41
$$ 216 284 122 175 48 2 -37 -104 -89 -147 -221 -202 -195 -159 -220 -111 -81 -77 17 82 145 84 -33 17 150 36 -9 132
3712A32j9M6j00L4q3L9J1J8n0P2n1lo6pJ8mp5j35J45O1j19O1O6k9R1k0j7K5lo3
$$ 132 113 159 59 93 10 49 60 78 28 100 49 46 -20 -27 -9 -13 -88 -223 -78 -17 -136 -75 -9 -38 53 33 16 41 38 -25
3742b5N8N2q0Q2j06M1m1Q7j19O8j6K6K7m6J17qQ5j06R8j52L4L3q4o6K0m4j89m3
$$ -25 33 85 5 87 -19 22 -19 68 -51 17 1 27 54 8 125 117 202 96 194 42 76 109 25 -41 -21 -65 -254 -297
3770b97R9o5Oo8J30P0J21K7R4J50NJ19m9N5J0o9m7k49M2j10p6j05n2K0r8j0N7
$$ -297 -198 -263 -257 -325 -195 -125 -4 23 117 267 272 391 342 397 407 338 291 42 84 -26 -102 -207 -259 -239 -337 -347 -290
3797b90k1R5K4J72J07nJ60K8J5K4j9j5m6j67Pk0q2j05N9j44M3p5J34M0q5L8Q9
$$ -290 -311 -216 -192 -20 87 82 242 270 285 309 290 275 229 62 69 49 -33 -138 -79 -223 -180 -255 -121 -81 -166 -128 -39
3824c9L1M1M1o0J65j6p8k1j24P9p2jl7KN8J0l4L1N6j1k4L2Q6j32J02MO9j14J60
$$ -39 -8 33 74 14 179 163 85 64 -60 19 -53 -54 -91 -89 -31 -21 -55 -24 32 21 -3 29 115 -17 85 89 158 44 204
3853B04j46L0n3J6qj49Q7K3j4n7o8J08l1j8j39J21k4M0nl9J53j02p9J29K0J19
$$ 204 58 88 35 51 43 -106 -19 4 -10 -67 -135 -27 -58 -76 -215 -94 -118 -78 -83 -122 31 -71 -150 -21 -1 118
3879A18p8Q6K4l0P8j5j11J52k2j04m1j97N7r0O7j58M6K4L4o8J08j1J09j7L0L3
$$ 118 40 126 150 120 198 183 72 224 202 98 57 -140 -83 -173 -106 -264 -218 -194 -160 -228 -120 -131 -22 -39 -9 24
3905B4R5M5j4M9K0K4j28m5J3j69L2j01O7j0J08j45R2q6Q7K7j6N0o0R0j06L5o6
$$ 24 119 164 150 199 219 243 115 70 83 -86 -54 -155 -88 -98 10 -135 -43 -129 -42 -15 -31 19 -41 49 -57 -22 -88
3932h8R9K5j44J12j08M6l4R2n4K8K2KL6J04l9K0j8N2j24Q2q3k9M6q0l3l2P0o8
$$ -88 11 36 -108 4 -104 -58 -92 0 -54 -26 -4 -2 34 138 99 119 101 153 29 111 28 -1 45 -35 -68 -100 -30 -98
3960i8mo6M4m7N3J9J0M5R8m3Q4j16L3J95j45k0p2P3J4q7r1Q2K9l5K4n4R5n3M0
$$ -98 -102 -168 -124 -171 -118 -99 -89 -44 54 11 95 -21 12 207 62 42 -30 43 57 -30 -121 -39 -10 -45 -21 -75 20 -33 7
3989Gm6QQ2o8k1M7j7pk5j4JL4j19O5J12p1J06n6n5Q2j1m5Q1j02J09n8L0J0j7P3
$$ 7 -39 -31 51 -17 -38 9 -8 -15 -40 -54 -53 -19 -138 -73 39 -32 74 18 -37 45 34 -11 70 -32 77 19 49 59 42 115
4019A15j09p5M8k1O8k2j04O8n5J8p6R3m0L1m3m5P7o3J64J0k3l1J12p1K5R4K3O0
$$ 115 6 -69 -21 -42 26 4 -100 -32 -87 -69 -145 -52 -92 -61 -104 -149 -72 -135 29 39 16 -15 97 26 51 145 168 228
4047B28j23N7kN8j36%p1pJ9j55M9j00m5M4K0L5j21J37n9Q4J41K9p0J44o7P6o3
$$ 228 105 162 160 218 82 82 11 4 23 -132 -83 -183 -228 -184 -164 -129 -250 -113 -172 -88 53 82 12 156 89 165 102
4074A02P3m0J3j7q0L4K2p1j71Q5m4K6j29N5k3K8k6o3J17O1O6N4j47Q6R7K8m1O
$$ 102 175 135 148 131 51 85 107 36 -135 -50 -94 -68 -197 -142 -165 -137 -163 -226 -109 -48 18 72 -75 11 108 136 95 101
4102A01M3Oj41m5N2Pro2Q5o5L1OK1k8P1n3j14Q4Q8q8o9J56j52J15j38O5k9mQ6
$$ 101 144 150 9 -36 16 23 14 -48 37 -28 3 9 30 2 73 20 -94 -10 78 -10 -79 77 -75 40 -98 -33 -62 -66 20
4131B0o9M0N7n2K0rjRO6m1k8Q4n4k5jl2Q0l3l5j1M1L9p3ORP4m7n4l8K7KK3L0o7
$$ 20 -49 -9 48 -4 16 7 6 15 81 40 12 96 42 17 16 -16 64 31 -4 -15 26 65 -8 -2 7 81 34 -20 -58 -31 -29 -6 24 -43
4165d3K8R9j76M5M0k0l6rP2P7kp2p1J15M8%j9P2kj17k6oO4o6J4p4kN2l6k2m8K2
$$ -43 -15 84 -92 -47 -7 -27 -63 -72 0 77 75 3 -68 47 95 95 76 148 146 29 3 -3 61 -5 9 -65 -67 -15 -51 -73 -121 -99
4197i9k4Q9p1L6J34r1M4r3J14M1m4J04o2J28p8j6l1O9j49O9m6k0j03J31j14l4
$$ -99 -123 -34 -105 -69 65 -26 18 -75 39 80 36 140 78 206 128 112 81 150 1 70 24 4 -99 32 -82 -116
4223a16K5Ql1J7Km1L5O1pO7rqR5J6J2L1qp1M7J5o8p4J06m6p9l7k6k1J9j59J9J56
$$ -116 -91 -83 -114 -97 -95 -136 -101 -40 -47 20 11 3 98 114 126 157 149 78 125 140 72 -2 104 58 -21 -58 -84 -105 -86 -245 -226 -70
4255g0n0k1Q8JN7Rj6N7N7o8O7l9l0M4o3m2j1m5qJ9K4o8lR3kL5L0j3j4M9j45J65
$$ -70 -120 -141 -53 -52 5 14 -2 55 112 44 111 72 42 86 23 -19 -30 -75 -83 -64 -40 -108 -111 -18 -20 15 45 32 18 67 -78 87
4287H7m2j5J6j43P4L3m1J9p0O3j18P7L2p9O4l5J31J09l5j4J4O0K0j46m6n7Q0r6
$$ 87 45 30 46 -97 -23 10 -31 -12 -82 -19 -137 -60 -28 -107 -43 -78 53 162 127 113 127 187 207 61 15 -42 38 -58
4315e8L5o5Pl3nOl2m0OJ21J00rM1j00J08q5J14qj68J26J7j5r6k6L1j15J56m9m7
$$ -58 -23 -88 -81 -114 -119 -113 -145 -185 -179 -58 42 33 74 -26 82 -3 111 103 -65 61 78 63 -33 -59 -28 -143 13 -36 -83
4344h3K1N8K4p3N2P7n6QR2m8j08P6nj01J32p5j26OK8J00j18Q4M6Qk3J0K2L3k9
$$ -83 -62 -4 20 -53 -1 76 20 28 120 72 -36 40 35 -66 66 -9 -135 -129 -101 -1 -119 -35 11 19 -4 6 28 61 32
4373C2j7J3R6l8l4k5O2%n6l6P2K2nk00NM3m0n7O1j5k1J11k9o6K1J14J22k0j13
$$ 32 15 28 124 86 52 27 89 89 33 -3 69 91 86 -114 -109 -66 -106 -163 -102 -117 -138 -27 -56 -122 -101 13 135 115 2
4402BJ77P4j17k7Q7P2k4q6o3k8P0j95j30M7n%m8O6r4P7lP6qP4K1L3N7J30j11K6
$$ 2 179 253 136 109 196 268 244 158 95 67 137 -58 -188 -141 -146 -146 -194 -128 -222 -145 -148 -72 -80 -6 15 48 105 235 124 150
4432A50L9j7q6J1l7q6r6Q8j18K3K0j5q7J42l0J0L8J05rL0R0jr9n3J66j16%n0j00
$$ 150 189 172 86 97 60 -26 -122 -34 -152 -129 -109 -124 -211 -69 -99 -89 -51 54 45 75 165 164 65 12 178 62 62 12 -88
4461h8k9J18j21M0j6J37l5r0M9KK4j7P8J4p7O9j0J8r5J32j49ro1O7K2o9p8J45
$$ -88 -117 1 -120 -80 -96 41 6 -84 -35 -33 -9 -26 52 66 -11 58 48 66 -29 103 -46 -55 -116 -49 -27 -96 -174 -29
4489b9n9Rl7J15m8n3P2jL7k4M1p8J75o9k2N1k6l8Oo4M1L4m9rN7m1q2N5Pk8N9n6
$$ -29 -88 -79 -116 -1 -49 -102 -30 -31 6 -18 23 -55 120 51 29 80 54 16 22 -42 -1 33 -16 -25 32 -9 -91 -36 -29 -57 2 -54
4521e4kM4l1l9J01k7K8k5%%n2Q6rn3N5Km8M5j5J1k6o3J40j05N3J47j08n0N3p7
$$ -54 -56 -12 -43 -82 19 -8 20 -5 -5 -5 -57 29 20 -33 22 24 -24 21 6 17 -9 -72 68 -37 16 163 55 5 58 -19
4551a9o7J19l1o8RLj24J05m4Q5m5m6O6L6L2K5K5R3L2q8N1M7K0j31pJ3r6M3p8j04
$$ -19 -86 33 2 -66 -57 -54 -178 -73 -117 -32 -77 -123 -57 -21 11 36 61 154 186 98 149 196 216 85 78 91 -5 38 -40 -144
4581a44J02j45j19J48j91K01Q6j55J56j2J27q7M1N1k13M31n6r2P1j32No1Q2p6
$$ -144 -42 -187 -306 -158 -349 -148 -62 -217 -61 -73 54 -33 8 59 -154 277 221 129 200 68 73 12 94 18
4605A8Oj07n2P8opo3M5LN0J5J5O0O8j25J08r0k7P1Ll8j4j1%k6l9R9l3k2p9k5L7
$$ 18 24 -83 -135 -57 -63 -70 -133 -88 -85 -35 -20 -5 55 123 -2 106 16 -11 60 63 25 11 0 0 -26 -65 34 1 -21 -100 -125 -88
4637h8O7k2j6Q7K9q6Q3j3Oq4N9Jm2L0M2Kj14L7J8n6m0P5n5J14j76J57jr8N5nP1
$$ -88 -21 -43 -59 28 57 -29 54 41 47 -37 22 23 -19 11 53 55 -59 -22 -4 -60 -100 -25 -80 34 -142 15 14 -84 -29 -34 37
4668C7J9P0r8j7J35j04Ko1Q8q7M2J2j1j2j15N4J5j2j6j2j6N7l1m5K2M9K8Q4r0
$$ 37 56 126 28 11 146 42 44 -17 71 -16 26 38 27 15 -100 -46 -31 -43 -59 -71 -87 -30 -61 -106 -84 -35 -7 77 -13
4697a3J0P1K7n4j2L4O5qj50k2lN0K3kM0kL0p2n6j5J28p0j10R0J1M1j23J03p1J81
$$ -13 -3 68 95 41 29 63 128 120 -30 -52 -55 -5 18 16 56 54 84 12 -44 -59 69 -1 -111 -21 -10 31 -92 11 -60 121
4727A21j23L0QJ0J5J0j07P9P1O9j14N9j25o3P2m7P5j03N8r2l6K3n2J25j3Q7k6
$$ 121 -2 28 36 46 61 71 -36 43 114 183 69 128 3 -60 12 -35 40 -63 -5 -97 -133 -110 -162 -37 -50 37 11
4754A1l3oR0Kn1N2N2j09K8O8r9L7J9q2jj3k4Kj1K6j1L3j9j06J79pp2L2m4K2M7
$$ 11 -22 -28 62 64 13 65 117 8 36 104 5 42 61 -21 -22 -35 -59 -57 -68 -42 -53 -20 -39 -145 34 27 -45 -13 -57 -35 12
4785A2M1p9M4M4k4p6R8j31P1k0nJ8o5J07j02O2j5L4Nj16l8J35k6R3n1j4N0oro7
$$ 12 53 -26 18 62 38 -38 60 -71 0 -20 -25 -7 -72 35 -67 -5 -20 14 19 -97 -135 0 -26 67 16 2 52 46 37 -30
4815c0J32r0n6L0J0m3j9L6kj6J11k51J47Q3q6L1K9M4r7J16l0o4K1J09j0j07J9
$$ -30 102 12 -44 -14 -4 -47 -66 -30 -32 -48 63 -188 -41 42 -44 -13 16 60 -37 79 49 -15 6 115 105 -2 17
4842A7l3O8Jj37J31j54J14r4O7O9o8l2L6k3P9k4n6L8M6M8j5q1L1mk0j7J07j10
$$ 17 -16 52 53 -84 47 -107 7 -87 -20 49 -19 -51 -15 -38 41 17 -39 -1 45 93 78 -3 28 24 4 -13 94 -16
4870a6J60j27J9J9j17K21k26J5Pk8Kj4Q8r7Q4j72P0R3Q1k12J28M8q4Q3n7R0j0
$$ -16 144 17 36 55 -62 159 -67 -52 -45 -73 -71 -85 3 -94 -10 -182 -112 -19 62 -150 -22 26 -58 25 -32 58 48
4897D8J0m0J69j12j8L2n6j4K8p0N7j20rN8n3k3J09j34J8J1OoQ3R0m3m3P8MK8n4
$$ 48 58 18 187 75 57 89 33 19 47 -23 34 -86 -95 -37 -90 -113 -4 -138 -120 -109 -103 -109 -26 64 21 -22 56 60 88 34
4927C4P0Ok3J7J0l7o5k9p8R2k7o2q8O2L7pj12J39p4J05l5L6R7l9M5l6j6qJ08K0
$$ 34 104 110 87 104 114 77 12 -17 -95 -3 -30 -92 -180 -118 -81 -88 -200 -61 -135 -30 -65 -29 68 29 74 38 22 14 122 142
4957A42nj9n3o5j4n8O0q7m4O6Ll7M2KJQ8m2P4o9L7P3P3l4l7R2m5k30J20M0k4j88
$$ 142 137 118 65 0 -14 -72 -12 -99 -143 -77 -74 -111 -69 -67 -66 22 -20 54 -15 22 95 168 134 97 189 144 -86 34 74 50 -138
4988a38M4JJ2m6nJ4Q3M1j04pJ44L6J9o6L4m5M5J01j07j5O6P0k02j38J83j5j3l7
$$ -138 -94 -93 -81 -127 -132 -118 -35 6 -98 -105 39 75 94 28 62 17 62 163 56 41 107 177 -25 -163 20 5 -8 -45
5016d5n5M9p4P9j00J9O6L0O0L0M1q2M7M1p5J24k9j8L7o2n3Nr3o5J6J0r0R5o7l0
$$ -45 -100 -51 -125 -46 -146 -127 -61 -31 29 59 100 18 65 106 31 155 126 108 145 83 30 35 -58 -123 -107 -97 -187 -92 -159 -189
5046a89J10R7L2j24O1k2J20p2O3%K5j5M%p1K5j3n2o2J06n0L3j18Q5j12N7K5J9
$$ -189 -79 18 50 -74 -13 -35 85 13 76 76 101 86 90 90 19 44 31 -21 -83 23 -27 6 -112 -27 -139 -82 -57 -38
5074c8N2p0N0N8n4J4o5P4J08o9j3k7Lj26Q1K6P6j26J2Q0r0k4R7m3M2q3lO1L7K0
$$ -38 14 -56 -6 52 -2 12 -53 21 129 60 47 20 23 -103 -22 4 80 -46 -34 46 -44 -68 29 -14 28 -55 -58 3 40 60
5104F0m8j8rkK6J1m2lR1j63J04K9n0k5J18k1L8j08Q6N7j32L8p4J4n3J17k5n6L2
$$ 60 12 -6 -15 -17 9 20 -22 -25 66 -97 7 36 -14 -39 79 58 96 -12 74 131 -1 37 -37 -23 -76 41 16 -40 -8
5133hM1k3l6k9nL8L2o0M6N6k7m2j7k5Q5Nl7K4k5m3k0l5R0L1o7J8Kl9O5J7m6M6
$$ -8 33 10 -26 -55 -60 -22 10 -50 -4 52 25 -17 -34 -59 26 31 -6 18 -7 -50 -70 -105 -15 16 -51 -33 -31 -70 -5 12 -34 12
5165A2J10j08K3J6P8n4M3j18J8k0N8J0p9j8j3k5p0qO8LO0q5l7K19n9K9p8J15L1
$$ 12 122 14 37 53 131 77 120 2 20 0 58 68 -11 -29 -42 -67 -137 -145 -77 -74 -14 -99 -136 83 24 53 -25 90 121
5194A21o6R5r7m1M2J3k9n6k3p2k0J49j97J08l9O7l2O5O5p4P8o4oL5R2o2m5K3O8
$$ 121 55 150 53 12 54 67 38 -18 -41 -113 -133 16 -181 -73 -112 -45 -77 -12 53 -21 57 -7 -13 22 114 52 7 30 98
5223I8n1m%k3q1rK2R7j16J41l4o2j4K9j6lMl6J67j01Op6P0j7lMjL4%kn1pL6j28
$$ 98 47 43 43 20 -61 -70 -48 49 -67 74 40 -22 -36 -7 -23 -26 -22 -58 109 8 14 -62 8 -9 -12 -8 -9 25 25 23 -28 -35 1 -127
5257a27R1l0O1r2J62r2J25J5j03P0o1K3j44J01On7J12n6k1M5qq0O3n3P8l8n2J3
$$ -127 -36 -66 -5 -97 65 -27 98 113 10 80 19 42 -102 -1 5 -52 60 4 -17 28 20 -60 3 -50 28 -10 -62 -49
5285d9K2Q6m1L4l6J07o8Jr0N0pML3%nj02rJ2pPp0J56m9q7N7L9K7M7K1Qo2k8J37
$$ -49 -27 59 18 52 16 123 55 56 -34 16 9 13 46 46 41 -61 -70 -58 -65 -58 -128 28 -21 -108 -51 -12 15 62 83 91 29 1 138
5318A38o6k7n9L0j4l0m9K3M2o6n3M1Q0K3O7k8l7O4P3p5k2N8p5o9L2n1RKl8M3j03
$$ 138 72 45 -14 16 2 -28 -77 -54 -12 -78 -131 -90 -10 13 80 52 15 79 152 77 55 113 38 -31 1 -50 -41 -39 -77 -34 -137
5349a37N9p7N8K7R3j01oMJ69j2l1QJ7l0O1o6j4L4J7j12J9l4l5J06j50J13j09N6
$$ -137 -78 -155 -97 -70 23 -78 -84 -80 89 77 46 54 71 41 102 36 22 56 73 -39 -20 -54 -89 17 -133 -20 -129 -73
5377g3J28j26M9P9l9l0N6j9r0M9J6JP5j4k8l2O3j00O0Qq7O4r8J07j3l2J26j01
$$ -73 55 -71 -22 57 18 -12 44 25 -65 -16 0 1 76 62 34 2 65 -35 25 33 -54 10 -88 19 6 -26 100 -1
5405ao9N5k7o2R5p2K5O5N6j09J22q2N0L2r1J08j24j2M0n7L1j8qRj2Q4km4n2P5
$$ -1 -70 -15 -42 -104 -9 -81 -56 9 65 -44 78 -4 46 78 -13 95 -29 -41 -1 -58 -27 -45 -53 -44 -56 28 26 -18 -70 5
5435Em1n8J10M5j11P1r5K1L8m5J25j15K6J8M4j05R5m5LK2O3K1m4K2n1M5n7m3L9
$$ 5 -36 -94 16 61 -50 21 -74 -53 -15 -60 65 -50 -24 -6 38 -67 28 -17 -14 8 71 92 48 70 19 64 7 -36 3
5464Cq9Q3n2NJ0J0K5M0j52J92q5j7J28m3L6j3q2L3O6j52N7k3nlnJ3r5J92j28J37
$$ 3 -86 -3 -55 -50 -40 -30 -5 35 -117 75 -10 -27 101 58 94 81 -1 32 98 -54 3 -20 -25 -28 -33 -20 -115 77 -51 86
5494H6j76O9N1o2J34m8kPj9J9n8k5k2JL7qQ3q3p4OL7j7OJ3n6J50NQl7n0J47n7
$$ 86 -90 -21 30 -32 102 54 52 59 40 59 1 -24 -46 -45 -8 -16 67 -16 -90 -84 -47 -64 -58 -45 -101 49 54 62 25 -25 122 65
5526F5m7O8j7O4j06j0P4o7m0l9l9M3L3l7mM5n6nK3q6J30L3n6r1J91K2k0p3M0N0
$$ 65 18 86 69 133 27 17 91 24 -16 -55 -94 -51 -18 -55 -59 -14 -70 -75 -52 -138 -8 25 -31 -122 69 91 71 -2 38 88
5556H8k7j10P7M4p0m9K6j0K6p9J0O6o6q7J86j08K2Q6o5Q6m4N6N2p4P9j91J17J4
$$ 88 61 -49 28 72 2 -47 -21 -31 -5 -84 -74 -8 -74 -161 25 -83 -61 25 -40 46 2 58 110 36 115 -76 41 55
5584E5n3j7K6o6J6n1m6l6mP0J6J1N0j5K7Q7q7Q7PPJ0p1l0K6%n7K5q1J10l5m5m5
$$ 55 2 -15 11 -55 -39 -90 -136 -172 -176 -106 -90 -79 -29 -44 -17 70 -17 70 77 84 94 23 -7 19 19 -38 -13 -94 16 -19 -64 -109
5616a09K3o1M4L1N8L3j9O9m8K1J05r7M4M8K4k05J95j28l3j8n9R4p9n2J32k5q2
$$ -109 -86 -147 -103 -72 -14 19 0 69 21 42 147 50 94 142 166 -39 156 28 -5 -23 -82 12 -67 -119 13 -12 -94
5643i4o5K18r0J7P1O4nj04l7J8M4ql7rM2l5q6P3O9j5l7j44R6K5L1r8L0O8M3p1
$$ -94 -159 59 -31 -14 57 121 116 12 -25 -7 37 29 -8 -17 25 -10 -96 -23 46 31 -6 -150 -54 -29 2 -96 -66 2 45 -26
5673b6m3K4k3J06J3l3k7N3kj40J08M0j9o2K0JN5J0n0p1M3l2L6l1J4P5n8J40r6
$$ -26 -69 -45 -68 38 51 18 -9 44 42 -98 10 50 31 -31 -11 -10 45 55 5 -66 -23 -55 -19 -50 -36 39 -19 121 25
5702B5j20J08n9mJ01J3n0M8%p9m9J2J2j6J7P3L4j13K5O3l0QQ1j25R6Ko1r3J47
$$ 25 -95 13 -46 -50 51 64 14 62 62 -17 -66 -54 -42 -58 -41 32 66 -47 -22 41 11 19 100 -25 71 73 12 -81 66
5731F6m3r1N8k1L9q5KJ14m1o5pO4o6P8L5K9k7l1J4j2Q1o1K%J7q5l1M0OM8k8j31
$$ 66 23 -68 -10 -31 8 -77 -75 39 -2 -67 -74 -10 -76 2 37 66 39 8 22 10 91 30 32 32 49 -36 -67 -27 -21 27 -1 -132
5763a32J77n6L2M6l9l7k8J14Oj7J7r0OQ7r3Q4k3p2K2p7K6M9J9l9m3P3o6M4O4L1
$$ -132 45 -11 21 67 28 -9 -37 77 83 66 83 -7 -1 86 -7 77 54 -18 4 -73 -47 2 21 -18 -61 12 -54 -10 54 85
5793H5m4l2pj6j1k2kpj6L5n6J30j7J6k9j16R1k9P4j7N5L6Mj48N7J3j32J14o1k9
$$ 85 41 9 2 -14 -25 -47 -49 -56 -72 -37 -93 37 20 36 7 -109 -18 -47 27 10 65 101 105 -43 14 27 -105 9 -52 -81
5823h1J8R8n4MJ6p3M2k4N2N4k1L9jk5N6J3q7J0m3R0j06qm7pJ3l1NL4K9K3n6LO6
$$ -81 -63 35 -19 -15 1 -72 -30 -54 -2 52 31 70 69 44 100 113 26 36 -7 83 -23 -31 -78 -85 -72 -103 -98 -64 -35 -12 -68 -65 1
5856Ak3K7p6J34L3j9J2j14P1q3O4k3O4j33J03j24P8Rm7J8K0k7q8R3pQ3N1j66Q9
$$ 1 -22 5 -71 63 96 77 89 -25 46 -37 27 4 68 -65 38 -86 -8 1 -46 -28 -8 -35 -123 -30 -37 46 97 -69 20
5885B0L2M2J0j6n8K4m3Q7J9q4m4n5L1j46J46m8P8r2rj05K8R5R8q8J13pJ07n0M5
$$ 20 52 94 104 88 30 54 11 98 117 33 -11 -66 -35 -181 -35 -83 -5 -97 -106 -211 -183 -88 10 -78 35 28 135 85 130
5914A30j4j61J74o6l9k7K3j31K8qo0L9O9n2JL6J4M7N1r4N8J28j19Q9J5j38O5m8
$$ 130 116 -45 129 63 24 -3 20 -111 -83 -91 -151 -112 -43 -95 -94 -58 -44 3 54 -40 18 146 27 116 131 -7 58 10
5942A0N3q9N5l6Po8K8jk1k9k8Q1J0J5K7j0N5o6n4J49j12L5L3O9j33l4L4l1oJ16
$$ 10 63 -26 29 -7 0 -68 -40 -41 -62 -91 -119 -38 -28 -13 14 4 59 -7 -61 88 -24 11 44 113 -20 -54 -20 -51 -57 59
5972E9q2m7M4J8j2P8r2J1j7Q1n3J13q4K5j04R4oj7J2k3pM3k1K1LM4l1j36O0o8
$$ 59 -23 -70 -26 -8 -20 58 -34 -23 -40 41 -12 101 17 42 -62 32 26 9 21 -2 -9 34 13 34 37 81 50 -86 -26 -94
6002i4N2j4P5j23K4P3k7j8P2n0P2k5m2J0N3n2M2N7l0rr5K4J25j28n5Q9j02N4M2
$$ -94 -42 -56 19 -104 -80 -7 -34 -52 20 -30 42 17 -25 -15 38 -14 28 85 55 46 -49 -25 100 -28 -83 6 -96 -42 0
6031@p3O7r6J40l5Mj1N6l5jk7J2O0p0J9k9m5L0RkP5k1j04Q4Rn9J00j40J22k0l6
$$ 0 -73 -6 -102 38 3 7 -4 52 17 16 -11 1 61 -9 10 -19 -64 -34 -25 -27 48 27 -77 7 16 -43 57 -83 39 19 -17
6062a7N0j15J13o6rQ5po9Q4J4l0Pl%K1j5J6J6%j35J01%P9p9p4L9m3J9jm2R0L7
$$ -17 33 -82 31 -35 -44 41 34 -35 49 63 33 40 37 37 58 43 59 75 75 -60 41 41 120 41 -33 6 -37 -18 -19 -61 29 66
6094F6k46P9O9j0N3l3N2M7o0N4n7Ml0mQ5l2m7j21P5n4O6J0Q3n8q8J23j0J8q5J07
$$ 66 -180 -101 -32 -42 11 -22 30 77 17 71 14 18 -12 -16 69 37 -10 -131 -56 -110 -44 -34 49 -9 -97 26 16 34 -51 56
6124E6lN3mp9O2K9n7m4o0O8j14M3J04p4j02P3n3J20O3j55R0o4J11j05R6Jp2L1
$$ 56 53 106 102 23 85 114 57 13 -47 21 -93 -50 54 -20 -122 -49 -102 18 81 -74 16 -48 63 -42 54 55 -17 14
6152A4j5oN3K2qk2q0k3N4k0mn2N5o0O0lJ0lk5P1Pj0n3J84j68NJ02j2LM0j01l8
$$ 14 -1 -7 46 68 60 38 -42 -65 -11 -31 -35 -87 -32 -92 -32 -35 -25 -28 -53 18 25 15 -38 146 -22 -17 85 73 76 116 15 -23
6184b3L2J5N9j23Jk8M5K6j01j0kJ73n0o6L0P9J3l4m2l0L8J8rk1O4r2M7m5n2N1
$$ -23 9 24 83 -40 -39 -67 -22 4 -97 -107 -109 64 14 -52 -22 57 70 36 -6 -36 2 20 11 -10 54 -38 9 -36 -88 -37
6214c7J01q6M3j61O0L8R7j9n2j3N3p5R3k7PM2K1j49J34p3jQ9j06j2J4kp6M1O6
$$ -37 64 -22 21 -140 -80 -42 55 36 -16 -29 24 -51 42 15 22 64 85 -64 70 -3 -4 85 -21 -33 -19 -21 -97 -56 10
6243A0l0o3J43n4J5r0J76r0N4l7L3l6mo9n4M0l6P4L2K5l2k5q0R9ol7L5j4M2o1
$$ 10 -20 -83 60 6 21 -69 107 17 71 34 67 31 27 -42 -96 -56 -92 -18 14 39 7 -18 -98 1 -5 -42 -7 -21 21 -40
6273d0P8m0J21r0R4o4L1q8N7j8m5Lm0J3k8M1kO6j28oM2K8O3j36P5M4K1o1n6R5
$$ -40 38 -2 119 29 123 59 90 2 59 41 -4 -1 -41 -28 -56 -15 -17 49 -79 -85 -43 -15 48 -88 -13 31 52 -9 -65 30
6303C0M3p3q7K0J14n8jj4r2J33ql1K8qM7n6pj01J67o4m9Q8JJ3r2O0N2p1Q6j10
$$ 30 73 0 -87 -67 47 -11 -12 -26 -118 15 7 -24 4 -4 43 -13 -20 -121 46 -18 -67 21 22 35 -57 3 55 -16 70 -40
6333d0P8K4l4J2K8Nn9l5J3j9M2L3j04M9kJ5J3o7K7O2l1Jj5k4J6JJ2L5l5n3R8r2
$$ -40 38 62 28 40 68 73 14 -21 -8 -27 15 48 -56 -7 -9 6 19 -48 -21 41 10 11 -4 -28 -12 -11 1 36 1 -52 46 -46
6365d6K8k0N8k4j4N2L4n1m5J4N6j66J6O1J07j06R6o2J8m6N7K7m0P4n3k5k6O0k6
$$ -46 -18 -38 20 -4 -18 34 68 17 -28 -14 42 -124 -108 -47 60 -46 50 -12 6 -40 17 44 4 78 25 0 -26 34 8
6394Hq7R6j9K3k0j1k2l0mo2R8Q2pl7K3j07J69q4j8J22q6L9Nj01j4M5p2M0N4kl
$$ 8 -79 17 -2 21 1 -10 -32 -62 -66 -128 -30 52 45 8 31 -76 93 9 -9 113 27 66 71 -30 -44 1 -71 -31 23 21 18
6425A8m4o0N5K9n3O5k0k0Q6m2K8k4J01m4q1L9L8L2m6j0r8N7k3k2lK3J0p7J11o5
$$ 18 -26 -86 -31 -2 -55 10 -10 -30 56 14 42 18 119 75 -6 33 71 103 57 47 -51 6 -17 -39 -42 -19 -9 -86 25 -40
$$ [...]
8191a9
##END NTUPLES=NMR FID
##END=
