##TITLE=C13_PR166_13
 D2O, 2050 sc

 14.02.2019
##JCAMPDX= 6.0         $$ Bruker NMR JCAMP-DX V2.0
##DATA TYPE= NMR SPECTRUM
##DATA CLASS= NTUPLES
##ORIGIN= UXNMR, Bruker Analytische Messtechnik GmbH
##OWNER= root
$$ XWIN-NMR		Version 3.5
$$ Thu Feb 14 15:36:49 2019 Russian Standard Time (UT+4h)  she@DPX200
##.OBSERVE FREQUENCY= 50.32789651
##.OBSERVE NUCLEUS= ^13C
##.ACQUISITION MODE= SIMULTANEOUS
##.ACQUISITION SCHEME= undefined
##.AVERAGES= 2051
##.DIGITISER RES= 17
##SPECTROMETER/DATA SYSTEM= spect
##.PULSE SEQUENCE= zgpg30
##.SOLVENT NAME= CDCl3
##.SHIFT REFERENCE= (INTERNAL, CDCl3, 0, 222.661)
##AUDIT TRAIL= $$ (NUMBER, WHEN, WHO, WHERE, WHAT)
$$ ##TITLE= Audit trail, XWIN-NMR		Version 3.5
$$ ##JCAMPDX= 5.01
$$ ##ORIGIN= Bruker BioSpin GmbH
$$ ##OWNER= she
$$ F:/spectra/data/she/nmr/c13/2/pdata/1/auditp.txt
$$ ##AUDIT TRAIL=  $$ (NUMBER, WHEN, WHO, WHERE, WHAT)
(   1,<2019-02-14 15:35:30.25 +0400>,<she>,<DPX200>,
      <created by zg, POWCHK disabled, PULCHK disabled
       terminated by command 'halt'
       configuration hash MD5:
       00 E9 B6 7A A2 85 ED C7 34 08 36 98 17 FE 4E 26
       data hash MD5: 32K
       9D 11 DB 49 6F F1 03 64 BE 43 90 B6 6B 1F C5 3A>)
(   2,<2019-02-14 15:35:52.01 +0400>,<she>,<DPX200>,
      <Start of raw data processing
       efp BC_mod = 2 LB = 1 FT_mod = 6 PKNL = 1 PHC0 = 1442.609 PHC1 = 47.42154 SI = 32K 
       data hash MD5: 32K
       2E 72 7C 25 67 9E 2A A2 C9 49 27 91 C5 74 08 BD>)
(   3,<2019-02-14 15:35:54.78 +0400>,<she>,<DPX200>,
      <abs ABSG = 5 
       data hash MD5: 32K
       57 1D 1B 47 37 34 52 2D 28 C4 11 F5 33 5B F8 7E>)
(   4,<2019-02-14 15:36:16.42 +0400>,<she>,<DPX200>,
      <pk PHC0 = 8.097528 PHC1 = -12.4 
       data hash MD5: 32K
       75 AA 37 DF 18 81 2E 62 B5 08 7F 5D 6E 0C 3A 7C>)
(   5,<2019-02-14 15:36:19.71 +0400>,<she>,<DPX200>,
      <abs ABSG = 5 
       data hash MD5: 32K
       B6 50 8D 9F F2 D7 DB FF 58 5A 59 C7 9F 46 14 3C>)
$$ ##END=
$$ 
$$ hash MD5
$$ 9B 84 D1 22 EF D0 D8 49 DB EB 28 7B 68 3E 24 BB
##$RELAX= 
##$RELAX= 
##$RELAX= 
##$RELAX= 
##$RELAX= 
##$RELAX= 
##$RELAX= 
##$RELAX= 
$$ Bruker specific parameters
$$ --------------------------
##$DU= <F:/spectra>
##$EXPNO= 2
##$NAME= <c13>
##$PROCNO= 1
##$TYPE= <nmr>
##$USER= <she>
##$AMP= (0..31)
100 100 100 100 100 100 100 100 100 100 100 100 100 100 100 100 100 100 
100 100 100 100 100 100 100 100 100 100 100 100 100 100 
##$AQSEQ= 0
##$AQ_mod= 1
##$AUNM= <au_zg>
##$AUTOPOS= <>
##$BF1= 50.322709
##$BF2= 200.13
##$BF3= 50.322709
##$BF4= 500.13
##$BF5= 500.13
##$BF6= 500.13
##$BF7= 500.13
##$BF8= 500.13
##$BYTORDA= 1
##$CFDGTYP= 0
##$CFRGTYP= 5
##$CHEMSTR= <none>
##$CNST= (0..31)
1 1 145 1 1 1 1 1 1 1 1 1 1 1 1 1 1 1 1 1 1 1 1 1 1 1 1 1 1 1 1 1 
##$CPDPRG= <waltz16>
##$CPDPRG1= <>
##$CPDPRG2= <waltz16>
##$CPDPRG3= <>
##$CPDPRG4= <mlev>
##$CPDPRG5= <mlev>
##$CPDPRG6= <mlev>
##$CPDPRG7= <mlev>
##$CPDPRG8= <mlev>
##$CPDPRGB= <>
##$CPDPRGT= <>
##$D= (0..31)
$$ [...]
##$SUBNAM4= <"">
##$SUBNAM5= <"">
##$SUBNAM6= <"">
##$SUBNAM7= <"">
##$SUBNAM8= <"">
##$SUBNAM9= <"">
##$SW= 239.972172959595
##$SWIBOX= (0..15)
0 1 3 0 0 0 0 0 0 0 0 0 0 0 0 0 
##$SW_h= 12077.2946859903
##$TD= 32768
##$TD0= 1
##$TE= 0
##$TE2= 300
##$TE3= 300
##$TEG= 300
##$TL= (0..7)
120 120 120 120 120 120 120 120 
##$TP= (0..7)
150 150 150 150 150 150 150 150 
##$TP07= 0
##$TPNAME0= <>
##$TPNAME1= <>
##$TPNAME2= <>
##$TPNAME3= <>
##$TPNAME4= <>
##$TPNAME5= <>
##$TPNAME6= <>
##$TPNAME7= <>
##$TPOAL= (0..7)
0.5 0.5 0.5 0.5 0.5 0.5 0.5 0.5 
##$TPOFFS= (0..7)
0 0 0 0 0 0 0 0 
##$TUNHIN= 0
##$TUNHOUT= 0
##$TUNXOUT= 0
##$USERA1= <user>
##$USERA2= <user>
##$USERA3= <user>
##$USERA4= <user>
##$USERA5= <user>
##$V9= 5
##$VALIST= <valist>
##$VCLIST= <CCCCCCCCCCCCCCC>
##$VD= 0
##$VDLIST= <DDDDDDDDDDDDDDD>
##$VPLIST= <PPPPPPPPPPPPPPP>
##$VTLIST= <TTTTTTTTTTTTTTT>
##$WBST= 1024
##$WBSW= 4
##$XGAIN= (0..3)
0 0 0 0 
##$XL= 0
##$YL= 0
##$YMAX_a= 12720398
##$YMIN_a= -8166211
##$ZGOPTNS= <>
##$ZL1= 120
##$ZL2= 120
##$ZL3= 120
##$ZL4= 120
##$ABSF1= 222.6608
##$ABSF2= -17.33601
##$ABSG= 5
##$ABSL= 3
##$ALPHA= 0
##$AQORDER= 0
##$ASSFAC= 0
##$ASSFACI= 0
##$ASSFACX= 0
##$ASSWID= 0
##$AUNMP= <proc_1d>
##$AZFE= 0.1
##$AZFW= 0.5
##$BCFW= 0
##$BC_mod= 2
##$BYTORDP= 0
##$COROFFS= 0
##$CY= -3
##$DATMOD= 1
##$DC= 0
##$DFILT= <>
##$DTYPP= 0
##$F1P= 0
##$F2P= 0
##$FCOR= 0.5
##$FTSIZE= 32768
##$FT_mod= 6
##$GAMMA= 0
##$GB= 0
##$INTBC= 1
##$INTSCL= 1.329259e-09
##$ISEN= 128
##$LB= 1
##$LEV0= 0
##$LPBIN= 0
##$MAXI= 10000
##$MC2= 0
##$MEAN= 0
##$ME_mod= 0
##$MI= 0.9312502
##$NCOEF= 0
##$NC_proc= -2
##$NLEV= 6
##$NOISF1= 120.0001
##$NOISF2= 80.00006
##$NSP= 0
##$NTH_PI= 0
##$NZP= 0
##$OFFSET= 222.6608
##$PC= 1.4
##$PHC0= 1450.707
##$PHC1= 35.02154
##$PH_mod= 1
##$PKNL= yes
##$PPARMOD= 0
##$PSCAL= 0
##$PSIGN= 0
##$REVERSE= no
##$SF= 50.3227302600002
##$SI= 32768
##$SIGF1= 140
##$SIGF2= 120
##$SINO= 35.31775
##$SIOLD= 32768
##$SREGLST= <13C.CDCl3>
##$SSB= 0
##$STSI= 32768
##$STSR= 0
##$SW_p= 12077.2946859903
##$SYMM= 0
##$S_DEV= 0
##$TDeff= 32768
##$TDoff= 0
##$TI= <>
##$TILT= no
##$TM1= 0
##$TM2= 0
##$TOPLEV= 0
##$USERP1= <user>
##$USERP2= <user>
##$USERP3= <user>
##$USERP4= <user>
##$USERP5= <user>
##$WDW= 1
##$XDIM= 32768
##$YMAX_p= 463224486
##$YMIN_p= -12785755
$$ End of Bruker specific parameters
$$ ---------------------------------
##NTUPLES= NMR SPECTRUM
##VAR_NAME=  FREQUENCY,     SPECTRUM/REAL,   SPECTRUM/IMAG
##SYMBOL=    X,             R,               I
##VAR_TYPE=  INDEPENDENT,   DEPENDENT,       DEPENDENT
##VAR_FORM=  AFFN,          ASDF,            ASDF
##VAR_DIM=   32768,         32768,           32768
##UNITS=     HZ,            ARBITRARY UNITS, ARBITRARY UNITS
##FACTOR=    0.368581032318806, 1,           1
##FIRST=     11204.8992329031, 0,            0
##LAST=      -872.395453087158, 0,           0
##MIN=       -872.395453087158, -12785755,   0
##MAX=       11204.8992329031, 463224486,    0
$$ Real data points
##PAGE= N=1
##DATA TABLE= (X++(R..R)), XYDATA
$$ [...]
$$ plain form
7472 344943 405631 822210 379320 -1784701 -3493420 -3604828 -3056941 -3076141 -3624085 -5289886
7462 -5289886 -6015719 -3301033 -1367378 -348330 2494674 4727911 4027471 -270080 -1287998
7453 -1287998 -1275400 -2869635 -1580554 -177322 -405024 -775916 -414058 -288103 -541970
7444 -541970 -1742450 -3386564 -4321424 -3823374 -3193347 -4872138 -6391979 -5172715 -4135778
7435 -4135778 -5565725 -5512900 -4421282 -2324277 -2368739 -1824647 427208 55488 -2076904
7426 -2076904 -4648541 -6340982 -6435196 -6295415 -5740850 -3152721 -1044445 1724211 1165074
7417 1165074 352356 1832503 2772969 2247779 -732251 -2039012 -1594499 -1332390 -2407746
7408 -2407746 -3011759 -1580654 -542820 193850 1108455 2203816 2711416 1630885 551049
$$ packed form
7472C44943O0688M16579m42890k164021j708719j11408N47887j9200n47944j665801
7462e289886p25833K714686J933655J019048K843004K233237p00440m297551j017918
7453a287998J2598j594235J289081J403232k27702l70892L61858J25955k53867
7444e41970j200480j644114r34860M98050O30027j678791j519841J219264J036937
7435d135778j429947N2825J091618K097005m4462N44092K251855l71720k132392
7426b076904k571637j692441r4214J39781N54565K588129K108276K768656n59137
7417A165074q12718J480147R40466n25190k980030j306761M44513K62109j075356
7408b407746o04013J431105J037834P36670R14605J095361N07600j080531j079836
$$ plain form
7399 551049 -875431 -1400440 559121 3581883 4833785 5109954 3946273 1088275 622397
7390 622397 2447448 3654513 3130264 1017207 -185249 1459375 3997956 5689496 5384885
7381 5384885 4985954 3331320 1302105 656909 -1261537 -2980302 -2333215 168009 2001350
7372 2001350 3270770 2120098 -2021341 -4286804 -3568584 -2486482 -1244188 -1102064 -2476123
7363 -2476123 -3274806 -1791148 1005401 3719524 4580806 4155372 2003068 32502 1501403
7354 1501403 4190169 6589442 7064227 6205657 6237541 5610712 5457378 6120673 5158931
7345 5158931 3230183 1506607 569482 -569049 714755 2852158 1666043 1792325 2058328
7336 2058328 -551433 -1033396 1021831 2449843 4047189 3520134 93127 -1820915 -2465750
$$ packed form
7399E51049j426480n25009J959561L022762J251902K76169j163681k857998m65878
7390F22397J825051J207065n24249k113057j202456J644624K538581J691540l04611
7381E384885l98931j654634k029215o45196j918446j718765O47087K501224J833341
7372B001350J269420j150672m141439k265463P18220J082102J242294J42124j374059
7363b476123p98683J483658K796549K714123Q61282m25434k152304j970566J468901
7354A501403K688766K399273M74785q58570L1884o26829j53334O63295r61742
7345E158931j928748j723576r37125j138531J283804K137403j186115J26282K66003
7336B058328k609761m81963K055227J428012J597346n27055l427007j914042o44835
$$ plain form
7327 -2465750 -3665492 -4255828 -3493621 -4055779 -4935654 -4701137 -5676843 -6962528 -6525823
7318 -6525823 -2764164 1473068 2315187 1457331 -435467 -2394168 -2240322 -1781904 -899767
7309 -899767 -895876 -2149987 -1763173 236474 2256469 3844398 2397657 1670709 994408
7300 994408 -394363 450657 1450285 388759 -809484 -458942 23899 1513873 2654313
7291 2654313 3037651 1881145 -35297 -1931112 -1813339 881885 3155001 2501498 339857
7282 339857 -1306850 -1557733 -427595 592799 688315 -296956 -816993 -354550 520915
7273 520915 331185 -2205508 -5624263 -6791724 -6610405 -6831956 -6593115 -6441897 -6561809
7264 -6561809 -5551897 -3368266 -1873940 -3225246 -5520907 -5763861 -3630837 -1394542
$$ packed form
7327b465750j199742n90336P62207n62158q79875K34517r75706j285685M36705
7318f525823L761659M237232Q42119q57856j892798j958701J53846M58418Q82137
7309h99767L891j254111L86814J999647K019995J587929j446741p26948o76301
7300I94408j388771Q45020R99628j061526j198243L50542M82841J489974J140440
7291B654313L83338j156506j916442j895815J17773K695224K273116o53503k161641
7282C39857j646707k50883J130138J020394R5516r85271n20037M62443Q75465
7273E20915j89730k536693l418755j167461J81319k21551K38841J51218j19912
7264f561809J009912K183631J494326j351306k295661k42954K133024K236295
$$ plain form
7256 -1394542 -948276 -3021523 -4053559 -4357507 -3958997 -4428685 -4419143 -5338549 -6783987
7247 -6783987 -6876031 -8776873 -8143748 -6015746 -4866336 -3194070 -2578786 -1036187 827638
7238 827638 2731020 3764179 3144754 4420862 5651385 7112568 6141395 2862321 1472426
7229 1472426 272703 -264156 58729 358521 1261188 1332989 1082684 1419977 2001683 2745529
7219 2745529 3818775 3873312 2363661 553272 48004 -649215 -2770095 -2930608 -2379074
7210 -2379074 -3482852 -3942794 -2636502 -2743389 -2479966 -1052946 -734233 -1069874 -1980937
7201 -1980937 -2579363 -1630832 -620970 -626273 294465 -399453 -1470540 -2874893 -4098939
7192 -4098939 -3320084 -3036493 -3011106 -1252427 -980322 -3200243 -5470517 -5878177 -3286040
$$ packed form
7256a394542M46266k073247j032036l03948L98510m69688R542r19406j445438
7247f783987r2044j900842O33125K128002J149410J672266O15284J542599J863825
7238H27638J903382J033159o19425J276108J230523J461183r71173l279074j389895
7229A472426j199723n36859L22885K99792R02667P1801k50305L37293N81706P43846
7219B745529J073246N4537j509651j810389n05268o97219k120880j60513N51534
7210b379074j103778m59942J306292j06887K63423J427020L18713l35641r11063
7201a980937n98426R48531J009862n303R20738o93918j071087j404353j224046
7192d098939P78855K83591K5387J758679K72105k219921k270274m07660K592137
$$ plain form
7183 -3286040 -1023763 -1149225 -3092462 -4910423 -4590801 -4162574 -4425670 -3124048 -1090788
7174 -1090788 -1213493 -1570693 -1616261 -3430437 -6378217 -7464409 -6315635 -6539417 -7615003
7165 -7615003 -6500149 -4134761 -2648885 -1824378 -2936805 -4730583 -2879898 1249006
7157 1249006 1579930 200148 -1914618 -4652303 -4376167 -5046975 -8506611 -9522610 -7050585
7148 -7050585 -4208872 -2955237 -1642942 -105156 -516721 -6572 1431989 2990929 2530856
7139 2530856 715546 -612225 -417774 -23317 -904325 83841 1971028 3022024 3994600
7130 3994600 4033602 911393 -3054891 -5127256 -5169966 -3777777 -1924086 -1219991 -3112004
7121 -3112004 -4426467 -3558388 -2906482 -5166171 -6128018 -3597800 -464913 1734623 2217039
$$ packed form
7183c286040K262277j25462j943237j817961L19622M28227k63096J301622K033260
7174a090788j22705l57200m5568j814176k947780j086192J148774k23782j075586
7165g615003J114854K365388J485876Q24507j112427j793778J850685M128904
7157A249006L30924j379782k114766k737685K76136o70808l459636j015999K472025
7148g050585K841713J253635J312295J537786m11565N10149J438561J558940m60073
7139B530856j815310j327771J94451L94457q81008R88166J887187J050996R72576
7130C994600L9002l122209l966284k072365m2710J392189J853691P04095j892013
7121c112004j314463Q68079O51906k259689r61847K530218L132887K199536M82416
$$ plain form
7112 2217039 233627 -2603685 -3587880 -4292227 -5972116 -4653060 -2867054 -475353 679221
7103 679221 -866337 -584094 520442 -433810 -3954193 -6594964 -5859594 -3208019 -2930087
7094 -2930087 -4784306 -5998902 -4332000 -2018141 120558 -138222 -1464069 -3815774
7086 -3815774 -4699027 -4738664 -5483152 -4613858 -2610776 622922 1504636 1156840 1945702
7077 1945702 3454850 2204447 -793962 -1510460 109926 -342889 -2174039 -4833991 -7211226
7068 -7211226 -7628802 -7355170 -6437509 -3984156 -1347898 129390 1451074 386018 -2124617
7059 -2124617 -2194259 -940956 -361870 -1076436 -3910207 -4927631 -1921797 966799 3508092
7050 3508092 3478246 2196213 1946364 1662645 2176170 1823099 -292090 -1632056 -1772164
$$ packed form
7112B217039j983412k837312r84195p04347j679889J319056J786006K391701J154574
7103F79221j545558K82243J104536r54252l520383k640771P35370K651575K77932
7094b930087j854219j214596J666902K313859K138699k58780j325847k351705
7086c815774q83253l9637p44488Q69294K003082L233698Q81714l47796P88862
7077A945702J509148j250403k998409p16498J620386m52815j831150k659952k377235
7068g211226m17576K73632R17661K453353K636258J477288J321684j065056k510635
7059b124617o9642J253303N79086p14566k833771j017424L005834K888596K541293
7050C508092k9846j282033k49849k83719N13525l53071k115189j339966j40108
$$ plain form
7041 -1772164 -1452578 -785766 41822 2382980 3345318 3030125 2458365 723589 90345
7032 90345 470961 352483 822972 2137241 2889439 3177458 3142498 2139449 27690 -1556996
7022 -1556996 -1124734 435094 1771119 2783808 1805794 -1110911 -3115391 -2968440 -2006209
7013 -2006209 -1920418 -1691198 -900829 -2039120 -3561868 -3159256 -957006 39857 679464
7004 679464 1958064 1045279 -694816 -1403459 -1085594 -1456225 -999054 1397781 2159251
6995 2159251 1775425 147325 -1977630 -2893341 -4308185 -2925288 -869851 -1156761 -2044344
6986 -2044344 -3195975 -3301847 -2299934 -1110225 432510 1567772 1425838 2579013 3643150
6977 3643150 3230827 2103418 -211780 -651286 -2738632 -4951271 -5233048 -4757003 -4195964
$$ packed form
7041a772164L19586O66812Q27588K341158R62338l15193n71760j734776o33244
7032I0345L80616j18478M70489J314269P52198K88019l4960j003049k111759j584686
7022a556996M32262J559828J336025J012689r78014k916705k004480J46951R62231
7013b006209Q5791K29220P90369j138291j522748M02612K202250R96863O39607
7004F79464J278600r12785j740095p08643L17865l70631M57171K396835P61470
6995B159251l83826j628100k124955r15711j414844J382897K055437k86910q87583
6986b044344j151631j05872J001913J189709J542735J135262j41934J153175J064137
6977C643150m12323j127409k315198m39506k087346k212639k81777M76045N61039
$$ plain form
6968 -4195964 -4039582 -1777250 -136134 108839 1466170 3051384 5092030 6428125 4502780
6959 4502780 3301070 3392265 3790656 1804017 -430134 -672787 1107236 2561521 1524852
6950 1524852 580080 -314654 -463274 -47711 112426 466902 48587 -610581 -173330 1530915
6940 1530915 1907878 1487674 2966331 3569191 1637124 -592446 -694031 1686048 2888752
6931 2888752 2012287 -653096 -2146386 -1421101 -2733890 -2290096 -80051 1621035 1209686
6922 1209686 -11247 -157867 654932 682853 252429 1047924 3274184 2419910 -1159821
6913 -1159821 -4238155 -3112881 -1236185 -1089885 -1218762 -2526368 -3301020 -3503247 -4017417
6904 -4017417 -4867829 -4107862 -2569256 -363432 72427 -585733 -703968 -126427 132190
$$ packed form
6968d195964J56382K262332J641116K44973J357331J585214K040646J336095j925345
6959D502780j201710R1195L98391j986639k234151k42653J780023J454285j036669
6950A524852r44772q94734j48620M15563J60137L54476m18315o59168M37251J704245
6940A530915L76963m20204J478657O02860j932067k229570j01585K380079J202704
6931B888752q76465k665383j493290P25285j312789M43794K210045J701086m11349
6922A209686j220933j46620Q12799K7921m30424P95495K226260q54274l579731
6913a159821l078334J125274J876696J46300j28877j307606p74652k02227n14170
6904d017417q50412P59967J538606K205824M35859o58160j18235N77541K58617
$$ plain form
6895 132190 680841 723787 375743 1150629 2335796 973000 707093 413540 -811701
6886 -811701 -2848053 -6288640 -7580064 -6225087 -4407986 -4583433 -7172545 -8151048 -6416615
6877 -6416615 -6663929 -7334263 -5561487 -3031931 -1325852 -1679384 -904432 -706793 -928816
6868 -928816 -2267232 -3838405 -3647607 -2735615 -1142053 975449 1901406 307817 -1216480
6859 -1216480 -1186923 -178072 -848274 -2035735 -2047912 438476 -802545 -3991298 -4094134
6850 -4094134 -2891176 -1623423 771036 1610750 -361146 -1530802 -342375 1229724
6842 1229724 3238065 2791301 242850 -2333014 -3613616 -3361325 -2080305 122075 2991304
6833 2991304 5261183 3661751 2555144 3631 -4226867 -2723955 53680 2682127
$$ packed form
6895A32190N48651M2946l48044P74886J185167j362796k65907k93553j225241
6886h11701k036352l440587j291424J354977J817101j75447k589112r78503J734433
6877f416615k47314o70334J772776K529556J706079l53532P74952J97639k22023
6868i28816j338416j571173J90798R11992J593562K117502R25957j593589j524297
6859a216480K9557J008851o70202j187461j2177K486388j241021l188753j02836
6850d094134J202958J267753K394459Q39714j971896j169656J188427J572099
6842A229724K008341m46764k548451k575864j280602K52291J281020K202380K869229
6833B991304K269879j599432j106607k551513m230498J502912K777635K628447
$$ plain form
6825 2682127 3955497 2815917 3420836 2742354 1405469 879528 891067 985851 516194
6816 516194 -478188 1363353 3049573 1237096 50226 1255494 3621721 4838902 7058778
6807 7058778 7915132 5923437 5254999 4507585 2507253 551052 -2003712 -4831717 -5377647
6798 -5377647 -3372011 -1747177 -1360919 -1831307 -3473938 -2645100 -1135741 -3371603 -5316648
6789 -5316648 -4237048 -2050295 -3023883 -3448337 -3387509 -3035291 -1602981 -1230366 -1006893
6780 -1006893 -1439475 -1050002 1279687 779672 -1037377 -2526550 -2375844 -1111462 1240396
6771 1240396 2890687 4175236 4587794 4840152 5131436 4339459 2585866 1336645 2190171
6762 2190171 3126890 3501209 3273225 1032350 -2860641 -4902088 -3953263 -749183 -103712
$$ packed form
6825B682127J273370j139580O04919o78482j336885n25941J1539R4784m69657
6816E16194r94382J841541J686220j812477j186870J205268K366227J217181K219876
6807G058778Q56354j991695o68438p47414k000332j956201k554764k828005n45930
6798e377647K005636J624834L86258m70388j642631Q28838J509359k235862j945045
6789e316648J079600K186753r73588m24454O0828L52218J432310L72615K23473
6780a006893m32582L89473K329689n00015j817049j489173J50706J264382K351858
6771A240396J650291J284549M12558K52358K91284p91977j753593j249221Q53526
6762B190171R36719L74319k27984k240875l892991k041447R48825L204080O45471
$$ plain form
6753 -103712 299377 2263336 3340703 4319456 3512237 2326381 1393062 347611 611814
6744 611814 1377014 -460161 -1705399 -2162668 -1433592 379566 464891 -2381407 -3690780
6735 -3690780 -4415553 -3618364 -2728885 -3238512 -3286283 -2139027 1433413 1723042 -420400
6726 -420400 -1346110 -707961 -1107098 -1523557 -2215490 -3102227 -2026395 -1850785 -3367176
6717 -3367176 -5016275 -5759187 -4203918 -2379616 -2701201 -1893412 -159731 2192206 3565824
6708 3565824 3234980 3290259 3370012 3268825 3107254 4367658 5216465 4305820 3122251 2269072
6698 2269072 1974077 2505825 1876670 843214 -544296 -3590304 -4104307 -2596434 -1646044
6689 -1646044 -1050204 -87789 2074412 2641498 2807660 3589582 3777435 2506446 2933140
$$ packed form
6753a03712M03089J963959J077367R78753q07219j185856r33319j045451K64203
6744F11814P65200j837175j245238m57269P29076J813158Q5325k846298j309373
6735c690780p24773P97189Q89479n09627m7771J147256L572440K89629k143442
6726d20400r25710O38149l99137m16459o91933q86737J075832J75610j516391
6717c367176j649099p42912J555269J824302l21585Q07789J733681K351937J373618
6708C565824l30844N5279P9753j01187j61571J260404Q48807r10645j183569q53179
6698B269072k94995N31748o29155j033456j387510l046008n14003J507873R50390
6689a646044N95840R62415K162201N67086J66162P81922J87853j270989M26694
$$ plain form
6680 2933140 4573103 4281894 5101514 6425554 6081683 4710747 3626352 3630726 2983189
6671 2983189 2569121 1939171 487788 -2322211 -4018546 -4153311 -3125210 -2743445 -2207415
6662 -2207415 -915525 1025504 1930121 1287058 9387 -1519018 -2278644 -2288036 -1998659
6653 -1998659 -736773 846598 1481070 1575913 1385526 1067875 -1544393 -3703241 -3260126
6644 -3260126 -2438189 -158602 2329634 2766102 1427464 41398 1382663 2592179 2492994
6635 2492994 570151 -731512 81051 674454 1254478 1918590 1686183 -1063750 -2990757
6626 -2990757 -3920493 -2924361 -2559666 -3488342 -3909420 -3322177 -2716542 -4023442 -6235632
6617 -6235632 -7350097 -4507917 -1170373 -2070936 -2202526 -654036 1704764 4719605 6409185
$$ packed form
6680B933140J639963k91209Q19620J324040l43871j370936j084395M374o47537
6671B983189m14068o29950j451383k809999j696335j34765J028101L81765N36030
6662b207415J291890J941029R04617o43063j277671j528405p59626r392K89377
6653a998659J261886J583371O34472R4843j90387l17651k612268k158848M43115
6644c260126Q21937K279587K488236M36468j338638j386066J341265J209516r9185
6635B492994j922843j301663Q12563N93403N80024O64112k32407k749933j927007
6626b990757r29736R96132L64695r28676m21078N87243O05635j306900k212190
6617f235632j114465K842180L337544r00563j31590J548490K358800L014841J689580
$$ plain form
6608 6409185 4237073 1360586 -779672 -883507 -791457 147702 955790 1481296 2080015
6599 2080015 3105866 3629903 479026 -2171816 -1769151 -1231691 -575621 -705267 -2011348
6590 -2011348 -2929707 -2379129 -2200151 -2263680 -1687383 -143913 826794 501157 191105 -1420553
6580 -1420553 -1481660 -674305 -1224470 -2667403 -3263747 -2297978 -1334343 -1590826 -864546 -582551
6570 -582551 -2670772 -4175547 -3841176 -2945427 -2845551 -3225248 -986216 1900783 1329645
6561 1329645 112918 2544883 4927982 2908080 1238236 1393419 2412706 2797102 3982843
6552 3982843 3828587 1825051 945515 565253 229645 133074 430548 -552189 -2311050
6543 -2311050 -2381098 -1573497 -2728273 -3684873 -2111035 302378 3124609 3217530 1546055
$$ packed form
6608F409185k172112k876487k140258j03835R2050R39159Q08088N25506N98719
6599B080015J025851N24037l150877k650842M02665N37460O56070j29646j306081
6590b011348r18359N50578J78978o3529N76297J543470R70707l25637l10052j611658
6580a420553o1107Q07355n50165j442933n96344R65769R63635k56483P26280K81995
6570e82551k088221j504775L34371Q95749R9876l79697K239032K886999n71138
6561A329645j216727K431965K383099k019902j669844J55183J019287L84396J185741
6552C982843j54256k003536q79536l80262l35608r6571K97474r82737j758861
6543b311050p0048Q07601j154776r56600J573838K413413K822231R2921j671475
$$ plain form
6534 1546055 1383461 543282 -1433801 -2916846 -4138275 -2395611 271037 1296407 509880
6525 509880 -1491937 -130666 1800819 2976347 1984136 587747 823212 1085256 454772
6516 454772 -392286 629418 2906474 3158024 2924612 2847594 2709779 2017642 436802
6507 436802 -3028739 -3824449 -990415 3217752 4597868 2791712 3642319 3533427 567526
6498 567526 1262756 4499551 6744305 8050718 7071516 5252892 3419489 1744297 1968891
6489 1968891 2249373 2248888 723871 -756059 600088 645579 -72399 544977 642717 344606
6479 344606 -899092 -1392716 -1960118 -1915510 888607 2757438 3204782 3609440 2518846
6470 2518846 813780 -1727337 -3917105 -4306880 -3715680 -3125795 -1206964 -76537 -385804
$$ packed form
6534A546055j62594q40179j977083j483045j221429J742664K666648J025370p86527
6525E09880k001817J361271J931485J175528r92211j396389K35465K62044o30484
6516D54772q47058J021704K277056K51550k33412p7018j37815o92137j580840
6507D36802l465541p95710K834034M208167J380116j806156Q50607j08892k965901
6498E67526O95230L236795K244754J306413r79202j818624j833403j675192K24594
6489A968891K80482m85j525017j479930J356147M5491p17978O17376R7740k98111
6479C44606j243698m93624n67402M4608K804117J868831M47344M04658j090594
6470B518846j705066k541117k189768l89775N91200N89885J918831J130427l09267
$$ plain form
6461 -385804 -1594676 -2277278 -610760 1933238 4010376 5024024 3946658 802312 -2803737
6452 -2803737 -4049544 -3370817 -2258155 -974229 -1563628 -1381116 847673 2524802 1653303
6443 1653303 1010945 2745269 4366413 3573248 3044255 3610941 3812908 4081802 2708537
6434 2708537 2746619 2607947 2586564 1077606 -2610940 -3977761 -4351620 -4156514 -5730073
6425 -5730073 -5656657 -3328705 -3124865 -2821605 -1242125 -367668 877783 1906526 1645255
6416 1645255 2623207 2339203 -217309 -1908771 -2366903 -1655533 -1219086 -1323038 87091
6407 87091 640262 -625980 -2809101 -3581808 -2646008 -3070658 -2112015 445115 2926806
6398 2926806 5237100 6018964 5807277 5724000 6610494 7112788 6730661 4066232 1210854
$$ packed form
6461c85804j208872o82602J666518K543998K077138J013648j077366l144346l606049
6452b803737j245807O78727J112662J283926n89399J82512K228789J677129q71499
6443A653303o42358J734324J621144p93165n28993N66686K01967K68894j373265
6434B708537L8082j38672k1383j508958l688546j366821l73859J95106j573559
6425e730073P3416K327952K03840L03260J579480Q74457J245451J028743k61271
6416A645255R77952k84004k556512j691462m58132P11370M36447j03952J410129
6407H7091N53171j266242k183121p72707R35800m24650R58643K557130K481691
6398B926806K310294P81864k11687q3277Q86494N02294l82127k664429k855378
$$ plain form
6389 1210854 969624 1626403 1496882 1618377 1021292 -1196059 -3125372 -2892757 -2693909
6380 -2693909 -3580090 -3279080 -685677 2621207 4438984 4388366 1513395 386167 -725888
6371 -725888 -1392594 -1673608 -756311 213455 958877 925150 66794 1278903 -273950 -1895164
6361 -1895164 -2248025 -1534715 387264 2368536 2272617 2447997 2757284 2301008 1175801
6352 1175801 -18241 -248224 596739 313137 -1345340 -1305709 -1017731 -398671 643700
6343 643700 1751732 3868680 5376286 5365855 5090228 4586016 4448702 2650001 1070321
6334 1070321 960993 -102024 -1082238 -1836988 -1990757 -1255325 -1235873 443250 2486975
6325 2486975 3127219 1702452 476269 1344633 1831632 967187 143761 -1348051 -2197480
$$ packed form
6389A210854k41230O56779j29521J21495n97085k217351j929313K32615J98848
6380b693909q86181L01010K593403L306884J817777n0618k874971j127228j112055
6371g25888o66706k81014R17297R69766P45422l3727q58356J212109j552853j621214
6361a895164l52861P13310J921979J981272r5919J75380L09287m56276j125207
6352A175801j194042k29983Q44963k83602j658477L9631K87978O19060J042371
6343F43700J108032K116948J507606j0431k75627n04212j37314j798701j579680
6334A070321j09328j063017r80214p54750j53769P35432J9452J679123K043725
6325B486975O40244j424767j226183Q68364M86999q64445q23426j491812q49429
$$ plain form
6316 -2197480 -1160747 670783 1827096 506356 -545127 -1666210 -1096014 -551790 -820597
6307 -820597 -2103029 -4174485 -4032157 -4561782 -6364633 -7609624 -5665743 -1538990 1987453
6298 1987453 3822866 2534253 570954 284589 -1076502 -2331543 -1652916 -1303417 -2578576
6289 -2578576 -4605480 -6326366 -4933055 -2445110 -3336945 -5249659 -3670079 170056
6281 170056 3126066 3695586 3768313 4163819 3352180 2338165 1350830 766453 518855 -1081940
6271 -1081940 -994944 684440 2135884 1903976 1291554 219272 97619 -184866 -1169095
6262 -1169095 -1756666 -2500991 -2971764 -3517712 -929210 1963249 2844178 2650022 3140642
6253 3140642 3087857 1760355 1071553 1806100 3910644 4140849 1507578 70519 1932599
$$ packed form
6316b197480J036733J831530J156313j320740j051483j121083N70196N44224k68807
6307h20597j282432k071456J42328n29625j802851j244991J943881M126753L526443
6298A987453J835413j288613j963299k86365j361091j255041O78627L49499j275159
6289b578576k026904j720886J393311K487945q91835j912714J579580L840135
6281A70056K956010N69520P2727L95506q11639j014015r87335n84377k47598j600795
6271a081940Q6996J679384J451444k31908o12422j072282j21653k82485r84229
6262a169095n87571p44325m70773n45948K588502K892459Q80929j94156M90620
6253C140642n2785j327502o88802P34547K104544K30205k633271j437059J862080
$$ plain form
6244 1932599 4233619 3872701 1992140 3305384 4883941 5068332 5107501 5585329 7330159
6235 7330159 7539452 5280096 2411780 1760446 2463887 1705339 194138 592286 3516356
6226 3516356 5036981 5807126 8000814 8183422 6738327 5764024 4538165 2684761 1662733
6217 1662733 2269525 2609950 2436682 2694548 5739585 7987460 6723132 5360164 5588287
6208 5588287 6838117 7505731 9314461 12899597 15724928 16134923 15287673 15654839 16471206
6199 16471206 18407063 21267450 25974041 33818488 45260364 63097710 92940447 137023330
6191 137023330 194259427 231600965 207760352 156997920 115613687 85287309 64225302
6184 64225302 49804032 41204700 36269999 31135087 24499247 20532704 16486366 12347605
$$ packed form
6244A932599K301020l60918j880561J313244J578557J84391L9169M77828J744830
6235G330159K09293k259356k868316o51334P03441p58548j511201L98148K924070
6226C516356J520625P70145K193688J82608j445095r74303j225859j853404j022028
6217A662733O06792L40425j73268K57866L045037K247875j264328j362968K28123
6208E588287J249830O67614J808730L585136K825331M09995q47250L67166Q16367
6199A6471206J935857K860387M706591P844447J1441876J7837346K9842737M4082883
6191A37023330N7236097L7341538k3840613n0762432m1384233l0326378k1062007
6184F4225302j4421270q599332m934701n134912o635840l966543m046338m138761
$$ plain form
6176 12347605 9780154 10116026 11649207 11889347 13203133 16280715 16733877 14280398 14187747
6167 14187747 12082786 9160072 7482759 6214408 4626992 2881108 476520 -9931
6159 -9931 1952588 3935603 3867078 3546725 2696247 254995 -1702510 -829406 -919744 -1504940
6149 -1504940 -374388 806934 -5046 236952 2225931 2155676 1369413 3584360 3721854
6140 3721854 3419348 5602885 6460734 5999244 3306362 1995629 2239320 2912717 2256972
6131 2256972 865599 778505 1231678 -1176697 -2733822 -1522115 -211829 -348998 -294048
6122 -294048 -1581626 -2359001 -3102178 -5220889 -5658607 -3846351 -3191647 -3028953 -2205539
6113 -2205539 1028729 4080766 1488052 -3116866 -3174751 -2139325 -860347 41378 -699691
$$ packed form
6176A2347605k567451L35872J533181K40140J313786L077582M53162k453479r2651
6167A4187747k104961k922714j677313j268351j587416j745884k404588m86451
6159i931J962519J983015o8525l20353q50478k441252j957505Q73104r0338n85196
6149a504940J130552J181322q11980K41998J988979p0255p86263K214947J37494
6140C721854l02506K183537Q57849m61490k692882j310733K43691O73397o55745
6131B256972j391373q7094M53173k408375j557125J211707J310286j37169N4950
6122b94048j287578p77375p43177k118711m37718J812256O54704J62694Q23414
6113b205539L234268L052037k592714m604918n7885J035426J278978R01725p41069
$$ plain form
6104 -699691 83629 2495692 1953331 -1043011 -3217866 -4332072 -4013127 -3014993 -1716650
6095 -1716650 -90906 620351 571763 1299654 1600145 1003564 1568176 2270265 2948469 5569250
6085 5569250 6648502 6534862 5121339 3051424 2137006 1794049 381242 657967 2447493
6076 2447493 4406717 4685615 3868674 4760800 5928900 6403050 6735652 4073941 1500991
6067 1500991 3559350 5027876 5762761 5019590 3320183 3075736 3123476 720746 -1625224
6058 -1625224 -2078127 -2308905 -1296227 -294342 388703 1419876 1012129 -1247619 -2153086
6049 -2153086 -2199644 -2755605 -2481259 -1029177 667087 224966 -1262422 -669027 1242799
6040 1242799 11322 15108 2778611 3010088 3375758 4331181 6584721 7696876 8160482
$$ packed form
6104f99691P83320K412063n42361k996342k174855j114206L18945R98134J298343
6095a716650J625744P11257m8588P27891L00491n96581N64612P02089O78204K620781
6085E569250J079252j13640j413523k069915r14418l42957j412807K76725J789526
6076B447493J959224K78898q16941Q92126J168100M74150L32602k661711k572950
6067A500991K058359J468526P34885p43171j699407k44447M7740k402730k345970
6058a625224m52903k30778J012678J001885O83045J031173m07747k259748r05467
6049b153086m6558n55961K74346J452082J696264m42121j487388N93395J911826
6040A242799j231477L786K763503K31477L65670R55423K253540J112155M63606
$$ plain form
6031 8160482 8525988 5762140 2569448 641724 -755259 -1358491 -641743 -1300986 -1417476
6022 -1417476 312272 367015 -241977 10051 277491 594164 -1181770 -2975459 -4116711
6013 -4116711 -6349567 -7189499 -6124135 -5495841 -5629671 -4790505 -3966828 -2344127 256096
6004 256096 1281306 1783971 1401202 539864 -211850 -89796 -1028425 -3595048 -5272090
5995 -5272090 -4078112 -2842185 -3726390 -4720266 -3915945 -2086015 -1186479 -1070172 -1460796
5986 -1460796 -2405321 -2811027 -2034427 -2429340 -3268682 -3165210 -3163238 -3076618 -1374582 1219105
5976 1219105 2047339 1834538 654410 -205640 -141387 1701112 3014181 2891005 2787105
5967 2787105 4593416 6688865 6684543 6684084 5909146 5081879 4154571 4920681 8775929 11819662
$$ packed form
6031H160482L65506k763848l192692j927724j396983o03232P16748o59243j16490
6022a417476J729748N4743o08992K52028K67440L16673j775934j793689j141252
6013d116711k232856q39932J065364O28294j33830Q39166Q23677J622701K600223
6004B56096J025210N02665l82769q61338p51714J22054r38629k566623j677042
5995e272090J193978J235927q84205r93876Q04321J829930Q99536J16307l90624
5986a460796r44525m05706P76600l94913q39342J03472J972Q6620J702036K593687
5976A219105Q28234k12801j180128q60050O4253J842499J313069j23176j03900
5967B787105J806311K095449m322m59p74938q27267r27308P66110L855248L043733
$$ plain form
5957 11819662 12455487 11796005 10949209 11232228 11439390 13210336 20218071 26218016 31708129
5948 31708129 41381082 55039939 73022593 103422714 151336344 209479060 230511963
5941 230511963 195263076 146061963 109587262 85120322 65030653 49304076 39328045
5934 39328045 31397944 22589893 15346022 11795516 10958908 13420176 15180569 15788578
5926 15788578 14151379 11287187 9310821 5148063 1985205 -287234 -1295530 -524817
5918 -524817 1140017 -118399 -72171 1573456 2696549 2271013 1871204 1728407 1186966
5909 1186966 815815 1056246 2177786 2582618 3734344 4244200 2297374 -858066 -3926274
5900 -3926274 -4354197 -3998029 -4069819 -3208738 -1066911 -1423958 -1698701 -1028351 -750044 -1034582
$$ packed form
5957A1819662O35825o59482q46796K83019K07162J770946P007735N999945N490113
5948C1708129R672953J3658857J7982654L0400121M7913630N8142716K1032903
5941B30511963l5248887m9201113l6474701k4466940k0089669j5726577r976031
5934C9328045p930101q808051p243871l550506q36608K461268J760393O08009
5926A5788578j637199k864192j976366m162758l162858k272439j008296P70713
5918e24817J664834j258416M6228J645627J123093m25536l99809j42797n41441
5909A186966l71151K40431J121540M04832J151726N09856j946826l155440l068208
5900c926274m27923L56168p1790Q61081K141827l57047k74743O70350K78307k84538
$$ plain form
5890 -1034582 1578868 4810380 4677350 3645953 3854953 2417313 -167132 -31221 2070217
5881 2070217 3488892 3264241 1415457 729294 61425 -892680 172200 893465 2402537
5872 2402537 2553091 900968 1564046 1638542 2090049 2775231 2836389 2205940 1974862 618647
5862 618647 -2605712 -1998489 -1419450 -4005873 -5671680 -7747295 -8205241 -6427093 -4507570
5853 -4507570 -3848615 -4727780 -4411177 -4469125 -4507589 -1663330 631805 353992 215126 -668218
5843 -668218 -1828941 -2728917 -2310229 -1132128 -1388215 302311 1103135 1042147 1377708
5834 1377708 182452 -1820519 -3789847 -6788935 -7427246 -7123317 -7321415 -6151397 -4444672
5825 -4444672 -2583959 -1594481 -759266 -1708051 -3919806 -3769030 -1147240 610598 766059
$$ packed form
5890a034582K613450L231512j33030j031397K09000j437640k584445J35911K101438
5881B070217J418675k24651j848784o86163o67869r54105J064880P21265J509072
5872B402537J50554j652123O63078P4496M51507O85182O1158o30449k31078j356215
5862F18647l224359O07223N79039k586423j665807k075615m57946J778148J919523
5853d507570O58955q79165L16603n7948l8464K844259K295135k77813j38866q83344
5843f68218j160723q99976M18688J178101k56087J690526Q00824o0988L35561
5834A377708j195256k002971j969328k999088o38311L03929j98098J170018J706725
5825d444672J860713R89478Q35215r48785k211755J50776K621790J757838J55461
$$ plain form
5816 766059 400110 -578035 -2730597 -2781924 -710439 267010 2279 1372076 3491950
5807 3491950 3063644 1303918 161865 403677 996019 -122800 -1460577 -864848 467042
5798 467042 905121 755625 444162 517518 1519889 3336943 5187903 4352008 4483979
5789 4483979 8083435 10815219 10558004 6669570 3262867 340615 -415021 -1706920 -2604379
5780 -2604379 -3199282 -2464356 -983135 642716 439701 -1844252 -2438483 -2951011 -4020215
5771 -4020215 -3719675 -1757317 937287 2898205 1356072 -2837112 -5661629 -5636460 -3093128
5762 -3093128 -546034 609676 1166916 183779 -276487 1214792 1011422 442459 1175684
5753 1175684 3119240 4963492 5893006 5836258 3745556 2912871 4620062 6328349 4177586
$$ packed form
5816G66059l65949r78145k152562n1327K071485R77449k64731J369797K119874
5807C491950m28306j759726j142053K41812N92342j118819j337777N95729J331890
5798D67042M38079j49496l11463P3356J002371J817054J850960q35895J31971
5789D483979L599456K731784k57215l888434l406703k922252p55636j291899q97459
5780b604379n94903P34926J481221J625851k03015k283953n94231n12528j069204
5771d020215L00540J962358K694604J960918j542133m193184k824517K5169K543332
5762c093128K547094J155710N57240r83137m60266J491279k03370n68963P33225
5753A175684J943556J844252R29514n6748k090702q32685J707191J708287k150763
$$ plain form
5744 4177586 2705897 1983021 2075648 1582793 1900181 3114050 2428395 2903759 3412277
5735 3412277 2234118 473920 692125 3593238 6327403 5506354 3277489 3224279 1421114
5726 1421114 -701104 -1145846 -1464777 -2335290 -3545234 -2487246 -1010090 443790 1079678
5717 1079678 1133391 1344987 2488157 2513793 2147458 1076630 1223528 747407 -297532
5708 -297532 -1082506 -1488028 -991950 -1710129 -3879136 -4910670 -3145698 -2581472 -2748316
5699 -2748316 -4750403 -5735836 -3457729 -330531 290798 -2251158 -4208811 -3977570 -2988443
5690 -2988443 -1991896 -3707703 -6282755 -6291562 -5938110 -3841836 119203 -944851 -2413335
5681 -2413335 -2446193 -1392768 780672 1694349 1043084 -1431492 -2145931 -1013684 17800
$$ packed form
5744D177586j471689p22876R2627m92855L17388J213869o85655M75364N08518
5735C412277j178159j760198K18205K901113K734165q21049k228865n3210j803165
5726A421114k122218m44742l18931q70513j209944J057988J477156J453880O35888
5717A079678N3713K11596J143170K5636l66335j070828J46898m76121j044939
5708b97532p84974m05522M96078p18179k169007j031534J764972N64226j66844
5699b748316k002087r85433K278107L127198O21329k541956j957653K31241R89127
5690b988443R96547j715807k575052q807L53452K096274L961039j064054j468484
5681b413335l2858J053425K173440R13677o51265k474576p14439J132247J031484
$$ plain form
5672 17800 -1313779 -2588470 -2202715 -295199 -432297 -2688888 -3038123 -216376 446850
5663 446850 -1213857 -3714347 -4371282 -2626387 -274639 1557830 1637721 1477642 1601780
5654 1601780 895788 -557881 -1556237 -2627846 -2832866 -690672 2141932 1750677 -34288
5645 -34288 -818996 -2227240 -3410202 -3614284 -1834531 -1632941 -3642692 -1778338 1385333
5636 1385333 1773755 2432963 3972252 4829403 5079165 3839422 2239551 2689078 3897163
5627 3897163 3692397 4384016 2672978 -184873 126097 1570463 3849989 2158242 1169954
5618 1169954 1152356 254692 -1444849 -2387588 -1946913 -1540458 258994 942329 -302276
5609 -302276 139194 2224350 3971111 5152160 5320321 3814421 3678573 3413506 4191698
$$ packed form
5672A7800j331579j274691L85755J907516j37098k256591l49235K821747O63226
5663D46850j660707k500490o56935J744895K351748J832469P9891j60079J24138
5654A601780p05992j453669r98356j071609k05020K142194K832604l91255j784965
5645c4288p84708j408244j182962k04082J779753K01590k009751J864354L163671
5636A385333L88422O59208J539289Q57151K49762j239743j599871M49527J208085
5627C897163k04766O91619j711038k857851L10970J444366K279526j691747r88288
5618A169954j7598q97664j699541r42739M40675M06455J799452O83335j244605
5609c02276M41470K085156J746761J181049J68161j505900j35848k65067P78192
$$ plain form
5600 4191698 5283158 4027876 1781869 1181712 1272655 819604 1005516 1335914 519347
5591 519347 -972826 -1879140 -3369145 -2335106 -1540397 -2689507 -3947168 -3883878 -2641618
5582 -2641618 65246 1729252 1940363 2190411 2000015 296826 -968673 -1867676 -4387020
5573 -4387020 -4802570 -3388614 -2827878 -1310650 758638 2900858 2232742 -801565 -3212309
5564 -3212309 -5613619 -6207818 -3471645 -385885 1420944 1758224 2367796 1647384 639479
5555 639479 -557164 -1269126 -274473 1013437 745346 1258065 3481360 3522112 3296236
5546 3296236 2273795 2023390 2041357 999679 -898082 -867841 596209 745403 576380
5537 576380 -2614885 -4904976 -5496342 -6371595 -5700589 -3546487 -1375027 49396 269327
$$ packed form
5600D191698J091460j255282k246007o00157R0943m53051J85912L30398q16567
5591E19347j492173r06314j490005J034039P94709j149110j257661O3290J242260
5582b641618K706864J664006K11111K50048j90396j703189j265499q99003k519344
5573d387020m15550J413956N60736J517228K069288K142220o68116l034307k410744
5564c212309k401310n94199K736173L085760J806829L37280O09572p20412j007905
5555F39479j196643p11962R94653J287910k68091N12719K223295M0752k25876
5546C296236j022441k50405J7967j041678j897761L0241J464050J49194j69023
5537E76380l191265k290091n91366q75253O71006K154102K171460J424423K19931
$$ plain form
5528 269327 -19505 225495 1291416 1394657 560180 112366 1760718 3878696 6083806
5519 6083806 6686839 6064429 4494767 3520978 2085721 1225289 1916853 1990310 945926
5510 945926 988053 2069984 2740263 3758454 1098271 128894 554541 -432159 -899677
5501 -899677 -2233876 -4023599 -2785720 -2654223 -4599724 -4968986 -4879043 -4911810 -4187916
5492 -4187916 -378739 2313601 3180935 3925139 4327690 3123837 1189015 1221128 3004845
5483 3004845 3769118 4379894 3272860 2114499 1394141 -586150 -1089684 -1514582 -889492
5474 -889492 -242839 657193 111764 -1415774 -397704 1649145 2474777 1229473 860497
5465 860497 1091691 438366 1646042 3713037 4023351 4542633 3462402 2633653 1210909
$$ packed form
5528B69327k88832K45000J065921J03241q34477m47814J648352K117978K205110
5519F083806O03033o22410j569662r73789j435257q60432O91564P3457j044384
5510I45926M2127J081931O70279J018191k660183r69377M25647r86700m67518
5501h99677j334199j789723J237879J31497j945501l69262Q9943l2767P23894
5492d187916L809177K692340Q67334P44204M02551j203853j934822L2113J783717
5483C004845P64273O10776j107034j158361p20358j980291n03534m24898O25090
5474h89492O46653R00032n45429j527538J018070K046849Q25632j245304l68976
5465H60497K31194o53325J207676K066995L10314N19282j080231q28749j422744
$$ plain form
5456 1210909 -506663 -940561 -1105904 -1592183 -3061388 -4667816 -5553550 -4082069 -1174619
5447 -1174619 -276051 -731822 -1861582 -2280608 -1132534 1414809 3409835 5078265 6088950
5438 6088950 4943511 3447784 2782522 2641235 3362292 4105418 2637098 743323 -1959555
5429 -1959555 -3323160 -3009251 -2806647 -1222605 -244034 1450483 2120935 3289678 5458123
5420 5458123 4394952 4200572 2509948 -463849 -2594944 -3344898 -2097420 -1973400 -3010871
5411 -3010871 -2681770 871751 2891575 1719121 1047943 436295 -700149 -2248076 -2977406
5402 -2977406 -948327 760463 522712 2313703 5077890 5056692 2989366 3647293 6418279
5393 6418279 6889988 4519152 3089392 1581954 1136566 2822812 4902313 5537662 4621927
$$ packed form
5456A210909j717572m33898j65343m86279j469205j606428q85734J471481K907450
5447a174619Q98568m55771j129760m19026J148074K547343J995026J668430J010685
5438F088950j145439j495727o65262j41287P21057P43126j468320j893775k702878
5429a959555j363605L13909K02604J584042R78571J694517O70452J168743K168445
5420E458123j063171j94380j690624k973797k131095p49954J247478J24020j037471
5411c010871L29101L553521K019824j172454o71178o11648j136444j547927p29330
5402b977406K029079J708790k37751J790991K764187k1198k067326O57927K770986
5393F418279M71709k370836j429760j507438m45388J686246K079501O35349r15735
$$ plain form
5384 4621927 2206299 270169 -1326131 -1857507 -1991609 -1219553 -152088 924484 -151477
5375 -151477 -1409238 -2136698 -2963710 -1783181 -327615 -202881 -366884 -1083676 -2728207
5366 -2728207 -5660581 -5589268 -2636044 -811306 -1084943 -921723 -499744 -1364566 -396454
5357 -396454 1079884 2404023 3478225 3739311 1759352 -613672 -1732867 -1223739 612336
5348 612336 1799335 3579635 5579078 5863719 2445846 -1805225 -3355789 -1710518 363499
5339 363499 733255 -505620 -2424130 -3730345 -3888990 -4014740 -5179452 -6116744 -6076726
5330 -6076726 -3083983 -1502005 -919079 1648444 3966075 1450727 -3495 1953248
5322 1953248 2886388 2801595 2317596 773455 232080 519409 -519585 -1456033 -1695671
$$ packed form
5384D621927k415628j936130j596300n31376j34102P72056J067465J076572j075961
5375a51477j257761p27460q27012J180529J455566J24734j64003p16792j644531
5366b728207k932374P1313K953224J824738k73637J63220M21979q64822R68112
5357c96454J476338J324139J074202K61086j979959k373024j119195N09128J836075
5348F12336J186999J780300J999443K84641l417873m251071j550564J645271K074017
5339C63499L69756j238875j918510j306215j58645j25750j164712r37292M0018
5330f076726K992743J581978N82926K567523K317631k515348j454222J956743
5322A953248R33140q4793m83999j544141n41375K87329j038994r36448k39638
$$ plain form
5313 -1695671 -1008657 148399 1965488 2033060 3585551 4975483 3049815 -250795 -2358781
5304 -2358781 -1773519 -107802 1605537 1097477 74495 -356193 934565 2436500 2472959
5295 2472959 2471267 1903113 1654090 2063696 2791738 3917386 4831128 5263501 4108874 3235249
5285 3235249 1318474 -2196861 -2758046 -2831015 -1557044 507459 892382 1341854 2843756
5276 2843756 2722344 1548070 1324667 73033 -3715736 -5698985 -5181275 -4714338 -4129835
5267 -4129835 -4772450 -4552046 -2899431 -872527 303751 260535 -1217403 -2072917 -284876
5258 -284876 1083993 -750640 -1142770 -848973 -1768102 -2742857 -2587227 -638511 258927
5249 258927 -569427 -1371194 -496590 1081596 2991646 2892549 1574456 944007 1804581
$$ packed form
5313a695671O87014J157056J817089O7572J552491J389932j925668l300610k107986
5304b358781N85262J665717J713339n08060j022982m30688J290758J501935L6459
5295B472959j692n68154k49023M09606P28042J125648R13742M32373j154627q73625
5285C235249j916775l515335n61185p2969J273971K064503L84923M49472J501902
5276B843756j21412j174274k23403j251634l788769j983249N17710M66937N84503
5267d129835o42615K20404J652615K026904J176278m3216j477938q55514J788041
5258b84876J368869j834633l92130K93797r19129r74755J55630J948716Q97438
5249B58927q28354q01767Q74604J578186J910050r9097j318093o30449Q60574
$$ plain form
5240 1804581 1910088 2055488 2013214 2387933 4779409 4570038 3839820 1632548 17061
5231 17061 926918 2941020 3214582 1688868 1885578 3301322 2947303 2949823 4076324 4500961
5221 4500961 5112808 5178551 3930528 3915960 4243716 2966303 2289544 2259422 2716670 2785812
5211 2785812 3021664 3279905 1783950 135102 -146870 -1655910 -3563447 -4072346 -2485280
5202 -2485280 203092 1899154 1558615 1093734 1216984 -221988 -1095973 -146208 1541815
5193 1541815 787435 -799787 -1380167 -1341902 -272441 366975 -881164 -3641439 -5937103
5184 -5937103 -7086496 -6709523 -4730327 -3015880 -1422464 -110107 -440199 -2064797 -2860469
5175 -2860469 -3491966 -3699491 -2580833 -2424598 -1954118 94284 669582 -4725 92024
$$ packed form
5240A804581J05507J45400m2274L74719K391476k09371p30218k207272j615487
5231A7061R09857K014102K73562j525714J96710J415744l54019K520J126501M24637
5221D500961O11847O5743j248023j4568L27756j277413o76759l0122M57248O9142
5211B785812K35852K58241j495955j648848k81972j509040j907537n08899J587066
5202b485280K688372J696062l40539m64881J23250j438972q73985R49765J688023
5193A541815p54380j587222n80380L8265J069461O39416j248139k760275k295664
5184e937103j149393L76973J979196J714447J593416J312357l30092j624598p95672
5175b860469o31497k07525J118658J56235M70480K048402N75298o74307R6749
$$ plain form
5166 92024 -360121 -210159 -1415983 -1361327 -889920 -1384174 -932927 552270 2607058 2505543
5156 2505543 2288575 -331499 -1241492 980080 1914752 2715060 3394867 3225591 2939663
5147 2939663 3182214 3061147 1219954 1235861 2088447 3083909 3790132 2216392 340942
5138 340942 -1297493 -1685065 -300661 2112070 3583975 3522994 3070157 4255748 5438912
5129 5438912 4801963 3143653 2494554 2589979 2305924 1203641 235058 410455 223762
5120 223762 786661 2765748 5191439 5747963 4001629 1699969 -251860 -2936145 -3510878
5111 -3510878 -3973703 -4661454 -1956207 1453476 2284804 1328197 -547230 -3492341 -5542900
5102 -5542900 -5512274 -3735321 -4889479 -5394881 -1669111 2490442 5194606 5881858 3451179
$$ packed form
5166I2024m52145J49962j205824N4656M71407m94254M51247J485197K054788j01515
5156B505543k16968k620074r09993K221572R34672Q00308O79807j69276k85928
5147B939663K42551j21067j841193J5907Q52586R95462P06223j573740j875450
5138C40942j638435l87572J384404K412731J471905o0981m52837J185591J183164
5129E438912o36949j658310o49099R5425k84055j102283r68583J75397j86693
5120B23762N62899J979087K425691N56524j746334k301660j951829k684285n74733
5111c510878m62825o87751K705247L409683Q31328r56607j875427k945111k050559
5102e542900L0626J776953j154158n05402L725770M159553K704164O87252k430679
$$ plain form
5093 3451179 331910 -2297208 -1536371 437756 -66870 -229565 1093683 2119908 2030549
5084 2030549 1864519 982074 22768 36632 1081541 2433371 419459 -2325408 -3085489
5075 -3085489 -2573488 -571845 -767285 272074 1917757 3964297 6734938 9284883 8338219
5066 8338219 5958243 5439857 4283779 4215970 2174852 -561993 -1696465 -3501143 -3357792
5057 -3357792 -2260695 -1867028 -1512407 -1748424 -1150775 655422 2912064 2692658 -232838
5048 -232838 -3015012 -2406778 -132980 1131490 246494 -1504509 -4037701 -4131352 -1700159
5039 -1700159 -570663 -536974 -705601 -2167900 -3565648 -2858472 -339212 2231464 3221917
5030 3221917 3689201 2100389 -298814 -2230918 -2438819 -1093077 -267294 -418538 -111971
$$ packed form
5093C451179l119269k629118P60837J974127n04626j62695J323248J026225q9359
5084B030549j66030q82445r59306J3864J044909J351830k013912k744867p60081
5075c085489N12001K001643j95440J039359J645683K046540K770641K549945r46664
5066H338219k379976n18386j156078o7809k041118k736845j134472j804678J43351
5057c357792J097097L93667L54621k36017N97649J806197K256642k19406k925496
5048b32838k782174O08234K273798J264470q84996j751003k533192r3651K431193
5039a700159J129496L3689j68627j462299j397748P07176K519260K570676R90453
5030C221917M67284j588812k399203j932104k07901J345742Q25783j51244L06567
$$ plain form
5021 -111971 1579775 1044247 442551 1160390 315392 -60075 683075 -317562 -213195
5012 -213195 779641 325012 -597061 -1203051 -1875587 -1524184 -3348061 -5836252 -5382795
5003 -5382795 -4405137 -4033717 -2319357 -851267 -137272 -635897 -1441587 -1327467 525366
4994 525366 1276826 1409722 207176 -712957 -1032795 -537649 2788071 2463550 848953
4985 848953 1668583 2586229 1371569 220844 -1698116 -4332129 -4128129 -2256825 -1919912
4976 -1919912 -2359564 -4077115 -3650280 -77394 4361063 8275859 10440134 11105986 11114550
4967 11114550 9110823 5442872 2021087 -348742 1141122 4947592 6313617 5381187
4959 5381187 4820252 3729521 3661927 4022258 2901043 2683720 5945352 9030326 6866455
$$ packed form
5021a11971J691746n35528o01696P17839q44998l75467P43150j000637J04367
5012b13195R92836m54629r22073o05990o72536L51403j823877k488191M53457
5003e382795R77658L71420J714360J468090P13995m98625q05690J14120J852833
4994E25366P51460J32896j202546r20133l19838M95146L325720l24521j614597
4985H48953Q19630R17646j214660j150725j918960k634013K04000J871304L36913
4976a919912m39652j717551M26835L572886M438457L914796K164275O65852Q564
4967A1114550k003727l667951l421785k369829J489864L806470J366025r32430
4959E381187n60935j090731o7594L60331j121215k17323L261632L084974k163871
$$ plain form
4950 6866455 3738062 3382678 4541853 5041314 4198617 2612585 3362809 5528019 4602771
4941 4602771 2143575 923298 -155515 247959 3332799 4877559 3185377 1871713
4933 1871713 1875389 2996583 3305381 212902 -1983387 -2482569 -2668093 -1098825 591001
4924 591001 2220215 3454489 3862618 3017954 1029601 -853278 1023312 2973723 3855965
4915 3855965 3032483 331940 -892431 281036 935005 141996 627445 1788221 1599291
4906 1599291 1475581 1279775 3213379 5702828 4625648 4103725 5797223 6681864 5276648
4897 5276648 2559640 1191045 3795526 7011792 8572918 8117298 5828796 3237156
4889 3237156 2122599 2807534 3670388 4262820 3469436 1509117 -644504 -1120758 -938435
$$ packed form
4950F866455l128393l55384J159175M99461q42697j586032P50224K165210r25248
4941D602771k459196j220277j078813M03474L084840J544760j692182j313664
4933A871713L676J121194L08798l092479k196289m99182j85524J569268J689826
4924E91001J629214J234274M08129q44664j988353j882879J876590J950411Q82242
4915C855965q23482k700543j224371J173467O53969p93009M85449J160776j88930
4906A599291j23710j95806J933604K489449j077180n21923J693498Q84641j405216
4897E276648k717008j368595K604481L216266J561126m55620k288502k591640
4889C237156j114557O84935Q62854N92432p93384j960319k153621m76254J82323
$$ plain form
4880 -938435 -707880 1700042 2105480 573633 126716 -586559 -2027277 -2445040 -870366
4871 -870366 586944 -353385 -15667 888780 -758553 -3323893 -3437823 -2588845 -1744412
4862 -1744412 153525 -169461 -908494 515633 1276395 1607493 2352720 2407491 1449955
4853 1449955 -353981 -1058887 -162346 1187763 1301986 36232 389150 3796516 4879541
4844 4879541 3757286 3579179 3098710 1722310 475449 -25717 -138119 997433 1671697
4835 1671697 1239743 2346252 3222797 2275373 564654 528581 1183553 3400558 5924438
4826 5924438 5716285 4864841 3985684 1746287 2040258 3617586 5584139 6715967 6697332
4817 6697332 6848941 8352988 11182915 13314005 13170382 12968734 13563352 11574257 10065658
$$ packed form
4880i38435K30555K407922M05438j531847m46917p13275j440718m17763J574674
4871h70366J457310r40329L37718R04447j647333k565340j13930Q48978Q44433
4862a744412J897937l22986p39033J424127P60762L31098P45227N4771r57536
4853A449955j803936p04906Q96541J350109J14223j265754L52918L407366J083025
4844D879541j122255j78107m80469j376400j246861n01166j12402J135552O74264
4835A671697m31954J106509Q76545r47424j710719l6073O54972K217005K523880
4826E924438k08153q51444q79157k239397K93971J577328J966553J131828j8635
4817F697332J51609J504047K829927K131090j43623k01648N94618j989095j508599
$$ plain form
4808 10065658 11849902 14219975 16111770 20011952 24473967 27188073 32127137 40792209
4800 40792209 49860168 59379897 73560662 94895305 128264401 178410602 248272191
4793 248272191 294406451 276782668 244596898 237785489 264746947 329248987 414946416
4786 414946416 463224486 441322011 356466156 259391891 190170631 142331398 109321881
4779 109321881 85183656 66815564 50916613 40335579 34871969 30687985 27307590
4772 27307590 24251968 22297824 22049286 20561631 19811095 19708583 19805418 19241415 16942419
4763 16942419 12976795 10281925 8103324 8051977 8415783 8682212 9287541 12619470 16927640
4754 16927640 17419600 14418510 13325160 13907642 16083581 18756755 21988876 27977830
$$ packed form
4808A0065658J784244K370073J891795L900182M462015K714106M939064Q665072
4800D0792209R067959R519729J4180765K1334643L3369096N0146201O9861589
4793B48272191M6134260j7623783l2185770o811409K6961458O4502040Q5697429
4786D14946416M8278070k1902475q4855855r7074265o9221260m7839233l3009517
4779A09321881k4138225j8368092j5898951j0581034n463610m183984l380395
4772B7307590l055622j954144k48538j487655p50536j02512R6835n64003k298996
4763A6942419l965624k694870k178601n1347L63806K66429O05329L331929M308170
4754A6927640M91960l001090j093350N82482K175939K673174L232121N988954
$$ plain form
4746 27977830 36993870 48252682 62673328 81887862 111895586 160670368 220770330
4739 220770330 235912515 190887735 138395322 98801740 72480543 54457995 40705161
4732 40705161 31626882 24621153 17818476 12367681 8834340 6009058 5594382 5944278
4724 5944278 6479616 6354075 5042968 5975821 8142523 7827204 6873613 6926057 6789449
4715 6789449 5933930 5724969 5232417 2041078 826123 3396125 6591077 7873877 7826528
4706 7826528 7178752 7442899 8038242 7964140 6867764 4279471 1723559 138658 -394913
4697 -394913 523078 1227288 2789079 3801797 3086558 2256413 4082852 4263978 2511385
4688 2511385 997414 -649689 -2180245 -508620 1451540 1711387 2540263 2273537 979052
$$ packed form
4746B7977830R016040J1258812J4420646J9214534L0007724M8774782O0099962
4739B20770330J5142185m5024780n2492413l9593582k6321197j8022548j3752834
4732D0705161r078279p005729o802677n450795l533341k825282m14676L49896
4724E944278N35338j25541j311107R32853K166702l15319r53591N2444j36608
4715F789449q55519k08961m92552l191339j214955K570002L194952J282800m7349
4706G826528o47776K64147N95343p4102j096376k588293k555912j584901n33571
4697c94913R17991P04210J561791J012718p15239q30145J826439J81126j752593
4688B511385j513971j647103j530556J671625J960160K59847Q28876k66726j294485
$$ plain form
4679 979052 966668 826730 262436 1078122 2197447 2490285 2027134 1035251 -357269 -678505
4669 -678505 -643398 1948102 2889046 2095792 3247140 3405933 3656780 4067136 3237128 1791184
4659 1791184 695006 -253806 -1079878 -622081 1706145 3399028 3700819 2096266 -521839
4650 -521839 -1933720 -3456995 -3461068 -1507535 -819265 -1593169 -1569080 94682 1331324
4641 1331324 -41300 -1892490 -1779854 -3064070 -3953189 -3015883 -2413416 -2436500 -3549222
4632 -3549222 -3859373 -1679160 -1309597 -2543060 -2328726 -1873190 -2396719 -1406994 1479872
4623 1479872 3176330 1788504 1836821 3249010 1628059 -667879 -1965069 -2783585 -4207287
4614 -4207287 -3521072 -3428340 -4407487 -4616520 -3922068 -702665 2860497 4355729 2339424
$$ packed form
4679I79052j2384j39938n64294Q15686J119325K92838m63151r91883j392520l21236
4669f78505L5107K591500R40944p93254J151348J58793K50847M10356q30008j445944
4659A791184j096178r48812q26072M57797K328226J692883L01791j604553k618105
4650e21839j411881j523275m073J953533O88270p73904K4089J663762J236642
4641A331324j372624j851190J12636j284216q89119R37306O02467k3084j112722
4632c549222l10151K180213L69563j233463K14334M55536n23529R89725K886866
4623A479872J696458j387826M8317J412189j620951k295938j297190q18516j423702
4614d207287O86215R2732r79147k09033O94452L219403L563162J495232k016305
$$ plain form
4605 2339424 -301904 -934639 -256908 185385 212960 -1149894 -213438 1154091 1239505
4596 1239505 3167799 4327800 3479646 2565307 1921287 188952 -951488 -741799 -821293
4587 -821293 -2411355 -3635557 -2400360 -1130539 -1163458 -678085 1628112 3211185 3011569
4578 3011569 4197515 3312465 1905030 3377711 5229467 5943774 6406774 5259182 3325672
4569 3325672 1183423 -556813 -532152 -1291811 -1933778 -544167 -948585 -1604439 -1646170
4560 -1646170 -2489852 -1352893 -782362 -859654 -1869808 -1799229 -997807 -1064607 -153106 1697513
4550 1697513 2273369 1033853 764161 1390094 1260732 -123541 -283514 -227005 1340822
4541 1340822 4029047 3260544 981954 320704 -207441 -542201 -648514 -1341303 -2789864
$$ packed form
4605B339424k641328o32735O77731M42293K7575j362854R36456J367529Q5414
4596A239505J928294J160001q48154r14339o44020j732335j140440K09689p9494
4587h21293j590062j224202J235197J269821l2919M85373K306197J583073j99616
4578C011569J185946q85050j407435J472681J851756P14307M63000j147592j933510
4569C325672k142249j740236K4661p59659o41967J389611m04418o55854m1731
4560a646170q43682J136959N70531p7292j010154P0579Q01422o6800R11501J850619
4550A697513N75856j239516k69692O25933j29362j384273j59973N6509J567827
4541A340822K688225p68503k278590o61250n28145l34760j06313o92789j448561
$$ plain form
4532 -2789864 -2040192 1542077 2467195 865104 139865 669994 919837 21357 39676
4523 39676 2192106 3833099 5046145 5719813 5117262 4700079 3995780 3567620 2523811
4514 2523811 2086031 1753337 1271491 2549612 3137113 3442831 4455875 5400779 3242210
4505 3242210 137485 -895573 -280829 -483130 534008 1525701 747070 -123715 -2401972
4496 -2401972 -4583699 -3685595 -1497881 -491699 -586941 156931 -491324 -2143686 -2909426
4487 -2909426 -3707201 -1423853 1328517 3158146 3980697 3980531 4298088 4865884 3491437
4478 3491437 1256625 1516484 2060123 3710361 5075069 3686619 2380862 1598600 -490764
4469 -490764 -1279385 104239 2253289 2662381 1928492 2447951 4137886 4267694 4496610
$$ packed form
4532b789864P49672L582269R25118j602091p25239N30129K49843q98480J8319
4523C9676K152430J640993J213046O73668o02551m17183p04299m28160j043809
4514B523811m37780l32694m81846J278121N87501L05718J013044R44904k158569
4505C242210l104725j033058O14744k02301J017138R91693p78631q70785k278257
4496b401972k181727Q98104K187714J006182r5242P43872o48255j652362p65740
4487b909426p97775K283348K752370J829629Q22551j66L17557N67796j374447
4478C491437k234812K59859N43639J650238J364708j388450j305757p82262k089364
4469d90764p88621J383624K149050M09092p33889N19459J689935J29808K28916
$$ plain form
4460 4496610 5579369 6946722 8209524 8031543 5524786 3375768 3929189 4570715 4581214
4451 4581214 4937284 6542178 8037399 8895584 5727919 2716956 697005 -725497 -581742
4442 -581742 828802 1419918 564340 -814615 840202 2633615 3128799 2828071 2659169
4433 2659169 2598792 653785 158275 1411901 1877463 1086866 442786 -1438014 -901776
4424 -901776 -1917131 -2140102 855816 1163037 399091 -1050334 -2263705 -3225446 -2828675
4415 -2828675 -1387828 -201923 -2063621 -3769593 -1443557 -68904 1656648 4358985
4407 4358985 4120669 2370515 1077052 1707985 1918343 1249205 527945 -193863 -552175
4398 -552175 -478110 514041 2041294 1400463 1432495 3182828 4034481 3920411 1909244 -1502770
$$ packed form
4460D496610J082759J367353J262802j77981k506757k149018N53421O41526J0499
4451D581214L56070J604894J495221Q58185l167665l010963k019951j422502J43755
4442e81742J410544N91116q55578j378955J654817J793413M95184l00728j68902
4433B659169o0377j945007m95510J253626M65562p90597o44080j880800N36238
4424i01776j015355k22971K995918L07221p63946j449425j213371r61741L96771
4415b828675J440847J185905j861698j705972K326036J374653J725552K702337
4407D358985k38316j750154j293463O30933K10358o69138p21260p21808l58312
4398e52175P4065R92151J527253o40831L2032J750333Q51653j14070k011167l412014
$$ plain form
4388 -1502770 -2125660 -1453047 -1985552 -2024341 -2057953 -2079966 -2119763 -2749638 -1647503 -2072570
4378 -2072570 -2569244 401700 3345666 3424619 3805687 2905061 3542116 5236899 4406422
4369 4406422 2000612 859987 1337809 707318 -157350 -1910996 -4284189 -3646605 -1555168
4360 -1555168 -745965 263723 1423390 1971385 1492686 935017 1170874 2780665 3664592
4351 3664592 2334270 1629565 2361907 2653853 3083953 3645696 2477345 1700701 1024595
4342 1024595 2031645 2992897 2195047 2995420 2047254 1097265 1340442 2267543 734856
4333 734856 -2572681 -3702787 -3514679 -1360586 -1094919 -1015809 393063 1234532 1766926
4324 1766926 3327870 2854095 81450 -321838 -757272 -3314799 -5214319 -2747858 340987
$$ packed form
4388a502770o22890O72613n32505l8789l3612k2013l9797o29875J102135m25067
4378b072570m96674K970944K943966P8953L81068r00626O37055J694783q30477
4369D406422k405810j140625M77822o30491q64668j753646k373193O37584K091437
4360a555168Q09203J009688J159667N47995m78699n57669K35857J609791Q83927
4351C664592j330322p04705P32342K91946M30100N61743j168351p76644o76106
4342A024595J007050R61252p97850Q00373r48166r49989K43177R27101j532687
4333G34856l307537j130106J88108K154093K65667P9110J408872Q41469N32394
4324A766926J560944m73775k772645m03288m35434k557527j899520K466461L088845
$$ plain form
4315 340987 2569475 3675719 3994184 2057113 2052551 1698676 329623 -374871 -387669 304
4305 304 -1257037 -3895716 -5252207 -3105724 56024 2032498 925437 371941 1044540
4296 1044540 -7269 -2214885 -2810714 -3213741 -1901823 1114902 2169384 2078856 -181029
4287 -181029 -1437875 -1024832 -1889227 -2270676 -1289129 -1582777 -1716704 -1836271 -1432854 -697480
4277 -697480 710463 1039124 -54928 1390724 4600367 5391203 4648123 3153659 2472297
4268 2472297 3556983 3135457 2652885 75355 -2608853 -3082673 -2538890 -1331321 -765626
4259 -765626 -35339 1590104 1449648 314209 -811957 -2096285 -2536673 -1977532 246624
4250 246624 1265534 1074411 -200111 -29638 1568290 4118933 4445251 4808580 4279827
$$ packed form
4315C40987K228488J106244L18465j937071m562l53875j369053p04494j2798L87973
4305C04j257341k638679j356491K146483L161748J976474j107061n53496O72599
4296A044540j051809k207616n95829m03027J311918L016725J054482r0528k259885
4287a81029j256846M13043q64395l81449R81547k93648j33927j19567M03417P35374
4277f97480J407943L28661j094052J445652L209643P90836p43080j494464o81362
4268B472297J084686m21526m82572k577530k684208m73820N43783J207569N65695
4259g65626P30287J625443j40456j135439j126166j284328m40388N59141K224156
4250B46624J018910j91123j274522J70473J597928K550643L26318L63329n28753
$$ plain form
4241 4279827 2379365 1360349 2051204 2698380 4171395 5061183 3790987 1700809 891717
4232 891717 210671 -33972 -313929 616816 2043159 1882722 1566751 419533 -1918430
4223 -1918430 -3235793 -508872 743510 250928 -1421218 -1942847 -1709794 -1891232 -2802978
4214 -2802978 -974960 806973 -754870 -3052898 -3389443 -2802984 -1067960 1037327 470385
4205 470385 -1979824 -5120250 -5130221 -3516192 -1213644 176578 1875298 4594093 5124731
4196 5124731 4389007 2909354 1703166 3047679 3611295 2014467 1762064 -276143 -2693931
4187 -2693931 -1460710 2106868 3865584 3166523 2315958 648006 -1318371 -2981976 -4510324
4178 -4510324 -5136579 -4566341 -4105208 -3221413 -2432779 -1750518 -740065 -737953 -2427799 -2182951
$$ packed form
4241D279827j900462j019016O90855O47176J473015Q89788j270196k090178q09092
4232H91717o81046k44643k79957R30745J426343j60437l15971j147218k337963
4223a918430j317363K726921J252382m92582j672146n21629K33053j81438r11746
4214b802978J828018J781933j561843k298028l36545N86459J735024K105287n66942
4205D70385k450209l140426r971J614029K302548J390222J698720K718795N30638
4196E124731p35724j479653j206188J344513N63616j596828k52403k038207k417788
4187b693931J233221L567578J758716o99061q50565j667952j966377j663605j528348
4178d510324o26255N70238M61133Q83795P88634O82261J010453K112j689846K44848
$$ plain form
4168 -2182951 76748 47641 -378498 358224 532647 380985 600390 1208529 4375026
4159 4375026 5409301 4516726 2030531 -185257 -688920 -2390497 -4613578 -7038160 -6187709
4150 -6187709 -3604061 -2193846 40512 1030620 1576424 3122123 5240033 7265046 5669029
4141 5669029 3193235 2242750 1412565 1249416 83173 -2022532 -3346677 -2638680 -944433
4132 -944433 -1219576 -2314986 -3441605 -3404336 -2003715 582838 2205859 1673908 1605609
4123 1605609 2253148 4031576 5422748 4431773 3503091 3358442 3082018 3139878 4021823
4114 4021823 2732391 1524102 2665479 2890504 368562 -1616219 -1846263 -1631730 -1994501
4105 -1994501 -1364671 836515 1397090 1354108 667194 -1668973 -1153693 1388671 1446123
$$ packed form
4168b182951K259699k9107m26139P36722J74423j51662K19405O08139L166497
4159D375026J034275q92575k486195k215788n03663j701577k223081k424582Q50451
4150f187709K583648J410215K234358R90108N45804J545699K117910K025013j596017
4141E669029k475794r50485q30185j63149j166243k105705j324145P07997J694247
4132i44433k75143j095410j126619L7269J400621K586553J623021n31951o8299
4123A605609O47539J778428J391172r90975r28682j44649k76424N7860Q81945
4114D021823j289432j208289J141377K25025k521942j984781k30044K14533l62771
4105a994501O29830K201186N60575m2982o86914k336167N15280K542364N7452
$$ plain form
4096 1446123 -38036 -1242778 -2215563 -663923 745951 -633828 1360031 2139084 603922
4087 603922 -332118 -1515002 -495463 1460913 590676 -580204 -513917 -54557 548898
4078 548898 1403160 2356154 2762792 3362840 2185443 2345901 2776566 1845135 2491881 3463292
4068 3463292 5069613 3228047 -17773 -1358711 -502698 -410482 -336395 956468 1745290
4059 1745290 3220461 5035422 5236994 4449743 2313357 -1336409 -3570571 -2548675 -2031278
4050 -2031278 -3097913 -2832131 -2067479 -256700 1664326 3568607 3879172 992213 -1624920
4041 -1624920 -1635341 -2988737 -3554506 -2423925 -1030848 -983550 -2167981 -3151302 -2815307
4032 -2815307 -1831741 -1069849 -1103876 -1364429 -2760263 -3925897 -3965057 -2799839 -559746
$$ packed form
4096A446123j484159j204742r72785J551640J409874j379779J993859P79053j535162
4087F03922r36040j182884J019539J956376q70237j170880O6287M59360O03455
4078E48898Q54262R52994M06638O00048j177397J60458M30665r31431O46746R71411
4068C463292J606321j841566l245820j340938Q56013R2216P4087J292863P88822
4059A745290J475171J814961K01572p87251k136386l649766k234162J021896N17397
4050b031278j066635K65782P64652J810779J921026J904281L10565k886959k617133
4041a624920j0421j353396n65769J130581J393077M7298j184431r83321L35995
4032b815307R83566P61892l4027k60553j395834j165634l9160J165218K240093
$$ plain form
4023 -559746 912516 1229686 1931617 3271886 2678693 2073957 141145 -2119748 -1969321
4014 -1969321 -455446 716573 2614076 2773575 514415 1295630 4429368 6034724 5974177
4005 5974177 3276677 695491 -549005 -2211893 -447156 2650929 4668889 4804551
3997 4804551 1878889 770784 650371 -875870 -2233867 -142725 2021874 2885650 1970338
3988 1970338 476009 759061 1042158 2203686 3296613 3104794 1632254 -303519 -2197290
3979 -2197290 -3573735 -3354753 -2389468 -721774 180746 894825 228082 665326 1689721
3970 1689721 2466445 3819951 1452731 -927446 -2005783 -1849657 -111546 1877158 2301658
3961 2301658 1637346 1808981 2094964 945656 1271988 2246779 1850587 1762993 2306845 2232693
$$ packed form
4023e59746J472262L17170P01931J340269n93193o04736j932812k260893J50427
4014a969321J513875J172019J897503J59499k259160P81215L133738J605356o0547
4005E974177k697500k581186j244496j662888J764737L098085K017960J35662
3997D804551k925662j108105j20413j526241j357997K091142K164599Q63776r15312
3988A970338j494329K83052K83097J161528J092927j91819j472540j935773j893771
3979b197290j376445K18982R65285J667694R02520P14079o66743M37244J024395
3970A689721P76724J353506k367220k380177j078337J56126J738111J988704M24500
3961B301658o64312J71635K85983j149308L26332R74791l96192q7594N43852p4152
$$ plain form
3951 2232693 1829588 989043 1169969 1742986 2219405 2192601 130187 -2242242 -3098705
3942 -3098705 -2307816 -2093252 -2039788 -727884 -928102 -2405530 -1131132 1693983 3329388
3933 3329388 1469012 -1162498 -1750243 928855 2631256 2359138 3352531 5718970 5984158
3924 5984158 4402641 1897984 659113 1116542 2551717 2815791 1331028 -745965 -2954015
3915 -2954015 -2414717 -296875 218122 -832525 -3559280 -5580909 -4300739 -2972334 -1583092
3906 -1583092 102444 -418722 -952334 -28081 1462184 931863 -1316121 -2324082 -2636633
3897 -2636633 -3060861 -2792883 -1978393 -1591584 -759659 -602727 242471 665256 -1109435
3888 -1109435 -709806 1096476 883403 804358 1924015 1754456 737951 13140 -197707
$$ packed form
3951B232693m03105q40545J80926N73017M76419k6804k062414k372429q56463
3942c098705P90889K14564N3464J311904k00218j477428J274398K825115J635405
3933C329388j860376k631510n87745K679098J702401k72118R93393K366439K65188
3924E984158j581517k504657j238871M57429J435175K64074j484763k076993k208050
3915b954015N39298K117842N14997j050647k726755k021629J280170J328405J389242
3906a583092J685536n21166n33612R24253J490265n30321k247984j007961l12551
3897b636633m24228K67978Q14490L86809Q31925J56932Q45198M22785j774691
3888a109435L99629J806282k13073p9045J119657j69559j016505p24811k10847
$$ plain form
3879 -197707 1935038 3612515 3846595 4122793 3948975 1686407 -7778 1109471 2011531
3870 2011531 438571 -171770 1229795 3126999 3632977 4248757 4942897 3957246 1660968
3861 1660968 -1033051 -472672 110981 1868571 3323105 1839327 -1341604 -2298040 -448130
3852 -448130 1331242 -105516 -2220837 -1967491 -1345906 -1679649 -2690631 -1346105 395129
3843 395129 75727 -273269 2598848 5541321 4164315 746962 -2181614 -1818305 1955828
3834 1955828 3677014 3396950 3608391 4751969 4949145 4767169 3503453 2506880 774229
3825 774229 -414594 689183 1577427 37446 -1644908 -1543743 -1398428 -2238242 -3270388
3816 -3270388 -2117081 -526216 -705975 -1096294 -1263149 -439803 2167009 3899445 2814232
$$ packed form
3879a97707K132745J677477K34080K76198j73818k262568j694185J117249R02060
3870B011531j572960o10341J401565J897204N05978O15780O94140r85651k296278
3861A660968k694019N60379N83653J757590J454534j483778l180931r56436J849910
3852d48130J779372j436758k115321K53346O21585l33743j010982J344526J741234
3843C95129l19402l48996K872117K942473j377006l417353k928576L63309L774133
3834A955828J721186k80064K11441J143578J97176j81976j263716r96573j732651
3825G74229j188823J103777Q88244j539981j682354J01165J45315q39814j032146
3816c270388J153307J590865j79759l90319j66855Q23346K606812J732436j085213
$$ plain form
3807 2814232 2225755 -473048 -2925446 -2397211 361455 2820644 3947169 5114812 7771989
3798 7771989 9456778 9025916 7410768 4742180 2491206 951323 721020 1161081 3260087
3789 3260087 4777920 3009703 -630644 -3935905 -4471047 -2871757 107817 1040443 -993004
3780 -993004 -3079036 -2940047 -470934 3097745 4993450 4267713 3597629 3241484 1429315
3771 1429315 201137 991056 1060649 1007586 578584 770628 3007072 3936192 2199763
3762 2199763 750112 1625168 3901210 3780628 1689122 193125 352184 708397 -1306384
3753 -1306384 -3662891 -2752904 258534 2021035 1800789 679617 -1977355 -1894772 -591314
3744 -591314 684106 790278 -294323 96776 1123816 1093921 385020 1941329 3561386
$$ packed form
3807B814232n88477k698803k452398N28235K758666K459189J126525J167643K657177
3798G771989J684789m30862j615148k668588k250974j539883k30303M40061K099006
3789C260087J517833j768217l640347l305261n35142J599290K979574R32626k033447
3780i93004k086032J38989K469113L568679J895705p25737o70084l56145j812169
3771A429315j228178P89919O9593n3063m29002J92044K236444R29120j736429
3762B199763j449651Q75056K276042j20582k091506j495997J59059L56213k014781
3753a306384k356507R09987L011438J762501k20246j121172k656972Q2583J303458
3744e91314J275420J06172j084601L91099J027040k9895p08901J556309J620057
$$ plain form
3735 3561386 4185583 3631877 1098407 392320 -9615 -1284205 -1628930 -1791998 -2853477
3726 -2853477 -3840043 -4562049 -3414565 -1837902 -1903604 -3979885 -5146867 -4051171 -4589113
3717 -4589113 -4873193 -3143631 -721613 1212424 -37929 -1688672 -2193510 -1640988 771541
3708 771541 2359527 1378911 52437 -536928 -646728 635204 2969849 2524831 -1902793
3699 -1902793 -5487062 -4513461 -1863474 -595739 -618585 -1235206 -2445594 -3571064 -4216299
3690 -4216299 -4686481 -4130219 -2888132 -888716 1014182 -387439 -1875062 -1650067 -2228287
3681 -2228287 -2761957 -1961611 -1477298 -1654990 -1178741 -1880617 -3916650 -3846564 -5185693
3672 -5185693 -5593008 -3885377 -2252699 -1008753 -495204 -998200 -1097885 -303294 -1604832
$$ packed form
3735C561386O24197n53706k533470p06087m01935j274590l44725j63068j061479
3726b853477r86566p22006J147484J576663o5702k076281j166982J095696n37942
3717d589113k84080J729562K422018J934037j250353j650743n04838N52522K412529
3708G71541J587986r80616j326474n89365j09800J281932K334645m45018m427624
3699a902793l584269R73601K649987J267735k2846o16621j210388j125470o45235
3690d216299m70182N56262J242087J999416J902898j401621j487623K24995n78220
3681b228287n33670Q00346M84313j77692M76249p01876k036033P0086j339129
3672e185693m07315J707631J632678J243946N13549n02996r9685P94591j301538
$$ plain form
3663 -1604832 -1581724 -836052 -245886 1597438 2745230 3119664 3526277 2525032 3876633
3654 3876633 5598619 6473425 5116139 1754042 -1129668 -3166260 -3052158 -3787096 -3678812
3645 -3678812 -1379062 1188111 3162725 2155983 -951189 -2398343 -3841812 -5168844
3637 -5168844 -2129668 -654291 -1980538 -2755851 -2435813 170973 2356456 1940249 1602656
3628 1602656 3224673 4872217 4558651 1944070 259835 -199089 -462377 152395 -503698
3619 -503698 475535 2555671 4294875 4888276 2070647 1161313 1401057 -567115 -2065369
3610 -2065369 -4470597 -4918862 -4038704 -3440763 -2271898 -181909 902228 245552 643506
3601 643506 1996054 3256441 5363349 4498165 869043 -2280768 -1230124 -551573 885357
$$ packed form
3663a604832K3108P45672N90166J843324J147792L74434M06613j001245J351601
3654C876633J721986Q74806j357286l362097k883710k036592J14102p34938J08284
3645c678812K299750K567173J974614j006742l107172j447154j443469j327032
3637e168844L039176J475377j326247p75313L20038K606786K185483m16207l37593
3628A602656J622017J647544l13566k614581j684235m58924k63288O14772o56093
3619e03698R79233K080136J739204N93401k817629r09334K39744j968172j498254
3610b065369k405228m48265Q80158N97941J168865K089989J084137o56676L97954
3601F43506J352548J260387K106908q65184l629122l149811J050644O78551J436930
$$ plain form
3592 885357 3446333 3617738 673413 -1103148 98251 722816 1151786 894260 1562446
3583 1562446 1255179 -755505 -2841352 -3161963 -1127983 1040583 993991 965022 2443867
3574 2443867 856083 -1360158 -2061828 -2368768 -1990393 -1621851 -3237585 -5019713 -4754060
3565 -4754060 -4689156 -3338928 -1350795 449470 2247416 3057028 1198303 119549 776946
3556 776946 850279 -1259754 -1318468 -1391800 -1897864 -2659752 -2653087 -1912042 -2305565 -2085639
3546 -2085639 -2469200 -2893834 -3415407 -4501636 -3905712 -929219 1000516 1018296 -869718
3537 -869718 -1571234 -2932070 -2404598 -350048 2351603 5258247 1462258 -2189108 -1642047
3528 -1642047 480477 667831 -2316089 -4030900 -2684990 -2181031 -1908763 -891719 192978
$$ packed form
3592H85357K560976J71405k944325j776561J201399O24565M28970k57526O68186
3583A562446l07267k010684k085847l20611K033980K168566m6592k8969J478845
3574B443867j587784k216241p01670l06940L78375L68542j615734j782128K65653
3565d754060O4904J350228J988133J800265J797946Q09612j858725j078754O57397
3556G76946P3333k110033n8714p3332n06064p61888O665P41045l93523K19926
3546b085639l83561m24634n21573j086229N95924K976493J929735J7780j888014
3537h69718p01516j360836N27472K054550K701651K906644l795989l651366N47061
3528a642047K122524J87354k983920j714811J345910N03959K72268J017044J084697
$$ plain form
3519 192978 1210021 1110209 -434718 -2035935 -1638022 -1140287 -2132453 -2126734 -501337 768372
3509 768372 351927 1002287 3044273 3817252 2302607 1406435 2405445 3262548 4536354
3500 4536354 3766479 273234 -2394687 -2160161 -2379114 -5121446 -7104388 -8464205 -6606722
3491 -6606722 -5432674 -4931757 -3137723 214042 1687100 1846041 1542949 9027 -2976280
3482 -2976280 -3727864 -1499079 -1117226 -1678201 -1753275 -1390464 -1112351 -643586 -415497 577845
3472 577845 1740886 2227997 1158044 -403878 -2775687 -3184370 -2879853 -3256923 -1102079
3463 -1102079 1328565 1444482 892766 255989 -1028223 -181324 1191307 3080403 5122963
3454 5122963 4204229 3391567 3817856 4244812 4168053 4339606 3420593 1816273 1454280 2127867
$$ packed form
3519A92978J017043r9812j544927j601217L97913M97735r92166N719J625397J269709
3509G68372m16445O50360K041986P72979j514645q96172R99010Q57103J273806
3500D536354p69875l493245k667921K34526k18953k742332j982942j359817J857483
3491f606722J174048N00917J794034L351765J473058J58941l03092j533922k985307
3482b976280p51584K228785L81853n60975p5074L62811K78113M68765K28089R93342
3472E77845J163041M87111j069953j561922k371809m08683L04517l77070K154844
3463a102079K430644J15917n51716o36777j284212Q46899J372631J889096K042560
3454E122963r18734q12662M26289M26956p6759J71553r19013j604320l61993O73587
$$ plain form
3444 2127867 1414181 -2095045 -5661403 -7291540 -8841463 -8874207 -8513340 -7544769 -6591013
3435 -6591013 -7198687 -8406287 -8402331 -6494547 -4019008 -3150657 -3077265 -3043606 -2129048 -351931
3425 -351931 450785 367411 -157756 -981953 -958598 -2174205 -4013822 -4715714 -2834447 52181
3415 52181 2324352 4639157 6231633 5878854 5221346 5380605 3518750 1667827 2372556
3406 2372556 3158449 1995978 -264501 -2515845 -3458364 -3768420 -3555915 -2519146 -2758920
3397 -2758920 -1568848 -576894 -2491458 -4080959 -4454134 -5205192 -5316630 -2977923 -657818
3388 -657818 259931 455485 -1300310 -2576324 -903285 4334907 5726826 3466354 3381624
3379 3381624 3409557 2563158 1657758 -638433 -2870196 -1943671 -1422021 -1566364 -1149321
$$ packed form
3444B127867p13686l509226l566358j630137j549923l2744L60867R68571R53756
3435f591013o07674j207600L956J907784K475539Q68351P3392L3659R14558J777117
3425c51931Q02716q3374n25167q24197K3355j215607j839617p01892J881267K886628
3415E2181K272171K314805J592476l52779o57508J59259j861855j850923P04729
3406B372556P85893j162471k260479k251344r42519l10056K12505J036769k39774
3397b758920J190072R91954j914564j589501l73175p51058j11438K338707K320105
3388f57818R17749J95554j755795j276014J673039N238192J391919k260472q4730
3379C381624K7933q46399r05400k296191k231763R26525N21650j44343M17043
$$ plain form
3370 -1149321 -763334 -1508425 -1695063 -392179 1654435 3033948 2210432 -791388 -2523862
3361 -2523862 -4372109 -6979387 -6829810 -4967329 -3240952 -2935144 -4316683 -6247294 -8333982
3352 -8333982 -7389135 -4412552 -2954229 -2870311 -4595551 -4524671 -2737608 -2665495 -3023528
3343 -3023528 -2847994 -2842504 -4477808 -4899524 -5278244 -5609988 -6021807 -6759436 -7560241 -6826634
3333 -6826634 -5597306 -7112674 -9213774 -9387377 -7168538 -4905470 -5196142 -5457965 -6034290
3324 -6034290 -6319701 -5760465 -5012092 -2441200 -388923 -1926256 -3543819 -4176179 -4377263
3315 -4377263 -5261993 -5086585 -3938232 -3376346 -1649455 -2079318 -2005555 459706 995491
3306 995491 232988 864432 -119347 -1003801 -28211 1175448 2899310 4027286 2204686
$$ packed form
3370a149321L85987p45091j86638J302884K046614J379513q23516l001820j732474
3361b523862j848247k607278J49577J862481J726377L05808j381539j930611k086688
3352h333982R44847K976583J458323Q3918j725240P0880J787063P2113l58033
3343c023528J75534N490j635304m21716l78720l31744m11819p37629q00805P33607
3333f826634J229328j515368k101100j73603K218839K263068k90672k61823n76325
3324f034290k85411N59236P48373K570892K052277j537333j617563o32360k01084
3315d377263q84730J75408J148353N61886J726891m29863P3763K465261N35785
3306I95491p62503O31444r83779q84454R75590J203659J723862J127976j822600
$$ plain form
3297 2204686 806148 1494034 1358565 2930769 4360808 3602393 2257522 2021927 2298299
3288 2298299 1082010 -754368 -3468449 -8554661 -9404953 -5927524 -2469981 -1480417 -1004823
3279 -1004823 -94852 242514 -949657 -3217822 -4463276 -3224839 582281 1248251 -1342482
3270 -1342482 -3224231 -4184117 -2053361 774821 2100380 -401469 -2648665 -2425817 -1359579
3261 -1359579 333870 2611543 5380388 4174428 2259156 2674753 1959112 -1066918 -2140002
3252 -2140002 -1287947 -469853 206162 1088267 2661269 4502436 5411936 3827998 2755376
3243 2755376 2458976 1063634 1266405 2143421 1398582 814705 2177700 2622991 643296
3234 643296 -2193182 -3946501 -5382323 -6333428 -6109600 -4902445 -3441346 -3605816 -3520216
$$ packed form
3297B204686j398538O87886j35469J572204J430039p58415j344871k35595K76372
3288B298299j216289j836378k714081n086212q50292L477429L457543R89564M75594
3279a004823R09971L37366j192171k268165j245454J238437L807120O65970k590733
3270a342482j881749r59886K130756K828182J325559k501849k247196K22848J066238
3261a359579J693449K277673K768845j205960j915272M15597p15641l026030j073084
3252b140002Q52055Q18094O76015Q82105J573002J841167R09500j583938j072622
3243B755376k96400j395342K02771Q77016p44839n83877J362995M45291j979695
3234F43296k836478j753319j435822r51105K23828J207155J461099j64470Q5600
$$ plain form
3225 -3520216 -2998998 -523559 3801011 4047280 3472874 1844260 20982 189943 -1126020
3216 -1126020 -3045295 -2294699 -978541 -1972821 -2881545 -2488511 -1707244 -1353381 478719
3207 478719 1762568 -507834 -1970583 -556096 -94770 -345433 -788774 595688 2058283
3198 2058283 884544 440984 1846523 2765952 1645220 -178166 -1989349 -2459466 -1864492
3189 -1864492 -1200295 -1187014 -1475187 -3847212 -4893037 -5120723 -6651008 -5797259 -3571198
3180 -3571198 -2613181 -2581809 -3192901 -3579988 -3017129 -1733048 -1298709 -3783910 -4118628
3171 -4118628 -1097554 584261 -104526 -768445 -1718830 -3284921 -2645982 -2103002 -1743607
3162 -1743607 -1131071 -2648536 -4851265 -4112658 -923355 106082 -1383027 -2462872 -1909382
$$ packed form
3225c520216N21218K475439M324570K46269n74406j628614j823278J68961j315963
3216a126020j919275P50596J316158r94280r08724L93034P81267L53863J832100
3207D78719J283849k270402j462749J414487M61326k50663m43341J384462J462595
3198B058283j173739m43560J405539R19429j120732j823386j811183m70117N94974
3189a864492O64197J3281k88173k372025j045825k27686j530285Q53749K226061
3180c571198R58017L1372o11092l87087N62859J284081M34339k485201l34718
3171d118628L021074J681815o88787o63919r50385j566091O38939N42980L59395
3162a743607O12536j517465k202729P38607L189303J029437j489109j079845N53490
$$ plain form
3153 -1909382 272135 382644 -710446 -274650 633400 -680355 -3351708 -4729302 -4532269
3144 -4532269 -2796943 -1231510 -2475793 -2034389 -1861267 -3273449 -3888550 -3401427 -2660194
3135 -2660194 -1048314 -271290 -2083593 -2920174 -3514539 -1978103 -43569 -635438 -1033169
3126 -1033169 263324 2794751 3113705 4223760 7338866 9253053 7319789 4940977
3118 4940977 2667344 1204770 2004658 3701763 4155842 4185788 4534171 4369232 3807396
3109 3807396 1692866 663625 276810 -791633 -1184588 -792774 1594576 1779677 1599155
3100 1599155 757069 844203 2177893 2443010 1755588 1052645 1387261 3136059 4436353
3091 4436353 3694547 2299073 2267205 683357 -63745 1424222 2756565 2924159 1065109
$$ packed form
3153a909382K181517J10509j093090M35796R08050j313755k671353j377594J97033
3144d532269J735326J565433j244283M41404J73122j412182o15101M87123P41233
3135b660194J611880P77024j812303q36581n94365J536436J934534n91869l97731
3126a033169J296493K531427L18954J110055L115106J914187j933264k378812
3118D940977k273633j462574P99888J697105M54079K9946L48383j64939n61836
3109C807396k114530j029241l86815j068443l92955L91814K387350J85101j80522
3100A599155q42086Q7134J333690K65117o87422p02943L34616J748798J300294
3091D436353p41806j395474l1868j583848p47102J487967J332343J67594j859050
$$ plain form
3082 1065109 142869 -49744 2068040 3177324 2804912 2645589 2088992 2679194 4398230
3073 4398230 5177218 4626377 3549181 2772510 -177604 -1173927 -1357250 -54331 1116397
3064 1116397 562211 -1297903 -2226828 -1346524 14328 -796307 -2182083 -3290205 -4102109
3055 -4102109 -6288481 -4660999 -2176422 -2524854 -2637776 -2168025 -2367846 -1703976 -993832
3046 -993832 -735853 40167 -662659 -1748304 -806878 1596035 2774471 2155768 957906
3037 957906 287283 348891 1328437 3684884 4975131 4299821 3753258 1867889 1539880
3028 1539880 2127378 2725759 2049980 -732601 -2050573 -542766 1406664 1860540 875416
3019 875416 445778 897783 1147249 839910 -591430 -1307488 -923882 -211733 430763 1222683
$$ packed form
3082A065109r22240j92613K117784J109284l72412j59323n56597N90202J719036
3073D398230P78988n50841j077196p76671k950114r96323j83323J302919J170728
3064A116397n54186j860114r28925Q80304J360852q10635j385776j108122q11904
3055d102109k186372J627482K484577l48432j12922M69751j99821O63870P10144
3046i93832K57979P76020p02826j085645R41426K402913J178436o18703j197862
3037I57906o70623O1608R79546K356447J290247o75310n46563j885369l28009
3028A539880N87498N98381o75779k782581j317972J507807J949430M53876r85124
3019H75416m29638M52005K49466l07339j431340p16058L83606P12149O42496P91920
$$ plain form
3009 1222683 1014812 575257 2775913 3087033 468297 -816495 610274 1548700 -726897
3000 -726897 -935874 520332 192582 -1081147 -1432614 -2420887 -3024338 -2912836 -4237945
2991 -4237945 -2890749 1154521 4119186 5846754 4932560 2885545 711921 -490621
2983 -490621 -252281 -787991 -1032897 -1140288 -2572457 -3539088 -2118550 -1138083 -1496774
2974 -1496774 -2025678 -3019694 -4343187 -3477384 -1151357 -335514 26675 1949460 819064
2965 819064 -388801 222629 671243 -30258 574569 116366 -3516422 -5391923 -3292041
2956 -3292041 -1740185 -1559934 -2134532 -1702692 595010 3120797 2525171 -1591163 -4830561
2947 -4830561 -5768711 -3344607 -591978 -718615 198885 1634992 2523947 1925589 140725
$$ packed form
3009A222683k07871m39555K200656L11120k618736j284792J426769R38426k275597
3000g26897k08977J456206l27750j273729l51467r88273o03451J11502j325109
2991d237945J347196M045270K964665J727568r14194k047015k173624j202542
2983d90621K38340n35710k44906j07391j432169r66631J420538R80467l58691
2974a496774n28904r94016j323493Q65803K326027Q15843L62189J922785j130396
2965H19064j207865O11430M48614p01501O04827m58203l632788j875501K099882
2956c292041J551856J80251n74598M31840K297702K525787n95626m116334l239398
2947d830561r38150K424104K752629j26637R17500J436107Q88955n98358j784864
$$ plain form
2938 140725 -723156 -2102827 -2825778 -1219848 800181 3030934 4777383 4394843 4710464
2929 4710464 4236352 1471884 424612 574100 -1636188 -3893284 -3687788 -3170162 -3673757
2920 -3673757 -4355817 -5372808 -4524075 -3946947 -3077764 193631 1172684 113704 -320384
2911 -320384 209557 -257909 249938 153798 -1928333 -1190830 697666 1910925 2820484
2902 2820484 1925373 1171007 -2318514 -5355846 -3710915 -912233 -920863 -1131772 -801317
2893 -801317 -332710 1717612 3355787 3781767 2960035 1372787 371487 280141 -214639
2884 -214639 83020 553480 -1501144 -3918200 -3708598 -3341747 -1867868 -2007888 -3130646
2875 -3130646 -4273086 -4858098 -1454368 2809351 4830311 4683932 3833955 2837245 1232452
$$ packed form
2938A40725q63881j379671p22951J605930K020029K230753J746449l82540L15621
2929D710464m74112k764468j047272J49488k210288k257096K05496N17626n03595
2920c673757o82060j016991Q48733N77128Q69183L271395R79053j058980m34088
2911c20384N29941m67466N07847r6140k082131P37503J888496J213259R09559
2902B820484q95111p54366l489521l037332J644931K798682q630k10909L30455
2893h01317M68607K050322J638175M25980q21732j587248j001300r1346m94780
2884b14639K97659M70460k054624k417056K09602L66851J473879j40020j122758
2875c130646j142440n85012L403730M263719K020960j46379q49977r96710j604793
$$ plain form
2866 1232452 164294 -131617 925991 852812 1099 147494 2531562 4480396 4269676
2857 4269676 4000394 3999778 4019075 4254526 3899870 4186689 4957947 4117718 2979084 2414589
2847 2414589 3010354 2703263 1432748 685391 -487319 -255880 264382 -404408 84172
2838 84172 1436768 1721163 1749719 2081721 1636697 166672 -1303289 -3213559 -5637519
2829 -5637519 -5271659 -3466539 -2881883 -2688287 -4934552 -7983861 -7910089 -8088253 -6541589
2820 -6541589 -3424364 -1601813 -2888435 -4636589 -4450944 -3294452 -1963577 -958689
2812 -958689 -1301794 -3258688 -4809012 -4135419 -3393613 -3462860 -3506778 -4401147 -3976090 -1320808
2802 -1320808 251230 -922276 -2243002 -3801169 -2716192 -414464 422909 1308023 1725219
$$ packed form
2866A232452j068158k95911J057608p3179q51713J46395K384068J948834k10720
2857D269676k69282o16J9297K35451l54656K86819P71258q40229j138634n64495
2847B414589N95765l07091j270515p47357j172710K31439N20262o68790M88580
2838H4172J352596K84395K8556L32002m45024j470025j469961j910270k423960
2829e637519L65860J805120N84656J93596k246265l049309P3772j78164J546664
2820f541589L117225J822551j286622j748154J85645J156492J330875J004888
2812i58689l43105j956894j550324O73593P41806o9247m3918q94369M25057K655282
2802a320808J572038j173506j320726j558167J084977K301728Q37373Q85114M17196
$$ plain form
2793 1725219 1988417 2239375 118240 -1178900 -1039136 -1904954 -2764697 -3929979 -3843399
2784 -3843399 -1949534 -867279 -1521797 -2542638 -1939298 -1863568 -2915268 -4612077 -4568522
2775 -4568522 -1915670 -484458 -367479 -628750 -1115651 -1167555 551781 2812729 3121340
2766 3121340 4122735 5834923 5101226 2556403 1153483 54882 -2457779 -3895385
2758 -3895385 -3007363 -734915 807009 616205 1801038 1138517 -1267957 -1610647 507889
2749 507889 2580431 3738352 3478926 2792954 2261815 2189851 1479794 1215659 -170338
2740 -170338 -1441291 11449 3742465 3602792 137358 -1204828 2131597 4282713 3676999
2731 3676999 3607846 3973409 2654826 1335399 1840529 2522967 875200 352228 98489
$$ packed form
2793A725219K63198K50958k121135j297140J39764q65818q59743j165282Q6580
2784c843399J893865J082255o54518j020841O03340P5730j051700j696809M3555
2775d568522K652852J431212J16979k61271m86901n1904J719336K260948L08611
2766C121340J001395J712188p33697k544823j402920j098601k512661j437606
2758c895385Q88022K272448J541924j90804J184833o62521k406474l42690K118536
2749E07889K072542J157921k59426o85972n31139p1964p10057k64135j385997
2740a70338j270953J452740L731016j39673l465434j342186L336425K151116o05714
2731C676999o9153L65563j318583j319427N05130O82438j647767n22972k53739
$$ plain form
2722 98489 -1626506 -2574967 -1441708 -2155018 -3036572 -3117705 -3256353 -857053 -571039 -3255785
2712 -3255785 -3710831 -3662095 -3827806 -1845083 -879694 -540170 464956 1809534 2074815
2703 2074815 1506514 1875268 1307253 2577842 3054669 3303764 4324929 5816512 6361500
2694 6361500 2877209 1074199 1886544 3423233 4071031 4065560 2971409 676276 -1674405
2685 -1674405 -4259883 -5003348 -3532995 -3804962 -1777875 304475 1843857 2034517 1087689
2676 1087689 -1472064 -2823670 -3084448 -3774119 -2004234 689193 496434 238227 -629463
2667 -629463 -1242436 -80922 -726421 -1395968 -613807 453422 1127863 410587 281320
2658 281320 1021017 752575 -731644 -1413780 -1615993 -2603097 -3856599 -4237545 -3737134
$$ packed form
2722I8489j724995r48461J133259p13310q81554q1133j38648K399300K86014k684746
2712c255785m55046M8736j65711J982723R65389L39524J005126J344578K65281
2703B074815n68301L68754n68015J270589M76827K49095J021165J491583N44988
2694F361500l484291j803010Q12345J536689O47798n471j094151k295133k350681
2685a674405k585478p43465J470353k71967K027087K082350J539382J90660r46828
2676A087689k559753j351606k60778o89671J769885K693427j92759k58207q67690
2667f29463o12973J161514o45499o69547P82161J067229O74441p17276j29267
2658B81320P39697k68442j484219o82136k02213r87104j253502l80946N00411
$$ plain form
2649 -3737134 -3978420 -4529916 -2936470 -1158387 -961377 -1431507 -2497369 -3828765 -3062963
2640 -3062963 -1232267 -857958 -285729 -609941 1136063 2243762 2404271 1999966 -459257
2631 -459257 298786 1397960 56705 -2018650 -1643263 -1242849 -428429 114328 99721
2622 99721 192997 1042029 808483 100001 275407 490123 808759 1252965 1269664 694295
2612 694295 -697790 -2803357 -3689281 -1658218 2822504 3608521 928652 -619630 -1638802
2603 -1638802 -1339386 703273 2039781 1556659 859049 -1204224 -2360512 -1836017 1092358
2594 1092358 2626888 2906208 3208886 4356644 3259028 1915708 1223852 228004 -169255
2585 -169255 -462861 -2143216 -4945904 -6408619 -6357751 -5299437 -4808369 -3011444 -1227371
$$ packed form
2649c737134k41286n51496J593446J778083J97010m70130j065862j331396P65802
2640c062963J830696L74309N72229l24212J746004J107699J60509m04305k459223
2631d59257P58043J099174j341255k075355L75387M00414Q14420N42757j4607
2622I9721R3276Q49032k33546p08482J75406K14716L18636M44206J6699n75369
2612F94295j392085k105567q85924K031063M480722P86017k679869j548282j019172
2603a638802K99416K042659J336508m83122o97610k063273j156288N24495K928375
2594A092358J534530K79320L02678J147758j097616j343320o91856r95848l97259
2585a69255k93606j680355k802688j462715N0868J058314M91068J796925J784073
$$ plain form
2576 -1227371 -280698 -358790 -429617 214626 1235875 1607233 2499119 3199622 2193633 1351918
2566 1351918 601200 153299 -1023345 -3421838 -3291311 -1913178 -162235 910372 287909
2557 287909 -353540 -995492 -887100 -955734 1504043 4103201 3535278 -267120 -3302134
2548 -3302134 -3783568 -1632931 602790 1252510 2365135 2370036 2018511 1763671 1669519 -1451997
2538 -1451997 -3514808 -1969439 2645409 5847063 4053470 256676 -1344920 -177315
2530 -177315 745769 1024973 822642 -1502855 -3341654 -2063009 -90733 1530462 2043425
2521 2043425 1649129 963560 -236475 -2205553 -2130970 -400347 -74100 -2897156 -4125584
2512 -4125584 -1733238 -147424 -1320608 -2823836 -3515064 -4396403 -5689837 -5127092 -3418809
$$ packed form
2576a227371R46673p8092p0827O44243J021249L71358Q91886P00503j005989q41715
2566A351918p50718m47901j176644k398493J30527J378133J750943J072607o22463
2557B87909o41449o41952J08392o8634K459777K599158n67923l802398l035014
2548c302134m81434K150637K235721O49720J112625M901l51525k54840r4152l121516
2538a451997k062811J545369M614848L201654j793593l796794j601596J167605
2530a77315R23084K79204k02331k325497j838799J278645J972276J621195N12963
2521B043425l94296o85569j200035j969078P4583J730623L26247k823056j228428
2512d125584K392346J585814j173184j503228o91228q81339j293434N62745J708283
$$ plain form
2503 -3418809 -2731256 -2822531 -1585744 148883 2055154 3606975 4548965 4977071 5033701
2494 5033701 6212307 6481398 4942422 2912390 393127 -969154 -1545036 -370407 266437
2485 266437 546982 1537026 2064063 2200157 1774112 411355 -470454 -1588158 -2666212
2476 -2666212 -1188505 -26160 781090 2366116 2568192 2612692 784595 -1590178 -2298695
2467 -2298695 -2771482 -4361260 -4831468 -3303148 -2346479 -1598296 -784348 29255 1850251
2458 1850251 3596389 5264215 6015913 4962435 2505650 1013379 2217903 4785041
2450 4785041 5525605 2514583 -641330 -567968 1063714 984359 737129 2860492 6357196
2441 6357196 6444412 5329513 2912663 814898 1409210 2852833 1466722 1234019 2805784
$$ packed form
2503c418809O87553r1275J236787J734627J906271J551821R41990M28106N6630
2494E033701J178606K69091j538976k030032k519263j362281n75882J174629O36844
2485B66437K80545R90044N27037J36094m26045j362757q81809j117704j078054
2476b666212J477707J162345Q07250J585026K02076M4500j828097k374773p08517
2467b298695m72787j589778m70208J528320R56669P48183Q13948Q13603J820996
2458A850251J746138J667826P51698j053478k456785j492271J204524K567138
2450D785041P40564l011022l155913P3362J631682p9355k47230K123363L496704
2441F357196Q7216j114899k416850k097765N94312J443623j386111k32703J571765
$$ plain form
2432 2805784 2990867 2649639 1929894 1673605 1544448 1731800 1807919 983913 -471023 -1943730
2422 -1943730 -1741218 -674509 445196 798821 -407488 -2412613 -3345626 -2747579 -1295937
2413 -1295937 -1997149 -3129440 -2163104 -2429366 -1806921 -487679 -275821 2101706 1922504
2404 1922504 -503559 -1846781 -1343800 -1001609 -503769 -365564 763496 4007971 6473291
2395 6473291 4929127 2464091 -661458 -3102065 -2385061 533676 2291162 -569180
2387 -569180 -3316770 -5092474 -6724010 -5307790 -2647993 -1362907 -482926 368568 111393
2378 111393 972131 464466 -1821729 -4136600 -4682374 -3444144 -1094672 980282 1154156
2369 1154156 3411883 6409010 6357941 5153032 4005730 4760973 5268787 5004572 4514393
$$ packed form
2432B805784J85083l41228p19745k56289j29157J87352P6119q24006j454936j472707
2422a943730K02512J066709J119705L53625j206309k005125r33013N98047J451642
2413a295937p01212j132291R66336k66262O22445J319242K11858K377527j79202
2404A922504k426063j343222N02981L42191M97840J38205J129060L244475K465320
2395F473291j544164k465036l125549k440607P17004K918737J757486k860342
2387e69180k747590j775704j631536J416220K659797J285086Q79981Q51494k57175
2378A11393Q60738n07665k286195k314871n45774J238230K349472K074954J73874
2369A154156K257727K997127n1069j204909j147302P55243N07814k64215m90179
$$ plain form
2360 4514393 4809509 5545990 5160922 3214264 1790769 867050 238568 -2571651 -6373813
2351 -6373813 -7029247 -4669631 -1919105 -1387889 -1751741 -1674086 -2198891 -1250534 -674899
2342 -674899 -1076378 261849 893662 597864 -400476 -981068 -3057184 -4831143 -3361244
2333 -3361244 -1536007 -320346 -411757 -1261321 15253 1175070 2247788 3539081 3542215
2324 3542215 3837658 2812215 2237518 2328181 2354589 930618 -1345500 -1936517 -926889
2315 -926889 -643852 -633266 -365677 -1469711 -3407002 -5107303 -4723440 -2661112 -1602114
2306 -1602114 -1110433 -494170 331544 2186505 1583864 -984587 -661940 -271472 -200744
2297 -200744 1109161 880159 -306388 -1606046 -2515303 -1292739 329760 1324863 1785324
$$ packed form
2360D514393K95116P36481l85068j946658j423495r23719o28482k810219l802162
2351f373813o55434K359616K750526N31216l63852P7655n24805R48357N75635
2342f74899m01479J338227O31813k95798r98340n80592k076116j773959J469899
2333c361244J825237J215661r1411q49564J276574J159817J072718J291293L134
2324C542215K95443j025443n74697R0663K6408j423971k276118n91017J009628
2315i26889K83037J0586K67589j104034j937291j700301L83863K062328J058998
2306a602114M91681O16263Q25714J854961o02641k568451L22647L90468P0728
2297b00744J309905k29002j186547j299658r09257J222564J622499R95103M60461
$$ plain form
2288 1785324 1849 -1696929 -2221337 -2159246 -1840649 -1269415 -715569 11124 170271
2279 170271 38509 1421595 1808405 878171 -1018419 -4058131 -3100728 68695 388222
2270 388222 337884 649841 1935467 1207631 -716060 -1174722 -548984 -1561253 -2500299
2261 -2500299 -2280471 -3287262 -3154380 -1597431 -1359862 -3401763 -5339256 -5601784 -4636902
2252 -4636902 -3789406 -2383582 -1050462 -1044132 -1784146 -2054014 -376292 927033 3860766
2243 3860766 6696535 6838964 6100962 6731352 7149512 5021955 4413492 4928856 4790302
2234 4790302 3542050 460499 -968018 371023 896076 149249 763656 2215589 3441893
2225 3441893 2851433 294627 -775554 -669454 -625836 -1070827 -504168 769989 1726730
$$ packed form
2288A785324j783475j698778n24408O2091L18597N71234N53846P26693J59147
2279A70271j31762J383086L86810r30234j896590l039712R57403L169423L19527
2270C88222n0338L11957J285626p27836j923691m58662O25738j012269r39046
2261b500299K19828j006791J32882J556949K37569k041901j937493k62528R64882
2252d636902Q47496J405824J333120O330p40014k69868J677722J303325K933733
2243C860766K835769J42429p38002O30390M18160k127557o08463N15364j38554
2234D790302j248252l081551j428517J339041N25053p46827O14407J451933J226304
2225C441893n90460k556806j070181J06100M3618m44991N66659J274157R56741
$$ plain form
2216 1726730 1386279 146057 2015771 6121914 8121112 6372520 6060327 5862940 4262500
2207 4262500 2178642 -1217156 -470776 2100551 3012129 2640326 3509504 4746385 3989718
2198 3989718 886196 -791500 -179494 2692292 3469555 752750 -3175583 -4264969 -3125126
2189 -3125126 -2349576 -2157915 -326730 1417354 388736 -1041162 -2318625 -3139765 -2492978
2180 -2492978 -849080 -486923 -2066556 -3060808 -3032773 -2196391 -2720333 -2618425 -2802019
2171 -2802019 -2517958 303890 862111 750188 1329080 360639 -554018 1901582 4202916
2162 4202916 4131757 3980543 1867725 -1878232 -4468577 -5944701 -7409200 -7582197 -7207017
2153 -7207017 -5739502 -2900371 -3378211 -3999253 -2835544 -1918804 -940761 1120538 306179
$$ packed form
2216A726730l40451j240222J869714M106143J999198j748592l12193j97387j600440
2207D262500k083858l395798P46380K571327R11578l71803Q69178J236881p56667
2198C989718l103522j677696O12006K871786P77263k716805l928333j089386J139843
2189c125126P75550J91661J831185J744084j028618j429898j277463q21140O46787
2180b492978J643898L62157j579633r94252K8035Q36382n23942J01908j83594
2171b802019K84061K821848N58221j11923N78892r68441r14657K455600K301334
2162D202916p1159j51214k112818l745957k590345j476124j464499j72997L75180
2153g207017J467515K839131m77840o21042J163709R16740R78043K061299q14359
$$ plain form
2144 306179 -1657946 -2305041 -1726866 411839 1481156 1445641 2785062 4090547 3638600
2135 3638600 1637240 -794132 -11476 122466 771363 621016 134015 -269032 -854645
2126 -854645 -2952262 -3092415 -2263232 -2348711 -2560952 -967646 45320 -1227619 -913584
2117 -913584 1882609 3901694 3034255 1589154 1610148 1526780 2776991 3196293 2901442
2108 2901442 3521472 3379978 1527178 239127 646220 -18888 158449 851161 969223
2099 969223 1085537 1992303 2453620 1661557 1993187 2629072 2332381 1674484 3300762 3484178
2089 3484178 2069957 1886635 963575 845627 458060 -573462 -1413628 -2318675 -1953148
$$ packed form
2144C06179j964125o47095N78175K138705J069317l5515J339421J305485m51947
2135C638600k001360k431372P82656J33942O48897j50347m87001m03047n85613
2126h54645k097617j40153Q29183q5479k12241J593306J012966j272939L14035
2117i13584K796193K019085q67439j445101K0994q3368J250211M19302k94851
2108B901442O20030j41494j852800j288051M07093o65108J77337O92712J18062
2099I69223J16314R06766M61317p92063L31630O35885k96691o57897J626278J83416
2089C484178j414221j83322r23060j17948l87567j031522q40166r05047L65527
$$ [...]
##END NTUPLES=NMR SPECTRUM
##END=
