##TITLE=31Pdec_DE-174_oil_TFA
 DMSO+CCl4, 64 sc
13.8.2026
##JCAMPDX= 6.0         $$ Bruker NMR JCAMP-DX V2.0
##DATA TYPE= NMR SPECTRUM
##DATA CLASS= NTUPLES
##ORIGIN= UXNMR, Bruker Analytische Messtechnik GmbH
##OWNER= root
$$ XWIN-NMR		Version 3.5
$$ Thu Aug 13 15:05:01 2026 Russian Standard Time (UT+4h)  she@DPX200
##.OBSERVE FREQUENCY= 81.013821
##.OBSERVE NUCLEUS= ^31P
##.ACQUISITION MODE= SIMULTANEOUS
##.ACQUISITION SCHEME= undefined
##.AVERAGES= 64
##.DIGITISER RES= 17
##SPECTROMETER/DATA SYSTEM= spect
##.PULSE SEQUENCE= zgpg30
##.SOLVENT NAME= CDCl3
##.SHIFT REFERENCE= (INTERNAL, CDCl3, 0, 197.392)
##AUDIT TRAIL= $$ (NUMBER, WHEN, WHO, WHERE, WHAT)
$$ ##TITLE= Audit trail, XWIN-NMR		Version 3.5
$$ ##JCAMPDX= 5.01
$$ ##ORIGIN= Bruker BioSpin GmbH
$$ ##OWNER= she
$$ F:/spectra/data/she/nmr/P31/2/pdata/1/auditp.txt
$$ ##AUDIT TRAIL=  $$ (NUMBER, WHEN, WHO, WHERE, WHAT)
(   1,<2026-08-13 15:03:56.89 +0400>,<she>,<DPX200>,
      <created by zg, POWCHK disabled, PULCHK disabled
       configuration hash MD5:
       00 E9 B6 7A A2 85 ED C7 34 08 36 98 17 FE 4E 26
       data hash MD5: 32K
       1E B9 60 92 BD 12 DD EB 96 9D 34 80 E7 6D 52 15>)
(   2,<2026-08-13 15:04:00.42 +0400>,<she>,<DPX200>,
      <Start of raw data processing
       efp BC_mod = 2 LB = 1.5 FT_mod = 6 PKNL = 1 PHC0 = 2035.406 PHC1 = -137.3017 SI = 64K 
       data hash MD5: 64K
       3D 13 18 38 B5 B4 29 BB 9E 39 B6 AF 08 3D 86 E3>)
(   3,<2026-08-13 15:04:13.87 +0400>,<she>,<DPX200>,
      <pk PHC0 = 4.919663 PHC1 = 0 
       data hash MD5: 64K
       AD 76 0B 3B D2 B3 4A 07 B0 C4 F5 EC 2F 04 7D 26>)
(   4,<2026-08-13 15:04:19.82 +0400>,<she>,<DPX200>,
      <abs ABSG = 5 
       data hash MD5: 64K
       34 07 46 D8 66 4B 79 83 36 AC FF 14 8D 7F 88 91>)
$$ ##END=
$$ 
$$ hash MD5
$$ 05 A1 F9 C4 AA DA 65 32 33 C8 D5 6D 72 72 8C 29
##$RELAX= 
##$RELAX= 
##$RELAX= 
##$RELAX= 
##$RELAX= 
##$RELAX= 
##$RELAX= 
##$RELAX= 
$$ Bruker specific parameters
$$ --------------------------
##$DU= <F:/spectra>
##$EXPNO= 2
##$NAME= <P31>
##$PROCNO= 1
##$TYPE= <nmr>
##$USER= <she>
##$AMP= (0..31)
100 100 100 100 100 100 100 100 100 100 100 100 100 100 100 100 100 100 
100 100 100 100 100 100 100 100 100 100 100 100 100 100 
##$AQSEQ= 0
##$AQ_mod= 1
##$AUNM= <au_zg>
##$AUTOPOS= <>
##$BF1= 81.014009
##$BF2= 200.13
##$BF3= 200.13
##$BF4= 200.13
##$BF5= 200.13
##$BF6= 200.13
##$BF7= 200.13
##$BF8= 200.13
##$BYTORDA= 1
##$CFDGTYP= 0
##$CFRGTYP= 5
##$CHEMSTR= <none>
##$CNST= (0..31)
1 1 145 1 1 1 1 1 1 1 1 1 1 1 1 1 1 1 1 1 1 1 1 1 1 1 1 1 1 1 1 1 
##$CPDPRG= <waltz16>
##$CPDPRG1= <>
##$CPDPRG2= <waltz16>
##$CPDPRG3= <>
##$CPDPRG4= <mlev>
##$CPDPRG5= <mlev>
##$CPDPRG6= <mlev>
##$CPDPRG7= <mlev>
##$CPDPRG8= <mlev>
##$CPDPRGB= <>
##$CPDPRGT= <>
##$D= (0..31)
0 1 0 0 0 0 0 0 0 0.06 0 0.03 2e-05 3e-06 0 0 0.0002 0 0 0 0 0 0 0 0 0 
0 0 0 0 0 0 
##$DATE= 1786619036
##$DBL= (0..7)
120 120 120 11 120 120 24 19 
##$DBP= (0..7)
150 150 150 150 150 150 150 150 
##$DBP07= 0
##$DBPNAM0= <>
##$DBPNAM1= <>
$$ [...]
##$SUBNAM3= <"">
##$SUBNAM4= <"">
##$SUBNAM5= <"">
##$SUBNAM6= <"">
##$SUBNAM7= <"">
##$SUBNAM8= <"">
##$SUBNAM9= <"">
##$SW= 400.765351723535
##$SWIBOX= (0..15)
0 1 3 0 0 0 0 0 0 0 0 0 0 0 0 0 
##$SW_h= 32467.5324675325
##$TD= 32768
##$TD0= 1
##$TE= 0
##$TE2= 300
##$TE3= 300
##$TEG= 300
##$TL= (0..7)
0 120 53 12 22 120 120 120 
##$TP= (0..7)
150 150 150 150 150 150 150 150 
##$TP07= 0
##$TPNAME0= <>
##$TPNAME1= <>
##$TPNAME2= <>
##$TPNAME3= <>
##$TPNAME4= <>
##$TPNAME5= <>
##$TPNAME6= <>
##$TPNAME7= <>
##$TPOAL= (0..7)
0.5 0.5 0.5 0.5 0.5 0.5 0.5 0.5 
##$TPOFFS= (0..7)
0 0 0 0 0 0 0 0 
##$TUNHIN= 0
##$TUNHOUT= 0
##$TUNXOUT= 0
##$USERA1= <user>
##$USERA2= <user>
##$USERA3= <user>
##$USERA4= <user>
##$USERA5= <user>
##$V9= 5
##$VALIST= <valist>
##$VCLIST= <CCCCCCCCCCCCCCC>
##$VD= 0
##$VDLIST= <DDDDDDDDDDDDDDD>
##$VPLIST= <PPPPPPPPPPPPPPP>
##$VTLIST= <TTTTTTTTTTTTTTT>
##$WBST= 1024
##$WBSW= 4
##$XGAIN= (0..3)
0 0 0 0 
##$XL= 0
##$YL= 0
##$YMAX_a= 3143
##$YMIN_a= -13629
##$ZGOPTNS= <>
##$ZL1= 120
##$ZL2= 120
##$ZL3= 120
##$ZL4= 120
##$ABSF1= 197.3918
##$ABSF2= -203.3724
##$ABSG= 5
##$ABSL= 3
##$ALPHA= 0
##$AQORDER= 0
##$ASSFAC= 0
##$ASSFACI= 0
##$ASSFACX= 0
##$ASSWID= 0
##$AUNMP= <proc_1d>
##$AZFE= 0.1
##$AZFW= 0.5
##$BCFW= 0
##$BC_mod= 2
##$BYTORDP= 0
##$COROFFS= 0
##$CY= -3
##$DATMOD= 1
##$DC= 0
##$DFILT= <>
##$DTYPP= 0
##$F1P= 0
##$F2P= 0
##$FCOR= 1
##$FTSIZE= 65536
##$FT_mod= 6
##$GAMMA= 0
##$GB= 0
##$INTBC= 1
##$INTSCL= 9.790993e-09
##$ISEN= 30
##$LB= 1.5
##$LEV0= 0
##$LPBIN= 0
##$MAXI= 10000
##$MC2= 0
##$MEAN= 0
##$ME_mod= 0
##$MI= 50
##$NCOEF= 0
##$NC_proc= -8
##$NLEV= 6
##$NOISF1= 182.463
##$NOISF2= 159.3651
##$NSP= 0
##$NTH_PI= 0
##$NZP= 0
##$OFFSET= 197.3918
##$PC= 4
##$PHC0= 2040.326
##$PHC1= -137.3017
##$PH_mod= 1
##$PKNL= yes
##$PPARMOD= 0
##$PSCAL= 0
##$PSIGN= 0
##$REVERSE= no
##$SF= 81.014063255964
##$SI= 65536
##$SIGF1= 159.3651
##$SIGF2= -187.1042
##$SINO= 113.3802
##$SIOLD= 16384
##$SREGLST= <1H.CDCl3>
##$SSB= 0
##$STSI= 65536
##$STSR= 0
##$SW_p= 32467.5324675325
##$SYMM= 0
##$S_DEV= 0
##$TDeff= 32768
##$TDoff= 0
##$TI= <>
##$TILT= no
##$TM1= 0
##$TM2= 0
##$TOPLEV= 0
##$USERP1= <user>
##$USERP2= <user>
##$USERP3= <user>
##$USERP4= <user>
##$USERP5= <user>
##$WDW= 1
##$XDIM= 65536
##$YMAX_p= 399315726
##$YMIN_p= -20816624
$$ End of Bruker specific parameters
$$ ---------------------------------
##NTUPLES= NMR SPECTRUM
##VAR_NAME=  FREQUENCY,     SPECTRUM/REAL,   SPECTRUM/IMAG
##SYMBOL=    X,             R,               I
##VAR_TYPE=  INDEPENDENT,   DEPENDENT,       DEPENDENT
##VAR_FORM=  AFFN,          ASDF,            ASDF
##VAR_DIM=   65536,         65536,           65536
##UNITS=     HZ,            ARBITRARY UNITS, ARBITRARY UNITS
##FACTOR=    0.49542278885378, 1,            1
##FIRST=     15991.5117654749, 0,            0
##LAST=      -16476.0207020576, 0,           0
##MIN=       -16476.0207020576, -20816624,   0
##MAX=       15991.5117654749, 399315726,    0
$$ Real data points
##PAGE= N=1
##DATA TABLE= (X++(R..R)), XYDATA
$$ [...]
##PAGE= N=2
##DATA TABLE= (X++(I..I)), XYDATA
9516 8181550 7796973 8704975 9284528 7593271 4251178 2201762 2995555 4554682 3751908
9507 3751908 323106 -3087859 -4218699 -3141257 -1172997 689260 1907311 2084540
9499 2084540 1216921 -164130 -1516045 -2734874 -3926226 -5001077 -5662970 -5632024 -4829919
9490 -4829919 -3519528 -2296516 -1785689 -2256785 -3455331 -4603766 -4618842 -2917221 -484546
9481 -484546 288878 -2221399 -6606958 -9047866 -6936790 -1789317 2041134 1670230 -1788732
9472 -1788732 -5139968 -6659515 -6823665 -6175469 -4340322 -1716870 -369854 -1624737 -3718982
9463 -3718982 -3721478 -1466931 303860 -212039 -1890646 -3135521 -4359402 -6645442 -9205991
9454 -9205991 -9760754 -7025402 -1916046 3190473 5819289 5082018 2999367 3119807 6554128
9445 6554128 10263821 10666229 8007329 5383339 4188779 2865625 133999 -2917392
9437 -2917392 -4674725 -4974686 -4185073 -1919489 1895556 5629471 7090573 5877876 3809659
9428 3809659 3194491 5019657 8275319 10539857 9789724 6342368 2821837 1782462 3452835
9419 3452835 5809077 6448459 4489793 1373264 -178995 1133327 3430110 3626449 1279965
9410 1279965 -957969 -1205768 -913185 -2284165 -4622790 -5249546 -3446227 -1463446 -1483503
9401 -1483503 -3229971 -5070724 -6166802 -6674749 -6562893 -5244112 -2562376 237953 1134735
9392 1134735 -467557 -2338042 -1331316 2840819 6820526 7389436 5027413 2666083
9384 2666083 2013984 2655127 3854085 5163021 5544114 4032202 1502154 -26240 -74401
9375 -74401 51707 -247182 -367966 -893247 -3773271 -8823742 -12512975 -12190983 -9567828
9366 -9567828 -7854616 -7291345 -6152203 -4652742 -4494275 -5095907 -3776177 -126642 2856348
9357 2856348 3035605 2025048 2570366 5123440 8320350 10942163 11889127 9923677 5283849
9348 5283849 421343 -2496053 -3863132 -5015756 -5576771 -4355312 -2068272 -989249
9340 -989249 -1971323 -3503126 -3761937 -2321443 -37258 1477242 641720 -2358328 -4989127
9331 -4989127 -5061785 -3543545 -2878322 -3092377 -2085310 269393 1259131 -639264 -3594181
9322 -3594181 -5533623 -6860071 -8459521 -9578008 -9888382 -11278334 -14615011 -16535327
9314 -16535327 -13048806 -5587336 44389 736850 -1106413 -2078998 -1735249 -974412 429407
9305 429407 2677687 4376672 4146388 2566626 992622 -418556 -2112611 -3697743 -4558951
9296 -4558951 -5018718 -5557957 -5759368 -5407762 -5832020 -8538699 -12790290 -15815794 -15400416
9287 -15400416 -11646362 -6678151 -3200916 -2515305 -3201677 -2705154 -913548 -717974 -3874613
9278 -3874613 -8014870 -9639270 -8603547 -7267266 -6399436 -4872334 -2862756 -2161794 -3050259
9269 -3050259 -3747368 -3516903 -3591361 -4288538 -4052858 -2560847 -2071764 -4048415 -6783495
9260 -6783495 -8132857 -8337729 -8146301 -6410252 -2116560 2979537 6484452 8662781 10771488
9251 10771488 11500948 8549169 3138690 -586188 -818807 409408 1253549 2274597 3851306
9242 3851306 4646957 4109218 3692318 3963633 3203442 877645 -173313 2225794 5452201
9233 5452201 5302543 2139951 359003 1991680 4132465 3299864 -382050 -4389575 -6986647
9224 -6986647 -7886604 -7364896 -6233948 -5860415 -7007045 -8967667 -10334174 -10122540 -8041033
9215 -8041033 -4685686 -1854652 -1477853 -3425751 -5233415 -4756400 -2366760 84395 1510901
9206 1510901 1946895 1638843 966187 610427 647297 63769 -1579229 -2587953 -818321
9197 -818321 3273008 6862267 8156801 8009429 7821337 7455279 6004351 3299768 -251442
9188 -251442 -4120836 -6916029 -6460045 -2247032 2848496 5010824 3489541 808571 -763429
9179 -763429 -1239451 -1305383 -759887 284491 144707 -2695889 -7031575 -9628964 -8584531
9170 -8584531 -4947377 -947947 2181721 4148652 4571961 3315127 1556241 1257190 3113205
9161 3113205 5745952 7402229 7795076 7579424 6688735 4522545 1746879 378712 1305271
9152 1305271 2851320 2933438 1820626 1356638 1936930 1996342 654447 -806689 -831793
9143 -831793 352396 1579560 2679701 4325469 6331716 7205239 5518942 1340301 -3510534
9134 -3510534 -6408453 -5743620 -2347739 1327624 3781160 5461238 6850394 6935611 4840076
9125 4840076 1880603 199232 -135657 -830785 -2456793 -3835439 -4340106 -4586070 -4390315
9116 -4390315 -2471999 706460 2194594 543037 -1428426 -339915 2647903 3389939
9108 3389939 809895 -1785808 -1734916 -234066 644233 1323852 3033573 4807379 4807005
9099 4807005 3576871 3378383 4656223 5609522 5330298 4910039 4787180 3343871 -492654
9090 -492654 -5044557 -7942800 -9078986 -9747587 -9979371 -8934730 -7380076 -7266926 -8519955
9081 -8519955 -8448736 -5295457 -767423 1980304 1671017 -613884 -2988399 -3828974 -2604725
9072 -2604725 -888776 -1381303 -4503631 -7015356 -5667681 -1354626 2210665 3207280 2938059
9063 2938059 2839701 2873602 3170503 4668996 7014864 7835639 5477341 1057056 -3303422
9054 -3303422 -6821885 -9411760 -10223791 -8623482 -5802976 -3810963 -3422290 -4130601 -5530897
9045 -5530897 -7316701 -8472375 -7999052 -6273748 -4472990 -2870315 -886332 1364099
9037 1364099 2780269 2564246 945978 -1217165 -2819197 -2935205 -1796345 -821120 -685031
9028 -685031 -110383 2068090 4441079 4542691 2430293 581482 152046 -411868 -2472561
9019 -2472561 -5102138 -6948361 -8272849 -9595053 -9750871 -7222609 -2870536 250604
9011 250604 -126082 -3483276 -7325305 -9295224 -8686930 -6551902 -4533067 -3585163 -3865298
9002 -3865298 -5331200 -7591190 -9391440 -9399098 -7673739 -5450542 -3509083 -1917082 -1245490
8993 -1245490 -2274564 -4082041 -4285884 -2179404 -128043 -746290 -3940406 -7725792 -10562301
8984 -10562301 -11699784 -10684334 -8119897 -5852499 -4910962 -4266754 -3006171 -2412469 -4045820
8975 -4045820 -6895796 -8614950 -8811465 -8897495 -9257741 -8973167 -8120256 -7880092 -8158197
8966 -8158197 -7349793 -4921604 -2277684 -691523 -321522 -1553635 -4945561 -8974551 -10160994
8957 -10160994 -6990018 -2119380 800101 1225668 1242061 2174915 3380056 3813964 3269206
8948 3269206 2104409 752284 -412224 -1161450 -1299950 -502994 1067952 1977823 525089
8939 525089 -2852921 -5175998 -3887864 187363 3516329 3267411 -204290 -3904714 -5051957
8930 -5051957 -3643369 -2011775 -1621441 -1306332 297801 1915408 1455063 -88422 483032
8921 483032 3643222 6219537 6240341 5527963 5916588 6021714 4155962 1760633 938934
8912 938934 655135 -1294961 -4074599 -5173559 -5060524 -6631273 -10049071 -11815095 -9797123
8903 -9797123 -6084879 -3580551 -2326249 -898189 404467 -259567 -3512508 -7425800
8895 -7425800 -9006289 -6921090 -2989948 -499333 -473633 -541025 1531237 4591944 6233456
8886 6233456 6768066 8253613 10198048 9505091 5078263 -359154 -3747742 -4585689 -3824693
8877 -3824693 -2436506 -1779752 -2855136 -4400130 -4205088 -2885509 -3319094 -5503949 -5604029
8868 -5604029 -1806670 2472336 3577393 2338713 944753 -1365096 -5539250 -8601426
8860 -8601426 -7172702 -3344635 -2001772 -3160445 -2149683 2444334 6105101 4985663
8852 4985663 947547 -1873446 -2151431 -1037658 416241 1339725 611633 -1769489 -4337327
8843 -4337327 -6216792 -7715965 -8152383 -5687863 -718607 3142109 3334418 1353184 -367255
8834 -367255 -2015086 -4350641 -5618227 -4046789 -1843025 -2730890 -6041646 -7138306 -4068374
8825 -4068374 -186123 943043 38888 -312887 -22577 -949492 -3328190 -5099794 -4506797
8816 -4506797 -1822669 1270343 2859948 1719726 -1650955 -4892711 -5762746 -4493603
8808 -4493603 -3536367 -4895528 -8272479 -11698658 -13196492 -11815143 -7990120 -3254866
8800 -3254866 1078713 5155262 9587133 12986960 12091110 5801361 -1949206 -5534897
8792 -5534897 -3826728 -1073907 -1253141 -3688382 -5332518 -5246775 -4745591 -4421262 -3452325
8783 -3452325 -1485035 799067 2795467 3930316 2995806 -292324 -3398495 -3342306 -1270413
8774 -1270413 -1721216 -6281293 -10858702 -11084714 -7893337 -5325846 -4895977 -5132716 -5296858
8765 -5296858 -6066177 -6815261 -5497906 -1921790 1342156 2214375 1341750 271927 -778151
8756 -778151 -2240594 -3740458 -4566200 -4669155 -4175662 -2671424 -14732 2539849 2965481
8747 2965481 397726 -3704636 -6414468 -5866053 -3467130 -2973636 -6315030 -10824553 -12078936
8738 -12078936 -9309077 -6249220 -6341979 -8899075 -10791235 -10373927 -8590292 -7258280 -7388198
8729 -7388198 -8558237 -9236582 -8325664 -6659395 -5963578 -6220349 -5728479 -4253856 -3951442
8720 -3951442 -5905047 -7936331 -7850133 -6937365 -7580941 -8817374 -7610278 -4034707 -1649577
8711 -1649577 -2134839 -2742475 -459528 3811577 6975502 7767054 7196859 6305904 5324978
8702 5324978 4333139 3297762 2020175 1051663 1704359 3909666 5146434 3237091 -474334
8693 -474334 -2601174 -2005237 -651509 -199245 137893 1652253 3845731 5241266 5389903
8684 5389903 4974208 4618375 4473831 4389242 3733582 1665253 -1623649 -4489793 -5484620
8675 -5484620 -4897999 -3852178 -2569002 -758316 840596 1025064 278649 559400 2287278
8666 2287278 3181836 1325344 -1878229 -3450050 -2797356 -2030414 -2473355 -2878710 -1717296
8657 -1717296 528501 2521036 4114896 5641241 6085515 4029532 306413 -2238995
8649 -2238995 -2126218 -704579 450738 1782966 3979636 5550100 4456629 1485928
8641 1485928 -506900 -837179 -1954261 -5256571 -8282399 -7866339 -4426886 -874717 1713651
8632 1713651 4717029 8417330 10469681 8877592 4715774 713649 -1746714 -3228263
8624 -3228263 -4730794 -6504558 -7768506 -7103949 -4023011 -658843 -589652 -4840691 -10040985
8615 -10040985 -11889899 -9762185 -6536398 -4524719 -3308271 -1529366 849938 2696924
8607 2696924 3243174 2979343 3237874 4645010 5718989 3929376 -911480 -5293827 -5558647
8598 -5558647 -2107464 1657964 3877566 5278067 5835138 3461359 -2625114 -9397822
8590 -9397822 -12721009 -11518912 -8128992 -5566094 -5333084 -6693261 -7097098 -4520874 -306809
8581 -306809 1686101 -273703 -3658864 -5443400 -5959080 -6878776 -7153215 -4099527 1957204
8572 1957204 7092492 8283231 6381996 4140174 3103211 3111273 3429302 3558492 3577612
8563 3577612 3849402 3960644 2659865 -102895 -1994324 -866914 2088009 3693858 2930020
8554 2930020 1621089 1115450 542212 -1266565 -4067297 -6813853 -8308319 -7243064 -3594993
8545 -3594993 -1901 514699 -1643755 -3473376 -3920896 -4533299 -5280036 -3636552 657774
8536 657774 3693844 2685625 12433 -790116 -213667 -804634 -2577853 -3998450 -5453463
8527 -5453463 -7856746 -9417855 -7919537 -5053456 -4190482 -4593435 -2474918 2318081 5581598
8518 5581598 5472392 5079773 6543079 7131108 3980990 -892670 -3736843 -4688837 -6740414
8509 -6740414 -10497484 -13167462 -12290488 -8196605 -3126110 406125 960001 -556524 -1488190
8500 -1488190 -494444 801341 322726 -1520523 -2921164 -3555179 -4502174 -6023340 -7275277
8491 -7275277 -7832555 -7841867 -6952113 -4636229 -1487541 1021274 1954878 1287794 -493925
8482 -493925 -2173140 -2105561 -139652 1563424 1146355 -333866 -688847 -193001 -1137109
8473 -1137109 -4092272 -6989458 -8135018 -7933825 -7077480 -5068449 -1457065 3012806 7294333
8464 7294333 10732763 12369950 11272588 8473848 6968791 8441386 11082193 11814929
8456 11814929 9709515 6133275 2670519 320344 -177339 974308 1899724 668977
8448 668977 -2120293 -3608138 -1923980 1661145 4173882 3860667 1337788 -1560524 -3465339
8439 -3465339 -4121196 -3878595 -3016797 -1807954 -984134 -1405421 -2823139 -3409009 -1318798
8430 -1318798 3004414 6517398 6218400 2455450 -715881 727907 6374572 11429666
8422 11429666 11802863 8418094 5403514 4708663 4423893 2560335 245920 -211000 1128830
8413 1128830 2192143 2105416 1997623 2530912 2544833 1010656 -974582 -1391836 33658
8404 33658 1493221 1385545 45943 -1101180 -1411490 -1377448 -1388724 -958893 540887 2960685
8394 2960685 5623411 7990661 9457358 9022069 6304076 2850391 1170883 1990965 3486032
8385 3486032 3868766 3654529 4270128 5261265 4495759 1104115 -3185349 -6053559 -6890651
8376 -6890651 -6570000 -5856383 -4913798 -3921753 -3232777 -2879560 -2559684 -2262915 -2407436 -3040293
8366 -3040293 -3250245 -1891591 1049505 4136437 5680032 5039726 2615914 -1036015 -5486714
8357 -5486714 -9815834 -12394602 -11965325 -9047801 -5922375 -4816053 -5913521 -7240589
8349 -7240589 -6674082 -3996501 -790249 1400469 2124416 1318604 -1248558 -5006649 -7902899
8340 -7902899 -7993712 -5530616 -2403249 274385 2730613 4737011 4948622 2847482 116120
8331 116120 -1018726 -123269 1630547 3284190 4655788 5520500 5456962 4705726 4412064
8322 4412064 5590558 7985739 10057115 10143333 7805233 3996513 -134154 -4054637 -6997227
8313 -6997227 -7344698 -4560629 -1362627 -1682957 -5846918 -9919720 -10958439 -10742879 -12474135
8304 -12474135 -15723610 -17309763 -16061930 -13818883 -12089696 -10645992 -9726119 -10786452
8296 -10786452 -13841693 -16146080 -15117452 -11451160 -8139573 -7215656 -8359040 -9949949
8288 -9949949 -10593691 -10055804 -9334608 -9542658 -10508396 -10939543 -10009504 -8148989 -6294796
8279 -6294796 -5139687 -5071678 -5891694 -6525925 -5973383 -4597171 -3541081 -3004499 -2337111
8270 -2337111 -1791956 -2655829 -5281105 -8279023 -9997091 -9657406 -7100824 -3062996 190759
8261 190759 540326 -1125304 -1712468 -280890 597537 -1120693 -3874092 -5029236 -4311874
8252 -4311874 -2724055 -74565 3790788 6694303 5981618 2244304 -1130548 -1894735 -613388
8243 -613388 994518 1415248 -341697 -3596417 -5584915 -4394279 -1936466 -1612016 -3293714
8234 -3293714 -3471479 -736119 1820283 917753 -2501125 -4808431 -4178353 -2092924 -1237885
8225 -1237885 -2834193 -5382530 -5717249 -2296953 2483888 4728808 3878200 3068219 4060840
8216 4060840 4309597 868705 -4631402 -7429157 -5465593 -1648482 -186588 -2202681
8208 -2202681 -5381354 -6933652 -6297576 -5222582 -5581949 -7358625 -8967998 -9195088 -8142524
8199 -8142524 -6498334 -4840559 -3664737 -3039989 -2140180 -278426 1469581 1140439 -1171144
8190 -1171144 -2830642 -2042884 -322263 -355163 -2430904 -4350281 -4265398 -2401286 -307039
8181 -307039 613392 5759 -1240309 -1643912 -164526 3421214 8509734 13107686 14084798
8172 14084798 10030678 3861279 348988 620613 1440390 491880 -683380 -429950 -314767
8163 -314767 -2046790 -3840787 -3303817 -1916898 -2790081 -5291256 -5969868 -4101842 -2139063
8154 -2139063 -868644 1443833 4610399 5822748 4827220 5397320 9267025 12501425 11118155
8145 11118155 7155573 5268244 5490602 3770099 -1157006 -5738442 -7000715 -6471819
8137 -6471819 -7212248 -9244351 -9833200 -7371189 -3513191 -1465850 -2755499 -5867796 -8060635
8128 -8060635 -8232383 -7401561 -6566259 -5481155 -4091581 -3590655 -4668987 -5847846 -5245295
8119 -5245295 -3286506 -1920384 -1675531 -1449030 -1012141 -1521216 -3052711 -3592824 -1506315
8110 -1506315 2342690 5922805 8358847 9884839 10481197 9935440 8866081 8479377 9286085
8101 9286085 10816674 12471859 13788231 13854218 11532514 6915105 1969520 -1091166 -1952877
8092 -1952877 -2026149 -2232030 -2007984 -943788 -210685 -1027352 -2265904 -1303108 2514022
8083 2514022 6760144 8833030 8541543 7017769 4620606 1410259 -1434225 -2618869
8075 -2618869 -2805546 -3977250 -6734977 -9611506 -11056673 -10736057 -8836161 -5595824 -1918984
8066 -1918984 814130 2067315 2413873 2367114 2000325 1701845 1899305 1925070 837091
8057 837091 -334929 731724 3808320 5159886 2207683 -2568007 -4613726 -3053542
8049 -3053542 -1037466 -1015712 -2347663 -3686056 -5053143 -6549521 -7057172 -5686221 -3282685
8040 -3282685 -1225310 377240 2152389 3939751 5081946 5731449 6510704 6963940 5640341
8031 5640341 2103866 -2073885 -4947101 -6273525 -7277124 -8608061 -9393471 -8607793 -6725572
8022 -6725572 -5258504 -4814455 -4437824 -3079546 -963934 924888 1969943 1888851 345236
8013 345236 -2353306 -4675452 -5281859 -4867287 -5270571 -6729098 -7496882 -6519655 -4904824
8004 -4904824 -3987879 -3489079 -2791366 -2671010 -4040995 -5850513 -6202580 -5266477 -5107603
7995 -5107603 -6395020 -7137522 -5479805 -2298816 106527 951869 1333290 2094415 2589236
7986 2589236 1852433 326505 -108745 2067818 6219996 9728114 10239640 7754587 4327985
7977 4327985 1984368 1384450 2209075 3813169 5130138 4759830 2041361 -1924510 -4684927
7968 -4684927 -4127138 -174778 4765160 7325186 5984609 2591814 545649 1320143 3351374
7959 3351374 4398408 4113645 3829500 4516713 5634873 5792702 4306671 2376571 2535600
7950 2535600 6047426 10738511 12565967 9909972 5324081 2352444 1658821 1287470 -215988
7941 -215988 -2375451 -4040155 -4671301 -4290810 -3096109 -1338508 801682 3010097 4259283
7932 4259283 3217817 -11197 -3274558 -4483780 -3858376 -3203087 -3608809 -4864629 -6362989
7923 -6362989 -7286464 -6613624 -4494626 -3064901 -4153996 -6532278 -7259539 -5588494 -3622090
7914 -3622090 -3126184 -3729018 -4515132 -5326592 -5911912 -5633706 -4674996 -3957692 -3538310 -2879046
7904 -2879046 -2827805 -4919315 -8238449 -9761803 -8794386 -8090198 -9064499 -9100987 -6015431
7895 -6015431 -2254022 -1472174 -3229854 -4566327 -4945448 -5749959 -6304647 -4816851 -2692866
7886 -2692866 -3361406 -6494126 -7764815 -5357103 -2635139 -2803770 -4694055 -5865459 -6364775
7877 -6364775 -6804686 -5804323 -2537405 478292 501781 -1128505 -1093073 713644 1488470
7868 1488470 365428 -515800 119945 925575 668974 -112905 -1270856 -4377132 -10263846
7859 -10263846 -16844368 -20990032 -21674314 -20181602 -18124656 -16307777 -14786274 -13042149
7851 -13042149 -10616860 -8230791 -7499263 -8740213 -9908837 -8805897 -5760131 -2999875
7843 -2999875 -1856723 -1864926 -2295982 -3003350 -3504747 -2703076 -314098 2340199 3694443
7834 3694443 3399900 1856273 -760845 -3974629 -6245590 -6176787 -4371702 -2810685 -2242491
7825 -2242491 -1437780 574871 2775820 3508920 2745750 2056663 2757598 4781415 6900355
7816 6900355 7344166 4787320 -163497 -4613700 -5605003 -3046164 114635 869979 -928331
7807 -928331 -2544843 -1039547 3698444 8280342 8696734 4409191 -910246 -3238311 -2078840
7798 -2078840 172274 1519286 1418282 -602514 -4927822 -10052267 -12836095 -11685376
7790 -11685376 -8337406 -5664576 -4717347 -4649673 -4434068 -3601831 -2085434 -440388 198826
7781 198826 -685161 -2060821 -2350044 -1288796 -246068 -585410 -1921561 -2245665 -174754
7772 -174754 2880649 3651110 687402 -3918033 -7461239 -9838847 -11916445 -12191069 -8480441
7763 -8480441 -2627685 474772 -381335 -776183 2575195 6780790 7565418 6038051 6587705
7754 6587705 9869593 12245319 11550333 9410528 7802410 6883271 6557016 6891785 6503994
7745 6503994 3720807 -51653 -1377823 1387 518630 -1363311 -2386247 99843
7737 99843 3331035 2997858 -468546 -3132419 -3670377 -4518999 -7284048 -10430368 -12134412
7728 -12134412 -12830637 -13880567 -15331779 -15871162 -14127250 -9815070 -4437660 -639806
7720 -639806 217898 -451138 -515903 -35675 -455552 -1506653 -1328182 164601 655816 -827634
7710 -827634 -1924629 -369871 2499951 3842019 3526267 3615131 4221580 2838954 -1598319
7701 -1598319 -6496429 -8849953 -8917718 -8883997 -9077691 -7732565 -4236332 -526001 1277315
7692 1277315 1087315 -18770 -1571488 -3503593 -5007151 -4858146 -2763353 258506 2585487
7683 2585487 2766906 428860 -2816897 -4245104 -2973629 -1326478 -1803495 -3367895 -2790628
7674 -2790628 456242 3121930 2813517 1432682 2248702 5047091 6347364 3958224 -522890
7665 -522890 -3817099 -4224123 -2572216 -955205 -916519 -2359675 -3990235 -4819193 -4811864
7656 -4811864 -4008669 -2121810 227728 1026319 -929031 -4007124 -5515912 -5128461 -4862932
7647 -4862932 -5847483 -7026073 -7250305 -6597794 -5021717 -1863475 2080652 4024714 2567300
7638 2567300 102133 -250127 1007618 865809 -1427331 -3456042 -3491706 -2509995 -1747490
7629 -1747490 -897604 75741 -184996 -1975581 -3112933 -2184774 -1325046 -2946542 -5148524
7620 -5148524 -3906891 596234 3590933 2325999 -445510 -1141595 -488904 -1630019 -5182373
7611 -5182373 -8734748 -10070917 -8763441 -5577126 -2290621 -1212516 -2931580 -5322188
7603 -5322188 -6439459 -7102656 -8475833 -8702064 -5232992 311953 3373475 2616684 1086062
7594 1086062 498789 -1539360 -6638555 -11519562 -11931232 -8483725 -5438856 -4969315 -5521624
7585 -5521624 -5189788 -3990293 -2773410 -1960894 -1636326 -1518338 -852458 576797 1627069
7576 1627069 1068958 -751338 -2570709 -3946971 -5194344 -6222639 -6714396 -6944857 -7298975
7567 -7298975 -7621789 -8063843 -9456200 -11434040 -11539844 -8285022 -4029241 -2298622 -2939271
7558 -2939271 -2744286 -602972 1088970 518569 -1139128 -2374247 -3492214 -4534494 -3561434
7549 -3561434 777730 6438032 9661794 8608897 4201149 -1303340 -5319857 -6036850
7541 -6036850 -4203232 -2795875 -3559487 -5127774 -5910884 -6969728 -9658676 -11896182 -10001147
7532 -10001147 -3957816 2155785 5359241 6653099 7916534 8594267 7167939 4116473
7524 4116473 1477988 377642 482352 1165950 1832860 1699772 669727 37974 955404
7515 955404 2437789 2373608 530495 -1009635 -834929 -16459 103770 543904 3190289
7506 3190289 7043212 8083172 3833299 -3215959 -8078054 -8609546 -6988516 -5956087
7498 -5956087 -5252677 -2774192 1757050 5814384 6768397 4472097 933424 -1603544 -1837758
7489 -1837758 284739 3481440 5840276 6488764 6282841 6255265 6133700 5508796 5637211
7480 5637211 8091609 11732973 13356797 12045792 10593069 11270158 12390789 11129036
7472 11129036 7879332 5193808 3839561 2988130 3195412 5391841 7306470 5345394
7464 5345394 844346 -121866 4753228 9899404 9378796 4853760 2037906 2191952 2250165
7455 2250165 1679370 3307898 6984035 7800538 2708525 -4819777 -8968009 -7795611 -3513062
7446 -3513062 932699 3498638 3302276 1448148 419497 1140649 1905492 1402573 1033535
7437 1033535 2498342 4643533 4886272 2899449 887813 656781 2048799 3941831 5339263
7428 5339263 5626606 4845665 3572789 1974700 -241161 -2282913 -2063778 982124 3969075
7419 3969075 3424164 -348669 -3635448 -3936251 -2426405 -1574963 -2038610 -2738877 -2884960
7410 -2884960 -2859702 -3373519 -4337296 -4712022 -3547929 -1196743 860225 1544234 1006304
7401 1006304 -281986 -2358273 -5027382 -7191123 -8032666 -8338683 -9444984 -11109201 -11608881
7392 -11608881 -9992717 -7230489 -4919404 -3612028 -2671030 -1233992 896692 3007243
7384 3007243 4065609 3783458 2960493 2533295 2499371 2059449 602432 -1700651 -4059170
7375 -4059170 -5615975 -5982960 -5212789 -3166482 467309 4891325 7842214 7987778 7051234
7366 7051234 7480877 8291367 5979567 107917 -5073999 -6075174 -4425508 -3425792 -3342196
7357 -3342196 -2717133 -2214134 -3515024 -5682962 -6335109 -5757023 -6130705 -6932501 -5113602
7348 -5113602 -499060 2797915 1810619 -1541417 -3800561 -4288453 -4128610 -3416113 -1861650
7339 -1861650 -681311 -1333414 -3038187 -3485469 -1746253 784489 2008663 815990 -2284072
7330 -2284072 -5427920 -6859856 -6731076 -6802554 -8002141 -9241176 -9057331 -7247922 -4362295
7321 -4362295 -983849 1653605 1763499 -998261 -4502275 -6134246 -5161659 -2623959 -18343
7312 -18343 1283735 744516 -284801 348711 2397352 2668182 -920880 -6225489 -9442956
7303 -9442956 -9397495 -7453242 -4643560 -1331207 1264898 1971995 1821938 2791063 4412504
7294 4412504 4134396 1312479 -1674009 -2976214 -3522651 -4547460 -5051704 -3501905 -623241
7285 -623241 1399929 1859852 2181195 3986701 7537130 11634607 14137322 13208393 9358401
7276 9358401 5995025 6584070 10972853 15408064 16442550 14069536 10753545 8251131
7268 8251131 6162966 3312707 -254441 -3019214 -3602148 -2363558 -1136418 -1300099 -2459875
7259 -2459875 -3403560 -4005194 -5260330 -7233994 -8057087 -6001235 -2091095 591905 324345
7250 324345 -1594862 -2846110 -2547396 -1017139 1678760 5428554 8752177 9397194 6716069
7241 6716069 2582212 -435932 -1249478 -496888 615015 1312086 1528394 1544932 1342720
7232 1342720 568203 -576785 -996093 -97220 870452 56652 -2424269 -4322771 -3805066
7223 -3805066 -1048198 2889785 7380167 11701639 14386980 14169232 11113024 6296325
7215 6296325 1056416 -3058690 -4693913 -3956581 -2498029 -1436455 33932 2963037
7207 2963037 6389545 8206978 7959052 7266359 7260776 6876749 4363369 -220933 -4727739
7198 -4727739 -6916218 -6342759 -4429988 -3084529 -3366475 -5170310 -7600433 -9361578 -9274718
7189 -9274718 -7189753 -4419369 -2631029 -2156014 -1941108 -1268146 -753657 -1203471 -2141244
7180 -2141244 -2310229 -1528496 -1248783 -2771130 -5209058 -6101428 -4508891 -2708378 -3624281
7171 -3624281 -7004926 -9918789 -11078480 -12172198 -13834036 -13177412 -8042402 -1656595
7163 -1656595 574559 -1836366 -4147653 -3087394 -348113 1075162 594911 -953480
7155 -953480 -2886911 -3942324 -2765852 -490053 -152854 -2269498 -3878810 -3441862 -3414636
7146 -3414636 -5840986 -8611202 -8883345 -7453637 -6673152 -6478608 -5792165 -5699158 -7627549
7137 -7627549 -10008502 -10331675 -9238416 -9119437 -9821717 -9271960 -7372731 -5676769 -3962955
7128 -3962955 -836991 2676039 3746447 1877870 -713917 -2543184 -3553921 -3021765
7120 -3021765 -416526 1959221 1068482 -2007853 -3039960 -669154 2297131 3848363
7112 3848363 4969172 6229271 6341170 5364979 5553118 7543598 9128288 9097313 8846728
7103 8846728 8885340 7427432 4089865 1429157 1010087 1345385 1406886 2452144 4344554
7094 4344554 3948761 -162382 -4842806 -6840150 -6740478 -5862011 -3064568 1927617 5587144
7085 5587144 4981188 2226502 682651 -343892 -2816335 -4841615 -3511717 -755588
7077 -755588 -805936 -3091568 -3369237 -1511576 -2226851 -7031688 -10823052 -8636464 -1924316
7068 -1924316 4220340 7174355 7795371 7356144 5817543 2632740 -1834656 -5714989 -6871322
7059 -6871322 -5345399 -3538321 -2855299 -1730230 1195835 3769058 3018240 -178622 -2342538
7050 -2342538 -2419000 -2181263 -2247892 -1401516 152333 457880 -840733 -2000218 -2297617
7041 -2297617 -2464205 -1939445 580199 3373531 2546572 -2086701 -5794393 -5324080 -2990932
7032 -2990932 -2316206 -2873056 -2062788 594098 3643614 6251676 8176641 8699979 7565094
7023 7565094 5706475 3720659 1247781 -1155908 -1906311 -1428882 -2445930 -5336151 -6260947
7014 -6260947 -2621780 2443961 4429078 3954147 4868770 7511023 8478252 6752500 5560812
7005 5560812 7237426 9879436 10648038 9649438 8693119 7998352 6007110 1796957 -3433154
6996 -3433154 -7108092 -7376257 -4977817 -2831731 -3051575 -4755835 -5650590 -5004375 -3725704
6987 -3725704 -2310065 -656301 455113 -89478 -1570414 -2013146 -1506916 -2803450 -7433799
6978 -7433799 -12920089 -15388564 -13949912 -11066527 -9198242 -8462676 -7516349 -5669216 -3688011
6969 -3688011 -2738275 -2807045 -2607651 -1360087 19448 487040 972193 3093194 5810854
6960 5810854 5763735 2047661 -1555151 -1204697 1699236 2547732 90213 -2188637 -1624279
6951 -1624279 -120667 -643030 -2385479 -2089432 885933 3487661 3045020 385424 -1725641
6942 -1725641 -1933555 -1425885 -2422417 -5797588 -9698678 -10779523 -7629066 -2610362 716015
6933 716015 1394899 882732 -57158 -1726156 -2943584 -1413692 2209075 3693279 839200
6924 839200 -2698492 -1907200 2984228 7331028 8312259 7193183 5888453 4540464 2956628
6915 2956628 1777737 1295496 916291 421724 259554 275332 -322106 -1508866 -2422408
6906 -2422408 -2830645 -3091820 -2786118 -1211628 802725 1591191 1273732 1590728 2864943
6897 2864943 3328242 1976110 -40231 -1463891 -2242034 -2133574 -300940 2671872 4464808
6888 4464808 4030093 3240746 4375308 7392130 10543023 12170466 11233843 7775909 3557042
6879 3557042 551771 -1509781 -4039129 -6039386 -4805275 -915276 1089659 -1212189
6871 -1212189 -4702287 -5661243 -4911512 -5103557 -5765682 -4733223 -2512106 -1393918 -1394411
6862 -1394411 -669494 635701 298963 -2182817 -4302683 -3292197 1407179 7889213 12537587
6853 12537587 12158975 7206344 1856341 -695073 -1503485 -2842252 -4232798 -4110913 -3284186
6844 -3284186 -3473820 -4096065 -3824817 -3694851 -4972121 -5526906 -2602935 1872904 3299947
6835 3299947 1200686 -556733 -118440 570065 656194 2084566 5195924 7102903 6119196
6826 6119196 3967348 2074595 -501982 -3794754 -5393310 -4290663 -2939715 -3436561
6818 -3436561 -4752498 -5646355 -7079040 -9575685 -11277701 -10937911 -10066244 -9984353 -9644067
6809 -9644067 -8462552 -8146871 -9321455 -9671297 -8185231 -7747232 -10116278 -11780523 -9092458
6800 -9092458 -4689136 -3888061 -6621145 -8064678 -6233212 -3886033 -3166186 -3206833 -3499975
6791 -3499975 -5149774 -7750673 -8989305 -8662453 -9407587 -11731225 -11827313 -6984704 -621468
6782 -621468 1256463 -2461933 -6866311 -7317209 -4574687 -2786464 -3875291 -5686853 -5661719
6773 -5661719 -4494510 -4733599 -6889306 -9152849 -10547323 -11551662 -11313840 -7699434 -1649262
6764 -1649262 1913133 138002 -3684010 -5234242 -5508629 -7895952 -11196000 -10862914 -6472874
6755 -6472874 -2613052 -1925341 -2261822 -1816413 -2142692 -4096979 -5340022 -4632206 -4603878
6746 -4603878 -6892526 -8065595 -4584474 783973 2320216 -242558 -1621825 772544
6738 772544 3272035 1866049 -2452812 -6530984 -9853983 -13172423 -14520741 -10835309
6730 -10835309 -3335586 2614869 4232228 4637220 7272463 9824847 7388193 310121
6722 310121 -5516721 -6529521 -5376187 -5330026 -5017704 -2006252 1501397 1049256 -3369103
6713 -3369103 -7344829 -8413039 -8209190 -7961752 -6118918 -2050954 1465447 1934031 956918
6704 956918 1879185 5062554 7702499 7535080 4951107 1814726 -568973 -2402959 -4730074
6695 -4730074 -7435761 -8250867 -5171413 146806 3395110 2655499 568083 558032 2722668
6686 2722668 4663793 4756919 3158436 812523 -1223496 -2369469 -3200338 -4399473 -4790299
6677 -4790299 -2493889 1322453 2637740 78860 -2595665 -1886802 212638 -392509 -3353282
6668 -3353282 -4674637 -3010474 -1065723 -810710 -1190271 -1274863 -2159791 -4349818 -6093765
6659 -6093765 -5997489 -5127187 -4854752 -4386024 -2240521 943435 2770668 1895168 -439371
6650 -439371 -1440395 748540 4895228 7206326 5223247 984342 -1328253 -661273 343168
6641 343168 275992 1330886 5134567 8987958 9025447 5502383 2053772 571739 -281101
6632 -281101 -1745636 -3164083 -4121602 -5743855 -8424951 -10141613 -8905593 -5938051 -4517138
6623 -4517138 -5792762 -7352971 -6508195 -3890348 -2696671 -4676606 -8065716 -9951995
6615 -9951995 -9730071 -9168387 -9613802 -10660645 -11671473 -12820081 -13644824 -12108993 -6910608
6606 -6910608 -94992 4435685 4971960 3094983 845869 -1372988 -3644381 -5207091
6598 -5207091 -5562268 -5671536 -6597067 -7676375 -7448492 -5899972 -4307051 -3075497 -1406468
6589 -1406468 599306 1172749 -787097 -3750635 -5285725 -5230354 -5715404 -7926860 -10141309
6580 -10141309 -9765469 -6676243 -3561445 -2932118 -4556050 -6280901 -6929748 -7530700 -9421885
6571 -9421885 -11834171 -12266237 -9377379 -4854014 -1983728 -2670880 -6138184 -10162892 -13026883
6562 -13026883 -14369076 -14712537 -14472904 -13464215 -11474212 -9153973 -7605696 -6724659 -4865806
6553 -4865806 -1225782 2066949 1871983 -1881760 -5725132 -6869126 -6250923 -6256866 -7003971
6544 -7003971 -6756490 -5001568 -2809394 -520269 2423063 5099854 5265556 3030526 1924024
6535 1924024 4282459 7439988 7091406 3287807 103549 -324787 -191493 -1740923 -3646013
6526 -3646013 -3517555 -1868701 -1224103 -2463192 -4273274 -5512122 -5900858 -4734815 -1275850
6517 -1275850 3264439 6230122 6704193 6403187 6574297 5860518 2710983 -1495166 -3593696
6508 -3593696 -2236566 1274607 5215733 8672831 10722024 10514076 8945732 8562477 10451564
6499 10451564 12230191 10643562 5776350 1202526 -120790 1337776 3488791 5709356
6491 5709356 8644906 11737061 13007428 11669558 9257908 7299544 5375296 2791079
6483 2791079 722771 641964 1545268 1346451 710733 2349872 5778806 6190440 818086
6474 818086 -6198322 -8506948 -5634225 -2874389 -3588003 -5348505 -4599369 -1818439 67841
6465 67841 333167 925088 2884459 4426224 3172488 -566460 -3441058 -2300604 2157055
6456 2157055 5640538 4922813 1565297 -346747 426118 1351506 643401 -56717 1099074
6447 1099074 2668627 2115107 168786 205938 3489659 7502488 9505646 9711946 9906139
6438 9906139 10422845 9962408 7807424 4898366 2605784 1275840 382749 -340260 -559974
6429 -559974 -199194 -25010 -777039 -1880746 -1718518 617857 4222446 7038799 7238972
6420 7238972 4229508 -758504 -4936960 -5796892 -3196815 864386 4510424 7062187
6412 7062187 7994928 6657915 3868372 2074971 2388521 2604031 -92576 -5221763 -9625566
6403 -9625566 -11502305 -11864858 -11989902 -11392375 -9022918 -5129948 -1144050 1513471 2091321
6394 2091321 743711 -1517380 -3660977 -5522560 -7294492 -8439243 -8211565 -7204707
6386 -7204707 -7043221 -8187494 -9241621 -8957620 -7815427 -6932930 -6408305 -5647718 -4669697
6377 -4669697 -4191414 -4745502 -6275499 -8235110 -9676264 -9751681 -8573568 -7034074 -5401387
6368 -5401387 -2904398 635432 3667167 4566702 3918752 3812032 4960951 5882094 5208525
6359 5208525 3472507 1804650 29301 -2513514 -4767679 -4433239 -1244043 1665598
6351 1665598 1028813 -2595186 -5697281 -6521496 -7027642 -9367504 -12123326 -11946441 -8260157
6342 -8260157 -4130955 -2036355 -695830 2516101 7177847 9832387 8474611 5315097
6334 5315097 4035448 5247838 6110122 4229024 405353 -2973917 -4840731 -5634834 -5709816
6325 -5709816 -5216365 -5090292 -6362218 -8385745 -9220721 -7839648 -4533154 511141 6704582
6316 6704582 11031296 9680654 3237302 -2387744 -2326788 2013513 6082460 7988288 8205829
6307 8205829 5922446 87381 -6733202 -9914113 -8487945 -5776637 -4159643 -2921514
6299 -2921514 -1670437 -1704373 -2718450 -2175980 163448 864380 -1684618 -4004567 -2767725
6290 -2767725 -90847 42376 -1945014 -2661054 -1718677 -1903969 -4042593 -5702014 -5085954
6281 -5085954 -2928098 -432340 1552253 1207889 -2995435 -8872766 -11369926 -8260475
6273 -8260475 -2811271 519624 1111345 1434161 2758037 3428319 1232094 -3468024 -7394723
6264 -7394723 -7535278 -4631112 -2299328 -2135272 -1562300 1946580 6626020 9009315 8989918
6255 8989918 8879435 8715239 6694163 3768601 3109895 4517022 4146739 1083914 -686265
6246 -686265 977175 2435840 213584 -3504366 -5255105 -6232785 -8978901 -11356937 -9597850
6237 -9597850 -5379386 -3729936 -4666719 -3234668 1645014 4640758 2333153 -1403781
6229 -1403781 -1495085 1164388 2382835 1394348 865244 1957874 3093683 2949151 1902490
6220 1902490 945267 1192077 3641925 7383094 9020434 6250603 1295032 -1694158 -2160872
6211 -2160872 -3387089 -7246877 -11587264 -13610005 -13276472 -11878151 -9281941 -4765350
6203 -4765350 332981 2934110 1406826 -2745029 -6607672 -8416300 -8166692 -6596366
6195 -6596366 -4428126 -2446492 -1463133 -1751429 -2877660 -4430148 -6387074 -8158287 -8026702
6186 -8026702 -5009264 -1091273 292259 -1379380 -2742785 -1204641 1217043 807569
6178 807569 -2266398 -4003097 -2086865 1204853 2326735 629954 -1942926 -3797118
6170 -3797118 -4927563 -6073831 -7868421 -10482854 -13298381 -15089287 -14972737 -13075431
6162 -13075431 -10324585 -8022731 -7341595 -8313220 -9424981 -9266011 -8455285 -8610443 -9492204
6153 -9492204 -8997904 -6391030 -3564362 -2212587 -1698055 -1025948 -1020843 -2613699 -4409501
6144 -4409501 -4191429 -1987354 481182 2735554 5652028 8892273 10498267 9387165
6136 9387165 6537129 3464535 1111599 347807 1707628 4041865 4991544 3613111 1510098
6127 1510098 879758 2354657 4920069 6828062 6547332 4236248 2425986 3567552 6512689
6118 6512689 7314099 4334695 641807 -43634 1883334 3052358 1903502 125659 -456268
6109 -456268 -396342 -1358195 -3502543 -5045100 -4178137 -1016220 2365678 3695362 2267296
6100 2267296 -841525 -3795287 -5076401 -4332512 -2853958 -2523666 -3368705 -2979436 242217
6091 242217 4101873 4979576 2796721 1091999 1959284 3720154 4465576 4877966 5720641
6082 5720641 5284308 2119755 -1531814 -2162592 41432 1559589 456025 -1816542 -3546257
6073 -3546257 -4971019 -6643824 -7816136 -7636563 -6576331 -5685985 -5413609 -5832626 -7044587
6064 -7044587 -8569187 -9115687 -7867432 -5651047 -4068940 -3490659 -2509311 260667 4185204
6055 4185204 7145807 8182476 8523445 9225704 9170990 7269529 5555329 7062261 10657080
6046 10657080 11476906 7585684 2779619 966503 1204458 956256 821761 2231013 3270706
6037 3270706 1492764 -1060142 -744798 1037796 -233586 -3982799 -4500890 -259546 2932631
6028 2932631 749692 -3129145 -3098473 212866 2413211 2738528 4006120 7013498 9672039
6019 9672039 10949114 11610436 11351471 8918049 5290433 3487030 4604724 6695038 8085008
6010 8085008 9238420 10500014 10449713 8090156 5213781 4929283 8141978 12318211 13718476
6001 13718476 10763102 5459795 1473201 617681 1544907 1876229 688381 -1483316 -3827117
5992 -3827117 -5463586 -5576225 -4558784 -4087334 -4695329 -4199302 -250586 6066852 10914921
5983 10914921 11821007 9675385 6838779 4869882 4285176 5070916 6680601 8071807 8123598
5974 8123598 6137588 2618301 -135717 606237 5036241 10067828 12566449 12364375 11062049
5965 11062049 9272803 6781367 4223737 2460334 1071495 -393305 -490673 2278365
5957 2278365 6251837 8061853 7235428 6429336 6794329 6275214 3571315 804908 456362
5948 456362 1902241 2867839 2478425 1086368 -1077845 -2952252 -2032836 2536171 7162493
5939 7162493 7021127 2105795 -2480937 -2803081 -292494 1439979 1788925 2871001 5089668
5930 5089668 5882650 3718694 1155740 1852133 5357351 7176830 4323749 -1150869 -4973058
5921 -4973058 -5151103 -2338122 2518302 8551758 13756871 15856011 14725237 12461220
5913 12461220 10926368 10423277 10460504 10288181 8938536 6366097 4229694 3760327 3379498
5904 3379498 804384 -2827446 -3975891 -2190679 -1279599 -3799019 -7536227 -9321508
5896 -9321508 -9425782 -9722588 -10047141 -9480092 -9367516 -11549562 -14528936 -14831975 -12022125
5887 -12022125 -9359704 -9275793 -10856041 -12168810 -12464181 -11317120 -8066376 -3420252 237854
5878 237854 1545485 1774537 2516630 3159007 2274623 485810 -46219 1287448 2873055
5869 2873055 3613449 4488271 6248835 7090800 4855103 1226963 1062207 6252036 12357124
5860 12357124 13666484 10368258 7747974 8617351 10087196 8960419 6933864 7775802
5852 7775802 11425519 14029230 13049770 9616252 6035588 3446556 2198667 2420580 3485804
5843 3485804 4310916 4695894 5266105 5880444 5403184 3530951 1712303 1473692 2359782
5834 2359782 2163678 -709978 -5099434 -7603027 -6075241 -2602718 -1572093 -4302831
5826 -4302831 -7497538 -8165257 -7747963 -8967956 -10588558 -8950041 -4000372 69819 637039
5817 637039 -388574 -428378 157581 37107 -190998 704676 2103885 2400798 1251598
5808 1251598 -629042 -2944410 -5743064 -8699812 -11463458 -13819820 -14845628 -13205472
5800 -13205472 -9076131 -4386024 -453172 2892596 5132049 4415210 629239 -3215890
5792 -3215890 -4774149 -5483606 -7472815 -9365568 -8393199 -5390087 -4055237 -5521637 -7027095
5783 -7027095 -6373642 -4776515 -4432774 -5569962 -6871546 -7171327 -6113190 -4513159 -4185282
5774 -4185282 -5863267 -7498116 -6591085 -3987116 -2851270 -3770532 -3797617 -1182001 1827964
5765 1827964 2374700 756777 -861714 -1373580 -597085 1720588 4634857 5405005 2466336
5756 2466336 -2157154 -5422950 -7011231 -8369918 -9383928 -8785532 -7177207 -6698873 -7678512
5747 -7678512 -8273668 -7741616 -7444202 -7841084 -7006894 -3650492 190444 1252667 -1089799
5738 -1089799 -4488239 -6515638 -6665863 -5869384 -5201582 -5110534 -5161799 -4409016 -2438388
5729 -2438388 -98800 1115820 511527 -1135391 -2516997 -3415393 -5047976 -8304756 -11867558
5720 -11867558 -13130343 -11353910 -8780973 -7805173 -8155727 -8137132 -7548980 -7461354 -7762343
5711 -7762343 -7286752 -6327659 -6464502 -7325632 -6213719 -2392920 664200 -422959 -4050226
5702 -4050226 -5638903 -3595772 -542812 1060288 1615174 2167528 2221163 1311051 888874
5693 888874 2672858 5964962 8267442 8193315 6494541 4594966 3430448 3470317 4345601
5684 4345601 4293834 1474598 -3583515 -8071551 -10088779 -10520015 -10919196 -11024515 -9977292
5675 -9977292 -8825811 -9482298 -11471514 -12071854 -10032836 -6994397 -4660290 -2919424 -1802789
5666 -1802789 -2682954 -5503063 -7046950 -4774834 -909621 393529 -952409 -1176947 1383522
5657 1383522 4114337 4545530 3589408 3078166 3069082 3333415 4833213 7507018 8811340
5648 8811340 6996122 4148952 3358321 4161723 3631681 1166010 -783686 -660893 292524
5639 292524 595975 649634 1323646 2176974 2288133 1815592 1620011 1789750 1386300 -268665
5629 -268665 -2373072 -3090905 -1596527 645982 1600405 1508766 2419893 4496903 4948112
5620 4948112 2061696 -1614403 -2270454 347324 3488474 5690477 7723261 9690913
5612 9690913 10129082 8399655 5634919 2759004 -431804 -3756637 -6173275 -7424330
5604 -7424330 -8488404 -9881693 -11023039 -11552428 -11645419 -10845859 -8426306 -5181463 -2968930
5595 -2968930 -2158048 -1466726 -533896 -406865 -1134082 -1422429 -1348182 -2674851 -5381093
5586 -5381093 -6621339 -4709533 -1646379 71967 769201 1726859 2321630 1425451 -195470
5577 -195470 -1285875 -2248596 -3500764 -3396875 -595337 2818980 3560873 1696769 175413
5568 175413 411323 1094215 1012448 276569 -1244196 -4061662 -7285650 -8860130 -7928815
5559 -7928815 -5287778 -1751983 1820960 3217508 392725 -5092131 -8548267 -7057363
5551 -7057363 -2206037 2528118 5081871 4861578 1921112 -2227390 -4532726 -3058219
5543 -3058219 758949 3676753 4089809 3048658 2287886 2280769 2448341 2647299 3615381
5534 3615381 5492879 6573182 4975070 1712024 300511 2392553 5590071 7017612
5526 7017612 7120126 7716726 8118131 6365278 3329359 2020893 2941691 3525034 2479206
5517 2479206 1260555 541100 -1207808 -4208497 -5838544 -4650222 -3028515 -3415988 -4355828
5508 -4355828 -3044119 165669 2809284 4395781 6220227 7855131 7145094 3974788
5500 3974788 1345250 1835799 4780601 7653187 8765638 7880423 5472257 2499276 323889
5491 323889 -166167 461488 483297 -1296357 -4057988 -5598744 -4876510 -3325648 -2696223
5482 -2696223 -2298517 -294844 2379584 2043537 -2507699 -7050101 -6409906 -646956 5438670
5473 5438670 8189414 8193527 7818215 8024524 8179965 7316312 4849346 1232389 -1585143
5464 -1585143 -1495247 1272382 3806382 3364169 139559 -3170435 -4087558 -2358968 257968
5455 257968 1843609 2164852 2732873 4752053 7316085 8450468 7867085 7490622 8739598
5446 8739598 10454475 10644908 9439727 8588068 8194543 6069427 1327833 -3126573 -3660724
5437 -3660724 -620758 2163654 2338652 1147684 279946 -730924 -2585169 -4023588 -3715381
5428 -3715381 -2684160 -2402671 -1696018 1611901 6524389 9322071 8389897 5969814 4599278
5419 4599278 4268078 3928911 3543106 3421765 3305274 3211669 3698369 4417886 4027011 2410366
5409 2410366 1271566 1480958 1603573 335260 -1312908 -1810058 -1559689 -1768894 -2062278
5400 -2062278 -1178882 653792 1888456 1933813 1758366 2281966 3354074 4411979 5270640
5391 5270640 5988045 6295470 5430974 2929099 -166417 -1677918 -821224 517705 539649
5382 539649 594912 3124450 7118127 8709878 6568318 3540295 2167103 1841787 1686238
5373 1686238 2789501 5441972 7178435 6234371 4565533 4800275 6299567 6857983 6329960
5364 6329960 5880640 5479054 4827397 4964949 6208579 6409515 4244627 2291162 3399178
5355 3399178 5735141 5283596 2033351 -343440 -237414 417088 3694 -1277643 -3614184
5346 -3614184 -7434111 -10829748 -10811231 -7728913 -5159635 -4787302 -4587722 -2894067 -1231711
5337 -1231711 -1917865 -5086592 -8903611 -10933888 -9304629 -4733119 -1204722 -2069496 -5570203
5328 -5570203 -6830325 -3977169 529406 4116916 6200019 6346908 4243635 1816412
5320 1816412 1613030 2557449 1123399 -2641737 -4337587 -1547193 2963176 5654253 5973746
5311 5973746 4378020 688817 -3745609 -6109197 -6290577 -7257050 -9496396 -9480196 -6145621
5302 -6145621 -4223508 -7406479 -12235375 -13203865 -10769865 -9517084 -10655547 -11340685 -10322959
5293 -10322959 -9697087 -11125747 -13763647 -15940749 -16387890 -14297956 -10498255 -7786771
5285 -7786771 -7834462 -8701587 -7687495 -5455954 -4723742 -5849622 -6587773 -5815934 -4916393
5276 -4916393 -5371479 -6879099 -7989780 -7527185 -5690852 -4257945 -4604687 -5248283 -3408606
5267 -3408606 409892 2252024 373062 -2191686 -2623084 -2289962 -2937576 -2588646 770342
5258 770342 4390449 4300061 1626111 720963 2410870 3727486 3370284 2811003 2428650
5249 2428650 992300 -958001 -1122639 1017225 3929596 6837653 9432284 9777913 6640677
5240 6640677 3158135 3562035 6569277 6993065 4043815 2579636 5022174 7513057 6340051
5231 6340051 3305155 1640601 611694 -2072409 -5134540 -4829677 -213774 5295561
5223 5295561 7446991 5178273 1578584 920222 3785482 5886023 3504597 -1157366
5215 -1157366 -3029040 -1423587 -199661 -1159645 -2030060 -1469268 -1196504 -1995899 -2441759
5206 -2441759 -3034486 -6335274 -10815074 -10250262 -2793001 4591084 5325658 2325129 2486950
5197 2486950 5840595 6639540 3183088 -83424 7195 1546344 1873210 1044341 -85629
5188 -85629 -1502603 -2646644 -2410762 -1398362 -1587004 -3234558 -4727896 -5866176 -8356590
5179 -8356590 -12198287 -14382668 -12641867 -8437460 -4835244 -2983465 -1913255 -549541
5171 -549541 1226912 2694589 2735345 844515 -1958514 -3947600 -4467440 -4048989 -2983016
5162 -2983016 -1058095 1301076 3005338 3583160 3287984 1983872 -525284 -2941497 -3127449
5153 -3127449 -991338 1031899 1442501 2012150 5088770 9743711 12628589 12271930 10445011
5144 10445011 8932671 7022067 3586684 240680 120442 3485368 6564613 5772441
5136 5772441 1716746 -2164638 -3721938 -3163590 -1005766 2530256 5939536 6718034 4349709
5127 4349709 1315631 -71407 -406996 -1515187 -3519960 -5407888 -7403181 -10410557
5119 -10410557 -13313095 -13276955 -9574940 -5241423 -3494849 -3693019 -2630725 648299 3542338
5110 3542338 4027436 3989544 6422643 10406861 11625236 8173283 3323575 1346589 2648897
5101 2648897 4581171 5169871 4067545 1450477 -1600450 -2825731 -1452742 -187505
5093 -187505 -1883118 -5093577 -5949428 -3808423 -1628228 -932352 -137613 1662920 2958811
5084 2958811 2866560 2527737 2346616 1220687 -182946 998246 5119102 8385002 8202911
5075 8202911 6883715 7352807 8356184 7248396 4945265 4406044 5939259 7470672 8155379
5066 8155379 8561219 8447870 7427029 6833259 8057433 9969313 10689864 10701905 11209918
5057 11209918 10709459 6907121 1553031 -435989 2877780 8198998 11393827 11521050
5049 11521050 10032730 8516288 8028609 8639766 8870718 7127655 4086764 2188281 2569075
5040 2569075 3945340 4619407 4141402 2928827 1676661 1296462 2268597 4000981 5655969
5031 5655969 7180519 8606727 9125109 8129969 6531984 5824270 6496198 8230683 10410904
5022 10410904 11382014 9089731 4289711 1314237 3245665 7764357 10294318 9814475
5014 9814475 8611264 7556251 5289642 1853778 -267211 729676 4210556 8543275
5006 8543275 11913866 11853691 6830787 -964858 -6594834 -7030589 -3679950 -251061 671347
4997 671347 -713806 -1845120 -364055 2740226 3815224 1612830 -411271 974923
4989 974923 3852197 4369291 3018035 3691934 7440515 11248088 12803438 12686865 11719714
4980 11719714 9791631 7851533 7854510 9965591 12274197 13576848 14219866 14419227 14142573
4971 14142573 14223797 15190626 15767351 15034676 14746957 16517250 18408974 18075448 17489033
4962 17489033 19836780 23080792 22136916 17062797 13435049 14186715 16428512 17100793 16523615
4953 16523615 15307417 12919883 10700420 11375804 14089213 14659272 12208257 10626500
4945 10626500 11826852 12643104 10603914 7912158 7061815 6844456 5448325 3779284 3263141
4936 3263141 3742779 5441570 9415821 14304212 16319490 14233412 10970243 9083100
4928 9083100 8330793 8468935 10136443 12153428 12410461 11974068 13447329 15197001 13150888
4919 13150888 8637360 7620667 11255161 14478222 15212521 16985504 20561687 21611126
4911 21611126 19554404 19985763 24686056 27917870 26714966 25949933 28478589 29324578 25240420
4902 25240420 21369652 22478915 25825857 28265010 31644120 35604930 34685939 28675925
4894 28675925 25682202 28641535 30035429 26689456 26794229 34026512 39063369 36914710
4886 36914710 37212565 45295777 49919949 44364252 41698752 51510643 61052736 60911219
4878 60911219 67561664 92948494 115836234 120928342 141396486 206521698 259628275
4871 259628275 200062710 22946008 -148013374 -201294878 -158906899 -116481283 -111044644
4864 -111044644 -106963035 -82732658 -62585881 -63464390 -67507093 -59835204 -52351886 -55312850
4856 -55312850 -57469671 -49437086 -41009621 -41033723 -41506372 -35030675 -29566278 -32810327 -37741931
4847 -37741931 -36203502 -33195871 -35583991 -38366428 -34063984 -26214049 -22554819 -22645525
4839 -22645525 -22029496 -21700273 -24227421 -26351402 -23887532 -19274150 -17122964 -16712693 -15156599
4830 -15156599 -13605476 -14368105 -15832754 -15599338 -15050039 -16203858 -17581212 -17151575 -15754813
4821 -15754813 -14331706 -11967384 -9758519 -11699482 -18034598 -22549935 -20583760 -15452252
4813 -15452252 -13019099 -14064857 -15899371 -17388665 -18282227 -17209939 -14250291 -12293758
4805 -12293758 -12670051 -12852100 -11214920 -9959360 -10431298 -10217413 -8437308 -9166526 -15222282
4796 -15222282 -22605288 -25583813 -23763477 -19997639 -15119654 -9446532 -6113244 -7745135
4788 -7745135 -11952255 -14296368 -13633963 -11179813 -7276414 -2882114 -1086914 -2824236
4780 -2824236 -3920548 -878679 3024621 2049178 -3868025 -9877138 -13082839 -14045515 -13286608
4771 -13286608 -11177870 -10185593 -12673617 -17032694 -19655669 -19791897 -18963334 -17002953 -12781650
4762 -12781650 -8037242 -6438220 -8891735 -12776899 -15427681 -15846284 -13933488 -10749467
4754 -10749467 -8750419 -9498115 -12074310 -15187323 -18621702 -20897682 -18862948 -12543736
4746 -12543736 -7110846 -6517257 -8406575 -9070791 -9623333 -12316884 -14447714 -12217533 -8035331
4737 -8035331 -7203799 -9010127 -8024797 -3308605 754410 2587684 5137314 8667226 8888068
4728 8888068 4219233 -1151015 -3650310 -4383319 -4807122 -3798826 -1538746 -1190518 -3729503
4719 -3729503 -5560219 -4257575 -2542949 -3504212 -5759678 -6628566 -6589541 -7203816 -7708335
4710 -7708335 -7095479 -6888583 -8482531 -10059249 -9395908 -7674972 -7400404 -8467481 -9386093
4701 -9386093 -10540008 -12881833 -14813730 -13820091 -10475181 -7778725 -6916972 -6387733 -5129044
4692 -5129044 -4033089 -4148589 -5245996 -6413595 -6858403 -6289039 -5551607 -6365529 -9239113
4683 -9239113 -12158347 -12552147 -10184060 -7113146 -5268243 -4999530 -5547278 -6025920 -6209702
4674 -6209702 -6793898 -8343588 -9832380 -9387096 -7009244 -5238244 -6157068 -8804718 -10605769
4665 -10605769 -10470684 -9335731 -8266575 -7272036 -5983604 -4725297 -4499711 -5794730 -7584275
4656 -7584275 -8317307 -8214033 -9303615 -12217504 -14482788 -13721644 -11039058 -8880872 -7025434
4647 -7025434 -3934139 -988433 -1283311 -4303455 -6048989 -5109824 -4427875 -5878076 -7356627
4638 -7356627 -7028367 -6322649 -6352825 -5259827 -1976054 869089 900774 -317843 -642036
4629 -642036 -1082830 -2699988 -3159955 -707796 1408661 -513108 -3958779 -3561740 332309
4620 332309 2282010 474274 -1040695 451932 2355738 1758952 -125901 -846269 -538203
4611 -538203 -464254 -336369 648039 1852911 1944081 341716 -2744674 -6152336 -7474411
4602 -7474411 -5193547 -1436019 -38018 -1398795 -2163682 -736161 383958 -617910
4594 -617910 -1307873 919019 3872040 3232972 -1172930 -5178302 -5947240 -4891199 -4625334
4585 -4625334 -5408342 -5514087 -3767159 -966333 501723 -1682998 -7575673 -14095520 -17127128
4576 -17127128 -15031531 -9828181 -4837467 -1750914 -346799 -225073 -1398248 -2963679
4568 -2963679 -2845466 -346911 2043818 1567070 -453733 55165 3736864 6173611 4099641
4559 4099641 57656 -1946192 -2604009 -5243030 -9701373 -12995554 -14986938 -18045110
4551 -18045110 -21005440 -19212722 -12277758 -6509659 -6657108 -9552371 -9542018 -6603050 -4791153
4542 -4791153 -5256003 -5522665 -4454409 -3558724 -3667005 -3971045 -4352200 -5439468 -6213733
4533 -6213733 -4613054 -974166 1869300 2507395 2409725 2712087 2094769 -760075 -4487437
4524 -4487437 -6386461 -5410817 -2775045 -456130 175783 -853911 -2003915 -1653255 -162797
4515 -162797 295300 -1637869 -4967358 -7843093 -9513588 -10053719 -9158049 -6448713 -2738641
4506 -2738641 14753 300326 -1727208 -4693294 -7415477 -9649832 -11464032 -12374038 -11813246
4497 -11813246 -10333012 -9217185 -8498092 -6624578 -3036102 247188 1209906 987754 2198655
4488 2198655 4508930 4458449 286421 -5385504 -8890256 -9686112 -9666662 -9737390 -8970817
4479 -8970817 -6561722 -3034601 346025 2396503 2655873 2103662 2644954 4859758 6883940
4470 6883940 6641786 4494286 2362841 1032954 99282 -75560 1328109 3449928 4465109
4461 4465109 4753620 6530758 9420325 9637355 5648351 1560591 1559835 3372640 1709810
4452 1709810 -2974936 -4424249 128011 5724073 6931142 4875482 3625472 3136363
4444 3136363 441086 -4086304 -6687563 -6214610 -5728962 -7299741 -8911958 -7977602 -4935900
4435 -4935900 -1691277 1026907 2869687 2589433 -135155 -2921662 -2942266 -319076 2416583
4426 2416583 3621373 3659494 3236955 2424669 1430022 878307 868199 663641 -225577 -1230472
4416 -1230472 -1429971 -856391 -728130 -2167111 -4721756 -6585243 -6566324 -5324840 -4132788
4407 -4132788 -3202419 -2373342 -2716694 -5534096 -9715055 -12050387 -10829200 -7571497 -4607888
4398 -4607888 -2666256 -1700180 -2172959 -3888793 -4866320 -3227013 337919 3356684 4446356
4389 4446356 4372753 4649565 5889237 7182620 6727556 3778766 182422 -1193774 128737
4380 128737 1881165 2493963 2915960 4125796 5112968 4962341 4922360 6337238 8168062
4371 8168062 8762707 8648077 9213527 9838161 8807728 6174930 3318089 494793 -2739597
4362 -2739597 -5417711 -5943873 -4464255 -2258318 391181 3346178 4776364 3193310
4354 3193310 479119 -447187 -376784 -2485236 -6463964 -8192906 -6014059 -3295376 -3294325
4345 -3294325 -5065818 -6301246 -6968161 -7879819 -8351919 -7714512 -7126914 -7720292 -8617853
4336 -8617853 -8600200 -8026251 -7445595 -6148201 -3846587 -1948272 -1280761 -395778 1778048
4327 1778048 3397312 2340557 50615 -17769 2739727 5157203 4221676 176494 -4302157
4318 -4302157 -6698755 -6390962 -4677194 -3153685 -2050137 -869174 -310441 -1669464 -4058413
4309 -4058413 -4668989 -2904439 -1822533 -3742736 -6608142 -6847128 -3944943 222340 4852823
4300 4852823 10082779 14436716 15466310 12879677 8900136 5723657 4332466 5056556
4292 5056556 7091265 7942368 5695435 1779592 -555940 -425120 75571 -553373 -1162005
4283 -1162005 27818 3128832 7014974 10685282 13473136 14855466 14763254 13666604 12052618
4274 12052618 10024529 7352531 3805528 -199551 -3284690 -4290944 -3932360 -4120278
4266 -4120278 -5263910 -5623208 -3998333 -1555444 36655 929451 2370014 4719326 7204749
4257 7204749 8711138 8199212 5549351 2446358 963080 1071298 1491222 2838058 6740187
4248 6740187 11346410 11814323 7160127 2776247 3493125 7618389 10806711 12257352 13318764
4239 13318764 13152153 10297867 6426673 4366372 4136513 4545472 6459872 10478331 13620896
4230 13620896 12738077 9335470 6849288 5358060 3477312 2972886 6149792 10620488
4222 10620488 12149754 11110545 10871300 11629135 11336593 10788130 12084257 14166244 15579784
4213 15579784 18678073 24606654 27991411 24676332 20664940 23646333 29676435 29964397
4205 29964397 27206445 30975625 39182627 40628556 35888560 37546425 47536127 53799041
4197 53799041 53776331 59777182 74125603 83486828 89102275 113267172 153203703 156692234
4189 156692234 80862130 -38984356 -119124504 -123280365 -92037702 -74710707 -72063271
4182 -72063271 -61596667 -43909483 -35925911 -38488470 -38526295 -33827290 -33128119 -36956954
4174 -36956954 -37195372 -32738141 -29906331 -29291748 -25902977 -20934911 -20739361 -24565130 -24720462
4165 -24720462 -19222421 -14238305 -13394829 -13747608 -13109926 -12985262 -13190685 -11237105 -8236261
4156 -8236261 -8421809 -11665966 -13121409 -11465388 -10936216 -13589856 -15829138 -14840614 -12892105
4147 -12892105 -12669342 -13055372 -12065010 -10021609 -7722795 -5169854 -3930716 -6822126 -12926524
4138 -12926524 -16471533 -13463956 -6909992 -3002330 -4144886 -7819711 -10486992 -10460976
4130 -10460976 -8193175 -5634681 -4831006 -6115576 -8038241 -9218601 -9460870 -9206599 -9065754
4121 -9065754 -9700554 -10935545 -11370550 -10232861 -8946685 -9166518 -10026394 -9494651 -7917607
4112 -7917607 -7815407 -10282411 -13784289 -16450754 -17519933 -16758654 -14650850 -13009769 -13253487
4103 -13253487 -14243220 -13854946 -12188051 -10943925 -10362161 -9561670 -9284693 -11027254 -13708201
4094 -13708201 -14701519 -14190873 -14707273 -15986737 -14581658 -9884843 -6322605 -7284836 -10405233
4085 -10405233 -11530079 -10366943 -9218308 -8592476 -7406974 -5934463 -5342323 -5231402 -4445252
4076 -4445252 -3721255 -4912163 -7725327 -9492890 -8413229 -5386444 -2479763 -933592
4068 -933592 -855725 -1711342 -2697969 -3238590 -3393841 -3714170 -4871635 -7377409 -11072928
4059 -11072928 -14840260 -17481897 -18832044 -19153513 -17754212 -13754942 -8387097 -4724915
4051 -4724915 -4335092 -5651735 -6585401 -7344808 -9419491 -12775906 -15486591 -15837524 -13892650
4042 -13892650 -11081894 -8688596 -6685045 -4158634 -1136467 683429 -99477 -2598971
4034 -2598971 -4850780 -6173061 -6712976 -5799636 -3325625 -1929538 -4348365 -8565359 -9336191
4025 -9336191 -5343718 -1053742 -115444 -939113 -1036739 -1664050 -4640696 -7829540 -8076651
4016 -8076651 -6566560 -6955967 -9474862 -11027717 -10389315 -9246321 -8346373 -6555119 -4030115
4007 -4030115 -2748867 -3261743 -4056998 -4679598 -6296585 -8468195 -8683830 -6319403 -3943970
3998 -3943970 -3144765 -2027265 1087862 4110266 3909142 796649 -2220088 -3365650 -2944781
3989 -2944781 -1396060 958918 2759703 2597581 1123212 178867 -172184 -1729667 -4943153
3980 -4943153 -7615976 -7744766 -6135726 -5025420 -5218027 -5966743 -6995764 -9010694 -12143880
3971 -12143880 -15257563 -17327300 -18574879 -19570250 -19974064 -19053598 -16964414 -14537783 -12027289
3962 -12027289 -9062187 -5761761 -2843740 -552055 1450868 2986843 3372408 2795707
3954 2795707 2261265 1618186 -718179 -4992978 -8587713 -8839529 -6291808 -3560090 -2048753
3945 -2048753 -1648450 -2607297 -5135795 -7492522 -7159155 -4346015 -2032528 -1895621 -2394799
3936 -2394799 -1790719 -860541 -1153033 -2339221 -3134710 -3692228 -5210628 -7714689 -9770616
3927 -9770616 -10203900 -9039938 -7053259 -5295672 -4702597 -5314247 -6200315 -6749146 -7433996
3918 -7433996 -8657034 -9658343 -9477755 -8245763 -6629236 -4953802 -3937022 -4960986
3910 -4960986 -7798450 -9204635 -6352591 -1299248 801199 -1660965 -4649542 -4016810
3902 -4016810 -471641 2651209 4115804 4727963 4306830 1942277 -1178848 -2192074 -278545
3893 -278545 2247613 3108273 2315232 616935 -2215583 -6240289 -9930318 -11333498 -9930663
3884 -9930663 -6619151 -2907696 -811260 -2044720 -5989174 -9569620 -10534799 -9927211 -10030567
3875 -10030567 -11089513 -11808195 -11961240 -12181653 -11751494 -9183519 -5113889 -2293909 -2258024
3866 -2258024 -4006092 -6333139 -9176395 -11907969 -12686883 -10951810 -8688170 -7646815
3858 -7646815 -6902028 -4860023 -2223271 -876910 -768756 -88783 1771820 3410926 3653448
3849 3653448 2921755 1929618 330278 -2466733 -5673730 -7199702 -5770461 -2812318 -1367889
3840 -1367889 -2471206 -3530263 -1797629 1350915 2079184 -56046 -1111101 1271045
3832 1271045 4133006 3706245 906048 -677098 -197612 449661 549527 703910 -153880
3823 -153880 -3919180 -9396849 -12797094 -12634531 -10948376 -9260697 -6833639 -3817530 -2486860
3814 -2486860 -3663481 -5030906 -4904758 -4779230 -5928130 -6243749 -3332640 1204875 3562768
3805 3562768 2651147 721281 -70582 381924 782274 -747795 -5397293 -11417637 -14458282
3796 -14458282 -12185713 -7264239 -3660212 -1710055 351413 1773506 251644 -3181587
3788 -3181587 -4650108 -3382831 -3074330 -5890631 -8754531 -7758589 -3432755 748145 2822813
3779 2822813 2884535 1163076 -1624479 -3247244 -2017539 680680 2051550 1401836 -36475
3770 -36475 -1833138 -4247834 -5902323 -4663323 -1286488 638646 -601097 -2581612 -2433552
3761 -2433552 -552925 1003591 1737448 2036967 792991 -3487258 -9538647 -13769343 -14116817
3752 -14116817 -11654338 -8187425 -4212613 84824 3533689 4824332 3734592 822579
3744 822579 -3146840 -6856640 -8617220 -7824465 -5559056 -3128576 -885417 901283 1224953
3735 1224953 -376675 -2497943 -3125080 -1848240 152026 1797955 2706770 2555468 1109016
3726 1109016 -1146721 -3192104 -4125536 -3244732 -404371 2844782 3686069 1175395 -1949876
3717 -1949876 -2427369 -701332 89676 -1302884 -3307992 -4978088 -7193280 -9703260 -10137174
3708 -10137174 -7671832 -5100275 -5045239 -6113381 -5248908 -2351084 145913 1250711 2076342
3699 2076342 2941244 2804923 2030638 2965605 6429924 9523553 8647823 3861736 -1094874
3690 -1094874 -2689455 -536101 3142556 5825167 6242715 4493277 1482670 -1560330
3682 -1560330 -3450801 -3587392 -2470031 -1516165 -2065318 -4448308 -7930161 -11403339 -14192381
3673 -14192381 -16351751 -18064478 -18700824 -17096459 -13325808 -9492380 -7654288 -7430954
3665 -7430954 -7009981 -6045811 -5606449 -5379653 -3563354 -330372 1334088 -54814 -1839292
3656 -1839292 -1321290 -277852 -1979443 -5105072 -4823824 -37372 4488149 4549026 1745841
3647 1745841 297863 1248338 2412021 2370681 1693453 827317 -713663 -2860831 -4406370
3638 -4406370 -4257348 -2259141 1127697 4843655 7053448 6308962 3250505 256317 -848181
3629 -848181 -67777 1569246 2884411 2483632 -713636 -6001616 -10803937 -12864603 -11939395
3620 -11939395 -8924948 -4540124 95414 2840913 2392011 319827 -594614 71452 408221
3611 408221 -205282 73217 2269391 4507972 4754556 3650409 2758488 1898747 629236
3602 629236 629749 3392671 6561073 6220648 2663708 140368 407309 425224 -2194768 -5310123
3592 -5310123 -6185864 -6058562 -7614640 -10179046 -10729784 -8293672 -4376969 -291257 2955457
3583 2955457 3354476 107093 -3282599 -1829419 4476052 10124800 10800583 7833286 4963085
3574 4963085 3529956 2714549 2339570 2946178 3987365 4030480 2670303 920762 -321092
3565 -321092 -1213711 -2157561 -2755845 -2200759 -655357 415764 -27823 -901344 -170768
3556 -170768 2251918 4304798 4893310 5318772 6514663 6920070 5061317 2543389 1903126
3547 1903126 2546202 1513594 -2268149 -6998883 -10714509 -12381806 -10842489 -5755028
3539 -5755028 329020 3767235 4127286 4172478 5497037 7042112 8056382 9163046 9829727
3530 9829727 8181166 4400423 1102795 -732600 -2746721 -4958772 -4691676 -1901832
3522 -1901832 -1388588 -6286992 -12649138 -14298472 -10569702 -5537784 -1938351 20284
3514 20284 -257964 -3166145 -6189461 -6078375 -3555989 -2230120 -3098199 -3771344 -3023846
3505 -3023846 -2375247 -2886732 -3921452 -5476836 -8226016 -10705303 -10149842 -7093295 -5470104
3496 -5470104 -6757541 -7651547 -5470190 -2288311 -995951 -384324 2288452 5935129 6728381
3487 6728381 3700230 -205024 -2489482 -3399115 -3571889 -2421140 -127151 1020786 -866334
3478 -866334 -4528356 -6906774 -6661922 -4956941 -3148464 -1401953 116199 449761 -492067
3469 -492067 -747233 1310019 3885076 3326493 -874745 -4884331 -5377089 -3567273 -2797786
3460 -2797786 -3873782 -4927037 -4654210 -3324490 -1421518 243756 -340712 -4393933 -9472065
3451 -9472065 -11211011 -8356239 -3860375 -821052 132992 -863509 -3998564 -7735594 -8476519
3442 -8476519 -4508268 1385166 5110278 5659160 4710148 3389069 1460457 -1210637 -4230245
3433 -4230245 -7145072 -9102628 -8977965 -7089584 -5591386 -5640241 -5457902 -3119079 -93781
3424 -93781 392881 -2095987 -4800542 -5729230 -5568774 -5417107 -5115233 -4707404 -5395346 -7631453
3414 -7631453 -9760035 -10030200 -8924124 -8032119 -7380888 -5569275 -2444265 -16719 -25890
3405 -25890 -1559019 -2087892 -598881 1230220 1171704 -985497 -3543777 -5007268 -5219007
3396 -5219007 -4614294 -3414183 -1889026 -643949 -154245 -421074 -1233740 -2206611 -2553134
3387 -2553134 -1756411 -672656 -861711 -2396157 -3583930 -3546539 -3634086 -5083296 -6602345
3378 -6602345 -5963884 -3023682 713598 4666889 8954372 12079194 11827595 9056365 7645353
3369 7645353 9140052 10014694 6641290 958302 -2085758 -1788428 -2553085 -6938412 -11557077
3360 -11557077 -12007639 -9082984 -6973407 -6989860 -6765519 -5191382 -4098765 -4088807 -2509393
3351 -2509393 2103310 6556813 7063601 4618777 2805612 1879297 -618797 -4001073 -4292328
3342 -4292328 -1032479 658806 -2540794 -6724218 -6383381 -2526823 -763396 -2895970
3334 -2895970 -5063875 -4036137 -1105582 1072348 1915980 1768034 234840 -2436437 -4380522
3325 -4380522 -4433313 -4088951 -5507755 -8564809 -11299537 -12484435 -12371900 -11435512 -9717182
3316 -9717182 -7393853 -5129432 -3699633 -3476557 -4088985 -4579797 -4403162 -4274365 -5334823
3307 -5334823 -7432229 -9076225 -9229254 -8255405 -7011996 -6087783 -6098566 -7388040 -8916274
3298 -8916274 -8713514 -6156322 -2732805 14873 2007134 3344481 3039912 414016 -3240678
3289 -3240678 -5739854 -6094249 -4594104 -1894530 744931 1477887 -136104 -1884880 -1342865
3280 -1342865 1034105 2898025 3345017 3205342 2569981 616098 -1940921 -2824572 -1483009
3271 -1483009 -197087 -745341 -1867156 -1467517 270815 1684151 2380051 3381277 5120270
3262 5120270 6891178 8058542 8556746 8362901 7516800 6484823 5582583 4225299 1588169
3253 1588169 -2167458 -5992946 -8898464 -10121910 -9024347 -5966049 -2896933 -1774787
3245 -1774787 -2394142 -2830215 -2002875 -747102 -342151 -1121405 -2733533 -4670200 -6089493
3236 -6089493 -5979946 -4070277 -1199426 1346702 2498517 1738743 -359275 -2149499 -2535685
3227 -2535685 -2440302 -3429123 -5049220 -5293998 -4019568 -3837576 -6488128 -10118105 -11919933
3218 -11919933 -12248368 -13941623 -17863747 -21104777 -20103421 -14439102 -7173487 -2241974
3210 -2241974 -1720393 -4847134 -9107713 -12231568 -13168987 -11579046 -7559669 -2493272 922587
3201 922587 798681 -2065073 -5254468 -7180006 -7516333 -6047257 -2834231 557618 1845007
3192 1845007 713665 -577972 -128666 1053832 504647 -2217645 -4751577 -4918250 -3617245
3183 -3617245 -3797676 -6565064 -9401936 -9128909 -5858280 -2494402 -657504 737399 2419193
3174 2419193 2893445 1342139 220802 2318852 6389084 8386262 6493482 2497603
3166 2497603 -1200722 -3184489 -2105243 2417475 7491299 8759676 5606374 1821723
3158 1821723 98378 -1036807 -3260455 -4775967 -3376954 -726973 -272076 -2202464
3150 -2202464 -3504759 -2271046 710959 4061070 6821362 7621901 5538845 2261527
3142 2261527 1301501 4241165 8979395 11992698 11303431 7380636 2540679 -382743 -24469
3133 -24469 2460476 4870419 6127410 6257585 5115768 2678697 138103 -1047452 -1197185
3124 -1197185 -2011812 -4063986 -6083906 -6891210 -6713819 -6305845 -5842267 -4952550 -3091453
3115 -3091453 -8875 3342169 4890598 3689419 1608159 1255192 2502241 2760249 575137
3106 575137 -2896195 -6057485 -8473657 -9806677 -9184263 -6714551 -4144902 -2857862 -2288957
3097 -2288957 -1344271 -407378 -781961 -2703587 -4932561 -6176760 -6323554 -6297264 -6907117
3088 -6907117 -7806450 -7828060 -6655988 -5710919 -6732229 -9830213 -13509314 -15991431 -15839702
3079 -15839702 -12402058 -7058550 -3090354 -2479637 -3495864 -3396308 -2708147 -4115667 -7346947
3070 -7346947 -8461573 -5235848 -542607 1219279 -837851 -4065097 -5708880 -4987742
3062 -4987742 -3013046 -1890018 -2974614 -5218288 -6171259 -4980219 -3099197 -1856637
3054 -1856637 -1098542 -582518 -644146 -910543 -547902 -392063 -2248609 -5193569 -5605711
3045 -5605711 -2456297 498188 -19318 -2306596 -3170568 -3048354 -4067232 -5267280 -4063054
3036 -4063054 -1325569 -666594 -2770907 -4331046 -3159390 -1035732 -545707 -1786632 -3287676
3027 -3287676 -4146754 -4285063 -3982532 -3569437 -2463161 996208 7006617 12296437 13091804
3018 13091804 9793721 6106837 3702499 813313 -3507445 -7064909 -7765151 -6422081
3010 -6422081 -4745378 -2907308 -895957 -159765 -1649739 -3562213 -3223067 -628364 1560999
3001 1560999 1256498 -1016322 -3105011 -3453617 -2447223 -1797954 -2345809 -2844048 -1833791
2992 -1833791 -166529 21412 -1379096 -2317355 -2002799 -2021550 -3206449 -3906356 -2913820
2983 -2913820 -1885801 -2713753 -4118558 -3307473 -187787 2296213 1740832 -1527828 -5592406
2974 -5592406 -8706365 -9968673 -9539725 -8373775 -7133411 -5713446 -4363926 -4366792 -6451326
2965 -6451326 -9150297 -10013257 -8295783 -5609879 -4159846 -4851536 -6518158 -6525415 -3227362
2956 -3227362 1357356 2671699 -1178537 -6547034 -8376131 -6255589 -4163654 -4687750
2948 -4687750 -6103008 -5634415 -3342338 -1583892 -2012209 -4245914 -6655334 -7559898 -6254745
2939 -6254745 -3649440 -1628633 -1343729 -2324499 -3379523 -3996383 -4731413 -6503105 -9482635
2930 -9482635 -12489433 -13838368 -13155133 -11766758 -10646452 -8780383 -4859898 -116976
2922 -116976 2240244 711859 -2686842 -4693768 -3763332 -509308 3362899 5755033 5003596
2913 5003596 1258590 -3365457 -6759635 -8539131 -9344256 -9276067 -8039766 -6200347 -5159408
2904 -5159408 -5726460 -7279598 -8367881 -7828100 -5629329 -3165114 -2395176 -3945850 -6176653
2895 -6176653 -6872121 -5808984 -4833046 -5375128 -6938081 -8373888 -9396272 -9814657 -8346002
2886 -8346002 -4033508 1296072 3996721 2866569 917728 1606720 4507349 6434929
2878 6434929 5946798 4360967 2470299 -925762 -6109251 -10501701 -11667993 -10683728 -10252370
2869 -10252370 -10616125 -10001655 -8534345 -8504425 -10191363 -10515422 -7491342 -3606924 -2486274
2860 -2486274 -3848617 -4423345 -2993482 -1725336 -2505484 -4539590 -6191467 -6968872 -6704015
2851 -6704015 -4776035 -1609576 585254 228418 -1537418 -2682674 -3100537 -3775923 -4236164
2842 -4236164 -3302180 -1906073 -2323568 -4268871 -4610621 -2058090 582522 657846 -215506
2833 -215506 1078653 3907320 4612483 1979361 -1101969 -1830027 -751834 28917 -225329
2824 -225329 -909829 -1415263 -1278675 -263605 649117 -476005 -4109728 -8036426 -9711975
2815 -9711975 -9105025 -8081932 -7616094 -6840931 -4597854 -924173 2869275 4916380 3941615
2806 3941615 539235 -2837065 -3921293 -2744884 -1353392 -1645990 -3929894 -7333733
2798 -7333733 -10969053 -14444847 -17407799 -18884581 -17668494 -13799159 -9106518 -5416585
2790 -5416585 -2685064 -130070 1295303 -381498 -4676759 -8121582 -8342129 -6857061
2782 -6857061 -6416598 -7275375 -7998421 -8576517 -10271451 -12801974 -13960546 -12393763 -9366642
2773 -9366642 -7483739 -8431665 -11645490 -14313272 -13354977 -8644183 -3740004 -2195169 -3786688
2764 -3786688 -5705179 -6478088 -6752834 -6941835 -6600496 -6122368 -6601615 -7496674 -6587778
2755 -6587778 -3077032 1054176 3655197 4862748 6127658 8143762 10529392 12335379
2747 12335379 12157893 8971164 3665753 -1144509 -3349798 -2578584 596506 5003452
2739 5003452 8304842 8313060 5768438 3824135 3701140 3009612 -32458 -2945665 -2139066
2730 -2139066 1633003 3895878 2271339 -883719 -2030365 -629014 939085 236018
2722 236018 -3111933 -7154347 -8977132 -7183171 -3492304 -1210912 -1779460 -3498876 -3975366
2713 -3975366 -2997998 -2288626 -2956485 -4242402 -4838822 -4404972 -3044749 -80449 5112161
2704 5112161 10914424 13858038 12410034 9169802 7681289 7894108 6800035 3189917
2696 3189917 -600122 -2092095 -1682486 -1400819 -2325575 -4038980 -5143887 -3746201 750599
2687 750599 5611549 6674976 3444967 73657 -265817 372620 -1676867 -5915102 -8449617
2678 -8449617 -7288703 -3958308 -617998 1629538 2085416 983347 569341 3008349 7105687
2669 7105687 9449354 8693691 6183871 2600007 -2693904 -8388081 -10796778 -8415993
2661 -8415993 -4371384 -2497126 -3010715 -3848454 -4362686 -5465597 -7246118 -8518982 -8338005
2652 -8338005 -6675059 -4055921 -1353555 697276 2276866 3859709 4696840 3547044
2644 3547044 1162084 -320719 -1257908 -4791046 -11357489 -15898071 -13762745 -7348194
2636 -7348194 -3094694 -3064120 -3555582 -1740332 675368 1351825 1037043 1484568 2506839
2627 2506839 3242629 4208728 5880884 6788588 5125810 1171004 -3606433 -8570103 -13086082
2618 -13086082 -14948635 -12331720 -7024702 -3210528 -2631420 -2951085 -1367702 2116286
2610 2116286 5800745 8677581 10239996 9402418 5713857 1219256 -856052 288028
2602 288028 2060112 1744049 -298986 -1633613 -1328688 -1253491 -3567272 -7824883 -11271455
2593 -11271455 -11660649 -9085616 -5107643 -952374 2859334 5562788 5817368 2838106
2585 2838106 -2302950 -6881013 -8322308 -6079093 -1920279 1603151 3035476 2509844
2577 2509844 856084 -1105610 -2359926 -1761860 845557 3970809 5775545 5852806 4976395
2568 4976395 3537411 1539507 -27933 301688 1907558 1856405 -1311734 -4997254 -5702917
2559 -5702917 -3866898 -3138865 -4950513 -6292519 -3749284 2094699 7424863 9140716
2551 9140716 7101063 3620254 1790844 3317072 6824166 8871529 7446867 3836371
2543 3836371 554228 -1365635 -2114394 -1611145 20190 1275858 353913 -2816618 -6853789
2534 -6853789 -10647911 -13426239 -13894328 -11327290 -7296117 -4371041 -3122764 -2273450 -1662090
2525 -1662090 -2572098 -4610110 -4971738 -2376029 328464 -442792 -4197166 -6943275 -6011755
2516 -6011755 -2544322 698484 2530094 3925139 6085068 8305207 8076078 3963846
2508 3963846 -1830274 -5285361 -5458124 -5869869 -9708192 -15128876 -17369546 -14817296 -10748304
2499 -10748304 -8949754 -9590479 -10151025 -8981528 -6760084 -4980919 -3968558 -2546174
2491 -2546174 561871 5073581 8919476 9688171 6397596 381880 -5016269 -6335255
2483 -6335255 -3151142 571250 54041 -4724906 -8798379 -8434693 -5466956 -3819425 -4082526
2474 -4082526 -4371378 -4767420 -6944998 -9780355 -9481058 -5080112 -301993 1639229 2010001
2465 2010001 3195306 4159293 2357978 -1459413 -3719570 -2926572 -1275048 -1079300 -1907113
2456 -1907113 -2083999 -1386463 -1069966 -1908122 -3036984 -2688041 40151 3980376 6616802
2447 6616802 6245709 3212469 -972049 -4916257 -7403735 -7336255 -4754034 -1320210 1231666
2438 1231666 2622887 3111207 1967497 -1482759 -5656850 -7419291 -5421623 -1480917
2430 -1480917 1736821 3242337 3489253 2769014 742320 -2792735 -7105812 -10454890 -11195527
2421 -11195527 -9625785 -8201448 -8725020 -9735546 -8428789 -5128855 -3513954 -5413634
2413 -5413634 -7625032 -5960922 -1076157 2265655 1374142 -1339343 -1990589 109527 2493327
2404 2493327 2894608 1197966 -1353212 -3599670 -5097363 -6164992 -7523900 -9399060
2396 -9399060 -10827832 -10324464 -7554138 -4089527 -2111520 -2366734 -3686563 -4516615 -4485127
2387 -4485127 -4162530 -3663058 -2258074 351250 2917398 3499015 1553645 -1235869 -2578599
2378 -2578599 -1895833 -639816 -257708 -387681 433955 2640220 4985954 5960216 4998410
2369 4998410 2280859 -1423936 -4177542 -3533038 851894 6008767 8457211 7750323 6001840
2360 6001840 4680571 3756310 3507086 4647355 6309168 6341788 4498564 3038868 2984800
2351 2984800 2179642 -1100513 -4807455 -5894242 -4816430 -4491789 -5908035 -7747546 -9636949
2342 -9636949 -12411137 -15137166 -15273731 -12621546 -10172379 -9908721 -10483023 -10374036 -10446645
2333 -10446645 -11318562 -10868812 -7376582 -3367973 -2843023 -5262036 -5691779 -1440252 4289715
2324 4289715 6631994 4911928 2595346 2523230 4034085 4788162 4029404 3154020 3414167
2315 3414167 4061256 3351714 915583 -1757316 -3104238 -2864044 -1675500 -414912 -125245
2306 -125245 -1308161 -2814996 -2804200 -1464082 -1272935 -3623623 -6877690 -9081620 -10676997
2297 -10676997 -12421292 -12466173 -8688439 -3096886 -399102 -1911806 -4051068 -3627809 -1598967
2288 -1598967 -221290 631107 2134390 3650443 3780463 3084327 3307234 4406126 4415554
2279 4415554 2189083 -1255934 -4022915 -4768863 -3248110 -779100 192115 -1480801 -3807969
2270 -3807969 -3866418 -1937986 -1701777 -5638471 -11718976 -15731881 -15852572 -13626555 -11131344
2261 -11131344 -8885517 -6790764 -5528779 -5715732 -6298098 -5383619 -3017118 -1780775 -3606381
2252 -3606381 -6891060 -8230705 -6660349 -4554259 -4175856 -5003914 -5172183 -4102452 -2620872
2243 -2620872 -1561317 -1486677 -2950879 -5653346 -7827956 -7843973 -6266493 -5210878 -5759035
2234 -5759035 -7018454 -7609259 -7019893 -5461540 -3378933 -1347976 167013 986786 717681
2225 717681 -1397144 -5136425 -8222365 -8037401 -4651643 -980904 443272 -64230 -375612
2216 -375612 926227 3416004 5300626 4636124 997022 -3550093 -5924346 -4973536 -2287924
2207 -2287924 63472 1402793 1591428 -7787 -3151724 -5313357 -3742638 979132
2199 979132 5070210 5731769 3957239 2485147 2057364 940405 -2219448 -6363606 -9247957
2190 -9247957 -9888099 -9009641 -7382298 -4753824 -928568 2837853 4623266 4092333 3021686
2181 3021686 3050369 3576582 2723233 123704 -2248730 -2400152 -859305 -218578 -2122461
2172 -2122461 -5235521 -6672183 -5365314 -3376309 -3354693 -5126513 -5850871 -3814635 -956945
2163 -956945 -559571 -2960456 -4974618 -3805110 -285350 2502247 2876816 1715380 562806
2154 562806 103483 665405 2779331 6277000 9552759 10725682 9392087 6702257 4041934
2145 4041934 2199860 1369075 1093532 406263 -1139649 -2698073 -3230230 -3249124 -4450889
2136 -4450889 -7537103 -11382740 -14424149 -15723497 -14544852 -10459563 -4666474 113247
2128 113247 2170757 2351017 2191967 1692720 219103 -1455764 -1838185 -984620 -322925
2119 -322925 -276305 312514 2181759 4515155 6223311 7198637 7822352 8155831 8090958 7621643
2109 7621643 6669159 5206383 3609933 2230781 695272 -1533838 -3969863 -5454434
2101 -5454434 -5746428 -5737404 -5884559 -5390989 -3301628 240671 3988949 6335778 6318311
2092 6318311 4644265 3367203 3669657 4516260 4498290 3931284 3370263 1314417 -3623575
2083 -3623575 -8774130 -9411402 -5454008 -2419443 -3920227 -6659878 -5540199 -795682
2075 -795682 3366635 5082386 5903054 6722112 6570835 5351572 4359230 3730092 2274992
2066 2274992 289860 -238845 1034440 1781423 289012 -2276120 -3824994 -3751680 -2550009
2057 -2550009 -760317 843602 1505027 1493503 1340626 -45887 -4182734 -9398757 -11298400
2048 -11298400 -8379199 -4639116 -4486766 -7241887 -9216333 -9361952 -9613079 -10617347 -10689849
2039 -10689849 -9287696 -8486036 -9853886 -11943355 -12234009 -10334445 -8124888 -7451930 -8495164
2030 -8495164 -9945953 -10213976 -8669725 -5991177 -3345132 -1531243 -997839 -1823256 -3052074
2021 -3052074 -3033725 -1506930 -410247 -1172012 -2144615 -809610 2023374 2790122 113584
2012 113584 -3397900 -4962615 -4683908 -3714852 -2104354 -468084 -1429854 -6507341 -12858724
2003 -12858724 -15986849 -15028059 -12774979 -11103975 -9432724 -7656065 -7195755 -8009421 -7429836
1994 -7429836 -3844723 420276 1789190 -292953 -3335412 -4848398 -3940400 -1143886
1986 -1143886 1570000 1583773 -1606884 -4949502 -4886716 -1439111 2336592 4341960 4934477
1977 4934477 4888729 4315910 3950427 5184674 7799154 9410556 8396323 6087670 4843950
1968 4843950 4928480 4574393 2626362 5724 -1359383 -465364 1810644 3446812 3175279
1959 3175279 1610730 134283 -950467 -2300329 -3953270 -5132473 -5503712 -5236132 -3896242
1950 -3896242 -1028203 1970016 2580386 469287 -1884914 -2772062 -3380270 -4993277 -6134993
1941 -6134993 -4578087 -815437 2542249 3874533 3266571 1197739 -1451145 -2903291
1933 -2903291 -2110816 -433773 90683 -373751 -55369 1560712 3256560 3878583 2885952
1924 2885952 -47292 -3985573 -6227958 -5215886 -3134262 -3041770 -4275037 -3810656 -1569541
1915 -1569541 -660440 -2290702 -4320429 -5530881 -7315282 -9734552 -9806697 -5958176 -939473
1906 -939473 2128474 3757968 5600429 6671909 5101706 1625098 -1567882 -3806081
1898 -3806081 -5202865 -4894937 -2920103 -2003209 -4153311 -6920254 -6466399 -3178745 -669383
1889 -669383 -265166 -483573 -1263644 -4025551 -7113015 -5939651 512976 7112917 8742314
1880 8742314 6083718 2945315 512572 -2698751 -6741055 -9280199 -8690894 -6060461
1872 -6060461 -3733274 -2876749 -2731066 -1927636 -473302 86712 -780464 -786670 2428079
1863 2428079 6951615 7648332 2425902 -4910678 -9445846 -10610092 -10936283 -11265179 -9968382
1854 -9968382 -6376012 -2507654 -908456 -1988791 -3739106 -3496255 -367612 3494790
1846 3494790 4700153 2354854 -929148 -2501721 -2758327 -3388434 -3991545 -2731604 210556
1837 210556 2224987 1533510 -978636 -3454809 -4864256 -4759770 -3064278 -914998 -225560
1828 -225560 -1397621 -2630934 -2502425 -2103355 -3286211 -5538232 -6146845 -3414649 1445544
1819 1445544 5698258 7365386 5991095 2369639 -1574394 -3276946 -1249068 3189810
1811 3189810 6491820 5944124 2266529 -1171676 -1807172 -243895 978322 518877 -503134
1802 -503134 -390280 821372 1758404 2159521 3634111 7149111 10655084 10846063 7384097
1793 7384097 3774528 3274667 5295027 6994027 7107151 6420294 5447963 4074448 3274386
1784 3274386 4506588 6751027 6679141 3162574 -465583 -472882 2537434 4974722 5076389
1775 5076389 3990606 2754779 916883 -1408347 -2278213 79423 4884753 9168450
1767 9168450 10289902 8206262 5612647 5240686 6372086 5086372 -682865 -7373441
1759 -7373441 -9127345 -4416079 2848784 8473546 11472924 12093285 9634254 4140216
1751 4140216 -1890633 -5649928 -6689245 -5973945 -3839715 -799899 1042013 -88011
1743 -88011 -2819967 -3918474 -2145997 996463 3959752 6366282 7600937 6607496 3800449
1734 3800449 1297279 441502 663095 1403401 3246535 5985497 7388780 5733409 2504391
1725 2504391 739155 1266782 2281363 2263634 1481575 451941 -1316157 -4203334 -7193960
1716 -7193960 -8668435 -8039509 -6002836 -3540765 -1274228 358413 834323 -308640 -3055155
1707 -3055155 -6555946 -9222712 -9554963 -7314673 -3972485 -1659946 -1255570 -1491871 -448885
1698 -448885 1812691 2772792 403988 -3880672 -6515733 -5954825 -3971602 -2425494 -739082
1689 -739082 2068765 4728084 5431089 5015144 5554262 6232619 4017593 -906846 -3869668
1680 -3869668 -1832028 2036216 2630473 -320116 -3051881 -4003878 -5315781 -8066722 -9894868
1671 -9894868 -8759869 -6064265 -4043782 -2361038 308810 2954873 3323555 1719756
1663 1719756 1021978 2662475 4838127 5451718 4916506 4742839 4704082 3216618 150658
1654 150658 -2487388 -3177937 -2940526 -3734353 -5502756 -6254540 -5168298 -4045913 -4669886
1645 -4669886 -5930046 -5371273 -3158808 -2299176 -4299891 -6556862 -5469800 -905388 3978203
1636 3978203 6449894 6125253 3963193 1418353 372924 1691456 3430118 2562304 -692241
1627 -692241 -2326725 216921 4074306 4385736 628351 -2962924 -3035687 -668958 1194970
1618 1194970 1476879 792583 -592370 -2660333 -4378041 -4496667 -3474774 -3058902 -3882260
1609 -3882260 -4810306 -4796597 -4075999 -3304252 -2912578 -3654498 -6115126 -8867445 -8892434 -5299919
1599 -5299919 -1120939 500225 526226 1855753 3928977 3128758 -1024915 -3922747 -2116991
1590 -2116991 1594857 2403172 624357 697274 3849822 6005221 3917040 -134408 -1758095
1581 -1758095 -74629 2472534 4227515 5411680 5702666 3606700 -942360 -5208937
1573 -5208937 -6173509 -3707086 -353104 1663360 2454358 3530777 5394748 6510195 4941631
1564 4941631 993214 -2365151 -2387251 247080 1946242 294013 -3051330 -4326665 -2231957
1555 -2231957 605369 1198708 178082 748439 3808033 5992545 3887299 -999170 -3617029
1546 -3617029 -1718314 1377883 1364149 -1557479 -3603895 -2719121 -598009 435183 162325
1537 162325 -678855 -2186332 -4352743 -5687440 -4745638 -2544422 -1631894 -2736188 -4011222
1528 -4011222 -4018796 -3887977 -5528476 -8720204 -11104390 -10587652 -6971086 -1816524 2296119
1519 2296119 2903300 -510883 -5566880 -8818036 -8840209 -6924612 -4862350 -3197117 -1916049
1510 -1916049 -1478923 -2137065 -3063729 -3327087 -3293505 -3896663 -4666551 -3754721 -381701 3527313
1500 3527313 4816370 2108076 -2797786 -6396892 -6497452 -4202005 -2911097 -4998670
1492 -4998670 -9437421 -12919969 -13097719 -10378420 -7020587 -5277102 -6107498 -8503672 -9906015
1483 -9906015 -8454870 -5319356 -3773474 -5381367 -8175611 -9403621 -8829339 -7941445 -6999904
1474 -6999904 -5043356 -2560638 -1672134 -2799849 -3223207 -615977 3233140 4207502 976765
1465 976765 -3470689 -5544077 -4714123 -2921071 -1734523 -1243490 -1038280 -1020414 -1242486
1456 -1242486 -1799329 -3049196 -5310932 -8040507 -9771586 -9389016 -7404729 -5534718 -4790077
1447 -4790077 -4329299 -2782330 -647218 -351132 -3153148 -6807919 -7859593 -6179030 -5370872
1438 -5370872 -7890704 -11501617 -12198307 -9449781 -6406998 -5402380 -5588155 -5287900 -4402030
1429 -4402030 -3483808 -2266170 -523220 848334 990905 387131 -244504 -1360935 -3439256
1420 -3439256 -5280857 -5215305 -3496536 -1743574 -329543 1751694 4479480 6391908 7008143
1411 7008143 7552193 8332672 7460330 3836344 -134104 -1039734 953140 2198522 325103
1402 325103 -3095198 -5295202 -5963097 -6672230 -7628414 -6943786 -3514098 761525 2708362
1393 2708362 1398456 -955354 -1592869 26900 2173752 2901703 1837276 361759 293267
1384 293267 2054311 4068276 4494012 3602917 3627519 5980921 9475167 11630011 10786143
1375 10786143 6675942 481621 -4842906 -6174010 -3836105 -2086162 -3890978 -6660931
1367 -6660931 -5931053 -2120304 39490 -1379464 -3044067 -2038971 -58984 224538 -355783
1358 -355783 373703 1664172 1095023 -1320907 -3512647 -5073479 -7532183 -11013383 -13274397
1349 -13274397 -12400074 -8541887 -2981983 2619525 6123254 6232250 4396532 3727998 5527458
1340 5527458 8104891 9077257 7467762 3689817 -782822 -3573106 -3060193 -501397 838148
1331 838148 -803690 -4031450 -6225976 -5982345 -3685192 -1012230 96898 -759647 -1779979
1322 -1779979 -1273356 -36129 219499 -85833 617010 1610882 530447 -2543180 -4898738
1313 -4898738 -5506982 -5975146 -6437611 -4643450 -916973 271035 -3274357 -7188306 -6487855
1304 -6487855 -2715555 -777453 -1214369 -824933 548862 -349595 -3785921 -5732842 -4163805
1295 -4163805 -1994411 -2090570 -3486278 -4527437 -5821034 -7469947 -6918095 -2875613 1197613
1286 1197613 1006924 -2906899 -6578920 -8196650 -8917311 -9174562 -7865854 -5227413 -3248273
1277 -3248273 -2496913 -1068852 2368705 6370410 8358750 7036428 2822840 -2383078
1269 -2383078 -5434250 -3962013 669254 3880538 2546565 -1858142 -5581148 -6745555
1261 -6745555 -6098899 -4986068 -4255774 -4423394 -5223342 -5304058 -3804287 -1939357 -1522413
1252 -1522413 -2166981 -1818123 -239888 142976 -2144367 -5037761 -5599506 -4004253 -2924510
1243 -2924510 -3716093 -5418153 -7284914 -9726679 -12027076 -11644243 -7648881 -3236642 -2510030
1234 -2510030 -5475448 -8476038 -9300311 -9343428 -10176082 -10521774 -8353895 -4346733 -1084537
1225 -1084537 433897 1375920 2281867 1876049 -497546 -2866427 -2513267 750893 4447622
1216 4447622 6408120 6796280 6926487 7005076 5908198 3113292 114788 -756149 934924
1207 934924 2692376 1543426 -2387764 -5617434 -5324354 -3012006 -2845308 -6249889 -9677040
1198 -9677040 -8796706 -3936407 221380 111781 -3171468 -6087983 -6708714 -5533081 -3658247
1189 -3658247 -1955117 -1612356 -3585756 -7020806 -9547766 -9900546 -9380583 -9979086 -11745474
1180 -11745474 -12940465 -12444817 -11013115 -9981150 -9481266 -8520581 -6666593 -5021604 -4980148
1171 -4980148 -6152441 -6406538 -4561538 -2288292 -2151014 -4101879 -5528871 -5057117 -4455410
1162 -4455410 -5608023 -7224925 -6691637 -4514423 -4425415 -8484225 -14013473 -16643438 -15227277
1153 -15227277 -12379755 -10817416 -10642328 -10223858 -8502491 -5904402 -3690718 -2968295 -3931429
1144 -3931429 -5477386 -5751272 -3795035 -894059 355431 -1027104 -2793126 -1786807
1136 -1786807 2077652 5428345 5654011 4093821 3471000 3277876 469595 -4962709 -8181140
1127 -8181140 -5425140 115982 1356854 -4065251 -10974688 -13091132 -9895848 -5642536
1119 -5642536 -3363752 -2174913 -30653 3104142 5611115 6482043 6106759 5133181 3546449
1110 3546449 1393590 4716 1380496 5563173 9268379 8701774 4076771 -137022
1102 -137022 -345162 2135465 3485900 2511686 1236189 1094785 1233367 850415 491756
1093 491756 -116578 -2950745 -8298564 -12365526 -11085109 -5647288 -1581488 -2246560 -5527013
1084 -5527013 -7500288 -7232292 -6693487 -7337457 -8375197 -8214060 -6668970 -5394295 -5905028
1075 -5905028 -7051662 -5364812 895105 8564695 12151907 9642129 4113257 -515495
1067 -515495 -3214141 -4632293 -4566359 -2578195 179884 1751434 1537522 444947 -483935
1058 -483935 -597652 210586 739940 -859708 -4155146 -5560009 -2551078 2327045 4258046
1049 4258046 2336052 114814 153841 1212109 1579648 2071467 3936622 6007924 6037231
1040 6037231 3720074 868832 -545027 459275 3472934 6367817 6545841 3624700
1032 3624700 -163196 -3013427 -5460239 -8273318 -10437636 -11016264 -11315374 -12885303 -14522256
1023 -14522256 -13678373 -10163600 -6199182 -3384695 -1839854 -1697516 -2855749 -3626809 -2483775
1014 -2483775 -1136091 -2790545 -6912490 -9055773 -7088542 -4213585 -3707795 -3825935 -1217896
1005 -1217896 2811380 3645077 359145 -2767118 -2668396 -1921111 -4579131 -9887565 -13070727
996 -13070727 -11668474 -8299217 -6589319 -6712173 -6660545 -6463533 -8412739 -12811284 -16029012
987 -16029012 -14643404 -10264054 -7990751 -10213043 -13943654 -14799861 -11898290 -7748073
979 -7748073 -4572156 -2354917 -356903 769762 -738675 -5281393 -10231160 -11767935
971 -11767935 -8863525 -4490507 -1912523 -838849 1080095 3908399 5217732 4135494
963 4135494 2609143 1801110 244195 -2668551 -4171049 -1914826 1567845 1388480 -3471497
954 -3471497 -9249233 -12241064 -11844910 -9088854 -5245262 -2482855 -3000319 -6105310 -8258401
945 -8258401 -7572185 -6625946 -9050115 -14389186 -18237705 -17197512 -12204635 -6809701 -3389306
936 -3389306 -1740652 -752874 -231319 -477908 -861769 -280843 778549 249755 -2484770
927 -2484770 -4973748 -4613388 -2122518 -312476 -239704 -758808 -1406131 -3120404 -5789535
918 -5789535 -7513365 -7201383 -6019793 -5371345 -5128519 -4753323 -4520451 -4588187 -4255117 -3073110
908 -3073110 -1399167 807015 4070991 7537146 9057950 8378107 8106667 9759423 10872721
899 10872721 8450611 3690894 413253 -341850 -1169918 -3929211 -7317536 -9320880 -9809593
890 -9809593 -9910764 -10497398 -11938867 -13824815 -14399402 -11898999 -7252840 -3938798 -4048570
881 -4048570 -5700327 -5629849 -3409950 -1529387 -1687145 -2763775 -2923491 -2249745 -2026962
872 -2026962 -2224228 -1611538 -627721 -1937089 -6392049 -9990759 -7805964 -920409 3525257
863 3525257 379605 -7713798 -14001881 -15007542 -12407734 -9541939 -8573681 -9818549 -11221663
854 -11221663 -9258965 -2909833 3799198 5761947 2937658 -79283 -345322 621685 645318
845 645318 293779 1108960 2827159 4014470 3997371 3049115 1937231 1896378 3486029 4999765
835 4999765 3922199 544436 -2095333 -2668450 -3305055 -5450393 -6774575 -4703864 -913803
826 -913803 740064 -398540 -1470547 -700013 451157 -120175 -2635496 -5875181 -8350041
817 -8350041 -8676911 -6421951 -3135626 -1280043 -1540734 -2136349 -1237549 796773 2175964
808 2175964 2113872 1818740 2943076 5324323 6814398 5771173 3142305 1037009 -330123
799 -330123 -2553182 -5840160 -8091008 -8014248 -6996491 -6439913 -5333124 -2517990 440200
790 440200 1257869 550410 590129 1209059 14162 -3374250 -6247279 -6527912 -5150809
781 -5150809 -4082290 -4093537 -5109732 -6703456 -7590301 -6693151 -5383086 -6400604 -9564511
772 -9564511 -10981086 -8188826 -3997334 -2996769 -5685394 -8471922 -8706070 -7188320 -5660371
763 -5660371 -4126886 -1729976 1004159 2189930 832550 -1705756 -2962319 -1913646
755 -1913646 359448 2641016 5152999 8266274 10635782 10351673 7696069 4974230 3483037
746 3483037 2408947 1003233 -152082 -754112 -1647595 -2950261 -3146395 -1501630 261491
737 261491 439364 87268 1215798 3222808 3413924 815362 -2525224 -4184771 -3779753
728 -3779753 -2546742 -1759619 -1817145 -2040480 -1303807 537620 2158365 2364179 1644067
719 1644067 1307391 1717500 2327455 2717762 2474862 881120 -1886391 -4064207 -4407010
710 -4407010 -4160916 -5041144 -6095133 -5137659 -2978352 -3208314 -7128563 -11574128 -12950598
701 -12950598 -11156257 -8134634 -4735478 -992219 2034137 2924139 1833143 215769
693 215769 -884116 -1182103 -628506 250080 320493 -589687 -970365 170956 1356368 566744
683 566744 -1701177 -3279773 -3664674 -4238031 -5265894 -5102696 -2989855 -563983 351075
674 351075 -263702 -1759929 -4172089 -7130466 -9038609 -9060516 -8747631 -9829070 -11334588
665 -11334588 -11080117 -9410720 -8858391 -9922074 -9979001 -7585709 -5411348 -6733859 -10596313
656 -10596313 -13075871 -12718143 -11899780 -12455357 -12668262 -10097403 -5509440 -1947494 -775103
647 -775103 -638787 -108610 557264 673510 606690 1113477 2053033 2537847 1890081 -44414
637 -44414 -2979089 -5987663 -7666457 -7234271 -5431918 -3897533 -3642799 -4318608 -4802723
628 -4802723 -4297359 -3007935 -1883145 -1524525 -1405166 -591262 793974 1545856 1049095
619 1049095 145049 -218439 -405722 -1292060 -2677913 -3692831 -4530675 -6442236 -9698452
610 -9698452 -12651276 -13454764 -12067597 -9980167 -8464731 -7703347 -7306737 -7009104 -6816911
601 -6816911 -6865793 -7208388 -7561370 -7317971 -6074978 -4235439 -2902955 -2893405 -3703141 -3693785
591 -3693785 -1796976 917232 2076716 893881 -475252 579707 3681629 5802766
583 5802766 5040330 2570026 369105 -1345562 -3163519 -4381415 -3906411 -2687464 -2948813
574 -2948813 -4711362 -5238507 -2899287 315588 1628851 1204904 921712 575125 -1764672
565 -1764672 -5605762 -7395283 -5464998 -3152927 -4631225 -9022267 -11277313 -8437122
557 -8437122 -2603795 2327807 4561529 4566143 3597508 3053199 3516331 3458514 674625 -3948045
547 -3948045 -6249113 -4077215 -579568 260796 -582094 689902 3929226 4673659 881386
538 881386 -4020285 -6203218 -6007230 -5460241 -4512012 -2587025 -1324690 -2318757 -3710317
529 -3710317 -2564811 187246 650034 -2398615 -6029547 -7545595 -7174358 -5718639 -2706790
520 -2706790 1594000 4876822 5438125 4365705 3390344 2166270 -450337 -3749664 -5884531
511 -5884531 -6444687 -6330948 -5516156 -2938598 1246162 4976313 6415086 5763627 4471743
502 4471743 3360507 2079536 182995 -1713094 -2263792 -1148025 34251 -357048 -1373030
493 -1373030 -265568 3560885 6979681 6690174 3070267 -905415 -3424242 -4711619 -5054482
484 -5054482 -4288203 -3222421 -3410614 -4887736 -5740668 -4633462 -2511489 -1173670 -1293991
475 -1293991 -2479215 -4135115 -5429047 -5340298 -3775245 -2125245 -1906950 -3186767 -4868451
466 -4868451 -5980849 -6015276 -4578147 -1744325 1341030 3122711 3151090 2404637 1921844
457 1921844 1659009 1056074 200691 -328309 -608317 -1353341 -2382343 -2185498 -65592
448 -65592 2078479 1705411 -890294 -2900261 -2968556 -2666233 -3205057 -3099620 -938621 1529658
438 1529658 1644078 -180669 -1581295 -2496928 -4984291 -8861641 -11037953 -10120158 -8555191
429 -8555191 -8580010 -8732691 -6599857 -3031246 -1038086 -1540558 -2563191 -2264567 -848107
420 -848107 488470 998291 581956 -506569 -1943222 -3622771 -5382369 -6407076 -5867814
411 -5867814 -4472693 -4124908 -5369321 -6514661 -6195714 -5341857 -5311993 -5513159 -4615778
402 -4615778 -2997125 -1961392 -1304872 163879 2020318 2344525 612094 -1469764 -2480032
393 -2480032 -2985264 -4030656 -5269185 -5565132 -4769705 -4065582 -4640672 -6313356 -7580437
384 -7580437 -7251487 -5911847 -5053464 -4829947 -4073248 -2942695 -3583549 -6746980 -9601593
375 -9601593 -9135159 -6401495 -4700551 -4379369 -2620133 1541923 5166380 5360259 2764932
366 2764932 -154498 -2187481 -3285090 -3160052 -1806293 -498349 -740948 -2515413 -4341101
357 -4341101 -4711871 -3174593 -649102 1165248 1486422 1415315 2095426 2391944 441541
348 441541 -2512753 -2586599 1329608 5131379 4431952 113336 -3313972 -3679991 -3019863
339 -3019863 -3909952 -6260277 -8186926 -8566756 -8063918 -8278232 -10179842 -13122740 -15453926
330 -15453926 -16091296 -15005676 -12292793 -7968381 -3039195 564277 1914136 1863744 1270410
321 1270410 -154395 -2307770 -3643299 -3191362 -2349028 -2921340 -4400647 -5018555 -4603110
312 -4603110 -4328121 -4250238 -3378387 -2030576 -1806857 -2795584 -2782151 -45855 4417589 8095424
302 8095424 9237964 7515513 3688496 -624258 -3765194 -5378368 -6441877 -7681407
294 -7681407 -8673324 -8857583 -8632103 -8806367 -9403651 -9586457 -8678624 -6942864 -5256057
285 -5256057 -4065598 -2936868 -1492883 -450621 -753284 -1730002 -1568442 -84440 678476
276 678476 -342476 -1246845 -178156 1342380 644279 -1632079 -2418392 -1262663 -1111373
267 -1111373 -3382713 -5491020 -4895328 -2983555 -2714350 -4238781 -5304255 -4904182 -4070511
258 -4070511 -3435216 -2297264 -467261 692027 -121929 -2392540 -4275317 -4410669 -2915947
249 -2915947 -957323 292280 404863 -243492 -953655 -1305960 -1556986 -2480465 -4417923
240 -4417923 -6392224 -6875755 -5838873 -5105610 -5834097 -6656968 -5713370 -3631615 -2507607
231 -2507607 -2434860 -1578763 116978 140601 -2491657 -4898610 -4070945 -1062424 855355
222 855355 840654 625225 761204 -251189 -2686215 -4135596 -2753594 -230876 266518
213 266518 -1674313 -3372921 -2978844 -2010031 -2897793 -5055807 -5313058 -2493765 353843
$$ [...]
##END NTUPLES=NMR SPECTRUM
##END=
