##TITLE=31Pdec_DE-168_oil_TFAd6
 DMSO-d6_CCl4, 64 sc
28.7.2026
##JCAMPDX= 6.0         $$ Bruker NMR JCAMP-DX V2.0
##DATA TYPE= NMR SPECTRUM
##DATA CLASS= NTUPLES
##ORIGIN= UXNMR, Bruker Analytische Messtechnik GmbH
##OWNER= root
$$ XWIN-NMR		Version 3.5
$$ Tue Jul 28 14:41:04 2026 Russian Standard Time (UT+4h)  she@DPX200
##.OBSERVE FREQUENCY= 81.013821
##.OBSERVE NUCLEUS= ^31P
##.ACQUISITION MODE= SIMULTANEOUS
##.ACQUISITION SCHEME= undefined
##.AVERAGES= 64
##.DIGITISER RES= 17
##SPECTROMETER/DATA SYSTEM= spect
##.PULSE SEQUENCE= zgpg30
##.SOLVENT NAME= CDCl3
##.SHIFT REFERENCE= (INTERNAL, CDCl3, 0, 197.392)
##AUDIT TRAIL= $$ (NUMBER, WHEN, WHO, WHERE, WHAT)
$$ ##TITLE= Audit trail, XWIN-NMR		Version 3.5
$$ ##JCAMPDX= 5.01
$$ ##ORIGIN= Bruker BioSpin GmbH
$$ ##OWNER= she
$$ F:/spectra/data/she/nmr/P31/2/pdata/1/auditp.txt
$$ ##AUDIT TRAIL=  $$ (NUMBER, WHEN, WHO, WHERE, WHAT)
(   1,<2026-07-28 14:39:55.96 +0400>,<she>,<DPX200>,
      <created by zg, POWCHK disabled, PULCHK disabled
       configuration hash MD5:
       00 E9 B6 7A A2 85 ED C7 34 08 36 98 17 FE 4E 26
       data hash MD5: 32K
       E8 81 7D E3 F8 CA CB 10 DD C6 39 22 E6 A8 4B 0E>)
(   2,<2026-07-28 14:39:58.32 +0400>,<she>,<DPX200>,
      <Start of raw data processing
       efp BC_mod = 2 LB = 1.5 FT_mod = 6 PKNL = 1 PHC0 = 1747.784 PHC1 = 692.0984 SI = 64K 
       data hash MD5: 64K
       D2 AE 7A 02 BD FE 56 F0 2F FA B2 78 31 00 F4 5F>)
(   3,<2026-07-28 14:40:17.70 +0400>,<she>,<DPX200>,
      <pk PHC0 = 155.8112 PHC1 = -445.4001 
       data hash MD5: 64K
       CA 72 DB B0 D6 83 8C 1C BE C6 45 E8 C9 57 D3 DE>)
(   4,<2026-07-28 14:40:22.01 +0400>,<she>,<DPX200>,
      <abs ABSG = 5 
       data hash MD5: 64K
       D0 A3 E1 02 AB F5 4B DE 2E 02 5B 32 16 9D 14 C3>)
$$ ##END=
$$ 
$$ hash MD5
$$ 61 71 2E A1 30 C4 C0 FA BF 7E 51 BD 7F 27 85 2F
##$RELAX= 
##$RELAX= 
##$RELAX= 
##$RELAX= 
##$RELAX= 
##$RELAX= 
##$RELAX= 
##$RELAX= 
$$ Bruker specific parameters
$$ --------------------------
##$DU= <F:/spectra>
##$EXPNO= 2
##$NAME= <P31>
##$PROCNO= 1
##$TYPE= <nmr>
##$USER= <she>
##$AMP= (0..31)
100 100 100 100 100 100 100 100 100 100 100 100 100 100 100 100 100 100 
100 100 100 100 100 100 100 100 100 100 100 100 100 100 
##$AQSEQ= 0
##$AQ_mod= 1
##$AUNM= <au_zg>
##$AUTOPOS= <>
##$BF1= 81.014009
##$BF2= 200.13
##$BF3= 200.13
##$BF4= 200.13
##$BF5= 200.13
##$BF6= 200.13
##$BF7= 200.13
##$BF8= 200.13
##$BYTORDA= 1
##$CFDGTYP= 0
##$CFRGTYP= 5
##$CHEMSTR= <none>
##$CNST= (0..31)
1 1 145 1 1 1 1 1 1 1 1 1 1 1 1 1 1 1 1 1 1 1 1 1 1 1 1 1 1 1 1 1 
##$CPDPRG= <waltz16>
##$CPDPRG1= <>
##$CPDPRG2= <waltz16>
##$CPDPRG3= <>
##$CPDPRG4= <mlev>
##$CPDPRG5= <mlev>
##$CPDPRG6= <mlev>
##$CPDPRG7= <mlev>
##$CPDPRG8= <mlev>
##$CPDPRGB= <>
##$CPDPRGT= <>
##$D= (0..31)
0 1 0 0 0 0 0 0 0 0.06 0 0.03 2e-05 3e-06 0 0 0.0002 0 0 0 0 0 0 0 0 0 
0 0 0 0 0 0 
##$DATE= 1785235195
##$DBL= (0..7)
120 120 120 11 120 120 24 19 
##$DBP= (0..7)
150 150 150 150 150 150 150 150 
##$DBP07= 0
##$DBPNAM0= <>
$$ [...]
##$SUBNAM3= <"">
##$SUBNAM4= <"">
##$SUBNAM5= <"">
##$SUBNAM6= <"">
##$SUBNAM7= <"">
##$SUBNAM8= <"">
##$SUBNAM9= <"">
##$SW= 400.765351723535
##$SWIBOX= (0..15)
0 1 3 0 0 0 0 0 0 0 0 0 0 0 0 0 
##$SW_h= 32467.5324675325
##$TD= 32768
##$TD0= 1
##$TE= 0
##$TE2= 300
##$TE3= 300
##$TEG= 300
##$TL= (0..7)
0 120 53 12 22 120 120 120 
##$TP= (0..7)
150 150 150 150 150 150 150 150 
##$TP07= 0
##$TPNAME0= <>
##$TPNAME1= <>
##$TPNAME2= <>
##$TPNAME3= <>
##$TPNAME4= <>
##$TPNAME5= <>
##$TPNAME6= <>
##$TPNAME7= <>
##$TPOAL= (0..7)
0.5 0.5 0.5 0.5 0.5 0.5 0.5 0.5 
##$TPOFFS= (0..7)
0 0 0 0 0 0 0 0 
##$TUNHIN= 0
##$TUNHOUT= 0
##$TUNXOUT= 0
##$USERA1= <user>
##$USERA2= <user>
##$USERA3= <user>
##$USERA4= <user>
##$USERA5= <user>
##$V9= 5
##$VALIST= <valist>
##$VCLIST= <CCCCCCCCCCCCCCC>
##$VD= 0
##$VDLIST= <DDDDDDDDDDDDDDD>
##$VPLIST= <PPPPPPPPPPPPPPP>
##$VTLIST= <TTTTTTTTTTTTTTT>
##$WBST= 1024
##$WBSW= 4
##$XGAIN= (0..3)
0 0 0 0 
##$XL= 0
##$YL= 0
##$YMAX_a= 13234
##$YMIN_a= -6656
##$ZGOPTNS= <>
##$ZL1= 120
##$ZL2= 120
##$ZL3= 120
##$ZL4= 120
##$ABSF1= 197.3918
##$ABSF2= -203.3724
##$ABSG= 5
##$ABSL= 3
##$ALPHA= 0
##$AQORDER= 0
##$ASSFAC= 0
##$ASSFACI= 0
##$ASSFACX= 0
##$ASSWID= 0
##$AUNMP= <proc_1d>
##$AZFE= 0.1
##$AZFW= 0.5
##$BCFW= 0
##$BC_mod= 2
##$BYTORDP= 0
##$COROFFS= 0
##$CY= -3
##$DATMOD= 1
##$DC= 0
##$DFILT= <>
##$DTYPP= 0
##$F1P= 0
##$F2P= 0
##$FCOR= 1
##$FTSIZE= 65536
##$FT_mod= 6
##$GAMMA= 0
##$GB= 0
##$INTBC= 1
##$INTSCL= 9.790993e-09
##$ISEN= 30
##$LB= 1.5
##$LEV0= 0
##$LPBIN= 0
##$MAXI= 10000
##$MC2= 0
##$MEAN= 0
##$ME_mod= 0
##$MI= 50
##$NCOEF= 0
##$NC_proc= -8
##$NLEV= 6
##$NOISF1= 182.463
##$NOISF2= 159.3651
##$NSP= 0
##$NTH_PI= 0
##$NZP= 0
##$OFFSET= 197.3918
##$PC= 4
##$PHC0= 1903.595
##$PHC1= 246.6983
##$PH_mod= 1
##$PKNL= yes
##$PPARMOD= 0
##$PSCAL= 0
##$PSIGN= 0
##$REVERSE= no
##$SF= 81.014063255964
##$SI= 65536
##$SIGF1= 159.3651
##$SIGF2= -187.1042
##$SINO= 113.3802
##$SIOLD= 16384
##$SREGLST= <1H.CDCl3>
##$SSB= 0
##$STSI= 65536
##$STSR= 0
##$SW_p= 32467.5324675325
##$SYMM= 0
##$S_DEV= 0
##$TDeff= 32768
##$TDoff= 0
##$TI= <>
##$TILT= no
##$TM1= 0
##$TM2= 0
##$TOPLEV= 0
##$USERP1= <user>
##$USERP2= <user>
##$USERP3= <user>
##$USERP4= <user>
##$USERP5= <user>
##$WDW= 1
##$XDIM= 65536
##$YMAX_p= 191706666
##$YMIN_p= -319967177
$$ End of Bruker specific parameters
$$ ---------------------------------
##NTUPLES= NMR SPECTRUM
##VAR_NAME=  FREQUENCY,     SPECTRUM/REAL,   SPECTRUM/IMAG
##SYMBOL=    X,             R,               I
##VAR_TYPE=  INDEPENDENT,   DEPENDENT,       DEPENDENT
##VAR_FORM=  AFFN,          ASDF,            ASDF
##VAR_DIM=   65536,         65536,           65536
##UNITS=     HZ,            ARBITRARY UNITS, ARBITRARY UNITS
##FACTOR=    0.49542278885378, 1,            1
##FIRST=     15991.5117654749, 0,            0
##LAST=      -16476.0207020576, 0,           0
##MIN=       -16476.0207020576, -319967177,  0
##MAX=       15991.5117654749, 191706666,    0
$$ Real data points
##PAGE= N=1
##DATA TABLE= (X++(R..R)), XYDATA
$$ [...]
44490d386311j375170q07435l03347k91077N43693K208161K763138J232033r25217
44481a341532j894258j508605o25499J54005N24701K95507j67162q66J087148
44472c476561K214786K221461J021494k63296o59469o02636j235664k341718k148570
44463e270173j36004J296203m3422k242833j358718K605330M947228K539123j955196
44454C81538l775388j724160J589752L220728J928916j417552l894358k830559
44446f521083M46576J331807j923289n276033m306138j28523K821855K785050
44438a0769778J453352N13068M83078J601034L026421K591301J5808j455533M26036
44429b115213K900498K249752k87557q59961O22009J245810P48866J066052J147946
$$ plain form
44490 -4386311 -5761481 -6568916 -6872263 -7163340 -6619647 -4411486 -1648348 -416315 -1341532
44481 -1341532 -3235790 -4744395 -5369894 -5215889 -4691188 -4395681 -4562843 -4563709 -3476561
44472 -3476561 -1261775 959686 1981180 1717884 1058415 455779 -779885 -3121603 -5270173
44463 -5270173 -5406177 -4109974 -4153396 -6396229 -7754947 -5149617 -202389 2336734 381538
44454 381538 -3393850 -5118010 -3528258 -307530 1621386 203834 -3690524 -6521083
44446 -6521083 -6074507 -4742700 -6665989 -11942022 -16248160 -16376683 -13554828 -10769778
44438 -10769778 -9316426 -8803358 -8320280 -6719246 -3692825 -1101524 -1085716 -2541249 -2115213
44429 -2115213 785285 3035037 2747480 1887519 2509528 3755338 4504204 5570256 6718202
44420F718202j854389o183502o349111j559614K403146J570134j207263j931962
44412h394359j156440r76435o10605J436672L833013M240163K512720p8399k451958
44403a645628l012505m34306L158417L346791j72404k219954J49194K703298N77733
44394B450636l902979m691830q41268L023832L633075J914752k87434k031025
44386g32241j959847R05131M532669N150598J901457k039237l487530k505931
44378A765069j261929j201209j825761j505590M70428K461822K091272l77681
44370F16421j963390r86758R06007J822707K261986K964343K653397L07402k402405
44361F179710l451300l369878l356452k517866J44864K813653L007114J228647
$$ plain form
44420 6718202 4863813 -1319689 -7668800 -9228414 -6825268 -5255134 -6462397 -8394359
44412 -8394359 -9550799 -10527234 -11137839 -9701167 -5868154 -1627991 884729 806330 -1645628
44403 -1645628 -4658133 -5092439 -1934022 1412769 1240365 -979589 -830395 1872903 2450636
44394 2450636 -1452343 -6144173 -6985441 -3961609 -328534 1586218 1298784 -732241
44386 -732241 -2692088 -1786957 2745712 7896310 9797767 7758530 4271000 1765069
44378 1765069 503140 -698069 -2523830 -4029420 -3558992 -1097170 994102 616421
44370 616421 -1346969 -2333727 -1427720 394987 2656973 5621316 8274713 8582115 6179710
44361 6179710 2728410 -641468 -3997920 -6515786 -6370922 -3557269 -550155 678492
44353F78492l64760j314842j992974j372990Q47494J856653m26824k767017n97479
44344e454247M446836O173825K854316o93484q15073K80706p06445l066945m131490
44335a112001l149008r37189J686516L337546K420019l32272j979584j337918
44327a403891l49041l61565m9432J291445J538907o23484k509716r97353K427849
44318a036281L406971P14303k305824k242447O02988L185279K984813Q4165l032960
44309B361007l638571j322367J634668K695609J511190k26760p55686K00210J320688
44300C779988J035895n91085j714142j164213k26312n11897r58737O46363L432439
44291C728299L738427M36635k892890k733556k08836J238111Q47787N27712Q46681
$$ plain form
44353 678492 313732 -1001110 -2994084 -4367074 -3519580 -1662927 -2089751 -4856768 -5454247
44344 -5454247 -1007411 5166414 8020730 7327246 6512173 6792879 6086434 3019489 -1112001
44335 -1112001 -4261009 -5198198 -3511682 -174136 2245883 1913611 -65973 -1403891
44327 -1403891 -1752932 -2114497 -2163929 -872484 666423 42939 -2466777 -3464130 -1036281
44318 -1036281 2370690 3084993 779169 -1463278 -860290 2324989 5309802 5393967 2361007
44309 2361007 -1277564 -2599931 -965263 1730346 3241536 3014776 2259090 2459300 3779988
44300 3779988 4815883 4224798 2510656 1346443 1120131 608234 -350503 295860 3728299
44291 3728299 7466726 7903361 5010471 2276915 2068079 3306190 4153977 4681689 5528370
44282E528370N0610k586521m828465m190909j360033N52569j04646j660566j596316
44273a0195907J37780J479607J486971J473599K476833L333380K456888J98526
44265B847677j927816l198236l413861j975401R44659L396208L760472K819008
44257C252710J806284j6157l105574m577310j339669M288404O396834L386028
44249A0091550q6564k12894R67454k04372l200827m634094l238056p70543Q88771
44240c99575J395217J314886J207391R55273k70028k438445l464607j574851J377676
44231a897063J702885p86311k349737r71665R42338Q78232j66248l88639m34191
44222c470399j441889k348317j755172n13186n0872J31400J121814K380088K789232
$$ plain form
44282 5528370 5578980 2992459 -1836006 -6026915 -7386948 -6834379 -6939025 -8599591 -10195907
44273 -10195907 -10058127 -8578520 -7091549 -5617950 -3141117 192263 2649151 2847677
44265 2847677 919861 -2278375 -5692236 -7667637 -6722978 -3326770 433702 3252710
44257 3252710 5058994 5042837 1937263 -2640047 -3979716 308688 6705522 10091550
44249 10091550 10004986 9792092 10759546 10555174 7354347 2720253 -517803 -1288346 -399575
44240 -399575 995642 2310528 3517919 4473192 4203164 1764719 -1699888 -3274739 -1897063
44231 -1897063 -194178 -980489 -3330226 -4301891 -3359553 -2481321 -2647569 -3036208 -3470399
44222 -3470399 -4912288 -7260605 -9015777 -9528963 -9579835 -9448435 -8326621 -5946533 -3157301
44213c157301K330766J179928r09378k910457k675905l83076R78235L37356L96885
44204d812947K425785L095616J3204l293792k479320N47758Q89216j198181j170426
44195e983087J866185L860110K547340L14163m02962j29216J93022Q86339J642661
44186D794555J212338k35686j263763j788563k548740k374408K35857L083102
44178A114692K246151j610810l611846k134511q54567j810836j800110J436745
44170g025092M303387K689822j381096k870167j027073P63211Q40623P06632J186316
44161a813437R81930n36353j888549j603033r7449J078125R41256q4701o11034
44152c633245L5689N61989o75118k776753k995400p67037J388454J885875K049478
$$ plain form
44213 -3157301 -826535 353393 -555985 -3466442 -6142347 -6525423 -5547188 -5209832 -4812947
44204 -4812947 -2387162 708454 721658 -2572134 -5051454 -4503696 -3614480 -4812661 -5983087
44195 -5983087 -4116902 -256792 2290548 2604711 2201749 2072533 2265555 3151894 4794555
44186 4794555 6006893 5771207 4507444 2718881 170141 -2204267 -1968410 1114692
44178 1114692 3360843 1750033 -1861813 -3996324 -4850891 -6661727 -8461837 -7025092
44170 -7025092 -2721705 -31883 -1412979 -4283146 -5310219 -4547008 -3706385 -2999753 -1813437
44161 -1813437 -831507 -1367860 -3256409 -4859442 -4956891 -3878766 -2937510 -3022211 -3633245
44152 -3633245 -3597556 -3035567 -3710685 -6487438 -9482838 -10249875 -8861421 -6975546 -4926068
44143d926068K477554Q92484l363035n807928k286808L818733M944524l27228
44135d577772n283954m449094k91042J700834P35575L2008Q95687J548668J149016
44126h540074J259369K635792L375054J735693r78666k067558j004471L44536
44118c240325O82040O86836J165861J433605N36514j009124j948620k025234j656922
44109e375369n60936J485520K822204J226850k311015l540225l02192L945569
44101b609594M263048P22517j936586q01841J956644K928978J820886L86835q48923
44092E881964k480774l945445l754587j781033N63173K300106L298085K992195
44084C073684R03185j450269j675429k09999k40762k703546m233816k165894J212474
$$ plain form
44143 -4926068 -2448514 -1556030 -4919065 -10726993 -13013801 -9195068 -4250544 -4577772
44135 -4577772 -9861726 -14310820 -14601862 -12901028 -12165453 -12133445 -11237758 -9689090 -8540074
44126 -8540074 -7280705 -4644913 -1269859 465834 -512832 -2580390 -3584861 -3240325
44118 -3240325 -2558285 -1871449 -705588 728017 1264531 255407 -1693213 -3718447 -5375369
44109 -5375369 -5936305 -4450785 -1628581 -401731 -2712746 -6252971 -6555163 -2609594
44101 -2609594 1653454 2375971 439385 -362456 1594188 4523166 6344052 6730887 5881964
44092 5881964 3401190 -544255 -4298842 -6079875 -5516702 -3216596 81489 3073684
44084 3073684 3976869 2526600 851171 641172 400410 -2303136 -6536952 -8702846 -7490372
44075g490372K322751J698363J932184K328899N15564j701865J09625N087423
44067D802572O582989J667990m148412m801093j676372Q5725o31371j370806j364627
44058h53405j507358j024551J175009L130438K160934m55532j283393k37776j2697
44049A091669p89473j21400K051625K787236R50514j383201k741755l587562l479547
44040e221894r87458K801821M544859L298624J402387K10539j191749k534044
44032B323085k007388l09928n36864k735832l193077p51995J031049J62708m14983
44023f433225J414895K800482J196087q34695l67094N37712q80101k152729M15950
44014d302718M541576M752072Q69332k078618j755622q29717j270580j447521
$$ plain form
44075 -7490372 -5167621 -3469258 -1537074 791825 1307389 -394476 -284851 4802572
44067 4802572 11385561 13053551 8905139 4104046 2427674 2513399 1882028 511222 -853405
44058 -853405 -2360763 -3385314 -2210305 920133 3081067 2625535 1342142 1104366 1091669
44049 1091669 302196 180796 2232421 5019657 5970171 4586970 1845215 -1742347 -5221894
44040 -5221894 -6209352 -3407531 1137328 4435952 5838339 6048878 4857129 2323085
44032 2323085 315697 5769 -531095 -3266927 -6460004 -7211999 -6180950 -6018242 -6433225
44023 -6433225 -5018330 -2217848 -1021761 -1856456 -2223550 -1685838 -2565939 -4718668 -4302718
44014 -4302718 238858 4990930 5860262 3781644 2026022 1196305 -74275 -1521796
44006a521796N2276J858034K418488K058227J432846O08683M01215K047342M714383
43997A4069698N544069L039065j186102m421684n242344l927225j957461r40544
43989D977472q72299j33921J673180K358053L85886k203093k617715j551907j603777
43980D11879k659886k287815j33583J554606J738044J716731K274876K635230
43972E250082K486544K308831J556936o95526l194519l520096j941773j281289
43964I69190k428689k990996j268719J182437K099003J371297L51341J46232J205857
43955F36953K877264L248396J389745n17567K24730K449012K438717l85462k650013
43946I711775k429485j707061k258887k744610j698410j84177N67504J271402
$$ plain form
44006 -1521796 -1469520 388514 2807002 4865229 6298075 6906758 7307973 9355315 14069698
43997 14069698 19613767 22652832 21466730 17045046 11802702 7875477 5918016 4977472
43989 4977472 4105173 3971252 5644432 8002485 8388371 6185278 3567563 2015656 411879
43980 411879 -2248007 -4535822 -4669405 -3114799 -1376755 339976 2614852 5250082
43972 5250082 7736626 10045457 11602393 10906867 7712348 4192252 2250479 969190
43964 969190 -1459499 -4450495 -5719214 -4536777 -2437774 -1066477 -715136 -568904 636953
43955 636953 3514217 6762613 8152358 7634791 7859521 10308533 12747250 12361788 9711775
43946 9711775 7282290 5575229 3316342 571732 -1126678 -1310855 -743351 528051
43938E28051K249267J806949o59553k506194j468158O92205R14930n85384j335149
43929c63036p96885o01263j320089j645675o00917J359043L213299L908604K631330
43920E784411n996j717554r43983J063961J825770O56684j038514j750289j034360
43911B840130M75193J180506l41992l215953m470936k667205K18Q15260L69576
43902e015203J092708K955647L345024J178364j341853j756971k39211J449273
43894A667778K330914K298301R36184j986238m935138n231405k275408Q21529
43886f373483M52109k769026m360845j733443K290003L253943Q62636j192256
43878i570362l42441K285002M150796L993238K201384K83247j75338M57894k94688
$$ plain form
43938 528051 2777318 4584267 3924714 1418520 -49638 642567 1557497 972113 -363036
43929 -363036 -1159921 -1761184 -3081273 -4726948 -5327865 -3968822 -755523 3153081 5784411
43920 5784411 5778415 4060861 3116878 4180839 6006609 6663293 5624779 3874490 2840130
43911 2840130 3315323 4495829 4153837 937884 -3533052 -6200257 -6200039 -5384779 -5015203
43902 -5015203 -3922495 -966848 2378176 3556540 2214687 457716 218505 1667778
43894 1667778 3998692 6296993 7233177 5246939 311801 -4919604 -7195012 -6373483
43886 -6373483 -5921374 -8690400 -13051245 -14784688 -12494685 -9240742 -8378106 -9570362
43878 -9570362 -9912803 -7627801 -3477005 516233 2717617 3000864 2825526 3283420 2988732
43869B988732l179535m684910j568974L290408L948546J6327k818472j702822
43861c710700n40436k654377m795136k448457K850588O113529O066071N046331
43853E927413L613614J67736m544189o896559n051333j243995J261224J539554
43845e226535R92089J342972K754146L389921J623301j143412j799721k24561
43837A708200J70736k044765l588223j638289J495744K131158Q14783L89830Q51221
43828B90395L31989n96641R357J347307J027275o30334j460683j521925k132202
43819c335462k027353Q19787M329208M251157P20652k002442k175602j858654
43811a278709j650427R7377K198220R40228k891028l436513J177933N051600L338098
$$ plain form
43869 2988732 -190803 -4875713 -6444687 -3154279 794267 810594 -2007878 -3710700
43861 -3710700 -4251136 -6905513 -11700649 -14149106 -11298518 -5184989 881082 5927413
43853 5927413 9541027 9708763 5164574 -1731985 -6783318 -8027313 -6766089 -5226535
43845 -5226535 -4234446 -2891474 -137328 3252593 4875894 3732482 1932761 1708200
43837 1708200 1878936 -165829 -3754052 -5392341 -3896597 -1765439 -950656 -560826 290395
43828 290395 622384 25743 35100 1382407 2409682 1779348 318665 -1203260 -3335462
43819 -3335462 -5362815 -4543028 -213820 4037337 4757989 2755547 579945 -1278709
43811 -1278709 -2929136 -2831759 -633539 306689 -2584339 -6020852 -4842919 208681 3546779
43802C546779m43168m34678K555283L267701K96573k958219m026038l577299k701774
43793d474840j590317n56822J96537J249860K635097L119981K373424J884721
43785D837641K027390P94963k309315m098864k480111n22591j899643m673243
43777h323773m091823O4053L592617M337501L879914L228664J558061m67651n76296
43768C201267J030692J404975l27680j532836n76217P96879R39570O84491O09183
43759F230324o52671l215528m180574j730219J520524K079809M76862k77970N04775
43750G55332J041300P33845Q72571J902213K616913K200965R39499j119874m042009
43741E900755o323024n603950j913581J587607K187530O33722m98074l19120j71396
$$ plain form
43802 3546779 3103611 2668933 5224216 8491917 8788490 5830271 1804233 -1773066 -4474840
43793 -4474840 -6065157 -6621979 -6425442 -5175582 -2540485 579496 2952920 4837641
43785 4837641 6865031 7659994 5350679 1251815 -1228296 -1750887 -3650530 -8323773
43777 -8323773 -12415596 -12351543 -8758926 -4421425 -541511 2687153 4245214 3777563 3201267
43768 3201267 4231959 5636934 5309254 3776418 3200201 3997080 4936650 5621141 6230324
43759 6230324 5577653 2362125 -1818449 -3548668 -2028144 51665 528527 250557 755332
43750 755332 1796632 2530477 3403048 5305261 7922174 10123139 11062638 9942764 5900755
43741 5900755 -422269 -6026219 -7939800 -6352193 -4164663 -3530941 -4029015 -4348135 -4519531
43732d519531j213798k762221l145954j539557J194700L214198L293990J854767
43724c623406K65597p35431j367286j660867j092148J52839P16082l3378n39813
43715g917811R49116L405788L934767J842596j41050M27591K414776K859746Q39784
43706H615303j928441l547879l416946j777734N08016J863360J284486j35490
43698A464675l92213N62540O62219j159549l241809l391654j560666N95853J788108
43689d672496J725231O21578p17906r54470L49886J652720J053149r77561j699679
43680c619548N55147L977222N015546K276387k025178m612897m467793l064150
43672e965264j865873q21849M60846J441477J577955J585526K369294L201004
$$ plain form
43732 -4519531 -5733329 -8495550 -11641504 -13181061 -11986361 -8772163 -5478173 -3623406
43724 -3623406 -3357809 -4093240 -5460526 -7121393 -8213541 -8060702 -7344620 -7377998 -7917811
43715 -7917811 -6968695 -3562907 371860 2214456 2073406 2500997 4915773 7775519 8615303
43706 8615303 6686862 3138983 -277963 -2055697 -1547681 315679 1600165 1464675
43698 1464675 1072462 1635002 2297221 1137672 -2104137 -5495791 -7056457 -6460604 -4672496
43689 -4672496 -2947265 -2325687 -3043593 -3998063 -3648177 -1995457 -942308 -1919869 -3619548
43680 -3619548 -3064401 912821 5928367 8204754 6179576 1566679 -2901114 -5965264
43672 -5965264 -7831137 -8652986 -8192140 -6750663 -5172708 -3587182 -1217888 1983116
43664A983116K467264J03182k163741l021323k586741j179771J145830L357613
43656A05429L580708J593892k41326J17738J666137J990666P82593m4674N41375
43647A0092538J285875P90544l75247p32613k88792n63613k182937l666791l383196
43638I75768j841872p62657l50907P04979K449938L085563K025938J210662J776732
43629I274144J748145n52142k951011k570935q13193j103962k712139j719525
43621a400618J802141L006977J59530k009547K30136L409282K247534k161150
43613E284285m242698j991765J424354L066125L014805K032805J60546j902140
43605F846317k786664k334192j604613j097509o24773l62938k54005P51057K879090
$$ plain form
43664 1983116 4450380 4553562 2389821 -631502 -3218243 -4398014 -3252184 105429
43656 105429 3686137 5280029 5038703 5156441 6822578 8813244 9595837 9551163 10092538
43647 10092538 11378413 12168957 11793710 11061097 10772305 10208692 8025755 4358964 975768
43638 975768 -866104 -1628761 -1979668 -1274689 1175249 4260812 6286750 7497412 9274144
43629 9274144 11022289 10470147 7519136 4948201 4135008 3031046 318907 -1400618
43621 -1400618 401523 3408500 3568030 1558483 1788619 5197901 7445435 5284285
43613 5284285 1041587 -950178 474176 3540301 6555106 8587911 8748457 6846317
43605 6846317 4059653 1725461 120848 -976661 -1601434 -1964372 -2218377 -1467320 1411770
43596A411770M093781K771474O15734K36504J013237M82921j169269j617459q11033
43587G027660r34742j946980j282170J263215K381179M29573j873044j855733
43579C208958q38206j382001l180171m121958l477501j751701Q93424L746569
43571f902587M555761K016268j473995j908939J506005N315980N742071K477943
43563A1328507j581426l536414l033403j866733j424007j200230k06712J140403
43555c80015J705341J422922Q76075j96813k018332k986640j269587J901215L185086
43546B239252J673823k22838q73011j307956k040991j415925R03185J903424m86165
43537C72798l406237k625756J346463L987426K945848M22859o57660j23361M92666
$$ plain form
43596 1411770 5505551 8277025 8892759 9129263 10142500 10625421 9456152 7838693 7027660
43587 7027660 6092918 4145938 2863768 4126983 6508162 6937735 5064691 3208958
43579 3208958 2370752 988751 -2191420 -6313378 -9790879 -11542580 -10649156 -6902587
43571 -6902587 -2346826 -330558 -1804553 -3713492 -2207487 3108493 8850564 11328507
43563 11328507 9747081 6210667 3177264 1310531 -113476 -1313706 -1520418 -380015
43555 -380015 1325326 2748248 3624323 3427510 1409178 -1577462 -2847049 -945834 2239252
43546 2239252 3913075 3690237 2817226 1509270 -531721 -1947646 -1044461 858963 372798
43537 372798 -3033439 -5659195 -4312732 -325306 2620542 3043401 2385741 2262380 2755046
43528B755046M26944N3128j23559l8884j21233r61211k389550k954387j202023
43519d555729K166893M143183K308376k038751m568674k629868J327894K660699
43511a185977O79813p06967O10937J289109j954177o186768o136089k421984m39347
43502a6451450j449302q87946L212162O235912M386288Q21083L15983J921297
43494a895973J585366r26060k580405k579086k666574l048067k136636J67275
43486a4080160K312129L609178M088336K962914K32105j451983J99523L295178
43478A167220M175550K507482P19592k68679j097693j134513K96080J073638p85664
43469F653013k475739K297M151958L098468l788174q736297o379371r78857O72526
$$ plain form
43528 2755046 3181990 3235118 3111559 3072675 2951442 1990231 -399319 -3353706 -4555729
43519 -4555729 -2388836 1754347 4062723 2023972 -2544702 -5174570 -3846676 -1185977
43511 -1185977 -506164 -1213131 -602194 686915 -1267262 -7454030 -13590119 -16012103 -16451450
43502 -16451450 -17900752 -18788698 -15576536 -9340624 -4954336 -4133253 -3817270 -1895973
43494 -1895973 -310607 -1236667 -3817072 -6396158 -9062732 -12110799 -14247435 -14080160
43486 -14080160 -11768031 -8158853 -4070517 -1107603 -875498 -2327481 -2127958 1167220
43478 1167220 5342770 7850252 8569844 8301165 7203472 6068959 6365039 7438677 6653013
43469 6653013 4177274 4179571 8331529 11429997 7641823 -1094474 -7473845 -8452702 -7780176
43460g780176j244371j700508Q37964L090402K578747M78563r05202o75986P23460
43451d597107K286742L036751K737681J833011N79629q94893j904299k013400
43443A064115k105374k669331j773225K234890O439878N775316K71616m318222
43435D919663m372975k527078k065300j836473J32762K057443J450788k36361
43427b477531n4992J631553K434444J937884R84617p65272l011687l039679J97444
43418b163219K677454O09039l106575k972529L87313J614554l49452j240183M48298
43409d095300J217734k69993m83396K003480L057968N7935l143352k649768r67922
43400e272614j835790k876043K00143M864112M444508j192515m627702j683080
$$ plain form
43460 -7780176 -9024547 -10725055 -9887091 -6796689 -4217942 -3739379 -4644581 -5320567 -4597107
43451 -4597107 -2310365 726386 3464067 5297078 5876707 4981814 3077515 1064115
43443 1064115 -1041259 -3710590 -5483815 -3248925 3190953 8966269 9237885 4919663
43435 4919663 546688 -1980390 -4045690 -5882163 -5749401 -3691958 -2241170 -2477531
43427 -2477531 -2532523 -900970 1533474 3471358 4455975 3690703 679016 -2360663 -2163219
43418 -2163219 514235 1123274 -1983301 -4955830 -4568517 -2953963 -3303415 -4543598 -4095300
43409 -4095300 -2877566 -3147559 -3630955 -1627475 1430493 1488428 -1654924 -4304692 -5272614
43400 -5272614 -7108404 -9984447 -9784304 -4920192 -475684 -1668199 -6295901 -7978981
43392g978981K921697L217542J83371j338356j51878J258877K003783L443006
43384C559061N143442M492574J160019j572563j556567j006222k673643m996024
43376B550077m262824o72461J343511o25493l525376l225829J3475K595026K473664
43367c336230O09267j442033k785768k371398M35795L945918M951983K397207
43359B404741j240386l011752k605188j601715r82446n81338j85402O5536J88000
43350g549950N38541J487271L013310M325403M090345J844087q73381j829563
43342E046063p35582M58061J53374j125551j955975j865376j347811r97297j210260
43333c580354j886834k023589o61917J340866J791798N3700j925468k277855j367306
$$ plain form
43392 -7978981 -5057284 -1839742 -1656371 -2994727 -3146605 -1887728 116055 3559061
43384 3559061 8702503 13195077 14355096 12782533 11225966 10219744 7546101 2550077
43376 2550077 -1712747 -2385208 -1041697 -1667190 -5192566 -8418395 -8404920 -5809894 -3336230
43367 -3336230 -2726963 -4168996 -6954764 -9326162 -8890367 -4944449 7534 2404741
43359 2404741 1164355 -1847397 -4452585 -6054300 -7036746 -7618084 -7803486 -7737950 -7549950
43350 -7549950 -7011409 -5524138 -2510828 1814575 5904920 7749007 6875626 5046063
43342 5046063 4310481 4768542 4921916 3796365 1840390 -24986 -1372797 -2370094 -3580354
43333 -3580354 -5467188 -7490777 -8152694 -6811828 -5020030 -4966330 -6891798 -9169653 -10536959
43324a0536959j81861J649003M371656O037871M370588K31646k959666l203785
43316b21507j493447M03730J678697J845984N03942j550544k629684k318439j885257
43307e666525j905074j113216J366701M131012N142833M194314K474781O51924
43299I276750j263629k921594l909334m458541m579707l180725L17115L932974
43291f786691M641494K114021p40514j384996k94478N33698K02279q01383j691984
43282d208554j742986m69573J617189L141752L387822K841763J807422n4763j989963
43273D330109j876367N63818K004992m73775m726316n892733k984705J42707O41109
43264h271161N455M15432J130276O99058M5569O32140J530752J195009O33279
$$ plain form
43324 -10536959 -10718820 -9069817 -4698161 1339710 5710298 5941944 2982278 -221507
43316 -221507 -1714954 -1311224 367473 2213457 2717399 1166855 -1462829 -3781268 -5666525
43307 -5666525 -7571599 -8684815 -7318114 -3187102 1955731 6150045 8624826 9276750
43299 9276750 8013121 5091527 1182193 -3276348 -7856055 -11036780 -10719665 -6786691
43291 -6786691 -2145197 -31176 -771690 -2156686 -2451164 -1917466 -1715187 -2516570 -4208554
43282 -4208554 -5951540 -6421113 -4803924 -1662172 1725650 4567413 6374835 6320072 4330109
43273 4330109 2453742 3017560 5022552 4548777 -177539 -6070272 -9054977 -8912270 -8271161
43264 -8271161 -8265706 -7850274 -6719998 -6020940 -5975371 -5343231 -3812479 -2617470 -1984191
43255a984191J735700L488705L171897Q78506n72573l89611r61638l272188m495699
43246b401092k191567J607480L078966J905451J197167K598038L984506K696955
43238A2475904o08876k683706j858236k35245r72645l980509n792205m075844
43230g731362o08364J478301J797610J926853J805098J3448k590245k927325k65529
43221g101515K260255K063378L72080n20639o11969p01133o2462J702741K571005
43212b8259R59382r08242P4050K644415K554586j091560m557002m897327l189897
43203h439854j486382P3035J547008J590327k41349j795561j231641O1881k25273
43194a0147809j499846j346431M33549J688921J686018K106463L479465L330399
$$ plain form
43255 -1984191 -248491 3240214 6412111 7290617 6718044 6328433 5366795 2094607 -2401092
43246 -2401092 -4592659 -2985179 93787 1999238 3196405 5794443 9778949 12475904
43238 12475904 11867028 9183322 7325086 7089841 6117196 2136687 -3655518 -7731362
43230 -7731362 -8339726 -6861425 -5063815 -3136962 -1331864 -1318416 -3908661 -6835986 -7101515
43221 -7101515 -4841260 -2777882 -2405802 -2926441 -3538410 -4239543 -4302005 -2599264 -28259
43212 -28259 931123 22881 96931 2741346 5295932 4204372 -352630 -5249957 -8439854
43203 -8439854 -9926236 -9853201 -8306193 -6715866 -6957215 -8752776 -9984417 -9922536 -10147809
43194 -10147809 -11647655 -12994086 -12560537 -10871616 -9185598 -7079135 -3599670 -269271
43186b69271o5473l799456l108865K029573N880668L922868j203699l148881k18207
43177A9257K931068K371864K01180M86624K554318K023409k264993o122426n549396
43168c349095j505825K109924L015504J642212m74702j705840r79181R78587J849285
43159A580869L75474k000576l117600k614000j331535M53547K461649L116409
43151a075763J082655k121247l176539j041526J690593K161414O33719m02635
43143b249329L72329J693548J536253l92585k298535k278468l20006J928663L098892
43134A090762L141273K491957J260481k40280j114847r47657o42291j255420k377308
43125A406670k584895j321860M20693J214539N33226p81560j164527k0925J055684
$$ plain form
43186 -269271 -334744 -4134200 -7243065 -5213492 667176 4590044 3386345 237464 19257
43177 19257 2950325 5322189 5523369 6009993 8564311 10587720 8322727 2200301 -3349095
43168 -3349095 -4854920 -2744996 270508 1912720 1438018 -267822 -1247003 -268416 1580869
43159 1580869 1956343 -44233 -3161833 -5775833 -7107368 -6653821 -4192172 -1075763
43151 -1075763 6892 -2114355 -5290894 -6332420 -4641827 -2480413 -1846694 -2249329
43143 -2249329 -1877000 -183452 1352801 960216 -1338319 -3616787 -3936793 -2008130 1090762
43134 1090762 4232035 6723992 7984473 7744193 6629346 5681689 5039398 3783978 1406670
43125 1406670 -1178225 -2500085 -2079392 -864853 -331627 -1113187 -2277714 -2298639 -1242955
43116a242955j32863l091794m419496k041704J778919L313013J998019J94003
43108c644858n71655n51747L31516K468638M295031L119662q85498m190182m520066
43099d149159l420620k883769k181599k02478J523363J102011k1225J078924L926148
43090e228404M860972K321021r50131j766402k70825J264201J596969J102178
43082B929579L57462m83990j337068k020999k236795j510870K29872J885437J936508
43073b50864M49556n72810L85655K207859K337920n4473k885043l391312j255718
43064c029230R19620N70589j609552k311462J13246L175160L328638O45918j573602
43055B29325j557651r02993j072175p87225J245985L190359K399078k48848j326205
$$ plain form
43116 -1242955 -1375818 -4467612 -8887108 -10928812 -9149893 -5836880 -3838861 -3644858
43108 -3644858 -4216513 -4768260 -4436744 -1968106 2326925 5446587 4561089 370907 -4149159
43099 -4149159 -7569779 -10453548 -12635147 -12837625 -11314262 -10212251 -10233476 -9154552 -5228404
43090 -5228404 -367432 1953589 1003458 -762944 -1033769 230432 1827401 2929579
43082 2929579 3287041 2803051 1465983 -555016 -2791811 -4302681 -4072809 -2187372 -250864
43073 -250864 198692 -374118 11537 2219396 4557316 4502843 1617800 -1773512 -3029230
43064 -3029230 -2109610 -1539021 -3148573 -5460035 -5346789 -2171629 1157009 1802927 229325
43055 229325 -1328326 -2231319 -3303494 -4090719 -2844734 345625 2744703 2495855 1169650
43046A169650L8024R84878n07227k557735k308723J01573K247963K679236J638766
43037C486405l76442k665282l472527j355332K322851M101070K283399j240271
43029C083871l594259l954480l155356j670136M52225K261910K225844J92531
43021d157850j968359k187987k52791K124352K911825J396023j307295l162536
43013f604618k934275j196717M87658J316960J798716K500278K843796J794912
43005F710l20460j497964k44317K227754L045618J242456q42919p25623O44256
42996C535511K56559k318918l977367k493097K76639J179533J21821m14579Q23509
42987c010389K726457L935498L927843K280707r16380l884625m570936l435532
$$ plain form
43046 1169650 1207674 2192552 1685325 -872410 -3181133 -3079560 -831597 1847639 3486405
43037 3486405 3109963 444681 -3027846 -4383178 -2060327 2040743 4324142 3083871
43029 3083871 -510388 -4464868 -7620224 -9290360 -8838135 -6576225 -4350381 -4157850
43021 -4157850 -6126209 -8314196 -8566987 -6442635 -3530810 -2134787 -3442082 -6604618
43013 -6604618 -9538893 -10735610 -10247952 -8930992 -7132276 -4631998 -1788202 6710
43005 6710 -313750 -1811714 -2056031 171723 3217341 4459797 3616878 2891255 3535511
42996 3535511 3792070 1473152 -2504215 -4997312 -4720673 -3541140 -3419319 -3833898 -3010389
42987 -3010389 -283932 3651566 7579409 9860116 8943736 5059111 488175 -2947357
42979b947357k670318k522125j066586J795961L238871J900480M35746J407898
42971d27430L117596K362910n27472k561262k701216k375016k131495j068204
42963f311589O15954J567697J828838K532587K984943J192592k272814m192852
42955b054644l309808j745885p21180J474702N210409O846606L617818j452997
42947G865021l286853j736754r73409k756291m278253k881242N60584L706534
42939c780663N247878M410669P86546l829194n767306l585462k19865Q45576J93575
42930e698246J032073L965923N866691M338173J030167q19130o35511m42817j243842
42921G393481j764449j242665j177065k653436l684982j833879J375382J913475
$$ plain form
42979 -2947357 -5617675 -8139800 -9206386 -7410425 -4171554 -2271074 -1835328 -427430
42971 -427430 2690166 5053076 4525604 1964342 -736874 -3111890 -5243385 -6311589
42963 -6311589 -5695635 -4127938 -2299100 233487 3218430 4411022 2138208 -2054644
42955 -2054644 -5364452 -7110337 -7831517 -6356815 -1146406 5700200 9318018 7865021
42947 7865021 4578168 2841414 1868005 -888286 -5166539 -8047781 -7487197 -3780663
42939 -3780663 1467215 5877884 6664430 2835236 -2932070 -6517532 -6737397 -5891821 -5698246
42930 -5698246 -4666173 -700250 5166441 9504614 10534781 9715651 9080140 8637323 7393481
42921 7393481 5629032 4386367 3209302 555866 -3129116 -4962995 -3587613 -1674138
42913a674138o39713j951631O37530L914307L657096R02664k67826P18221R16654
42904F213164l84187n80437J084024J773305J33515q39148J413447M432514M070094
42895A7316291L44499l134588m229954l740353k642128r35972P67648J120447
42887D865890K3859j099850j454120j744554k503272k923125k011629p9686J441470
42878e485017J425303L49607J87188K188435M573647M008325K64747k598319j581405
42869C332511P20301j26624l560959m851371k338467N57942J404790K299070N048703
42860B485896O794216M080455j323412m642022m534360l359595k080477N98443
42852a980856L862691M123430L82569l356829l374549j110348o2287j54092J284367
$$ plain form
42913 -1674138 -2313851 -4265482 -3627952 286355 3943451 4846115 4578289 5296510 6213164
42904 6213164 5828977 5248540 6332564 8105869 8239384 7400236 8813683 13246197 17316291
42895 17316291 17660790 14526202 10296248 6555895 3913767 2977795 3745443 4865890
42887 4865890 4889749 3789899 2335779 591225 -1912047 -4835172 -6846801 -6926487 -5485017
42878 -5485017 -4059714 -3710107 -3522919 -1334484 3239163 7247488 7512235 4913916 3332511
42869 3332511 4052812 3926188 365229 -4486142 -6824609 -6266667 -4861877 -2562807 2485896
42860 2485896 9280112 13360567 12037155 7395133 2860773 -498822 -2579299 -1980856
42852 -1980856 1881835 6005265 6387834 3031005 -343544 -1453892 -1516179 -1670271 -385904
42843c85904M092601M767712J870058j306260j072656J745036L207153J486725
42835A4404465j293507k341092j690366j659679l483449n483902n059613k111696
42827h718839N44402O97958l65968J48885K324782L402839K112636P13690J386026
42818B246411K708604J971547m32083j674494r24173k07972p56662j349082j001383
42809E80713o14379p78433m65970N34958L39210j774586l011777o70131L485430
42800b374965N372459M023434J892427N77035m53474j178913o30361L80050n19298
42791G088394l318268m896108l455749r19412M38435R65170J610367J706436Q32358
42782E1623L72686R29927N82371j748778l592597k556392l80522J10169j1543
$$ plain form
42843 -385904 3706697 8474409 10344467 9038207 7965551 9710587 12917740 14404465
42835 14404465 13110958 10769866 9079500 7419821 3936372 -1547530 -6607143 -8718839
42827 -8718839 -8174437 -7476479 -7842447 -7693562 -5368780 -1965941 146695 860385 2246411
42818 2246411 4955015 6926562 6494479 4819985 3895812 3687840 2931178 1582096 580713
42809 580713 -33666 -812099 -1278069 -743111 -403901 -2178487 -5190264 -5860395 -2374965
42800 -2374965 2997494 7020928 8913355 9490390 9036916 7858003 7227642 7607692 7088394
42791 7088394 3770126 -1125982 -4581731 -5501143 -5062708 -4097538 -2487171 -780735 51623
42782 51623 424309 1354236 1936607 187829 -3404768 -5961160 -6341682 -6231513 -6243056
42773f243056J915346M422122L517703m45813k690225j325206L31923N6795J84010
42764b76401K272201L083872k26380m417622m189701P6787K939424J398481j984484
42755a323823l323890j685995J082943K474598J119329j796134l196780j709122
42747h358874L37430L41928n25749N24568K839663L063842Q12156k88984J758960
42738E04940M130446L467729O31707j133532q69224k91538n90126j149748j243575
42729C457079j235687j720006k359695k082630m33056J408080J581908J034j086057
42720b469030n5637J655141J829297J061468J423955K326189J278623j121693
42712E928313j142710J845828L321738L45158l427329l018485N28146K221941
$$ plain form
42773 -6243056 -4327710 94412 3612115 3166302 476077 -849129 -517206 -460411 -276401
42764 -276401 1995800 5079672 4853292 435670 -3754031 -3677244 -737820 660661 -1323823
42755 -1323823 -4647713 -6333708 -5250765 -2776167 -1656838 -3452972 -6649752 -8358874
42747 -8358874 -8021444 -7679516 -8205265 -7680697 -4841034 -1777192 -965036 -1254020 504940
42738 504940 4635386 8103115 8734822 7601290 6732066 6440528 5850402 4700654 3457079
42729 3457079 2221392 501386 -1858309 -3940939 -4373995 -2965915 -1384007 -1382973 -2469030
42720 -2469030 -2524667 -869526 959771 2021239 3445194 5771383 7050006 5928313
42712 5928313 4785603 6631431 9953169 10298327 6870998 3852513 4380659 6602600
42704F602600M68970k024837l306964l574886k277280J328865M561407L121628
42696D899503k269274n421840k752997K030908L629257K014081O45592P18712
42688C493942Q16993N95052J173953K414842K733734J595252K8768j195140k040520
42679I616876k141109j126396J47761M31847q364k2546J01930j035830l131400
42670B832769l795867j813851R13748J812331P94342k53197l01894j30157o67779
42661f09555j567074j733688o65684J087671K524167K962583K364553J235096
42653E598069L06696M4747K11436Q9096o16485j340090j457127j147750r04243
42644G84349o18778m3770K53428l04294p27318O07899L129960M039904K014458
$$ plain form
42704 6602600 7071570 5046733 1739769 -1835117 -4112397 -2783532 1777875 4899503
42696 4899503 2630229 -2791611 -5544608 -3513700 115557 2129638 2775230 3493942
42688 3493942 4310935 4905987 6079940 8494782 11228516 12823768 12852536 11657396 9616876
42679 9616876 7475767 6349371 6497132 6928979 6920615 6898069 6999999 5964169 2832769
42670 2832769 -963098 -2776949 -1863201 -50870 743472 490275 188381 58224 -609555
42661 -609555 -2176629 -3910317 -4576001 -3488330 -964163 1998420 4362973 5598069
42653 5598069 5904765 5949512 6160948 6250044 5633559 4293469 2836342 1688592 784349
42644 784349 165571 121801 375229 70935 -656383 -48484 3081476 7121380 9135838
42635I135838p83776j733070j246650j472962k700212l226194k315822j219583
42627e562431j183716k015663k721739k361348m67704K148517L458098K556532
42619f149454J388065K221137L867320K920251j084841m465424m222443j568726
42611g094115O77997J782711K233100J391939j173641l258600k056536J493108
42603f004037L253239J449640p87713J49377L210848M044366Q08352l404933m338128
42594a618989j351665K416179L818890K485780J32370j554850j822012o47923
42586A857780J293791K729927K681201J309824n01070k104223l123888l042505
42578A100837j643369L49607J872297K517794K208236M86775k595303n310832
$$ plain form
42635 9135838 8352062 6618992 5372342 3899380 1199168 -2027026 -4342848 -5562431
42627 -5562431 -6746147 -8761810 -11483549 -13844897 -14312601 -12164084 -8705986 -6149454
42619 -6149454 -4761389 -2540252 1327068 4247319 3162478 -1302946 -5525389 -7094115
42611 -7094115 -6416118 -4633407 -2400307 -1008368 -2182009 -5440609 -7497145 -6004037
42603 -6004037 -2750798 -1301158 -2088871 -1939494 1271354 5315720 6124072 2719139 -1618989
42594 -1618989 -2970654 -554475 3264415 5750195 5882565 4327715 2505703 1857780
42586 1857780 3151571 5881498 8562699 9872523 9371453 7267230 4143342 1100837
42578 1100837 -542532 -192925 1679372 4197166 6405402 6892177 4296874 -1013958
42570a013958n583188l470281q75153J036221K320618K388809K96473k487931
42562g388390k512164Q49203L580593K270432j026339j970260j87585J125190
42554e259320Q02790R30026K338756K832473J187779m05727J37758J503110J484938
42545E552583N94040M48146K60714j790373m478358m362015j067605J539460P34701
42536b568707j343517j369244J17481K06860j267164j588893O4439J263971O88029
42527e796745M84417K229350L420076J178983k452914k847214K24963K055532
42519a503552L2866k730417k499756k09314R79186P83011J211704K454968K743558
42510A262254J733649R86056J068175Q26287j34103n88484R7370Q66502P76221
$$ plain form
42570 -1013958 -6597146 -10067427 -10942580 -9906359 -7585741 -5196932 -4900459 -7388390
42562 -7388390 -9900554 -9051351 -5470758 -3200326 -4226665 -6196925 -6384510 -5259320
42554 -5259320 -4456530 -3526504 -1187748 1644725 2832504 2426777 2564535 4067645 5552583
42545 5552583 6146623 6594769 6855483 5065110 586752 -3775263 -4842868 -3303408 -2568707
42536 -2568707 -3912224 -5281468 -5163987 -4957127 -6224291 -7813184 -7748745 -6484774 -5796745
42527 -5796745 -5312328 -3082978 337098 1516081 -936833 -3784047 -3559084 -1503552
42519 -1503552 -1470686 -4201103 -6700859 -6910173 -5930987 -5147976 -3936272 -1481304 1262254
42510 1262254 2995903 3981959 5050134 5876421 5742318 5153834 5251204 6117706 6893927
42501F893927K98030J72658L22371M27629M31254J98414k02574L9728J322724
42492I904161K174489Q51798j667345k545739j199687m6505n39153j255439j124300
42483D552280j562606l324862l953495j308929K314392K931768N93002r91643
42475g50093m3380J398585J316934L10700l63224o48358o33701j4077L83909j067118
42465a09823l580994l488682R08820N869946O211039J821682k387969k736605
42457B507414m96439R33530K97951j129185j833046j332439N7082J515927K041516
42448B562311J331809K58825p9811L87419Q58283P88480K91074m01638j189839
42439D806913j808102j912443j620595j437285j449003j088562J5255J322076
$$ plain form
42501 6893927 7191957 7364615 7686986 8114615 8545869 8744283 8541709 8581437 9904161
42492 9904161 12078650 12930448 11263103 8717364 7517677 7471172 6932019 5676580 4552280
42483 4552280 2989674 -335188 -4288683 -5597612 -3283220 -351452 241550 -750093
42475 -750093 -793473 605112 1922046 2232746 1869522 1221164 587463 573386 957295 -109823
42465 -109823 -3690817 -7179499 -6270679 -400733 5810306 7631988 5244019 2507414
42457 2507414 2010975 2944505 3242456 2113271 280225 -1052214 -995132 520795 2562311
42448 2562311 3894120 4152945 4073134 4460553 5318836 6107316 6398390 5996752 4806913
42439 4806913 2998811 1086368 -534227 -1971512 -3420515 -4509077 -4493822 -3171746
42431c171746J784122P77386j321158l085701k816894k65872K446869K872964
42423b780030J441508R83956K306251K379270j056863m930680m186696Q55219
42415d988065M219956K203413j888958k880520o82274Q43084J08441o16928O03372
42406c078479K785219M154763M405565L889792K426315J01963j959861k749301
42398I975976k570009k294111k050274j400656l50049N57426R25237O98814k02688
42389C289666j795215l297805l036920m2289L974804N321963K263888k290221
42381D387871l785564j674365N9592j418066m082115m483798k444053M3497K465379
42372a0931622N125750O286593L839354n40451k698070j716129o92934j307710
$$ plain form
42431 -3171746 -1387624 -610238 -1931396 -5017097 -7833991 -8099863 -5652994 -2780030
42423 -2780030 -1338522 -354566 1951685 4330955 3274092 -1656588 -5843284 -4988065
42415 -4988065 -768109 1435304 -453654 -3334174 -4016448 -3173364 -3064923 -3681851 -3078479
42406 -3078479 -293260 3861503 8267068 12156860 14583175 14685138 12725277 9975976
42398 9975976 7405967 5111856 3061582 1660926 1310877 1868303 2793540 3492354 3289666
42389 3289666 1494451 -1803354 -4840274 -4882563 -907759 4414204 6678092 4387871
42381 4387871 602307 -1072058 -1012466 -2430532 -6512647 -10996445 -13440498 -13397001 -10931622
42372 -10931622 -5805872 480721 4320075 3779624 1081554 -634575 -1327509 -2635219
42364b635219j603497m38608J8334j425014j939304Q99393M593909N223198L196052
42355E889244J743797J411058J20961k255600l494699k947531k151633j472966
42347c157369K54273K409304K551111N51611o21252N79226K108321J990330J036859
42338G702414K94573j052602l018332l042550J42622L201804K184831j633945
42330D778815l392613j373315J339582J877687R64180N13378O49112N37921K87162
42321F181909M73253R02205J080812J127826J159377M28820j710670m150224m503737
42312I89571j804494J848522L216889J569999n16720o13262L66974o2015j651984
42303C343480j343351J969385N108615M672162J494396j025917j561596j355452
$$ plain form
42364 -2635219 -4238716 -4677324 -4658990 -6084004 -8023308 -7123915 -2530006 2693192 5889244
42355 5889244 7633041 9044099 9165060 6909460 3414761 467230 -1684403 -3157369
42347 -3157369 -2903096 -493792 2057319 2608930 1987678 2566904 4675225 6665555 7702414
42338 7702414 7996987 6944385 3926053 883503 1026125 4227929 6412760 4778815
42330 4778815 1386202 12887 1352469 3230156 4194336 4707714 5356826 5894747 6181909
42321 6181909 6655162 7557367 8638179 9766005 10925382 11354202 9643532 5493308 989571
42312 989571 -814923 1033599 4250488 5820487 5303767 4690505 5057479 4995464 3343480
42303 3343480 2000129 3969514 9078129 13750291 15244687 14218770 12657174 11301722
42295A1301722j084940n1544J643073K635677K310865J255614l65017k738921
42287A4906529m635342m208392k099537j171002k172943k237546P48402M528573
42279C658742N312109K646207o24008k140687j819486p10259K0051n40068k102191
42270C700410l004624k199711p01455J80310R52927K531164L727357K503283o18263
42261G071398k767916k526984j336410o75652r976J448105K758906K552684J261953
42252G776108N68086J004880J310936K74924j505909k139155o74675J484671J942994
42243A0042860J78665j730591j740584k90736P93588R20832P96546M95341o31532
42234H834389k103548k247235o08257J006666P20943j128003k571474k227539
$$ plain form
42295 11301722 10216782 10165238 11808311 14443988 16754853 18010467 17645450 14906529
42287 14906529 10271187 6062795 3963258 2792256 619313 -1618233 -869831 3658742
42279 3658742 8970851 11617058 10993050 8852363 7032877 6322618 6342669 5802601 3700410
42270 3700410 695786 -1503925 -2205380 -2025070 -1072143 1459021 5186378 7689661 7071398
42261 7071398 4303482 1776498 440088 -235564 -245540 1202565 3961471 6514155 7776108
42252 7776108 8344194 9349074 10660010 10934934 9429025 7289870 6615195 8099866 10042860
42243 10042860 10221525 8490934 6750350 6459614 7253202 8174034 8970580 9465921 8834389
42234 8834389 6730841 4483606 3875349 4882015 5602958 4474955 1903481 -324058
42226c24058n63220N19712n90432l126401l911339p31234M406162P008700N251291
42217G939181J654064p10895j606764k273968k714349k081430o10131N47206Q89537
42208A032451Q02642O96151P11635P00847n441j810062l331982k200903J567251
42199a837411M498037L519748j95848k808770k284443K33575K517054K938881
42191F580823R20549k274989l679202j581180J803515K525167k11553l139967
42183I43163l117170n42648J865552K328331J378557P74456J477069K465520J881559
42174I454389l61444k120912j923428r28430o61878l80679J175582K753986K103265
42165I110451j81627j236290r0557J527007K295752K233748P94156k403414m800235
$$ plain form
42226 -324058 -887278 -367566 -957998 -4084399 -7995738 -8726972 -4320810 2687890 7939181
42217 7939181 9593245 8882350 7275586 5001618 2287269 205839 -404292 142914 1032451
42208 1032451 1835093 2531244 3242879 3943726 3938285 2128223 -1203759 -3404662 -1837411
42199 -1837411 2660626 6180374 5984526 3175756 891313 1124888 3641942 6580823
42191 6580823 7501372 5226383 1547181 -33999 1769516 4294683 4083130 943163
42183 943163 -2174007 -2716655 -851103 1477228 2855785 3630241 5107310 7572830 9454389
42174 9454389 9092945 6972033 5048605 4120175 3458297 3077618 4253200 7007186 9110451
42165 9110451 8928824 7692534 7601977 9128984 11424736 13658484 14452640 12049226 7248991
42156G248991k970879J592726L074643n08927m036315k814093P16099J452215
42148C754460o85517k055483j781954j974376k755452j927435O35929K468704
42140d321124K534077K125342J688532L85620r53469j66214K341113L533220K315143
42131I482240P17903j86166j696568l598536k977932R20363M318018M040279J831878
42122A2851479P26877K75755j160697k200998p67741J309262N52777k256820k848469
42113F481425Q9207L353520M373693L975204L330727J982203J56949m39989J93104
42104B3496043m43614k960981l826848j14372N713214Q572421O838619L110637
42096D0385119J85108j041510n20153J242273K487516J584933o43669j832022
$$ plain form
42156 7248991 4278112 5870838 8945481 8436554 4400239 1586146 2302245 3754460
42148 3754460 3068943 1013460 -768494 -2742870 -5498322 -7425757 -6789828 -4321124
42140 -4321124 -1787047 338295 2026827 2412447 1458978 1292764 3633877 7167097 9482240
42131 9482240 10200143 10013977 8317409 4718873 1740941 2661304 6979322 11019601 12851479
42122 12851479 13578356 13854111 12693414 10492416 9724675 11033937 11586714 9329894 6481425
42113 6481425 6570632 9924152 14297845 18273049 21603776 23585979 23742928 23302939 23496043
42104 23496043 23052429 20091448 16264600 16150228 21863442 30435863 37274482 40385119
42096 40385119 40570227 39528717 39008564 40250837 42738353 44323286 43679617 41847595
42088D1847595j444208j427485l145826n296936n530458l081689N93193K998639
42080B5512825K416320n11312l074207l248749j819954p82807m45749J74237P84194
42071A9004798R2859j365028j349086M73278J612991O66080k86744J038071L448159
42062B3335378M007736J972960j141191m131657o347119o355340l215024J044605
42054I170348K865714J618099M46997J843070M204187M071455O59108l161073
42046B1717905m084426j785341R80239J513038J81365l15239J238908K840810
42038B2287259K306362N61857l2908M01501k99073k221810k690801m85809J982051
42029B1808629K206280J028176O18865Q91941L53618o92980n58113N62581M54338
$$ plain form
42088 41847595 40403387 38975902 35830076 30533140 25002682 21920993 22514186 25512825
42080 25512825 27929145 27417833 24343626 21094877 19274923 18492116 18046367 18220604 19004798
42071 19004798 19097657 17732629 16383543 16856821 18469812 19135892 18849148 19887219 23335378
42062 23335378 27343114 29316074 28174883 24043226 17696107 11340767 8125743 9170348
42054 9170348 12036062 13654161 14101158 15944228 20148415 24219870 24878978 21717905
42046 21717905 17633479 15848138 16828377 18341415 18522780 18207541 19446449 22287259
42038 22287259 24593621 25155478 25122570 25524071 25224998 23003188 20312387 19826578 21808629
42029 21808629 24014909 25043085 25661950 26553891 26907509 26214529 25656416 26218997 26673335
42020B6673335j422010k436070l30510L301618M824285L178385R66397Q51143
42012C5606573K444178L565131L379868K802746K255646Q76348j526097l274888
42004D6129505k716852l76584J836922K709594J896458q89816n067449q139761
41996C5382017p520194l606078M39273K080916J390492k3318n03105Q56613L030318
41987C1526934L040731o46325m960626n216850j430987J491188O26500j326623
41979B3103942q76858J121277J683402M16079q95717j521233j744867j070809
41971B0215216P84923K284200J967525Q18172L90095N0443j249882k085434p31387
41962B2443871J118833O42341r44169K03783M010210N845173L475336M84690Q09421
$$ plain form
42020 26673335 25251325 22815255 22484745 25786363 30610648 33789033 34755430 35606573
42012 35606573 38050751 41615882 44995750 47798496 50054142 50930490 49404393 46129505
42004 46129505 43412653 43036069 44872991 47582585 49479043 48589227 43521778 35382017
41996 35382017 27861823 24255745 24695018 26775934 28166426 28143108 27640003 28496616 31526934
41987 31526934 34567665 33921340 28960714 23743864 22312877 23804065 24430565 23103942
41979 23103942 22227084 23348361 25031763 25447842 24552125 23030892 21286025 20215216
41971 20215216 21000139 23284339 25251864 26070036 26460131 26510574 25260692 23175258 22443871
41962 22443871 23562704 24205045 23260876 23464659 27474869 33320042 36795378 37280068 38089489
41953C8089489L309454M334183L156289K010833K162355K560698K049029J145826
41945E8818156J453948L873076P250690Q985437P812110N666701N458443P311872
41937A06630433Q786175Q664126Q374035R365261J1155158J2446650J2251788
41930A77673626R612802M420238j046140l756680l740328l875360n336295o164583
41922A67787280n428646n553017q406439j1692687j1738636q075824l142033Q14194
41914A14564192K488373J067077k520005n240656n121643l672016l251019l415079
41906I4899224k038243J194542M674372P219352Q443363P878004N941765M796291
41898A33008670N934337P646268P030108L888710P08187n28207K07825J691590
$$ plain form
41953 38089489 41398943 45733126 48889415 50900248 53062603 55623301 57672330 58818156
41945 58818156 60272104 64145180 71395870 80381307 88193417 93860118 99318561 106630433
41937 106630433 115416608 124080734 132454769 141820030 152975188 165421838 177673626
41930 177673626 187286428 191706666 190660526 186903846 183163518 179288158 173951863 167787280
41922 167787280 162358634 156805617 148399178 136706491 124967855 116892031 113749998 114564192
41914 114564192 117052565 118119642 115599637 110358981 105237338 101565322 98314303 94899224
41906 94899224 92860981 94055523 98729895 105949247 114392610 122270614 128212379 133008670
41898 133008670 138943007 146589275 153619383 157508093 158216280 157688073 157895898 159587488
41890A59587488J868329j045354n903378q694420p548409n751552o895966r185589
41882A16431149q517570n497565m436095o035331o473157m288928k790530l926750
41874G4465223m782179k914106r05475k044545m674555m775788k129979j17539
41866E2121057n04640j863678k730635l322921l926460l855187k515171j89693
41858C3212672K268864L591183K554388l73499k468507j489643J252132K200469
41850D0748059K6035k717501k863470l33870K206722K639456J330476j47302j258994
41841C9629611k614744m074389m127944k107607j494l42261k570881l512070j905781
41832A8372440l79472j596546m131340m278065j249187J707287J704824j52884
$$ plain form
41890 159587488 161455817 160410463 154507085 145812665 138264256 132512704 125616738 116431149
41882 116431149 107913579 102416014 97979919 91944588 85471431 81182503 78391973 74465223
41874 74465223 69683044 66768938 65863463 63818918 59144363 54368575 52238596 52121057
41866 52121057 51616417 49752739 47022104 43699183 39772723 35917536 33402365 33212672
41858 33212672 35481536 39072719 41627107 41253608 38785101 37295458 38547590 40748059
41850 40748059 40774094 38056593 35193123 34859253 37065975 39705431 41035907 40888605 39629611
41841 39629611 37014867 32940478 28812534 26704927 26703433 26361172 23790291 20278221 18372440
41832 18372440 17992968 16396422 12265082 7987017 6737830 8445117 10149941 9997057
41824I997057o50709J191849L198643L169623J374153n18516j603153j824078
41816A4334869j104190K3179j69625k396269m098396k184337J884528L112367
41808I402126J13117k401283l95979L779776N568820M743383L606356J612869
41800B6029185k716614o288549m238099J774684M282426L03027m696580n088427
41792I361053k103466O2203L88198L6333p31818j243471M39443L744498M435765
41783A4388738P32993k934726k253406L70050K13600j897741j747760M81386P90928
41774H144062j213563j728875J85150R05090j088824k244514O4794L027016K807784
41765H858120K12257j098980J60391K210749L270809K910915J255064j105899
$$ plain form
41824 9997057 9346348 10538197 13736840 16906463 18280616 17762100 16158947 14334869
41816 14334869 13230679 13253858 13084233 10687964 6589568 4405231 6289759 9402126
41808 9402126 9515243 7113960 6717981 10497757 16066577 20809960 24416316 26029185
41800 26029185 23312571 17024022 12785923 14560607 18843033 19146060 14449480 9361053
41792 9361053 7257587 7319790 7707988 7744321 7012503 5769032 6208475 9952973 14388738
41783 14388738 15121731 12187005 9933599 10303649 10517249 8619508 6871748 7353134 8144062
41774 8144062 6930499 5201624 5386774 6291864 5203040 2958526 3023320 6050336 8858120
41765 8858120 9070377 7971397 8131788 10342537 13613346 16524261 17779325 16673426
41757A6673426k740215k431336o62013P84707P89479P0453K26801J590738K446210
41748A6748250J200860r64052j285578N04293J579938M39762q07334l95690j83702
41739A6836747k046447l699101k100676R62778J288606r63309j800454j49306
41731H328838J097858R13938J550633L071052K004221k311336n051070k702580
41723F901554J537668K582657L01263j966620k841961l058610k351922p3883K281809
41714C311955K485590Q06438p03227j302001j670795j915604j699664j501210
41706b188518j700195j296018N63493K704699L392770K731313J921981J174887
41698G304412J3085j366961k501887l280084l022958p02803K601169L713832J650567
$$ plain form
41757 16673426 13933211 11501875 10839862 11624569 12414048 12484501 12711302 14302040 16748250
41748 16748250 17949110 16985058 15699480 16203773 17783711 18223473 17416139 17020449 16836747
41739 16836747 14790300 11091199 8990523 9953301 11241907 10278598 8478144 8328838
41731 8328838 9426696 10340634 11891267 14962319 16966540 14655204 9604134 6901554
41723 6901554 8439222 11021879 11323142 9356522 6514561 3455951 1104029 1030146 3311955
41714 3311955 5797545 6603983 5900756 4598755 2927960 1012356 -687308 -2188518
41706 -2188518 -3888713 -5184731 -4621238 -1916539 1476231 4207544 6129525 7304412
41698 7304412 7317497 5950536 3448649 168565 -2854393 -3557196 -956027 2757805 4408372
41689D408372n05670j93116Q24438J4207j399621j150466n83978j964819l018795
41680c569448L79457O678957R380817N929248Q31867j401472j713299k805974
41672A3710153m166089l782198k053565j044410j373570j907794j446427M17640
41664a646260K785444L308147N38533l160610l653865o80177J549246M98662j394223
41655a855103j402759p85014j365771j182251K234182O380512O351793K132453
41647A0508042j254372j117761k66729j541892l101306j702077J915851L963846
41639G403602K821418O45899j11071L29262J51989j412259l397185m347222l484978
41630a400545j053035J648675K665813Q74657k390855l954687j975420J775699
$$ plain form
41689 4408372 3902702 3709586 4534024 4548231 3148610 1998144 1414166 -550653 -3569448
41680 -3569448 -3189991 3488966 12869783 18799031 19630898 18229426 16516127 13710153
41672 13710153 9544064 5761866 3708301 2663891 1290321 -617473 -2063900 -1646260
41664 -1646260 1139184 4447331 4985864 1825254 -1828611 -2508788 -959542 -460880 -1855103
41655 -1855103 -3257862 -4042876 -5408647 -6590898 -4356716 2023796 8375589 10508042
41647 10508042 9253670 8135909 7869180 6327288 3225982 1523905 3439756 7403602
41639 7403602 10225020 10870919 10759848 11089110 11241099 9828840 6431655 2084433 -1400545
41630 -1400545 -2453580 -804905 1860908 2735565 344710 -3609977 -5585397 -3809698
41622c809698L698730K297736n51648k124649j490244M55105K204631K304675
41614B984638J22473k961960m059704j796681J599874K508782J32072k614391
41606d084897k613244p859K298757K011267k26316j663881k78819L138664N554372
41597D128044M475744M23175l394735m112380j950536L37850P38963m667p8284
41588E63174O77281J062009R49118J337820J775202K35069l148562m644711j565465
41579b759065L415970N477300M001774K394174K167462J185451j618177l733844
41571A0531045l084435j321212q11259r63109j74235P55224J96483q44404o9878
41562D214220K053656K681366R25844r13960p39533R88809K594674K859234J089510
$$ plain form
41622 -3809698 -110968 2186768 1635120 -489529 -1979773 -1524668 679963 2984638
41614 2984638 3107111 145151 -3914553 -5711234 -4111360 -1602578 -1470506 -4084897
41606 -4084897 -6698141 -6706000 -4407243 -2395976 -2622292 -4286173 -4564992 -1426328 4128044
41597 4128044 8603788 9026963 5632228 1519848 -430688 -92838 646125 641458 563174
41588 563174 1240455 2302464 3251582 4589402 6364604 6599673 3451111 -1193600 -2759065
41579 -2759065 656905 6134205 10135979 12530153 14697615 15883066 14264889 10531045
41571 10531045 7446610 6125398 5314139 4351030 4176795 4932019 5128502 4284098 4214220
41562 4214220 6267876 8949242 9875086 8961126 8221593 9210402 11805076 14664310 15753820
41553A5753820k392256n328242n120747k138372L37821K98176o46799k12126J021374
41544A572649P87328j186549k651406j857424M12717K132046K322986J549590
41536C081937O96331n0807q82557j446246r37840N66199J497933M20329j907161
41527A038118l122142k136975m17533J65523j45663L59840K109268L349603K390102
41518C590141l430j258088r950K241233L011423J945005J073199J811928K865041
41509A5266502K072282m22436k303881k309630j825467k662498m394035m960249
41501a539412l403662r74866M45396K90442m43049l68339J047174L028967M045933
41492B128584L064833N81901j604079j890488l16997J479725J790315K88402j979900
$$ plain form
41553 15753820 13361564 8033322 2912575 774203 1112024 1410200 763401 551275 1572649
41544 1572649 2359977 1173428 -1477978 -3335402 -2922685 -790639 1532347 3081937
41536 3081937 3778268 3727461 2844904 1398658 460818 1027017 2524950 2945279 1038118
41527 1038118 -2084024 -4220999 -4638532 -4473009 -4618672 -4258832 -2149564 1200039 3590141
41518 3590141 3586711 2328623 2318673 4559906 7571329 9516334 10589533 12401461 15266502
41509 15266502 17338784 16916348 14612467 12302837 10477370 7814872 3420837 -1539412
41501 -1539412 -4943074 -5917940 -5472544 -5182102 -5625151 -5993490 -4946316 -1917349 2128584
41492 2128584 5193417 5775318 4171239 2280751 1963754 3443479 5233794 5522196 3542296
41483C542296l759351m427462l841989j982575Q27434L574497M955309M370252
41475C258411K455613N29381n36516q99798j183654j445158j057714K18985J503815
41466B843365J651934O13605o37313j323851j306852n37390Q42390J762560R32361
41457D840809j062995j637833N90138L306339K813427j295237n282133n494805
41449c222290k283670R64594J751565M10370j289824k077461j512198K92130K299584
41440d667200K706137Q40808j314283j016194J632328L616152L120751J762442
41432F680941J435968J049207j220766m005019m265676k064711m23364m89682
41424c303102m58017K01057n42205k822436l131859L67855M170496M277563J931457
$$ plain form
41483 3542296 -217055 -4644517 -8486506 -10469081 -9641647 -6067150 -1111841 3258411
41475 3258411 5714024 6243405 5706889 4807091 3623437 2178279 1120565 1339550 2843365
41466 2843365 4495299 5108904 4471591 3147740 1840888 1303498 2145888 3908448 4840809
41457 4840809 3777814 2139981 2730119 6036458 8849885 7554648 2272515 -3222290
41449 -3222290 -5505960 -4541366 -2789801 -2379431 -3669255 -5746716 -7258914 -6966784 -4667200
41440 -4667200 -1961063 -1120255 -2434538 -3450732 -1818404 1797748 4918499 6680941
41432 6680941 8116909 9166116 7945350 3940331 -325345 -2390056 -2813420 -3303102
41424 -3303102 -3761119 -3560062 -4102267 -6924703 -10056562 -9688707 -5518211 -1240648 690809
41415F90809R25295J581933J503923N58526O62843J570391J275489J31833J88412
41406I089454O24212j475108n379341o583593l589123j63613Q64408J416723L366899
41397a829082M499506K696432K97076K67528J174953L32419p38788J016045L892574
41388A1608663L323555n15766k499533n35458J463462K87269j616956p77154J412852
41379A2150934J176528j470275k876810j248152J437472L036579L737090M049218
41371A9992584K791217r99489n286953o243045k476467L155151O479483N952303
41363B3364784L052153l50165l474676n503610m913612j435455K212873K480126
41355A5432418q70901m197205m190137j532613N69145N83101o8828K87220J192793
$$ plain form
41415 690809 1616104 3198037 4701960 5260486 5923329 7493720 8769209 8901042 9089454
41406 9089454 9713666 8238558 2859217 -3724376 -7313499 -7477112 -6612704 -5195981 -1829082
41397 -1829082 2670424 5366856 5663932 5931460 7106413 7438832 6700044 7716089 11608663
41388 11608663 14932218 14416452 11916919 11381461 12844923 13132192 11515236 10738082 12150934
41379 12150934 13327462 11857187 8980377 7732225 9169697 12206276 15943366 19992584
41371 19992584 22783801 21784312 16497359 10254314 7777847 10932998 17412481 23364784
41363 23364784 26416937 26066772 22592096 17088486 12174874 10739419 12952292 15432418
41355 15432418 14561517 10364312 6174175 4641562 5210707 5793808 5724980 6012200 7204993
41346G204993J082741l56284j961006k783402k899574k601219j849353p83550
41338d946654J03904O33125J019414J096446M52927l45123O3176J756947K925012
41329B759174K244425N62996q19401j925556k672472j589407J616283L841990
41321D018032K180220j217600j566991J524629L561502K284805Q83742K179173
41313A3847512L657315J543667k965110n219227l414721j03465J888277K239761
41305A1474009K000391J890652J956742J677877N48070q53282j269460p99301
41297A6625698r88915k096140k298010q79970J32430o40060j365992k92057P57280
41288H954264o75077l140747l312505j262852L8715k66540k19575R04957J499225
$$ plain form
41346 7204993 8287734 7931450 5970444 3187042 287468 -2313751 -4163104 -4946654
41338 -4946654 -4842750 -4209625 -3190211 -2093765 -1640838 -1985961 -1922785 -165838 2759174
41329 2759174 5003599 5566595 4747194 2821638 149166 -1440241 176042 4018032
41321 4018032 6198252 4980652 3413661 4938290 8499792 10784597 11668339 13847512
41313 13847512 17504827 19048494 16083384 10864157 7449436 7345971 9234248 11474009
41305 11474009 13474400 15365052 17321794 18999671 19547741 18694459 17424999 16625698
41297 16625698 15636783 13540643 11242633 10362663 10495093 9855033 8489041 8196984 8954264
41288 8954264 8279187 5138440 1825935 563083 601798 335258 115683 1020640 2519865
41279B519865P89544j30438o62540j076679n03107K129124M908557M238098Q8103
41270A2300527l339229l177567j047869L44557N77509J46204j190129k943774
41262A670229l359608k051305r03798q87080m03079J575259L220750K753033J462354
41253C076755J520260K379243J728205q08212k868655k081321J278617M110408
41245H335300L144076j220028m421309k970522P36856J714614l59430j314764
41237C644793J81590O27496j642484l145865j335409R41891P28202K43685K405260
41228B649159M873227L806912P02508q9346J279692R56116j546571k647996q09530
41219I174171J768645L651197N468509O312814L778799j216410m078569k626599
$$ plain form
41279 2519865 3309409 3178971 2516431 1439752 936645 3065769 7974326 12212424 12300527
41270 12300527 8961298 5783731 4735862 5080419 5657928 5804132 4614003 1670229
41262 1670229 -1689379 -3740684 -4644482 -5531562 -5934641 -4359382 -1138632 1614401 3076755
41253 3076755 4597015 6976258 8704463 7896251 5027596 2946275 4224892 8335300
41245 8335300 11479376 10259348 5838039 2867517 3604373 5318987 4959557 3644793
41237 3644793 3826383 4453879 2811395 -334470 -1669879 -727988 214 243899 2649159
41228 2649159 7522386 11329298 12031806 11942460 13222152 14178268 12631697 9983701 9174171
41219 9174171 10942816 14594013 20062522 26375336 30154135 28937725 24859156 22232557
41211B2232557J80845J125457P79422R74827J591677J975005K766254M148322
41203C5774366M523238K998413J355644J685023L540924M972820N023633L928250
41195F3802311K136438K70238j063316k141081l603506m773086m214058k375083
41187D8038857j642575l026953m777421n142494m528447l925351l109587j572510
41179B0313519L58973K211622L590009L276407L22648l311764l917715j081418
41171B1762281J177223L2424k155241j830193L42090J159905J25145n28468j01016
41162A9984150j77067j141269j143595O85029K481658K328244J002801P45239
41154B4765190K182610L671886L555743K310666J969015L366789M644548L446233
$$ plain form
41211 22232557 22413402 23538859 24318281 25293108 26884785 28859790 31626044 35774366
41203 35774366 40297604 43296017 44651661 46336684 49877608 54850428 59874061 63802311
41195 63802311 65938749 66208987 65145671 63004590 59401084 54627998 50413940 48038857
41187 48038857 46396282 43369329 38591908 33449414 28920967 24995616 21886029 20313519
41179 20313519 20672492 22884114 26474123 29750530 30073178 26761414 22843699 21762281
41171 21762281 22939504 22971928 20816687 18986494 19328584 20488489 20613634 20085166 19984150
41162 19984150 19807083 18665814 17522219 18207248 20688906 23017150 24019951 24765190
41154 24765190 26947800 30619686 34175429 36486095 38455110 41821899 46466447 49912680
41146D9912680L09745j708016j165446k24184j383511l788629m589298l101725
41138C4261616j611778k087189l757704m487263l540833k262729k218946l100372
41130A1194802k885536l79337K869898M077585K501532J00633j170726j426382
41122A4882469j759079k342907k466768j723463n08969K71084r4931j152630j345920
41113C758886M924J389669J201586L55709O81432J435462M41179j504915j168475
41104F595457J410524J928277j393447l952964j025763N000434P493487M033292
41096B0089297j506679m321889l074817K92218K448226J032328k668986m405063
41088G884635k346278q8025j640719n332531o245619l314102N7214J700831K715153
$$ plain form
41146 49912680 50222425 48514409 47348963 47124779 45741268 41952639 37363341 34261616
41138 34261616 32649838 30562649 26804945 22317682 18776849 16514120 14295174 11194802
41130 11194802 8309266 7929929 10799827 14877412 17378944 17479577 16308851 14882469
41122 14882469 13123390 10780483 8313715 6590252 6081283 6352367 6257436 5104806 3758886
41113 3758886 3763810 5153479 6355065 6710774 7392206 8827668 9268847 7763932 6595457
41104 6595457 8005981 9934258 8540811 4587847 3562084 8562518 16056005 20089297
41096 20089297 18582618 14260729 11185912 11478130 13926356 14958684 12289698 7884635
41088 7884635 5538357 5450332 3809613 -1522918 -7768537 -11082639 -11025425 -9324594 -6609441
41079f609441L757297L504801J658152m0848p34396j299972j582171r0898K537246
41070A099770L148544O83270j816187j594235Q6123O13179J31716O48575K534233
41061E534988M059948L703329J555068r79926k205983j663053q22030j110852
41053H071489j498874O8322K996911M328895K996360J049169j5915j156913k824793
41044A4014651l149362j029990J433778J737651K89345r19814j131335o15072
41036A0629852M62622J335481P92442m77609j79916J246874j38727n306305q324589
41027D0125l475120N651907R443777M470539k457742l534359Q44196M247165K713948
41018A7944436j582400l996253k569353N71579K022843P55800j397032k650777
$$ plain form
41079 -6609441 -2852144 652657 2310809 2269961 1535565 235593 -1346578 -1437476 1099770
41070 1099770 4248314 4931584 3115397 1521162 1607285 2220464 2352180 3000755 5534988
41061 5534988 9594936 13298265 14853333 13873407 11667424 10004371 9182341 8071489
41053 8071489 6572615 6640937 9637848 13966743 16963103 18012272 17996357 16839444 14014651
41044 14014651 10865289 9835299 11269077 13006728 13296073 12376259 11244924 10629852
41036 10629852 11092474 12427955 13220397 12742788 12562872 13809746 13671019 8364714 40125
41027 40125 -3434995 2216912 11660689 16131228 13673486 10139127 10983323 15230488 17944436
41018 17944436 16362036 12365783 9796430 10368009 12390852 13146652 11749620 9098843
41010I098843l242983l806570l516858j590897O79743J549690J569747K411221
41002C151936L592256K893593j66583l635878n775136o056437l800722J178277
40994h618694O126283O666807K029241l267118m396987j168690L059283N358973
40986E789098M722415J581182k113538l559765j820087P68584J352733J8162r05533
40977E833251k75705P24901N89902p54877k180259k367095p18528J910368L587224
40968F349182L145423J414282L4321l87519j33786Q40235K527922L528604J792181
40959A9110845k665014o901882p774567n013604j018523J869063L088830L140503
40951C835651K251728M06665j744691k925480k543369j455983q06738l01790J499875
$$ plain form
41010 9098843 5855860 2049290 -1467568 -3058465 -2378722 -829032 740715 3151936
41002 3151936 6744192 9637785 9471202 5835324 60188 -5996249 -9796971 -8618694
40994 -8618694 -2492411 4174396 6203637 2936519 -1460468 -2629158 430125 5789098
40986 5789098 10511513 12092695 9979157 6419392 4599305 5367889 6720622 6738784 5833251
40977 5833251 5557546 6282447 6872349 6117472 3937213 1570118 851590 2761958 6349182
40968 6349182 9494605 10908887 10943208 10555689 10421903 11262138 13790060 17318664 19110845
40959 19110845 16445831 9543949 1769382 -3244222 -4262745 -2393682 695148 3835651
40951 3835651 6087379 6494044 4749353 1823873 -719496 -2175479 -2982217 -3284007 -1784132
40942a784132M854235P528283O715526K257609k694222m590652k873486k48430
40934I164731L56679j083273j795576M11967M080447N135971J529777l778878
40926A4021845n732674l100733R8130m5242k255390k429729K8387J451887j17855
40917A918626j699522k00560K380065J968088r92059k002400O14786L306657K830099
40908H123780P40536L13076J518307J579554q17651m036374n595381m411915j554729
40899d140797M74368J47951j047357n57802J056126N55678k416261l601845k80758
40890i810697M004532M309915J402083j39318P36108Q01078j386999l354722l179831
40881f617851j998332j033436L05846K139569L092645K773122K389698J958330
$$ plain form
40942 -1784132 3070103 10598386 17313912 19571521 16877299 12286647 9413161 9164731
40934 9164731 9521410 8438137 6642561 7054528 11134975 16270946 17800723 14021845
40926 14021845 8289171 5188438 5286568 5241326 2985936 556207 584594 2036481 1918626
40917 1918626 219104 18544 2398609 4366697 3374638 1372238 1987024 5293681 8123780
40908 8123780 8864316 9177392 10695699 12275253 11457602 7421228 1825847 -2586068 -4140797
40899 -4140797 -3666429 -3518478 -4565835 -5123637 -4067511 -3511833 -5928094 -9529939 -9810697
40890 -9810697 -5806165 -1496250 -94167 -233485 502623 1303701 -83298 -3438020 -6617851
40881 -6617851 -8616183 -9649619 -9343773 -7204204 -4111559 -1338437 1051261 3009591
40873C009591J04939k269301j842122J764130M170959K427485l85570q3727K000007
40864H896391J495358j760792l527157j739949Q55677J202607l04029j630937
40856C487169k113473k275636k310808j991531j252740k56856N17797K95421r49865
40847f850522j650101j67771K693949M031525K230233r39086k280097p19174J698407
40838a952637K267793O74316q11312k84971J351735J771624M47765j054405j793793
40829F16115k346740k611283j251695J423376K577935R39729m70131J473617M808939
40820E159862M960437J524436j212566o63373Q47169L46521j510587k288344j558590
40811E604965o97032l07688J55954Q50467J093721K25493j757813l936519m580360
$$ plain form
40873 3009591 3114530 845229 -996893 767237 4938196 7365681 6980111 6896384 8896391
40864 8896391 10391749 8630957 5103800 3363851 4219528 5422135 5118106 3487169
40856 3487169 1373696 -901940 -3212748 -5204279 -6457019 -6713875 -6196078 -5900657 -6850522
40847 -6850522 -8500623 -8668394 -5974445 -1942920 287313 -651773 -2931870 -3651044 -1952637
40838 -1952637 315156 989472 178160 -106811 1244924 3016548 3464313 2409908 616115
40829 616115 -1730625 -4341908 -5593603 -4170227 -1592292 -652563 -1122694 350923 5159862
40820 5159862 10120299 11644735 10432169 9768796 10615965 10962486 9451899 7163555 5604965
40811 5604965 4907933 4600245 4756199 5606666 6700387 6925880 5168067 1231548 -3348812
40802c348812k586717P24796K496578J713172M05672N54329J176590K3123k687758
40793a529027l986869j623146L253189P007256O689272K626773j741391l164971
40785G531086k034022j599775l351832m796330l139435M43040K490372K206044
40777b250852J822858K163131J170326j944038m138459k557393R02426J970215
40769b861786q1777j933730j367151K03423R55618J445282K640428L554840K951418
40760E506565J749598J434594J195247q48953m045889n330192l194176M32302
40752c100904K693697K579355Q20670j350182k674788k372836r18889L57915O21311
40743c344651j27168j524818k548085j585565J372276L449203K265061q2672L43334
$$ plain form
40802 -3348812 -5935529 -5210733 -2714155 -1000983 -595311 -40982 1135608 1158731 -1529027
40793 -1529027 -5515896 -7139042 -3885853 3121403 9810675 12437448 10696057 7531086
40785 7531086 5497064 3897289 545457 -4250873 -7390308 -6947268 -4456896 -2250852
40777 -2250852 -427994 1735137 2905463 961425 -3177034 -5734427 -4832001 -2861786
40769 -2861786 -2943563 -4877293 -6244444 -6041021 -5085403 -3640121 -999693 2555147 5506565
40760 5506565 7256163 8690757 9886004 9037051 4991162 -339030 -3533206 -3100904
40752 -3100904 -407207 2172148 2992818 1642636 -1032152 -3404988 -4323877 -3965962 -3344651
40743 -3344651 -3471819 -4996637 -7544722 -9130287 -7758011 -4308808 -2043747 -2126419 -1783085
40734a783085L012258L429822N77296j062830R57923K525356j89245l755033k765656
40725I46806R70213J002285l233463n245905j588689L056414L207659J5393j813087
40716b682374q56274P47282J451841J392011O94291n19766j223508o67288K19629
40707a444156K41097j17371K66308J065514J189333Q69329J269508K285288K353924
40698G978774N91522k034916l849236l975742k628742o10316J212624K262154
40690a053878K354227J624998N19676l16347m63128M6038J015858K065709K108667
40681G901820N000l346751m799850k464822J429104L073957J854170M15641L74220
40672D442489N01467n91669k375410l614294l677824k236660L51153K132666J344867
$$ plain form
40734 -1783085 1229173 4658995 5236291 4173461 5131384 7656740 7467495 3712462 946806
40725 946806 1917019 2919304 -314159 -5560064 -7148753 -4092339 -884680 -869287 -2682374
40716 -2682374 -3538648 -2791366 -1339525 52486 746777 227011 -996497 -1663785 -1444156
40707 -1444156 -1203059 -1320430 -1054122 11392 1200725 2070054 3339562 5624850 7978774
40698 7978774 8570296 6535380 2686144 -1289598 -3918340 -4528656 -3316032 -1053878
40690 -1053878 1300349 2925347 3445023 3128676 2665548 2711586 3727444 5793153 7901820
40681 7901820 7906820 4560069 -239781 -2704603 -1275499 1798458 3652628 4068269 4442489
40672 4442489 4943956 4352287 1976877 -1637417 -5315241 -7551901 -7200748 -5068082 -3723215
40663c723215o12838n85929J570025K679820J485341O93643K143672L358936J497049
40654H506504j954828l283646j417925J781844M260137M523737J751764k305507
40646A1862080l601185p60810K203673J137946k357210l768336k466239j417658
40638H32261j397600k77269K087708K901079J125385q22772j119895p47390n40255
40629B041252M93643K337918K612161O4497l064877m133057l441327k621419j675642
40620g386851J82670K180860K730440J802309P72526L34138R519m91031o14432
40611d79852K00665J597583K370691J581403j82465j174497p57698n06446j795403
40602H53981l127017j886604J521025L641179K512049J05376o21456O64715K047805
$$ plain form
40663 -3723215 -4336053 -4921982 -3351957 -672137 813204 1506847 3650519 7009455 8506504
40654 8506504 6551676 3268030 1850105 3631949 7892086 12415823 14167587 11862080
40646 11862080 8260895 7500085 9703758 10841704 8484494 4716158 2249919 832261
40638 832261 -565339 -842608 1245100 4146179 5271564 4448792 3328897 2581507 2041252
40629 2041252 2534895 4872813 7484974 7549471 4484594 351537 -3089790 -5711209 -7386851
40620 -7386851 -7204181 -5023321 -2292881 -490572 281954 616092 625611 134580 -479852
40611 -479852 -279187 1318396 3689087 5270490 5088025 3913528 3155830 2649384 853981
40602 853981 -2273036 -4159640 -2638615 1002564 3514613 3619989 2998533 3663248 5711053
40593E711053K007777P20112m15385p3169J363166J621266p07484l649999m062219
40584B515118k097473q53818j320467q13309K279996N125731M008363o71000n068401
40575C104740o190926l844394K00203L208389L072007P62307q7122K133921M224908
40566F584033K384286k060258m097370j862873J021123O91646j857316k591840
40558a788569j7226L066716L464236J644348N97435J191888P91662k434443n794503
40549G21544n223059j244483J427016M78185j124991o1365K613632L724310K557029
40540C867818P64561n64892j320438j124657M8381R46516O69161K67126R48385
40531D501961J834111J412389Q7313p66981j236559k191092l072310k561653q29887
$$ plain form
40593 5711053 7718830 8438942 8023557 7950388 9313554 10934820 10227336 6577337 2515118
40584 2515118 417645 -436173 -1756640 -2569949 -289953 4835778 8844141 8173141 3104740
40575 3104740 -3086186 -6930580 -6730377 -3521988 -449981 312326 225204 2359125 6584033
40566 6584033 8968319 6908061 2810691 947818 1968941 2660587 803271 -1788569
40558 -1788569 -1805795 1260921 4725157 6369505 6966940 8158828 8950490 6516047 721544
40549 721544 -4501515 -5745998 -4318982 -3840797 -4965788 -5027153 -2413521 1310789 3867818
40540 3867818 4632379 4067487 2747049 1622392 1670773 2617289 3286450 3553576 4501961
40531 4501961 6336072 7748461 7835774 7068793 5832234 3641142 568832 -1992821 -2822708
40522b822708Q27347J943675K737835K910785K290492J545385O10974j859871
40514H183914n366715o127370j964769L282966M169148J127755p90657J58210
40506B672482O65255j280620l236388k758349q05103Q39396J869650J820854j49627
40497c62450k374837j462131K220192L820480J033477k190972j865757P8825j98245
40488a301418k003353k216924j186870j484901k429725j065615J984690K740781
40480f963335L72997j175081O08644L018339K653531N83000K64180K148829L179921
40471D691025J314167j543389j876470R02343L294535J823460k199774l798911
40463B606986q36233K754651K135501j802414l898976k027185M83277K43587j486777
$$ plain form
40522 -2822708 -1995361 -51686 2686149 5596934 7887426 9432811 10043785 8183914
40514 8183914 2817199 -3310171 -5274940 -1991974 2177174 3304929 2514272 2672482
40506 2672482 3337737 2057117 -1179271 -3937620 -4742723 -3903327 -2033677 -212823 -362450
40497 -362450 -2737287 -4199418 -1979226 1841254 2874731 683759 -1181998 -1103173 -1301418
40488 -1301418 -3304771 -5521695 -6708565 -8193466 -10623191 -11688806 -9704116 -6963335
40480 -6963335 -6590338 -7765419 -7156775 -4138436 -1484905 -901905 -637725 1511104 4691025
40471 4691025 6005192 4461803 2585333 3487676 6782211 8605671 6405897 2606986
40463 2606986 1770753 4525404 6660905 4858491 959515 -1067670 -584393 -340806 -1827583
40454a827583j224210J517553L521712J962861k047567m277873j735209L676237
40446d34079O523587L670655k035665n192038m137141j858475j033025p78543
40438e274724Q89926L505599M557247K510786j551547m817984n032688k619403
40430g832788m21234l41889p27587J234660M894158O369183L867640K92377o76895
40421F657625R16989K202447J314315j092966k942324k252013J111589M320389
40413A0236051L983098O95844j036309R85106L083710R66536l725873n725279
40405I462884l596216p85849L57368J195072K592797K351526q62535m120325l714002
40396B880720l03749K145350J603932l19614j482852j642363j430971p71431O30181
$$ plain form
40454 -1827583 -3051793 -1534240 1987472 3950333 1902766 -2375107 -4110316 -434079
40446 -434079 6089508 9760163 7724498 2532460 -1604681 -3463156 -4496181 -5274724
40438 -5274724 -4384798 -879199 3678048 6188834 4637287 -180697 -5213385 -7832788
40430 -7832788 -8254022 -8595911 -9323498 -8088838 -3194680 3174503 7042143 7334520 6657625
40421 6657625 7574614 9777061 11091376 9998410 7056086 4804073 5915662 10236051
40413 10236051 14219149 14914993 13878684 14863790 17947500 18914036 15188163 9462884
40405 9462884 5866668 5080819 5438187 6633259 9226056 11577582 10715047 6594722 2880720
40396 2880720 2576971 4722321 6326253 6006639 4523787 2881424 1450453 679022 1309203
40387A309203K032638K012682K95918j281977m56453K533194M624093L542914
40379A4612212Q84617j16633P29300O82243r75027j322529J318589L930355L002383
40370B2745510m4463j158153m2383j93656k724110m304872k439478P26292J831651
40361A4396338Q87178K20146Q12736J925094K875925L088492J682964q24993j656077
40352B3407803R60205M555038N108083K432739L7870k94454o25842k699065m621846
40343B8260531l659110m64975J674127J038673q65028j672385r20688j66069q12899
40334B2412177k169908k223817p11935k35181k684787n550522m634836m24174
40326C777017J772617o76411l696978k582162J105015K580299J521424J784124
$$ plain form
40387 1309203 3341841 5354523 5650441 4368464 3912011 6445205 11069298 14612212
40379 14612212 15496829 15380196 16109496 16791739 15816712 14494183 15812772 19743127 22745510
40370 22745510 22701047 21542894 21500511 21306855 18582745 14277873 11838395 12564687 14396338
40361 14396338 15283516 15503662 16316398 18241492 21117417 24205909 25888873 25063880 23407803
40352 23407803 24368008 28923046 34031129 36463868 36501738 36207284 35581442 32882377 28260531
40343 28260531 24601421 24136446 25810573 26849246 25984218 24311833 23391145 23225076 22412177
40334 22412177 20242269 18018452 17306517 17071336 14386549 8836027 4201191 3777017
40326 3777017 5549634 4873223 1176245 -1405917 -300902 2279397 3800821 5584945
40318E584945M185474M878932J987325q88383j97705K151277J957835j201600
40310A8458100m230669n212229m791875l785588k196215k93826J456637L126352
40302B530687M208301K818422j526123n215659l853302J685319N639021M482334
40294A0769000P11742j527460j537404r05887L3599J766666L219958K694605N27360
40285A5752179j490350k800005l971388m432654k868251k3447J270931m39321
40277I97694l494074n305931m607727j324765L540193P191454O700135K851032
40269F548011J21043R44662K201951P1754l583332l560439O51948L643925J906909
40260H946432j235347j025043J607012J965956j109419l922346l629249j509192
$$ plain form
40318 5584945 9770419 14649351 16636676 15748293 15550588 17701865 19659700 18458100
40310 18458100 14227431 9015202 4223327 437739 -1758476 -2052302 -595665 2530687
40302 2530687 6738988 9557410 8031287 2815628 -1037674 647645 6286666 10769000
40294 10769000 11480742 9953282 8415878 7509991 7543590 9310256 12530214 15224819 15752179
40285 15752179 14261829 11461824 7490436 3057782 189531 166084 1437015 997694
40277 997694 -2496380 -7802311 -12410038 -13734803 -10194610 -3003156 3696979 6548011
40269 6548011 6669054 7613716 9815667 9887421 6304089 2743650 3395598 7039523 8946432
40260 8946432 7711085 6686042 8293054 10259010 9149591 5227245 1597996 88804
40252H8804K57975J700762L229359L465357J368753j299318k267827k213196l109917
40243A220752m114106k576377R16023K384100M99480r58882R92864L527531K446073
40234D337458p89915j050784K341440M376806J920780j960706l093490j827866
40226D253723q89078n81584N04240J855500J562816k86552j614747j393269l93683
40217C017366N72666R99333J4814k226285l237172j035358K281170K839511N46187
40208C772232j023779k54024P87174P38616Q79169J375524l4986l318649m294189
40199a372912p62643L217454L160076R73282J097128K490819N59574l973597m744822
40190F44359N65517N948140N018791r61782n824191o004190k544175J733026M094879
$$ plain form
40252 88804 346779 2047541 5276900 8742257 10111010 8811692 6543865 4330669 1220752
40243 1220752 -2893354 -5469731 -4553708 -2169608 -1670128 -2629010 -1636146 1891385 4337458
40234 4337458 3547543 2496759 4838199 9215005 11135785 9175079 6081589 4253723
40226 4253723 3364645 2783061 3287301 5142801 6705617 6419065 4804318 3411049 3017366
40217 3017366 3590032 4589365 4604179 2377894 -859278 -1894636 386534 3226045 3772232
40208 3772232 2748453 2494429 3281603 4020219 4899388 6274912 6239926 2921277 -1372912
40199 -1372912 -2135555 1081899 4241975 5215257 6312385 8803204 9362778 5389181 644359
40190 644359 1209876 7158016 12176807 11215025 5390834 -613356 -3157531 -1424505 2670374
40181B670374K850953p71252k926153j501718J092602J423599k53940j130408
40173A454057l00797O94985J043143J518904K179611J663014o38499l356664m570724
40164c12970l402382l05555L038746M373466K794792k2674j636224j549018r75474
40155B002707n64402k2614M16261O9503o55242n71494K98948O65142j9622j060391
40145E58796j957369k556854j958159M34561K668533J791782j620231l333207
40137e972148j216889J647814J664802l7582R1746K343567L735155K867052J509547
40128F633064J265776J446007Q55959m50787j860699k963431l174069k101969
40120c50149n83612J17602K12126Q14235J505574O26485j625798k732017j366223
$$ plain form
40181 2670374 5521327 4750075 1823922 322204 1414806 2838405 2584465 1454057
40173 1454057 1153260 1848245 2891388 4410292 6589903 8252917 7614418 4257754 -312970
40164 -312970 -3715352 -4020907 -982161 3391305 6186097 6163423 4527199 2978181 2002707
40155 2002707 1438305 1415691 1831952 1901455 1246213 674719 973667 1638809 1619187 558796
40145 558796 -1398573 -3955427 -5913586 -5479025 -2810492 -1018710 -2638941 -5972148
40137 -5972148 -7189037 -5541223 -3876421 -3914003 -3822257 -1478690 2256465 5123517 6633064
40128 6633064 7898840 9344847 10200806 9750019 7889320 4925889 1751820 -350149
40120 -350149 -933761 -816159 -604033 210202 1715776 2342261 716463 -2015554 -3381777
40111c381777Q16176K000687K556419L061234K328440l15475k610853j977694
40103B477157N07270J428584l15682k772053m332691m988597m238046r71228L589153
40094i616133N661253L364018n12859j948483m97623J010531M74262j508965l035918
40085f609917k730568m87047K413337M084547L758482K469285J532617J075023
40077E505759P37444P75220J239294R33026j205068m028548n024835l224639o1195
40068d353542K549940L701132L197220J383579l72663n14564O78225J070252n24897
40059F814682k582781k917828j578895l30761K16204J181648K836255L270007
40051F908531J054985j862132k104723K83922J359520j138973m004350k891055
$$ plain form
40111 -3381777 -2565601 -564914 1991505 5052739 7381179 7065704 4454851 2477157
40103 2477157 2984427 4413011 4097329 1325276 -3007415 -7996012 -12234058 -13205286 -9616133
40094 -9616133 -3954880 -590862 -1103721 -3052204 -3549827 -2539296 -2065034 -3573999 -6609917
40085 -6609917 -9340485 -9827532 -7414195 -3329648 428834 2898119 4430736 5505759
40077 5505759 6243203 7018423 8257717 9190743 7985675 3957127 -1067708 -4292347 -4353542
40068 -4353542 -1803602 1897530 5094750 6478329 6105666 5591102 6269327 7339579 6814682
40059 6814682 4231901 1314073 -264822 -595583 -379379 802269 3638524 6908531
40051 6908531 7963516 6101384 3996661 4280583 5640103 4501130 496780 -2394275
40043b394275J088645K706023L38120j780849l41309K066730J618817m36536k49495
40034B615871J891825K007200r82353l677250l652175k266812r20084J423637
40026c560141M889256O364424L480892j305233l518370k210009k23431J00613
40018D018001q45049j534453j221874k73899L07255j34211r47802r21003j90380
40009a743415r7566r06167j502988j752019k725252l839242k753235M37108K226481
40000a2656295J168742Q14273L878734O832266M885602j07446k136212j00008
39992B579656J318047l78686k394180k364664j764523j846573j089262R30285
39984e009900J466726p70087k667823j404496J187332K033443J520343J420488
$$ plain form
40043 -2394275 -1305630 1400393 1738513 -42336 -383645 1683085 3301902 2865366 2615871
40034 2615871 4507696 6514896 5532543 1855293 -1796882 -4063694 -4983778 -3560141
40026 -3560141 1329115 7693539 11174431 9869198 6350828 4140819 3917388 4018001
40018 4018001 3172952 1638499 416625 142726 449981 315770 -632032 -1553035 -1743415
40009 -1743415 -1840981 -2747148 -4250136 -6002155 -8727407 -12566649 -15319884 -14882776 -12656295
40000 -12656295 -11487553 -10673280 -6794546 37720 4923322 4815876 2679664 2579656
39992 2579656 3897703 3519017 1124837 -1239827 -3004350 -4850923 -5940185 -5009900
39984 -5009900 -3543174 -4313261 -6981084 -8385580 -7198248 -5164805 -3644462 -2223974
39976b223974R73990j058073k673306j208514J760839K276598L1957j405216k22683
39967c748382J473818J485567L07525n70310n32787N92608K576057L922057L025612
39958H531765N20333j430572k168437k703582l018492j954056r1110K39559j217212
39949c291804j626243O81776L476821L983154K743007J889871J338458n70522
39941H624518l424075m383828j746614K794281N792294N048864J144699l052432
39933A0797707m602540l140714j136757q20729j490867j050668M50285P69701
39925b24582q57913k095610p73685J704768K092719j70507k188977j608611N12722
39916c609676J789841J857015J992597K424945K073733P02813o77396j665518
$$ plain form
39976 -2223974 -1249984 -2308057 -4981363 -6189877 -4429038 -2152440 -2120483 -3525699 -3748382
39967 -3748382 -2274564 -788997 -481472 -1051782 -1584569 -991961 1584096 5506153 8531765
39958 8531765 9052098 7621526 5453089 2749507 -268985 -2223041 -2314151 -2074592 -3291804
39949 -3291804 -4918047 -4236271 -759450 3223704 5966711 7856582 9195040 8624518
39941 8624518 5200443 816615 -929999 1864282 7656576 12705440 13850139 10797707
39933 10797707 6195167 3054453 1917696 1096967 -393900 -1444568 -994283 -224582
39925 -224582 -1082495 -3178105 -3951790 -2247022 -154303 -324810 -2513787 -4122398 -3609676
39916 -3609676 -1819835 37180 2029777 4454722 6528455 7231268 6553872 4888354
39908D888354k737326l382296k274734n1214O43283o98481r30269J856514M520590
39899A834421L296649J7572m74889J768935J658595k383221m916700j355586M648298
39890D094074N826497J183530l095577k245718J476367K929515J027451p24202
39882A0471937L01014K136040R91352l264611o328630m813445o13324J881605
39874G61938J609252J056108J188891r7205l416226n380876l114491J291111L670426
39865b431072L254227K225702J308006o39313l145605l847610k197407m85644
39857e958716k15021O1744K002488M563441N402555L967495J763267K15858o22728
39848A1180383j516388k834396l809107l023176j43039K977232L793192J798593
$$ plain form
39908 4888354 2151028 -1231268 -3506002 -3557216 -2913933 -3612414 -4542683 -2686169 1834421
39899 1834421 5131070 5148642 4673753 6442688 8101283 5718062 801362 -554224 4094074
39890 4094074 9920571 11104101 8008524 5762806 7239173 10168688 11196139 10471937
39882 10471937 10772951 12908991 13900343 10635732 4307102 -506343 -1119667 761938
39874 761938 2371190 3427298 4616189 4518984 1102758 -4278118 -7392609 -6101498 -2431072
39865 -2431072 823155 3048857 4356863 3717550 571945 -3275665 -5473072 -5958716
39857 -5958716 -6173737 -6111993 -4109505 453936 5856491 9823986 11587253 11803111 11180383
39848 11180383 9663995 6829599 3020492 -2684 -145723 2831509 6624701 8423294
39840H423294r83328k307974j772655n71011l7434o10138j607006j939315j426156
39831b831723j027758j227039r60342P31444K703456K916140J288454k78751n51646
39822G62235N210O76084J127111O46217j155162k692232j766282R12226K045208
39813E60615N15272q27752K99778J968469J366695l94586l9614K425565L436038
39804I310480J070258k358072l583844k091616K27985J353515L08012k368317
39796A868401m470420l806974r25131J044020K25318j481235j004444J660655
39788f889810L467110K348061l84674k093128j917190q60154L00926J634959K607543
39779a786357J677444j565757m784368m899599j566647K598195N170557N822124
$$ plain form
39840 8423294 7439966 5131992 3359337 2788326 2750892 2140754 533748 -1405567 -2831723
39831 -2831723 -3859481 -5086520 -6046862 -5315418 -2611962 304178 1592632 1313881 762235
39822 762235 767445 1443529 2570640 3216857 2061695 -630537 -2396819 -1484593 560615
39813 560615 1075887 248135 547913 2516382 3883077 3488491 3448877 5874442 9310480
39804 9310480 10380738 8022666 4438822 2347206 2575191 3928706 4236718 1868401
39796 1868401 -2602019 -6408993 -7334124 -6290104 -6064786 -7546021 -8550465 -6889810
39788 -6889810 -3422700 -1074639 -1459313 -3552441 -5469631 -6329785 -6028859 -4393900 -1786357
39779 -1786357 -108913 -1674670 -6459038 -11358637 -12925284 -10327089 -5156532 665592
39771F65592M994605K775679K10455k40980K285064M687130L066399j951543n497961
39762A0994440m448882q44817J525898J694535J037875R2729j693635l695221
39754D662922l975746j796640J234188K864061K032198q15913l784063l967098
39746c546091J27182N846605P966889M362758j283959l888209k698061p93647
39738F093467j99275k27791k49264j044903k683957l560816k742041j361834n80239
39729f556653J5812Q58282J222743R94793J564972L196549L557297J144165j699397
39720D298563j904281k36550L31374m81167m85453O66289J145634O43623O07946
39711D585978P68300n77176k451050j728534J270451K310661K0233j599025N5871
$$ plain form
39771 665592 5660197 8435876 8646331 8405351 10690415 15377545 18443944 16492401 10994440
39762 10994440 6545558 5700741 7226639 8921174 9959049 10051778 8358143 4662922
39754 4662922 687176 -1109464 124724 2988785 5020983 4205070 421007 -3546091
39746 -3546091 -3418909 2427696 10394585 14757343 13473384 9585175 6887114 6093467
39738 6093467 5894192 5666401 5417137 4372234 1688277 -1872539 -4614580 -5976414 -6556653
39729 -6556653 -6540841 -5682559 -4459816 -3465023 -1900051 1296498 4853795 5997960 4298563
39720 4298563 2394282 2157732 2489106 2007939 1522486 2188775 3334409 3978032 4585978
39711 4585978 5354278 4777102 2326052 597518 1867969 4178630 4198863 2599838 2655709
39702B655709J703531J19653j862344j97295K920512K210150k010028m143012
39694A396876j761789J614557K503839J496477M68188j65788k78670N35645J397765
39685G207100R03517j10893L25510J243904m74820m525411o443330l958321l08746
39676f141490P98564N1253j09936J57436n20887j282213k15657K193575L466170
39667a603185K314121l92561l026239m153886l112311q59276P99069J534105K409633
39658f090530K986656J221479k454960m099446j679024J317828Q49473j459527
39650i408051r52847K623346M544344J877560k748595m781979k566053J989299
39642i422976N438564N155103J520980j944151k095913L34944K137506J820412
$$ plain form
39702 2655709 4359240 4478893 2616549 2419254 5339766 7549916 5539888 1396876
39694 1396876 -364913 1249644 3753483 5249960 5718148 5552360 5273690 5809335 7207100
39685 7207100 8110617 7999724 8325234 9569138 9094318 4568907 -1874423 -5832744 -6141490
39676 -6141490 -5342926 -5291673 -5401609 -5244173 -5765060 -7047273 -7262930 -5069355 -1603185
39667 -1603185 710936 318375 -2707864 -6861750 -9974061 -10833337 -10034268 -8500163 -6090530
39658 -6090530 -3103874 -1882395 -4337355 -8436801 -10115825 -8797997 -7948524 -9408051
39650 -9408051 -10360898 -7737552 -3193208 -1315648 -4064243 -8846222 -11412275 -9422976
39642 -9422976 -3984412 1170691 2691671 747520 -1348393 -1013449 1124057 2944469
39634B944469N33036m76863r38246m58302J079052J971526J09500l604822n525844
39625d366494l639464K07083K983338L546660K487700P53133p26345j366915j493671
39616a614975j580056j027962Q32756K777832K710391P19851r77200j375755j692316
39607a227434k591920k887804j941626r87357p65026l1994J935051L303424K164099
39598c030587l37841j416690l54883J039479J173003K56521n99944n71876N10376
39589c332442J985799K592549J573000m55497k036264k077038n15485J608064
39581f57314K669406J838977J24925p03097k60148K83838J09863l56561n29968
39572B519921m04171j04604O0432p87653k868218m279741k817723N98405K625843
$$ plain form
39634 2944469 3477505 3000642 2062396 1604094 2683146 4654672 4764172 1159350 -4366494
39625 -4366494 -8005958 -7798875 -4815537 -1268877 1218823 1971956 1245611 -121304 -1614975
39616 -1614975 -3195031 -4222993 -3390237 -612405 2097986 2817837 1840637 464882 -1227434
39607 -1227434 -3819354 -6707158 -8648784 -9636141 -10401167 -10433161 -8498110 -5194686 -3030587
39598 -3030587 -3368428 -4785118 -5140001 -4100522 -2927519 -2670998 -3270942 -3842818 -3332442
39589 -3332442 -1346643 1245906 2818906 2363409 327145 -1749893 -2265378 -657314
39581 -657314 2012092 3851069 3975994 3272897 3012749 3296587 3406450 3049889 2519921
39572 2519921 2115750 2011146 2071578 1283925 -1584293 -5864034 -8681757 -8083352 -5457509
39563e457509K071882J222091J774360K230834Q61649j261319k114556j499794
39555b172362j34591J878744L721934L335402N89886j336074m81080M26604j558911
39546D269552m039268k730316J083068J966580r91720k620413q1803K582616J176918
39537F15214j887631j663392J479117K747522M40785j942650j466365Q8403n71305
39528b160302l244246m554386k439941J435131L908118L816881K553281J624192
39520I38728Q21969o83969k357540k648017j192864N46887J152767P30390P7850
39511b613799n87339j216790j015589Q12616L437443M552140K666168j148072
39503D886778m186782m590466k621976J48998K203024K629876J356038n28944
$$ plain form
39563 -5457509 -3385627 -2163536 -389176 1841658 2703307 1441988 -672568 -2172362
39555 -2172362 -2306953 -428209 3293725 6629127 7219013 5882939 5401859 5828463 4269552
39546 4269552 230284 -2500032 -1416964 549616 -442104 -3062517 -3144320 -561704 615214
39537 615214 -1272417 -2935809 -1456692 1290830 1731615 -211035 -1677400 -1588997 -2160302
39528 -2160302 -5404548 -9958934 -12398875 -10963744 -7055626 -3238745 -685464 938728
39520 938728 1760697 1076728 -1280812 -3928829 -5121693 -4574806 -3422039 -2691649 -2613799
39511 -2613799 -3201138 -4417928 -5433517 -4620901 -1183458 3368682 6034850 4886778
39503 4886778 699996 -3890470 -6512446 -6363448 -4160424 -1530548 -174510 -703454
39495g03454j395538q13465L7109N15975J797487M254289M981752J173391m378330
39486E469216n254006j04073M670598L425537j248387l198878j708993q98332
39478A152682k023558k095194q1755R70506o81464k544452k198286o87323L88472
39469g800372J550602K878243K237799r42162l043111q61011L283150M549999
39461A853137K170434m55928j165996r56587r35899p86500m97237p07741r02920
39452b385237J45656J706733J487340n56192j413792O96473L528367L996918K309610
39443I515876Q16238P0233j382729l619834m379284k389988K13964M05310j730803
39434b481017l230150k239351L5811J731428K729642L435148K928922N72676j566061
$$ plain form
39495 -703454 -2098992 -2912457 -2875348 -2359373 -561886 3692403 8674155 9847546 5469216
39486 5469216 215210 111137 4781735 8207272 6958885 3760007 2051014 1152682
39478 1152682 -870876 -2966070 -3047825 -2077319 -2758783 -5303235 -7501521 -8188844 -7800372
39469 -7800372 -6249770 -3371527 -1133728 -2075890 -5119001 -5980012 -2696862 1853137
39461 1853137 4023571 3567643 2401647 1445060 509161 -277339 -774576 -1482317 -2385237
39452 -2385237 -2239581 -532848 954492 398300 -1015492 -319019 3209348 7206266 9515876
39443 9515876 10332114 10402347 9019618 5399784 1020500 -1369488 -1155524 -750214 -2481017
39434 -2481017 -5711167 -7950518 -7914707 -6183279 -3453637 -18489 2910433 3483109 1917048
39425A917048p02922K296599L398038R47298k028089k385877j046578n20413o03929
39416A271175N56635K557294L039051J359347q59771k650690m430689n694688
39408d852336m771908j657428J271351K382885K630977L208002L334790J890182
39400C436515k94479j481946j397689j006573o60195j2941O38049M55749m72783
39391g96293r91985m44900M96524Q57601N41825J45659R5353L86805Q87933J395771
39381B574293J394398K60494j901644l847217m125768k486439J1725K182590L390581
39372b546987L195881J485132o64500j513448q70835n55332j542399k074214m52452
39363e539154J540315P70898k083696k721824O50931M372324M250140J061128
$$ plain form
39425 1917048 1214126 3510725 6908763 7856061 5827972 3442095 2395517 1875104 1271175
39416 1271175 1827810 4385104 7424155 8783502 7923731 5273041 842352 -4852336
39408 -4852336 -9624244 -11281672 -10010321 -7627436 -4996459 -1788457 1546333 3436515
39400 3436515 3142036 1660090 262401 -744172 -1404367 -1417308 -779259 -323510 -796293
39391 -796293 -1788278 -2233178 -1736654 -879053 -337228 -191569 -96216 290589 1178522 2574293
39381 2574293 3968691 4229185 2327541 -1519676 -5645444 -8131883 -8120158 -5937568 -2546987
39372 -2546987 648894 2134026 1469526 -43922 -914757 -1470089 -3012488 -5086702 -5539154
39363 -5539154 -3998839 -3227941 -5311637 -8033461 -7382530 -3010206 1239934 2301062
$$ [...]
##END NTUPLES=NMR SPECTRUM
##END=
