##TITLE=31Pdec_DE-165_oil_TFA
 DMSO-d6_CCl4, 64 sc
 15.7.2026
##JCAMPDX= 6.0         $$ Bruker NMR JCAMP-DX V2.0
##DATA TYPE= NMR SPECTRUM
##DATA CLASS= NTUPLES
##ORIGIN= UXNMR, Bruker Analytische Messtechnik GmbH
##OWNER= root
$$ XWIN-NMR		Version 3.5
$$ Wed Jul 15 13:12:11 2026 Russian Standard Time (UT+4h)  she@DPX200
##.OBSERVE FREQUENCY= 81.013821
##.OBSERVE NUCLEUS= ^31P
##.ACQUISITION MODE= SIMULTANEOUS
##.ACQUISITION SCHEME= undefined
##.AVERAGES= 64
##.DIGITISER RES= 17
##SPECTROMETER/DATA SYSTEM= spect
##.PULSE SEQUENCE= zgpg30
##.SOLVENT NAME= DMSO
##.SHIFT REFERENCE= (INTERNAL, DMSO, 0, 197.392)
##AUDIT TRAIL= $$ (NUMBER, WHEN, WHO, WHERE, WHAT)
$$ ##TITLE= Audit trail, XWIN-NMR		Version 3.5
$$ ##JCAMPDX= 5.01
$$ ##ORIGIN= Bruker BioSpin GmbH
$$ ##OWNER= she
$$ F:/spectra/data/she/nmr/P31/2/pdata/1/auditp.txt
$$ ##AUDIT TRAIL=  $$ (NUMBER, WHEN, WHO, WHERE, WHAT)
(   1,<2026-07-15 13:11:03.95 +0400>,<she>,<DPX200>,
      <created by zg, POWCHK disabled, PULCHK disabled
       configuration hash MD5:
       00 E9 B6 7A A2 85 ED C7 34 08 36 98 17 FE 4E 26
       data hash MD5: 32K
       6C D3 BE 64 74 47 2B 6E E9 05 0D E3 4B 96 4D 46>)
(   2,<2026-07-15 13:11:07.12 +0400>,<she>,<DPX200>,
      <Start of raw data processing
       efp BC_mod = 2 LB = 1.5 FT_mod = 6 PKNL = 1 PHC0 = 1932.533 PHC1 = 160.0991 SI = 64K 
       data hash MD5: 64K
       64 83 AF 82 95 5F E9 EB 39 0D 03 54 03 AD 26 E2>)
(   3,<2026-07-15 13:11:25.39 +0400>,<she>,<DPX200>,
      <pk PHC0 = -11.7257 PHC1 = 0 
       data hash MD5: 64K
       F1 C8 85 71 A2 96 4A D9 4E FD C6 C5 15 18 34 42>)
(   4,<2026-07-15 13:11:35.81 +0400>,<she>,<DPX200>,
      <abs ABSG = 5 
       data hash MD5: 64K
       69 93 2B C5 2B 5C 25 D2 C7 B3 03 0C AE A1 50 95>)
$$ ##END=
$$ 
$$ hash MD5
$$ 34 0B 69 34 1E 40 39 C6 9F 08 98 8B 96 83 1A 04
##$RELAX= 
##$RELAX= 
##$RELAX= 
##$RELAX= 
##$RELAX= 
##$RELAX= 
##$RELAX= 
##$RELAX= 
$$ Bruker specific parameters
$$ --------------------------
##$DU= <F:/spectra>
##$EXPNO= 2
##$NAME= <P31>
##$PROCNO= 1
##$TYPE= <nmr>
##$USER= <she>
##$AMP= (0..31)
100 100 100 100 100 100 100 100 100 100 100 100 100 100 100 100 100 100 
100 100 100 100 100 100 100 100 100 100 100 100 100 100 
##$AQSEQ= 0
##$AQ_mod= 1
##$AUNM= <au_zg>
##$AUTOPOS= <>
##$BF1= 81.014009
##$BF2= 200.13
##$BF3= 200.13
##$BF4= 200.13
##$BF5= 200.13
##$BF6= 200.13
##$BF7= 200.13
##$BF8= 200.13
##$BYTORDA= 1
##$CFDGTYP= 0
##$CFRGTYP= 5
##$CHEMSTR= <none>
##$CNST= (0..31)
1 1 145 1 1 1 1 1 1 1 1 1 1 1 1 1 1 1 1 1 1 1 1 1 1 1 1 1 1 1 1 1 
##$CPDPRG= <waltz16>
##$CPDPRG1= <>
##$CPDPRG2= <waltz16>
##$CPDPRG3= <>
##$CPDPRG4= <mlev>
##$CPDPRG5= <mlev>
##$CPDPRG6= <mlev>
##$CPDPRG7= <mlev>
##$CPDPRG8= <mlev>
##$CPDPRGB= <>
##$CPDPRGT= <>
##$D= (0..31)
0 1 0 0 0 0 0 0 0 0.06 0 0.03 2e-05 3e-06 0 0 0.0002 0 0 0 0 0 0 0 0 0 
0 0 0 0 0 0 
##$DATE= 1784106663
##$DBL= (0..7)
120 120 120 11 120 120 24 19 
##$DBP= (0..7)
150 150 150 150 150 150 150 150 
##$DBP07= 0
##$DBPNAM0= <>
##$DBPNAM1= <>
$$ [...]
##$SUBNAM3= <"">
##$SUBNAM4= <"">
##$SUBNAM5= <"">
##$SUBNAM6= <"">
##$SUBNAM7= <"">
##$SUBNAM8= <"">
##$SUBNAM9= <"">
##$SW= 400.765351723535
##$SWIBOX= (0..15)
0 1 3 0 0 0 0 0 0 0 0 0 0 0 0 0 
##$SW_h= 32467.5324675325
##$TD= 32768
##$TD0= 1
##$TE= 0
##$TE2= 300
##$TE3= 300
##$TEG= 300
##$TL= (0..7)
0 120 53 12 22 120 120 120 
##$TP= (0..7)
150 150 150 150 150 150 150 150 
##$TP07= 0
##$TPNAME0= <>
##$TPNAME1= <>
##$TPNAME2= <>
##$TPNAME3= <>
##$TPNAME4= <>
##$TPNAME5= <>
##$TPNAME6= <>
##$TPNAME7= <>
##$TPOAL= (0..7)
0.5 0.5 0.5 0.5 0.5 0.5 0.5 0.5 
##$TPOFFS= (0..7)
0 0 0 0 0 0 0 0 
##$TUNHIN= 0
##$TUNHOUT= 0
##$TUNXOUT= 0
##$USERA1= <user>
##$USERA2= <user>
##$USERA3= <user>
##$USERA4= <user>
##$USERA5= <user>
##$V9= 5
##$VALIST= <valist>
##$VCLIST= <CCCCCCCCCCCCCCC>
##$VD= 0
##$VDLIST= <DDDDDDDDDDDDDDD>
##$VPLIST= <PPPPPPPPPPPPPPP>
##$VTLIST= <TTTTTTTTTTTTTTT>
##$WBST= 1024
##$WBSW= 4
##$XGAIN= (0..3)
0 0 0 0 
##$XL= 0
##$YL= 0
##$YMAX_a= 7642
##$YMIN_a= -8880
##$ZGOPTNS= <>
##$ZL1= 120
##$ZL2= 120
##$ZL3= 120
##$ZL4= 120
##$ABSF1= 197.3918
##$ABSF2= -203.3724
##$ABSG= 5
##$ABSL= 3
##$ALPHA= 0
##$AQORDER= 0
##$ASSFAC= 0
##$ASSFACI= 0
##$ASSFACX= 0
##$ASSWID= 0
##$AUNMP= <proc_1d>
##$AZFE= 0.1
##$AZFW= 0.5
##$BCFW= 0
##$BC_mod= 2
##$BYTORDP= 0
##$COROFFS= 0
##$CY= -3
##$DATMOD= 1
##$DC= 0
##$DFILT= <>
##$DTYPP= 0
##$F1P= 0
##$F2P= 0
##$FCOR= 1
##$FTSIZE= 65536
##$FT_mod= 6
##$GAMMA= 0
##$GB= 0
##$INTBC= 1
##$INTSCL= 9.790993e-09
##$ISEN= 30
##$LB= 1.5
##$LEV0= 0
##$LPBIN= 0
##$MAXI= 10000
##$MC2= 0
##$MEAN= 0
##$ME_mod= 0
##$MI= 50
##$NCOEF= 0
##$NC_proc= -8
##$NLEV= 6
##$NOISF1= 182.463
##$NOISF2= 159.3651
##$NSP= 0
##$NTH_PI= 0
##$NZP= 0
##$OFFSET= 197.3918
##$PC= 4
##$PHC0= 1920.807
##$PHC1= 160.0991
##$PH_mod= 1
##$PKNL= yes
##$PPARMOD= 0
##$PSCAL= 0
##$PSIGN= 0
##$REVERSE= no
##$SF= 81.014063255964
##$SI= 65536
##$SIGF1= 159.3651
##$SIGF2= -187.1042
##$SINO= 113.3802
##$SIOLD= 16384
##$SREGLST= <1H.CDCl3>
##$SSB= 0
##$STSI= 65536
##$STSR= 0
##$SW_p= 32467.5324675325
##$SYMM= 0
##$S_DEV= 0
##$TDeff= 32768
##$TDoff= 0
##$TI= <>
##$TILT= no
##$TM1= 0
##$TM2= 0
##$TOPLEV= 0
##$USERP1= <user>
##$USERP2= <user>
##$USERP3= <user>
##$USERP4= <user>
##$USERP5= <user>
##$WDW= 1
##$XDIM= 65536
##$YMAX_p= 105573228
##$YMIN_p= -306636608
$$ End of Bruker specific parameters
$$ ---------------------------------
##NTUPLES= NMR SPECTRUM
##VAR_NAME=  FREQUENCY,     SPECTRUM/REAL,   SPECTRUM/IMAG
##SYMBOL=    X,             R,               I
##VAR_TYPE=  INDEPENDENT,   DEPENDENT,       DEPENDENT
##VAR_FORM=  AFFN,          ASDF,            ASDF
##VAR_DIM=   65536,         65536,           65536
##UNITS=     HZ,            ARBITRARY UNITS, ARBITRARY UNITS
##FACTOR=    0.49542278885378, 1,            1
##FIRST=     15991.5117654749, 0,            0
##LAST=      -16476.0207020576, 0,           0
##MIN=       -16476.0207020576, -306636608,  0
##MAX=       15991.5117654749, 105573228,    0
$$ Real data points
##PAGE= N=1
##DATA TABLE= (X++(R..R)), XYDATA
$$ [...]
9613 554888 -1832421 -2465711 -2873461 -3595487 -3612240 -2670417 -1976051 -2162966 -2421699 -2337576
9603 -2337576 -2974495 -5080981 -7378008 -7802682 -5812217 -2547714 709784 3300993 4761164
9594 4761164 4554927 2338229 -1779087 -6955867 -11476456 -13616188 -13127540 -11186541 -8459527
9585 -8459527 -4367048 803722 4392005 3859729 255146 -2783816 -3401546 -2974075 -3088236
9576 -3088236 -3284665 -2549621 -1032209 815083 2961565 4381775 2822190 -2226105 -7966826
9567 -7966826 -11756845 -14492553 -17913327 -20033699 -17060760 -9680120 -3430132 -1663445
9559 -1663445 -1642939 390200 3387300 3753669 1360462 -335260 471934 1991351 2494148
9550 2494148 2893542 4391542 5890247 5749432 4813346 5476947 8024440 9860293 8857533
9541 8857533 5985734 3739300 3091724 3266748 3749551 4738153 5574697 4607187 1515180
9532 1515180 -1623287 -2833215 -2778992 -3350413 -4498995 -4288911 -1934957 890867 2040306
9523 2040306 944710 -1341706 -2819132 -1283656 3878083 10079775 13150916 11288855
9515 11288855 6431332 1530485 -2040143 -4084158 -4684119 -4865098 -6414585 -9487804
9507 -9487804 -11655876 -10847757 -8102441 -5843722 -4605245 -3420064 -2540419 -3347851 -5638034
9498 -5638034 -7160259 -6324183 -3787542 -974389 1489402 3337777 4032523 3364106 1800281
9489 1800281 -292293 -2863124 -5121108 -5391276 -3058954 123 1058680 -589451
9481 -589451 -3302365 -5461854 -6977328 -8067880 -7847163 -5475525 -2233482 -759154 -1819809
9472 -1819809 -3308153 -3265068 -2418709 -2285254 -2095176 94094 3754372 5911548 5139934
9463 5139934 3298773 2623134 3111677 3654125 3829161 3563157 2809735 2611181 4568363
9454 4568363 8019827 9719860 7805618 4121252 974707 -2160327 -6419193 -10101310
9446 -10101310 -10404203 -7344912 -3287451 185857 2236641 1232398 -3044786 -6487350
9438 -6487350 -4076225 3474508 9988505 11285379 9115998 7038561 5859234 4599368
9430 4599368 3086604 1802181 1150958 2038952 5115547 8536942 8870246 5389319 1190990
9421 1190990 -1048289 -1880763 -2376095 -1542536 1377844 4494005 5723676 5853782 6634633
9412 6634633 7354435 5955447 2524601 -796037 -2625558 -2818905 -865641 3685732 9252727
9403 9252727 12739642 12453247 9404282 5836591 3417055 2454415 1921084 654670 -907665
9394 -907665 -1249695 -716765 -2156414 -6961605 -11979323 -12627738 -8306233 -2591735 1350881
9385 1350881 3370585 4650269 5682739 6305292 6210917 5117677 3456156 2649094 3459156
9376 3459156 4352225 2946786 -909735 -4679541 -5731244 -3562265 161372 2808939
9368 2808939 2534240 -100307 -2635992 -3583866 -3930913 -5004469 -6233760 -6387633 -5611370
9359 -5611370 -4523835 -2716940 -152256 1484324 1324743 1734230 5056491 9081600 9505408
9350 9505408 6471520 4579954 5952156 7388248 5781576 2654271 1193191 1736911
9342 1736911 2653378 3486368 4721835 5908624 6270066 6292999 7009666 8384848 9479524
9333 9479524 9245613 6424544 241296 -7613175 -13201014 -13981402 -11154579 -7392464 -3775115
9324 -3775115 -271977 2416655 3454265 3368489 3280431 3274686 2821078 2122989 1937724 2713351
9314 2713351 4558239 6923349 7736432 4701307 -1281054 -5772509 -5507674 -1924165 1528118
9305 1528118 3718481 5446780 6623488 6580816 5973434 5666396 4733921 2290579 276708
9296 276708 1207883 3742942 3993308 1285070 -855689 13841 2419529 4427148 6482826
9287 6482826 8932784 9648982 6762318 1980496 -1285964 -2042726 -1937093 -2274951 -2818738
9278 -2818738 -3103968 -3186013 -3119352 -2951389 -3221437 -4527796 -6577760 -8217902 -8293751 -6346878
9268 -6346878 -3135332 -739820 -1143472 -4018665 -6751448 -7294191 -6051242 -4310389 -2220028
9259 -2220028 303537 1835957 670455 -2419581 -4429617 -3487878 -764718 1276239
9251 1276239 1483703 498643 -458436 -673171 -241805 250720 367892 75942 -669219 -2047462
9241 -2047462 -3675619 -4516283 -4391119 -4940194 -7649797 -11137247 -12148973 -9772609 -7058395
9232 -7058395 -7341394 -10097244 -11862829 -10568145 -7322102 -4117037 -1676914 -332681
9224 -332681 -1406347 -5861219 -11795060 -15015579 -13057022 -7907164 -3794696 -2605632
9216 -2605632 -2563363 -1423264 519315 1591277 1769194 2645819 4393780 4753143 2113350
9207 2113350 -1816091 -4058167 -4346731 -5136838 -7680652 -10061977 -9887136 -7357363 -4511781
9198 -4511781 -2623031 -1767860 -2076451 -3585006 -5065913 -4760398 -2628991 -560075 20061
9189 20061 -522993 -1522697 -3339848 -6100675 -8152881 -7280573 -3309780 1493698 4670138
9180 4670138 5623174 5532889 5740953 6203895 5352031 1853920 -3171765 -6295019 -4849934
9171 -4849934 331660 5778788 8714605 9041903 8401025 8082841 7953818 6921149 4255052
9162 4255052 538353 -2776765 -4692196 -5170904 -4502699 -3094598 -2075708 -2849682 -5188983
9153 -5188983 -6784609 -5895908 -3819910 -3465890 -5806291 -8915437 -10381902 -9634473 -7906576
9144 -7906576 -6737255 -6537615 -6207950 -4504729 -1994776 -595014 -598162 201270 2998848
9135 2998848 5319967 4246590 1120510 64971 2254320 4775898 5329323 4809441 4439604
9126 4439604 3593966 2062249 1687714 3643465 6178085 7173184 7200410 7925032 8946433
9117 8946433 8397571 5639548 1550412 -2713948 -5510427 -4732457 -338072 4205734 5418922
9108 5418922 4094282 3854607 6033005 8355710 8452911 6417878 3868259 2427738 3126202
9099 3126202 5471691 7141617 6273446 3876610 2352307 2175056 2073205 1921807 2898699
9090 2898699 4890945 6380238 7090910 8122545 9090822 7943452 4480431 1494429 1313283
9081 1313283 3400160 6184053 8730049 9573613 6809176 1190967 -3264689 -3842024 -2360855
9072 -2360855 -2076581 -3535319 -5582957 -8138127 -11121153 -12477093 -10543482 -7295497
9064 -7295497 -6040403 -6548589 -5660761 -2492546 196440 290200 -785049 -285900 2796902
9055 2796902 7462547 11434235 11682377 6572487 -1302636 -6263803 -5016660 26676
9047 26676 3852391 4157076 2517727 1308997 948227 85968 -2423421 -6018733 -8698197
9038 -8698197 -8772456 -6312130 -2810097 176788 1692691 1295347 -830724 -3812160 -6691845
9029 -6691845 -8834780 -9428654 -7491732 -3317880 794710 2357766 798693 -2886496
9021 -2886496 -7397336 -10853421 -10779837 -6632931 -1638946 166776 -1514858 -3560906 -3683783
9012 -3683783 -2122167 233911 2470009 2563225 -1051874 -6253278 -8632265 -7031326 -4796024
9003 -4796024 -4571030 -5090640 -4672970 -4561035 -6295968 -8358741 -8181515 -5670040 -2364675
8994 -2364675 1061980 4103069 5143502 3624927 1920937 2315164 3543448 3138821 1713796
8985 1713796 1601933 2311094 977744 -2928441 -6676955 -8076188 -7192353 -4323776 456979
8976 456979 5262500 7065553 5509348 3604749 3687790 4839364 5076921 3970034 2299250
8967 2299250 1071351 1438420 3589036 5355752 4217289 1054556 -699916 -115699 151750
8958 151750 -1254161 -2025291 -655158 173692 -2341479 -6302036 -7827521 -6785536 -6105058
8949 -6105058 -6372942 -5014230 -1097599 2376011 2196044 -1112418 -4202051 -4536005 -2427218
8940 -2427218 -396776 -906665 -3950318 -6708246 -6298168 -2883257 624847 1791141 755085
8931 755085 -802784 -1837094 -2694624 -4074594 -5585146 -5673794 -3422075 -134477 1789140
8922 1789140 1583971 660703 354286 484707 387581 -228911 -1861457 -4741659 -7125317
8913 -7125317 -6311686 -2545984 479712 599295 -19698 745707 852095 -1994367 -4823292
8904 -4823292 -2870911 2387367 4141721 -193387 -5476536 -6656613 -5304568 -5328466 -6184109
8895 -6184109 -4658041 -1085169 844749 -107715 -1174672 -344524 684847 -218564 -1762805
8886 -1762805 -789096 3216962 7085169 7623972 5057455 2040183 5676 -2028467 -4730103
8877 -4730103 -6233837 -4386546 -488513 1469702 -293933 -3201811 -4024502 -2962475
8869 -2962475 -2439405 -3120727 -3297491 -1926775 -181714 635526 1147545 2628815 4467294
8860 4467294 4489382 2136738 39918 1211340 5121917 8038708 7477792 4820936 2818890
8851 2818890 2152542 1930183 2121603 3183401 3959406 2576982 -419620 -2253512 -1841930
8842 -1841930 -1303559 -2518110 -4150740 -3555162 -294258 3576912 5770177 5318801 2938229
8833 2938229 811200 967380 2879493 3618160 1306471 -2504395 -4684017 -3740551 -558581
8824 -558581 2748419 3866192 1598873 -2612436 -5491910 -5111366 -2235579 1714188 5862976
8815 5862976 8294440 6251836 99686 -5379080 -6411763 -5009714 -5361099 -7365720
8807 -7365720 -7484068 -4791902 -2043504 -1051342 -1050818 -1809147 -4222883 -7000017 -6848175
8798 -6848175 -3651656 -1891682 -4724793 -9597980 -12070836 -11330337 -9275624 -6508601
8790 -6508601 -2548903 1306376 2692960 1610257 732892 2178550 5593328 9245979
8782 9245979 11488042 11303947 8807138 5226476 1660256 -1635731 -4116670 -4446041 -2549175
8773 -2549175 -954547 -2105112 -5049729 -6846629 -6730411 -6592184 -7468641 -8138060 -7869583
8764 -7869583 -8190325 -10391683 -12780574 -12220191 -7984426 -2831577 -267395 -1446212 -4711703
8755 -4711703 -7511968 -8379152 -7229727 -4489480 -869303 2049631 2463222 570614 -937657
8746 -937657 -79620 1530455 889245 -1724785 -2715976 -286051 2826237 3138084 1148600
8737 1148600 351886 2540150 6008710 8015623 7367996 4801410 2422666 2746873 6549410
8728 6549410 11218131 12751979 10138466 6501022 5115199 5662060 5760930 5054123 5688911
8719 5688911 8865763 12838911 14988706 14569918 12706258 10795552 9798262 10126068 11055307
8710 11055307 10780524 8166484 4217748 998917 -475541 -391080 1099437 3676411 5657610
8701 5657610 4936515 1751749 -984728 -1058935 491847 1190044 419444 -434612 -495134
8692 -495134 -463798 -1108923 -1941927 -1963120 -1111698 -419400 -823417 -2094986 -3086765 -3064832
8682 -3064832 -2527133 -2354695 -2409863 -1654736 346959 2739946 4247729 4102511 2312561
8673 2312561 13250 -679204 1269206 3731283 3253805 -452386 -3898948 -4645099 -4307089
8664 -4307089 -4970306 -5146980 -2373637 1875933 3620925 2075471 136534 -847348 -2754810
8655 -2754810 -6103182 -7736062 -5399812 -1640093 -327252 -1363802 -1717252 -253373
8647 -253373 1471322 2508172 3652568 5147259 5627698 3994038 781171 -2803544 -5990407
8638 -5990407 -8266399 -9194501 -8895065 -8056370 -7189265 -6203847 -4622168 -1968175 1526241
8629 1526241 4193093 3751624 -287268 -5674006 -9652477 -11376878 -11353273 -9708072 -6427354
8620 -6427354 -2350188 1695892 5945240 10215568 12376710 10571872 6402798 3405563
8612 3405563 2534849 1748723 107367 -722035 175295 1022471 259910 -1004896 -1170132
8603 -1170132 -693455 -585768 -173801 1483496 3353428 3845745 3454503 3758823 4460216
8594 4460216 3621372 651151 -2801184 -4908961 -5207761 -4304436 -3375566 -3579420 -4624252
8585 -4624252 -4443761 -1812744 1281753 1692417 -811611 -3451596 -4300470 -4198113 -4587391
8576 -4587391 -5457402 -6157424 -6722569 -7582094 -8880067 -10349372 -10964651 -9107643 -4723385
8567 -4723385 -1077602 -2101547 -7425803 -12049510 -11763223 -7209467 -1959978 1367502
8559 1367502 2032807 287422 -2803977 -5952744 -9159931 -13166303 -16574000 -15837450 -9861298
8550 -9861298 -2472096 1957338 3533602 5018647 6876871 7481389 7053463 7568106 8977407
8541 8977407 9244978 8430867 8926561 10606853 9579253 3850447 -2912661 -5935629 -5221794
8532 -5221794 -4030869 -3556979 -2620978 -1444716 -1785736 -3225641 -2985191 -555498 591856
8523 591856 -2098734 -5884936 -5754674 -744815 5169874 8128990 8004568 6639473 4728370
8514 4728370 1952237 -989654 -2408501 -1810161 -804607 -1251390 -3086173 -4556558 -4400370
8505 -4400370 -3285971 -2916275 -3864528 -4635930 -3250995 220972 3214898 3121453 -171750
8496 -171750 -4539520 -7780563 -8701209 -6687069 -1812136 4329635 9281666 11935898 13133739
8487 13133739 13531676 12174992 8338234 3766508 1475737 2525813 5152858 6967870
8479 6967870 6999402 5706038 4094512 3088602 3087284 3879525 5117839 6506057 7281634
8470 7281634 6335188 3555475 316908 -2163982 -4086851 -5728135 -6000823 -3970584 -1037286
8461 -1037286 237234 -850507 -2858527 -4415522 -5031844 -4400980 -3051633 -3148109 -6094687
8452 -6094687 -9625258 -10150929 -7992881 -6939179 -8087811 -8015875 -4728270 -1655401 -2839069
8443 -2839069 -6917805 -9196020 -7843333 -4855399 -2203282 -160168 1375796 2735009
8435 2735009 5071652 8640754 11217453 10677602 8256422 6606137 5675611 3682622 1222913
8426 1222913 487596 670384 -1433230 -5515349 -6880134 -3227379 1757482 4151151 5454882
8417 5454882 8942086 13073214 12956534 7407376 645865 -3062281 -3277868 -1599766 913703
8408 913703 3310453 3980513 2113837 -897990 -2550741 -1300717 2670061 7748723 11399951
8399 11399951 11405540 7701414 2767176 -496001 -1233526 -698942 -271498 -184916 -260955 -989867
8389 -989867 -2989702 -5519290 -6514596 -4754895 -1568104 377923 -47870 -1361020 -1337602
8380 -1337602 487631 2296765 1676591 -2045757 -6757191 -9046717 -7272661 -3019501
8372 -3019501 862218 3071567 3946545 3668303 2191304 768442 1330213 3587821 4679545
8363 4679545 2960758 483130 -24322 688890 -446148 -4036380 -7048990 -6805150 -4112685
8354 -4112685 -1508159 -57556 643623 402736 -1640061 -4956568 -7167920 -6550202 -4185731
8345 -4185731 -2661116 -3088316 -4511335 -6064291 -8192306 -11058729 -13018172 -12058985 -8346887
8336 -8346887 -4212089 -1842161 -1893122 -3882555 -6621842 -8456779 -8480576 -7535021 -6792010
8327 -6792010 -5674511 -2976156 139600 785109 -1297541 -2587179 -521665 2802791
8319 2802791 3735510 2141663 908543 1511897 2656028 2785996 1511886 -1220574 -4946340
8310 -4946340 -7568953 -6836415 -3517646 -1062093 -1360239 -2713405 -2886726 -2272840 -2567105
8301 -2567105 -3683730 -3810106 -2097836 128131 1009130 305290 -322830 848908 3437312
8292 3437312 5057260 4201921 2423209 2366382 3995172 4641054 3064153 1319312 1485248
8283 1485248 2486323 2036279 399131 -183254 577423 99416 -3339620 -7686068 -9231722
8274 -9231722 -6909462 -3201025 -784217 551879 2756846 5853293 7167479 5149818
8266 5149818 2467743 3059356 6540001 8333762 6103043 3165310 3599588 6497317 8108265
8257 8108265 7939174 8769075 11097908 11928611 10071231 8617256 9888192 11254180 9172872
8248 9172872 5038329 3228819 4549076 5565658 4348076 3082267 4077060 6389779
8240 6389779 7929471 8336577 8020058 6474752 3523147 560652 -1332592 -2965632 -4800828
8231 -4800828 -4941177 -1995872 1503542 1895069 -87597 -281466 2238179 3422917 623368
8222 623368 -2884373 -2355371 1942395 5721742 6586173 5786608 4764284 3116901 478210
8213 478210 -1943045 -2663070 -1454215 876597 3097562 3812073 2514104 711509 588389
8204 588389 2008966 2200656 -772291 -5350514 -8263035 -8085328 -5959665 -3515646 -1524283
8195 -1524283 -536376 -1392433 -4238324 -7589348 -9276530 -8460850 -6211375 -3885334 -1515919
8186 -1515919 1553813 4844340 6712909 6455317 5411248 5286761 6141026 6810474 6588089
8177 6588089 5485732 3485025 821760 -1335286 -1899557 -1546640 -2039188 -3679909 -4731727
8168 -4731727 -3812569 -1715852 -196273 191691 361861 1372943 3341929 5276312 5800551
8159 5800551 4568932 2940845 2463580 2756180 2096637 296987 -553887 910027 2878626
8150 2878626 2292528 -1338788 -5229609 -6270209 -3953069 -574551 948118 -260030
8142 -260030 -2260596 -2698825 -1967611 -2683518 -5545238 -7604528 -6261496 -3367983 -2761978
8133 -2761978 -4438299 -4309882 -343608 3983144 4075406 78028 -3786616 -4569115 -3072115
8124 -3072115 -1493215 -819916 -868637 -1177160 -1187101 -668562 -400111 -1318320 -2643400 -2262131
8114 -2262131 271967 2530158 2168378 -121289 -2055917 -2992776 -3754216 -4079929 -2823390
8105 -2823390 -654271 81592 -1128354 -2026008 -1182303 -72017 36218 838313 4215265
8096 4215265 8524575 10552722 10015460 9089195 8177039 5503631 1020091 -2544771 -3306377
8087 -3306377 -2091893 178512 4014959 8727792 11001279 8430902 2785306 -2324118
8079 -2324118 -5561909 -7622195 -8332249 -6652102 -3071523 330789 2335800 3430904
8071 3430904 4166640 4163008 3034496 1282545 5835 152185 1747576 3472613 3733205
8062 3733205 2660470 1974432 2213445 1736554 -189217 -1157768 1181785 4988663 6220777
8053 6220777 4304297 2754726 3821305 5455009 4708923 1735480 -1131680 -2463977
8045 -2463977 -2260985 -745495 1581552 3366800 3430519 2237755 1411837 1875175 2971474
8036 2971474 3166216 1350980 -2033413 -4916391 -5283298 -3228390 -672935 1075217 2486414
8027 2486414 4276166 6004352 6970986 7397615 7691126 7397194 6042174 4404951 3735788
8018 3735788 4000579 3939054 2652594 209078 -2978921 -6116816 -7416449 -5075443 299651
8009 299651 5230697 6545600 4816828 3605788 5138709 7762839 8378110 6539655 4788178
8000 4788178 5075267 6477892 7052610 6400165 5073426 2666737 -1505716 -6226265 -8896027
7991 -8896027 -8487630 -6343879 -3814982 -936053 1993243 3538607 3150331 2541835 3501424
7982 3501424 5359456 6135004 5392235 4439414 4296071 4972755 6302468 7913133 8639338
7973 8639338 7596100 5893532 5787111 7865163 10374997 11597570 11570737 11056646 10167525
7964 10167525 8803741 7426573 6514121 5935041 5555873 5772993 6683521 7318451 6493746
7955 6493746 4000961 342535 -4021488 -8169995 -10055294 -7902423 -2618411 2281968
7947 2281968 3811735 2094064 -438580 -1687641 -1226049 246982 1757022 2488383 2281686
7938 2281686 1966987 2635758 4310095 5780517 6026937 5364861 4878696 5209178 6354441
7929 6354441 8107015 9835255 10150740 8020562 4570714 2741840 4253986 7338794
7921 7338794 8339116 5537715 838090 -2354402 -2434404 -724210 252985 -627936 -2137236
7912 -2137236 -2250325 -476261 1828752 3517196 5108099 7414200 9490096 9424861 7074554
7903 7074554 4351732 2328670 -153375 -3691134 -5723057 -3117815 2927819 6944453
7895 6944453 4951736 -1345112 -6891441 -8404534 -6180016 -2279666 1222570 2710414
7887 2710414 1626722 -904623 -2960104 -3612517 -3329268 -2688502 -1469365 788053 3705654
7878 3705654 5637610 4466822 -349213 -6247438 -9340117 -8618502 -6989240 -6732442 -5688115
7869 -5688115 -669883 6402376 9486010 6004743 110964 -2878907 -2346875 -962786
7861 -962786 -165001 506708 1451047 2780074 4758440 6624044 6557936 4654654 3864466
7852 3864466 5614713 6776872 4240683 449766 140063 2784699 3176680 -487145 -4108569
7843 -4108569 -4458929 -3810770 -5499166 -8595125 -9965146 -9102430 -8067928 -8314912 -9894339
7834 -9894339 -12361894 -14446448 -14177856 -11217941 -7831387 -5956921 -4751501 -2644991
7826 -2644991 -200345 988585 799474 14238 -1385990 -3332408 -4366218 -3328619 -1203401
7817 -1203401 672308 2753064 5333669 6129229 2983667 -1970893 -4233526 -2666453
7809 -2666453 -112383 1466048 2844176 4103855 3171365 -600114 -4440716 -5820753
7801 -5820753 -5756257 -6312835 -6834451 -5304843 -2248825 -410169 -643595 -566167 1965569
7792 1965569 5716516 7557000 6185348 3108001 185625 -2367053 -4953212 -6862064
7784 -6862064 -7118277 -6520381 -6852405 -7906891 -7497264 -5239415 -3927644 -5500768 -7878633
7775 -7878633 -8183429 -7161304 -7336374 -8254137 -7339893 -4900233 -4227971 -6359793 -8531046
7766 -8531046 -8750751 -8291889 -8359377 -7930498 -6738875 -6810112 -8509985 -8414755 -4371929 141499
7756 141499 548925 -2100958 -3199239 -1889871 -1531535 -3219484 -3868768 -1944811 -738593
7747 -738593 -3508165 -8336331 -10504569 -8237145 -3881671 -675508 -283851 -2518256 -5581045
7738 -5581045 -7062895 -6083821 -4037990 -2417955 -1038926 345684 145957 -3050736 -7220243
7729 -7220243 -8269757 -5048740 -880365 620871 -599879 -2324688 -3365893 -3948643
7721 -3948643 -4012920 -3093972 -1552385 -366149 222710 648446 847650 461184 1393
7712 1393 297910 813455 224309 -1144430 -1492320 -797870 -1608940 -5074898 -8243332 -7637672
7702 -7637672 -4172410 -1772873 -1719138 -1315519 1530963 5190261 6897296 6355184 5283419
7693 5283419 4826464 4925904 5348846 5976575 6597427 7412297 9184392 11905809 13787744
7684 13787744 12654640 8369490 3358496 761935 2014681 5511976 7475862 5251605
7676 5251605 428359 -2343912 -583471 2948944 3642189 650916 -2577335 -3051776 -1567937
7667 -1567937 -784279 -1551263 -2290925 -1307773 1314962 3955153 4953528 3954278 2194305
7658 2194305 1443665 2366634 3950987 4733333 4428903 4031492 4433928 5503480 6681115
7649 6681115 7829449 8821043 8715679 6474920 2721415 -262903 -973308 -357107 -263211
7640 -263211 -962850 -1378720 -1301710 -1837484 -3429206 -4746953 -4214298 -1899280 642734
7631 642734 1886366 1353132 -339161 -2034051 -2954615 -3265387 -3510127 -3669515 -3282728
7622 -3282728 -2275417 -917902 905829 3500331 6385844 8330906 8442269 6634452
7614 6634452 3348916 -266393 -2363378 -1992958 -493139 282541 934351 3661577 8186618
7605 8186618 10940694 9471594 5713650 3390110 3665155 4814930 4787459 2466619 -2340287
7596 -2340287 -8270245 -12496489 -13109602 -10900828 -7622875 -3599819 1253119 5165668
7588 5165668 5715785 3132204 292305 -771641 -600396 -295152 444026 2480047 5555439
7579 5555439 8204652 8891313 7116548 3932298 1193719 -332817 -1712349 -3837149
7571 -3837149 -5304709 -3787749 590313 4840130 6490803 6076553 5505524 4966022 2705799
7562 2705799 -2100272 -7196410 -8898999 -6122241 -1869283 294808 561627 1887971
7554 1887971 4959179 6866812 5803646 4227301 5029431 6748785 5737605 1864525
7546 1864525 -1308763 -1635450 -389062 1017205 3117837 6309482 9395488 11505668
7538 11505668 13396307 15636735 17270010 17356445 16231789 14333192 11525302 8527786
7530 8527786 7004830 6848722 5307556 750296 -4121826 -4994482 -1127994 4090263 7309424
7521 7309424 8084496 7707665 6976001 5724670 3608562 781770 -1880077 -3182727 -2570411
7512 -2570411 -626263 1588259 3442487 4792396 5575300 5757850 5427156 4648923 3450101
7503 3450101 2013474 515904 -1215287 -3304686 -5031551 -5152818 -3291026 -408879
7495 -408879 2353232 4767369 7204399 9694763 11498366 11376253 8590154 4227794 1080572
7486 1080572 1071836 2849516 3052258 121379 -4128355 -6836734 -6955277 -5609063 -4618534
7477 -4618534 -4917695 -5662032 -4906264 -1935120 1477448 3250155 3784543 4802625 5889098
7468 5889098 4724690 1174777 -1375106 11513 4331415 8283577 9840872 9111992
7460 9111992 7198478 5466474 4786995 4496324 3190537 1123589 250559 1162773 1801445
7451 1801445 242706 -3037142 -6740124 -10538426 -13857803 -14952970 -13130690 -10291931
7443 -10291931 -8465100 -7356697 -5994018 -4857647 -4312913 -2912895 171434 2757924
7435 2757924 2510198 696910 110051 611597 78554 -1379988 -1913864 -1919925 -3405788
7426 -3405788 -5392658 -4257309 446832 4475429 4678636 2755772 1384480 -57346
7418 -57346 -3316463 -7367287 -9639849 -9688672 -9121570 -8817916 -8294719 -7074817 -4882018
7409 -4882018 -1170037 3829515 8099969 9469510 8021163 5695064 3826778 2178967
7401 2178967 111739 -2316154 -4290345 -4673328 -2938878 -290207 835200 -703553
7393 -703553 -3171061 -3777766 -1723294 1355497 3553691 4375447 4425097 4361694 4408779 4470116
7383 4470116 4513066 4793422 5463779 5977099 5384878 3434349 961225 -944126 -1729551
7374 -1729551 -1336872 -28135 1569787 2831364 3660067 4092430 3513520 1215042 -2212115
7365 -2212115 -5127896 -6732478 -7645556 -8368888 -8470521 -7798378 -7123932 -6727652 -5580005
7356 -5580005 -3002778 -139650 1340542 1152086 -7316 -1725880 -3457000 -3879292 -2437429
7347 -2437429 -844682 -1038125 -1913965 -405770 3733045 6559309 4849467 788239 -393772
7338 -393772 2965127 6818664 6519537 2459786 -854469 -643519 1151786 1193917 -626203
7329 -626203 -1431795 572194 4169827 7301449 9281621 10136713 9411353 7057804 4535277
7320 4535277 3512570 3938082 4657594 5433031 6819561 8306840 8446151 7230001 6593858
7311 6593858 7547416 8209030 6199644 2173404 -825424 -1422342 -1505758 -3056087 -4906756
7302 -4906756 -4238289 -728716 2580430 3006855 1431249 748556 2001936 3532809 3821890
7293 3821890 3549715 4053788 4907901 4494885 2732368 1689012 2801725 4518997 3996560
7284 3996560 932631 -1602174 -686290 3015486 6127164 6223126 3626294 43104 -3166705
7275 -3166705 -5192716 -5607784 -4779459 -3740910 -3060620 -2350150 -1196203 137371 1271297
7266 1271297 2156510 2613266 2382183 1989262 2326677 2880506 2003975 -110565 -654166
7257 -654166 1916346 5012970 5324620 3680168 3515549 5316439 6110727 4588347 3044933
7248 3044933 3110248 2979380 997775 -764798 625852 4185025 6019545 4477375 1741944
7239 1741944 349078 328622 349324 65522 289200 1396174 2296674 1238470 -2180610
7230 -2180610 -5958000 -7356551 -5830752 -3505451 -2483804 -2744234 -3262113 -3943739 -5248089
7221 -5248089 -6710969 -7216954 -6467740 -5204965 -4276876 -4277965 -5550319 -7460626 -8114752
7212 -8114752 -6095643 -2445262 213097 612902 -103238 -340499 131216 766933 1480405
7203 1480405 2225435 1993775 -286106 -3547986 -4592299 -1536525 3184851 4804805 1655791
7194 1655791 -2647123 -3358206 98642 4241085 6098566 5892031 5348175 5243689 5243320
7185 5243320 4879630 3899815 2293693 355010 -1754545 -4336736 -7283372 -9315048 -9381064
7176 -9381064 -8533957 -8830390 -10411145 -11349453 -10461384 -8406946 -5761926 -2082631 2430139
7167 2430139 6246569 8356003 9211424 9271747 8412408 7241710 6731430 5814152 2020878
7158 2020878 -4155938 -8260186 -7262580 -3706259 -2229307 -3841081 -5952362 -6419505 -5139845
7149 -5139845 -2889958 -710896 662802 2270392 5974292 10454184 10950609 5734101
7141 5734101 40437 -199369 3700956 5846221 4502946 3001504 2858574 1911624 -23938
7132 -23938 577249 4688308 7389063 4120098 -2731945 -6727732 -4993019 -212884 3710227
7123 3710227 5426428 5869573 6030832 5564010 3505793 386255 -1332925 -92699 2452952
7114 2452952 3720184 3773896 4281443 4951804 4213489 2824556 2983062 3796547 1841533
7105 1841533 -2954383 -6336832 -6226842 -5929973 -8427854 -11369615 -10912243 -7347408 -3438651
7096 -3438651 192207 4265047 7417627 7485666 5192698 3281123 2703380 2418753 1993437
7087 1993437 1574101 188687 -2956932 -6043930 -6286254 -3678102 -696336 1182273 2254003
7078 2254003 2619987 2150079 1827677 2325527 1813706 -1648492 -5844488 -6111528 -1745910
7069 -1745910 2760417 3773918 2456607 1351775 479153 -908725 -1561508 -281714 1032356
7060 1032356 -420955 -3875335 -5647945 -4249102 -2266728 -2517535 -4413258 -5333484 -4156330
7051 -4156330 -1899844 407776 2797229 5191609 6654723 6630612 6019009 5956645 6051429
7042 6051429 4973448 2478323 -428897 -3093160 -5344433 -6076893 -3899953 43910
7034 43910 2233609 1346895 654053 3541294 8182061 9579429 6238156 1762212 -268158
7025 -268158 -37328 626729 1260750 1993271 1871415 109658 -2071298 -2724502 -1648661
7016 -1648661 70429 2435510 6477953 11677024 15359694 15690804 14012767 12862031
7008 12862031 12396987 10549192 6810001 3988206 4965854 8786711 11558677 10886279 7962408
6999 7962408 5410397 4632453 5521545 7194859 8304005 7841406 6392706 5654600 6233686
6990 6233686 6989934 6898398 6144321 4901090 2791249 453853 -196671 1433610 3476469
6981 3476469 4475469 5542656 7810007 9599487 8594161 5443174 2609666 792874
6973 792874 -737541 -1347772 72957 1914905 1106053 -2142521 -4174073 -3177932 -1482952
6964 -1482952 -1417031 -1801652 -256086 3227659 6603702 7867957 5667592 -108150 -6954583
6955 -6954583 -11026712 -11440380 -11461345 -13741727 -16341508 -15645483 -11583651 -7433954 -5498947
6946 -5498947 -5428768 -6066417 -6409401 -5064232 -1327426 2819365 3883204 747379 -3976840
6937 -3976840 -6836384 -6440193 -3319042 1272370 5392484 6619654 3892594 -901892
6929 -901892 -4149598 -3708369 -716174 1900687 2650833 2981469 5276462 9571690 13116972
6920 13116972 13554949 11603953 9694253 8687188 7350854 4893878 2387356 1054688
6912 1054688 363370 -1167902 -3932031 -7013904 -9598665 -11472782 -12153640 -10701278 -6943012
6903 -6943012 -2176014 1871625 4188232 4178005 1262744 -3968848 -8781085 -10145082 -7877130
6894 -7877130 -4699974 -2848448 -1857379 -180243 2402487 4917748 6632792 7351215 7189251
6885 7189251 6925865 7517043 8346830 7327663 4048688 1320711 1685276 3679650 3951478
6876 3951478 2132696 805328 1041889 1044866 -498553 -2647079 -4510760 -6506759 -8175778
6867 -8175778 -7442972 -3746487 323192 2371228 3234526 4593717 5297712 2749403 -2778703
6858 -2778703 -7657589 -8807757 -6541381 -3549180 -2279257 -3270068 -5192585 -6591707
6850 -6591707 -7762205 -9978561 -12603665 -12797366 -9363978 -5142401 -3637482 -4675393
6842 -4675393 -5688207 -6036734 -6999660 -7991837 -6387044 -1932912 1793125 2027528 534108
6833 534108 624368 2324519 3015816 1797561 468137 337714 655581 776927 1590382
6824 1590382 3548019 5097703 4798765 3716836 3678011 3951834 2120258 -1784590 -4549012
6815 -4549012 -3968986 -1589694 -114155 -136508 -970931 -2624612 -4677718 -4931512 -2100984
6806 -2100984 1136730 930728 -2236849 -3945347 -1848571 1806287 4119662 4748267 4175925
6797 4175925 2083317 -741817 -1684537 253495 2491082 2553063 1674738 2363068 4313086
6788 4313086 5543487 6008589 6849246 6940137 3633586 -2862120 -8667323 -10513468 -8913892
6779 -8913892 -6589242 -5417987 -5407727 -5256462 -3446597 228555 4103954 6446014 7451357
6770 7451357 8298182 8755672 7431574 4298265 1261076 -89292 71203 842143 1752727
6761 1752727 2418800 2141794 521476 -1918632 -3848612 -3716412 -858911 3292397 5884516
6752 5884516 5551495 3938665 3203061 3000441 1705343 -218568 -546550 967731 1663593
6743 1663593 -311954 -3289662 -4437712 -3649251 -3646040 -6596595 -11618433 -15634764 -16207721
6734 -16207721 -13435830 -9312549 -5701842 -3476415 -3245263 -5414881 -8864931 -10961233
6726 -10961233 -10216595 -8104255 -7009651 -7261760 -7601633 -7705540 -8399380 -9734490 -10560391
6717 -10560391 -9954044 -7825186 -4490528 -959665 963268 488256 -719236 -550653 655493
6708 655493 1136659 1066138 2461786 5611282 7884878 6800127 2649060 -2380994 -6242039
6699 -6242039 -7870492 -7434301 -6149747 -4938093 -3493948 -1662602 -740246 -1547273 -2156158
6690 -2156158 -108394 3553472 5275897 3936373 1822311 411374 -1542571 -4632384
6682 -4632384 -6527259 -4925117 -775117 3069553 5010531 5439023 5596665 6326782 6741543
6673 6741543 4334988 -1586738 -7067075 -7165757 -2554675 1180079 1486908 1859136 5186965
6664 5186965 8591271 8190993 5448577 4582030 5992366 6625973 5558095 4883384 5340845
6655 5340845 5055040 3368567 2727253 5264358 9468215 11809100 10860069 8609389 7630390
6646 7630390 7651048 5931672 1442784 -2758487 -3067654 -187136 2165136 2712263 3305223
6637 3305223 4256529 3428251 1169553 1474774 5695515 9364908 8605920 5808797 4936578
6628 4936578 4813114 2106683 -1742354 -2306812 458058 2122663 632673 -1784399 -3621468
6619 -3621468 -6200091 -9996082 -12917092 -13336740 -11792331 -9138659 -5780042 -2726596
6611 -2726596 -629329 1695254 4730850 5476514 1310863 -4425579 -5812249 -2997791
6603 -2997791 -1902366 -4905856 -7863732 -7746429 -6964490 -7463891 -6488410 -2068285 2279539
6594 2279539 2724665 942148 390796 464294 -953327 -2349099 -1195000 730753 17460
6585 17460 -1970796 -758604 3842476 7110966 6356160 4004828 3138011 3809110 4676088
6576 4676088 5036543 4319162 2244677 180379 -38425 1031869 1125772 -158951 -1125318
6567 -1125318 -1284450 -1732094 -1801689 1150106 7243705 12389749 12973626 9943406 6572088
6558 6572088 4460816 3752652 5075392 8410223 11164129 10257626 6130247 2557122 2154690
6549 2154690 3642259 4023807 2205802 -351237 -1856526 -2073426 -1892237 -1685353 -793151
6540 -793151 1294345 3922907 5874399 6422425 5298049 2463098 -1035635 -2803140 -1433293
6531 -1433293 1058590 1030726 -2161575 -5132333 -4855729 -2378381 -813970 -1008181 -1076746
6522 -1076746 269384 1745903 1084176 -2494665 -7583368 -11562362 -12276924 -9727605 -6406611
6513 -6406611 -5196073 -6485151 -7805860 -6558330 -2586440 2147324 5649138 7008864
6505 7008864 6177094 3957127 2269791 3064376 6100182 8588253 8096646 5440866 3630581
6496 3630581 4183397 5772589 6584855 6433889 5827628 4460996 2102578 102309 278185
6487 278185 2418375 4341500 4670177 4388678 5232441 7362746 9089067 8486308 5262342
6478 5262342 1511074 320190 2725837 6215103 7321769 5547710 3282233 1848860
6470 1848860 -262148 -4246578 -8047814 -8497768 -5331124 -1097156 2244359 4471853
6462 4471853 5175302 3369839 -99432 -2018294 -393555 2668442 3373117 825354 -2342606
6453 -2342606 -3455847 -2302206 -320451 1010509 594159 -2004621 -5878717 -9212928
6445 -9212928 -10981595 -11505611 -11003643 -8707724 -4228458 1091612 5232650 7443997 8355305
6436 8355305 8666255 8524297 7717761 5767270 2460937 -983606 -2343016 -1223144 -381228
6427 -381228 -2352364 -5590163 -6440350 -4684296 -4141757 -7055103 -10838759 -12079520 -11221067
6418 -11221067 -10817358 -10979723 -9625277 -6519673 -4054419 -3737520 -4322782 -4067249 -2856241
6409 -2856241 -1193980 1230542 4664418 7939888 9224067 7807407 4508061 673563
6401 673563 -2684508 -5058451 -6258081 -6168982 -4865551 -3171008 -2547138 -3485710 -4176174
6392 -4176174 -1952314 3596987 9856747 13845976 14747339 13454403 10829038 7459187
6384 7459187 4461455 3245000 4304961 6771249 9171135 10410641 10318329 9669135 9533296
6375 9533296 10264637 11166174 11184111 9690060 6716064 3045696 86972 -1206772 -1554295
6366 -1554295 -2589714 -4555817 -5896734 -5759862 -5477347 -6315923 -7134673 -6287451 -4989054
6357 -4989054 -6198829 -10050302 -12899191 -11801686 -7927994 -4422043 -2682874 -2140090
6349 -2140090 -2084887 -2026389 -1496082 -1180747 -2953087 -6832658 -9317726 -7429560 -3468661
6340 -3468661 -2449064 -4978917 -6374500 -3692833 73297 810180 -916033 -1811123 -1358566
6331 -1358566 -1974781 -4775633 -8331342 -11133592 -12472061 -11186196 -6530242 -612335
6323 -612335 2638050 1624470 -1714971 -4941647 -6982264 -6875092 -3822748 317148 1504768
6314 1504768 -1556600 -5135963 -5125478 -2115785 273313 386092 -634935 -1683255 -2565553
6305 -2565553 -2656295 -1311153 455351 908526 196893 17588 777714 1252125 1177593 1858559
6295 1858559 3592084 4634518 3669264 1456534 -1013642 -4201360 -8397442 -11871802
6287 -11871802 -12416532 -9999455 -6421026 -2954557 203767 2613783 3453879 2919138 2413419
6278 2413419 2819845 3500179 3598417 3595317 4631943 6399945 6643855 3524341 -1615171
6269 -1615171 -4674346 -2682632 2967513 7829564 8796306 6374780 2748156 -876384
6261 -876384 -4106079 -5886405 -5084085 -2489519 -670948 -1287778 -3547099 -5775246 -7423189
6252 -7423189 -8702974 -9226502 -8349919 -6512411 -4909170 -3783599 -2237534 -9419 1746477
6243 1746477 2088255 1734643 2054987 3304918 4705808 5650082 5850856 4823216 2426865
6234 2426865 -260615 -1776875 -2015113 -2121003 -2652776 -2997863 -2826913 -2887007 -3694886
6225 -3694886 -4320423 -3272993 -251830 3381515 5561767 4903875 1803363 -1562272 -2854172
6216 -2854172 -1480205 1290537 3782714 4924864 4402749 2951547 2153040 2660430 3001679
6207 3001679 1749242 457524 2144791 6692578 10285951 10131443 7196625 3322861
6199 3322861 -1375085 -6385243 -9088534 -8178096 -6666339 -8048562 -10774258 -10112267 -4965002
6190 -4965002 692969 3339907 3719317 4520450 6979229 10661928 14302754 15849787 13663536
6181 13663536 8810686 4726759 3746308 5124763 6806250 7564472 6944373 4889343 2407832
6172 2407832 1312206 2349205 4379021 5776072 5727257 4125641 1485391 -933179 -2299386
6163 -2299386 -3543075 -5975044 -8691857 -9340329 -7567711 -5398017 -3749746 -1242705
6155 -1242705 2408224 4459396 2620591 -1328105 -3549157 -2735967 -934195 -588153 -2306689
6146 -2306689 -4999176 -6970762 -7188587 -6085090 -4610051 -2567933 658092 3734457
6138 3734457 4125971 2051963 1069678 3123014 5620913 5703082 4787609 5537664 6329667
6129 6329667 3135593 -3662292 -8895039 -9888296 -10024521 -13032337 -17037865 -17327123 -13074569
6120 -13074569 -8021139 -5139021 -3767686 -2456725 -1830753 -2996830 -4841604 -5036589
6112 -5036589 -3120336 -667397 1411490 3634442 5628936 5416140 2516520 -76995
6104 -76995 799510 4304417 6950180 7310039 6834962 6452550 5329139 3377979 2166587
6095 2166587 2334624 2429687 1379686 57166 -628978 -1183169 -2109548 -3134085 -4690411
6086 -4690411 -7675783 -10565603 -9653962 -4077785 2046498 4741611 4837974 4873758 3983379
6077 3983379 -351576 -6968185 -11364737 -11075868 -7724106 -4034658 -1483335 -561333 -796487
6068 -796487 -689996 253132 53773 -3005162 -7179588 -9399562 -9519132 -9390162 -8806813
6059 -8806813 -6245368 -3191720 -3348490 -6879207 -9534922 -8822674 -7274824 -7692377 -8523554
6050 -8523554 -6619176 -2254943 1289261 1885391 288280 -1331992 -1134382 1211317 4025234
6041 4025234 5217855 5001208 5718133 8437351 11322778 12067706 10244293 6550770 1790791
6032 1790791 -2258090 -3042957 -55327 3945479 6047128 6248021 6022090 5334363 3125405
6023 3125405 3772 -1604060 -207854 2917830 4890348 3876136 753022 -1826623
6015 -1826623 -2324641 -1808668 -1843471 -1901597 -614824 1224441 1506584 433804 310246
6006 310246 1379750 1261656 -371732 -167218 3676090 7678906 7510930 3816198 552059
5997 552059 -595828 -848479 -827859 -47318 641703 -509484 -3118491 -4861637 -4888812
5988 -4888812 -4496111 -4165506 -2643002 214524 2052934 822436 -2590213 -5658606 -6877048
5979 -6877048 -6068504 -3233152 1329923 5936917 7828679 5414578 340489 -3147050
5971 -3147050 -1774574 3445189 8068969 8754727 6221162 3357710 1686014 811502 222592
5962 222592 -234997 -1340510 -4073593 -7790597 -10176979 -9715483 -7418333 -5502018 -4844089
5953 -4844089 -4370778 -2822761 -509534 1173415 1831380 2811775 5258612 8181422 9615203
5944 9615203 9239556 8355796 7445819 5563481 2433907 -674959 -2808960 -4394681 -5798109
5935 -5798109 -6544500 -6698297 -7133466 -7565838 -6442528 -3948914 -2750094 -4007178 -4973101
5926 -4973101 -2847022 968879 3088179 2973217 2720100 3319306 4114160 5035442 6295581
5917 6295581 6423642 3666661 -818837 -3932733 -4591857 -4022558 -2504709 855787 4883109
5908 4883109 6327778 4213326 1406565 684347 1718382 3098801 4755037 6734263
5900 6734263 7795730 7151406 5956997 5263431 3965673 800536 -2689276 -3403826 -625502
5891 -625502 3119011 5302320 6031476 6878486 8159690 8506750 7014529 4724129 3258026
5882 3258026 2658665 1804268 705801 708235 2034759 2913672 2067484 482312 -320916
5873 -320916 -87150 1205206 4066623 7562411 8936172 7370305 5853166 6619993 7158689
5864 7158689 4284777 -48041 -1523396 -553812 -1469476 -5110348 -7501285 -6401748 -4243930
5855 -4243930 -3537513 -3885368 -4658486 -6125264 -6761708 -4229124 -477185 -647326 -4744977
5846 -4744977 -5905624 -189810 7107502 9069975 6433342 4429607 4403660 4191882 3975149
5837 3975149 5842563 8964653 10363447 9629875 8561412 7242884 4766306 2684385
5829 2684385 3298226 5368278 5829215 4909247 5185950 6507146 6664608 6438289 8663863
5820 8663863 12293540 12907304 9955632 8104122 9783983 11429472 9384017 5159490
5812 5159490 2227455 1346618 1741013 3517164 5993440 6429003 3381425 -695146 -2563158
5803 -2563158 -1969118 -363283 1842673 4502482 6316066 6480136 5971687 5250157 2828365
5794 2828365 -1635152 -5074532 -4700995 -2283802 -1816987 -4042729 -6028483 -5383111 -2436015
5785 -2436015 1079612 3254274 2588045 -485420 -3189768 -3331961 -1878336 -995549 -895130
5776 -895130 -768279 -1260547 -2982189 -3639475 -259071 5855422 9832370 9314570 6596275
5767 6596275 3973099 478462 -4863616 -9389106 -9243508 -4305733 1523123 4369647
5759 4369647 3202733 -628103 -4827428 -7226698 -7048716 -5744138 -5842005 -8381419 -11635123
5750 -11635123 -12690894 -10376224 -6429785 -3489680 -2120233 -638698 1955720 4202017
5742 4202017 4365455 3201490 2647487 2351898 -24875 -4616191 -7900430 -6949270 -3439594
5733 -3439594 -1480231 -2385163 -3751042 -3527091 -2755743 -3385498 -5001181 -5403683 -3940531
5724 -3940531 -2573709 -3169889 -4968728 -5801105 -5154027 -4653210 -5557766 -7178349 -8184783
5715 -8184783 -8111147 -6806434 -3886302 -187971 1466676 -850627 -4938884 -6394922 -3994258
5706 -3994258 -886534 326451 1309209 4909384 9950553 11761145 7990080 2027755
5698 2027755 -229853 3589934 9936678 12732785 9197663 2487340 -1641484 -728160
5690 -728160 2553155 4446472 4398811 4156389 4106150 2953394 865251 415379 3287584
5681 3287584 7614487 9936586 8893446 5790694 2295610 -955251 -3690627 -5410664
5673 -5410664 -5930829 -5747214 -5418081 -4970481 -4165915 -3081835 -2258125 -2308993 -3203561 -3833365
5663 -3833365 -2901162 -837230 -176952 -2801866 -6996281 -8771663 -6513450 -2809727 -839582
5654 -839582 -517565 230014 1677685 2211563 1660325 1986610 3847804 4803395 2568002
5645 2568002 -1574215 -4507287 -5322731 -5520423 -5855920 -5417624 -3951185 -2770055 -2563162
5636 -2563162 -2225959 -985758 -32499 -590627 -1683408 -1514236 -153923 970121 1658857
5627 1658857 2987090 4849043 5477467 3911203 1318889 -768540 -2084613 -2757001 -2315012
5618 -2315012 -740507 628934 593265 -240028 -457713 197886 1094689 2147382 3364316
5609 3364316 3488809 1126316 -2624304 -4670369 -3859326 -2805849 -4612714 -8890968 -12357460
5600 -12357460 -12718521 -10680855 -8424129 -7270372 -6932269 -6214619 -4271678 -1653328 -71275
5591 -71275 -627672 -2332632 -2903968 -1082055 2213943 4947047 5744627 4696046 2898685
5582 2898685 1388218 292964 -1008574 -2813038 -4394529 -4682621 -3564565 -2290148
5574 -2290148 -2528742 -4792304 -7354066 -7036439 -2285793 4111757 6713263 3005617 -3524588
5565 -3524588 -7174066 -6081210 -2970469 -789258 -153402 -1068223 -4052914 -8037205 -9556277
5556 -9556277 -6441235 -1109708 2013897 1638997 186936 -74376 840199 2092879 3053365
5547 3053365 2487755 -774749 -5342569 -7620513 -6074613 -3223207 -1737691 -585753
5539 -585753 2440806 5953294 6228738 3007996 476336 1505872 4055416 5037962 4948296
5530 4948296 5879619 6902555 4971447 -97773 -4920655 -7183311 -7919726 -8154306 -6316940
5521 -6316940 -1228465 4431185 6489986 4335428 1136657 -633559 -1384169 -1812840 -685325
5512 -685325 3251593 8534812 11911581 11728290 9290516 6860731 5089815 2718512 -1432290
5503 -1432290 -6441418 -9559952 -8804375 -5084365 -1251641 848177 1745480 2867230 4613155
5494 4613155 6241955 6945397 6542007 5500993 4504028 3558596 1624702 -1998519 -5874265
5485 -5874265 -7355455 -5927889 -4286860 -4955395 -6978515 -7555820 -6143381 -4849883 -4757441
5476 -4757441 -3970223 -342815 5135554 8980990 8879547 5849026 2720972 937869 -777359
5467 -777359 -4291626 -8830378 -10993131 -8766729 -4441897 -1919708 -1699524 -684681 2925171
5458 2925171 6991710 8743100 8546406 8505022 8747353 7372101 3559750 -1203589 -4899889
5449 -4899889 -6489726 -5895824 -4032055 -2739458 -3171889 -4278000 -4352973 -3871538 -4832935
5440 -4832935 -7209252 -8440744 -7375115 -6435386 -8122637 -10923775 -10773726 -5915530 1369080
5431 1369080 7436303 10259099 10152772 8994055 8608919 8820541 7377841 2937021 -2371216
5422 -2371216 -4881429 -3751635 -1744204 -1423966 -2204476 -1932905 -178319 1160493 80656
5413 80656 -3384659 -7102391 -8737004 -7996039 -6930921 -7578950 -9529653 -10452523 -8733951
5404 -8733951 -4804970 -328271 2742959 2762438 -154691 -3164311 -3071183 -251252 1581896
5395 1581896 304528 -1869809 -1862291 -13106 1138364 882345 517812 185753 -1521432
5386 -1521432 -4356529 -5488536 -3179752 443654 2104229 1784753 2403288 5327540 8268052
5377 8268052 8395908 5991520 3527113 2027538 372453 -1754543 -2524239 -836955 1269074
5368 1269074 1196971 -218734 259598 3532907 6920948 7868211 6464252 3819912 658399
5359 658399 -1492039 -684081 2032806 2422633 -1116814 -4147518 -2086045 2559613 3298487
5350 3298487 -910856 -4313951 -3014801 -94425 -878 -1936366 -2115220 138980 2224256
5341 2224256 2668206 2099683 367553 -3795660 -9580005 -13309585 -12232004 -7511859 -2319379
5332 -2319379 1728906 4903587 7186145 7636360 6012126 3569743 1623371 283148
5324 283148 -590428 -120594 2431319 5534102 6191747 3499513 -7697 -1473853 -898683
5315 -898683 63084 1225886 3779141 7487806 10039039 9568335 6488895 2568610 -631727
5306 -631727 -2353372 -3020925 -4158296 -6545406 -8383242 -7023264 -2962814 -243718 -1836289
5297 -1836289 -6129875 -9224079 -9399364 -7856197 -6104260 -4583836 -3693272 -4354893 -6729221
5288 -6729221 -9102503 -8931332 -5299988 -302433 2381814 812115 -3223661 -5838762
5280 -5838762 -4662811 -733492 2661685 2470345 -2093690 -8809076 -13899879 -15263874
5272 -15263874 -14188880 -13151050 -12607077 -11283499 -8903090 -6619828 -4970458 -3569804
5264 -3569804 -2970604 -4452059 -7261372 -8298577 -5772301 -1566191 1077368 873981 -1162520
5255 -1162520 -3052358 -2774200 428575 4819688 7787156 9064011 10248005 10917785 8510148
5246 8510148 3314162 -107184 884319 2527373 -118968 -5820143 -9005437 -7506253
5238 -7506253 -4307359 -2123768 -332299 2132713 4142395 3842712 876603 -3292930
5230 -3292930 -5811467 -3779564 2565786 8466336 9034616 4896731 964222 -8724 507192
5221 507192 1100048 2812860 5920622 7763516 6097750 2359923 -503909 -1659897 -1877846
5212 -1877846 -1128733 870690 2606732 1686382 -1968067 -5222488 -4463856 1035319 8136474
5203 8136474 12056955 10440692 5730922 2770818 3684305 6014177 6219187 3724202 745713
5194 745713 -682480 -306785 993233 2222646 2827343 3024815 3512897 4493251 5325148
5185 5325148 5498506 5488181 6115943 7297193 7865322 6655544 3668839 208878 -2200331
5176 -2200331 -3067933 -2901175 -2114726 -834889 107784 -566782 -2444756 -2963634 -660094
5167 -660094 2254748 2515242 151094 -2075959 -3019619 -4095183 -5663291 -5504363 -2284905
5158 -2284905 1732238 3305974 2214862 1030865 1813480 4422141 7442516 9446142
5150 9446142 9538994 7622683 4286597 383367 -2945759 -4139373 -2326746 1130740 3427070
5141 3427070 3289493 2157710 1692777 1234110 -995556 -4731434 -7244812 -6478061 -3646658
5132 -3646658 -1825699 -2214200 -2975388 -2352111 -1657523 -3340761 -6517562 -6964250 -2419912
5123 -2419912 4263557 8553311 8826407 6114694 1701636 -2662788 -4327752 -2647867
5115 -2647867 -836919 -1754357 -3282182 -1548193 2523427 4355174 2914764 1831088
5107 1831088 2773375 2729209 -413310 -4064492 -5180950 -4603908 -4460014 -4439311 -3576775
5098 -3576775 -3009103 -3854963 -4542440 -3373660 -1989092 -3053113 -5644820 -6119338 -3181975
5089 -3181975 534177 2060754 1335623 570817 1549660 3711165 4474656 1833492 -3180850
5080 -3180850 -7322593 -8350655 -6409723 -2734423 1111201 3042766 2105541 564460
5072 564460 1701815 5158815 7321572 6668088 5210971 3912773 974510 -3463192 -5293032
5063 -5293032 -2186097 2238558 3506884 2542886 3058607 5277872 6485499 6128214 6191965
5054 6191965 7396314 8704218 10055265 12240957 14351449 14345763 12147757 9737110 8269715
5045 8269715 7263625 6527133 6915076 8907293 11535017 12772103 10908011 6537458 3044317
5036 3044317 3145409 4977402 4345934 937900 -1455048 -1513652 -2435149 -5623107 -7452291
5027 -7452291 -5359426 -2273407 -1135306 279200 4407114 8191109 7847273 5629120
5019 5629120 5866711 7343904 5896551 2089548 -194133 -842935 -2564189 -4384535 -3004844
5010 -3004844 138761 17261 -3835490 -6681782 -6292602 -5226857 -5129235 -4809731 -4593248
5001 -4593248 -6672974 -10199920 -11491313 -10021513 -9054337 -9745044 -9859633 -8762100 -8192345
4992 -8192345 -7690915 -4969211 -1267853 -385318 -1923767 -1828603 -84018 -741572 -3319930
4983 -3319930 -2117854 3654999 7019333 3943767 -458303 -618550 1452872 1667243 1190801
4974 1190801 2736058 4565384 3881897 2418874 3524060 6636548 8827378 8962454 6973379
4965 6973379 2371655 -3214915 -5605649 -3491466 -792733 -606126 -732705 1580373 4613240
4956 4613240 5528961 4953322 4648204 4195557 3224128 3250601 4392411 4311559 3131853 4619315
4946 4619315 9471218 12801691 11856242 10454846 11539974 11488578 7264001 3324635 4828503
4937 4828503 8811661 9040270 5678600 3274405 2518966 862296 -1389638 -2111434 -2218936
4928 -2218936 -3539271 -4088232 -1169001 3015836 4263875 2749130 1632453 1836056 2775750
4919 2775750 5105592 7978174 7260900 1624761 -3505413 -3432189 -1274044 -1814372 -3166302
4910 -3166302 -1434334 1001737 -311163 -3238116 -2552415 1061187 3105841 3357467 4541124
4901 4541124 6043630 5963434 5972541 7459495 7199288 3673635 2217224 6399300 10745515
4892 10745515 10351442 10111394 14695954 18103064 14905734 12483712 18026903 23105088
4884 23105088 17746246 10035985 12331077 17899241 14178721 9397525 18212287 29747689
4876 29747689 23894311 12240339 18317433 15945836 -56486730 -196937733 -306636608
4869 -306636608 -298206917 -201886964 -118461957 -93367918 -90026158 -72179722 -51625276
4862 -51625276 -46939878 -46612296 -35328254 -22280825 -20643872 -23090031 -17824307 -10254874
4854 -10254874 -10484112 -14112012 -12143008 -8038987 -9662787 -13908527 -13322751 -10236568
4846 -10236568 -11498593 -15293977 -14861358 -10687572 -8721647 -9872648 -9929494 -7218074 -3465620
4837 -3465620 192901 2653371 1715179 -1840552 -3141798 -434869 1489628 -559754
4829 -559754 -2259821 747576 5048362 5202948 2347110 628539 -577853 -4150297 -8508518
4820 -8508518 -10243725 -10740162 -13606683 -17553090 -18103466 -14992422 -12015315 -10482400 -8324814
4811 -8324814 -5311049 -4131586 -5984672 -8956937 -10996048 -11443924 -9888431 -6392132
4803 -6392132 -2705825 -944116 -1325776 -2731488 -4429636 -5872593 -6501898 -7284603 -10285864
4794 -10285864 -14981515 -17570357 -16125771 -13685186 -13569730 -14397607 -12971921 -9637911
4786 -9637911 -7009053 -5183978 -2180396 1808878 4158590 3534570 1195316 -1122205
4778 -1122205 -2570227 -3028814 -3244566 -4290281 -5700533 -5682796 -4363313 -4572789 -7715851
4769 -7715851 -11299946 -12577117 -12019066 -10882679 -8357338 -4283835 -1826090 -3382121
4761 -3382121 -5879000 -4435853 547019 4122151 3914755 2593757 3453496 7002690 11898317
4752 11898317 16079346 16849194 12753367 5814608 -241569 -3981328 -6628453 -9052838
4744 -9052838 -10665376 -10906665 -9729193 -7084353 -3839517 -2285501 -3481813 -5006765
4736 -5006765 -3778015 -289422 2402759 2996503 2625513 2180053 1855041 2565702 4647994
4727 4647994 5676892 2928531 -2083534 -4773237 -3315270 -204921 2159351 4058060
4719 4058060 5949810 6783583 6255010 6032817 7047627 7599008 5779202 2270321 -677720
4710 -677720 -1944151 -2074699 -1928692 -1712333 -1088441 6782 643075 -257225 -1890411
4701 -1890411 -1811842 571716 2407830 1291519 -838640 -420883 2342621 4089036 3578073
4692 3578073 2716228 2331925 786385 -2283824 -4277880 -3214472 -376120 1986421 3197227
4683 3197227 3112074 916610 -3405561 -8163582 -11722547 -13502593 -12580012 -7816730 -747503
4674 -747503 4116577 3884053 542120 -1954704 -2108583 -845407 881435 2255609 1986623
4665 1986623 15832 -1189471 568830 3754620 4630506 1876631 -2378052 -5873892
4657 -5873892 -8361600 -10174554 -10771591 -9727509 -7874554 -6298938 -4781705 -2196106
4649 -2196106 1652460 5294700 6986419 6498648 5082658 3768165 2464141 1122800
4641 1122800 850114 2657651 5457692 6686111 5159931 2283624 189948 -315098 298821
4632 298821 1286694 1999030 2006489 1403229 638131 37945 33148 1488257 4682779 8070116
4622 8070116 9353622 7974030 5400515 3010794 1166449 410696 1584859 4038453
4614 4038453 5535543 4997294 3767941 3013176 1550408 -1960854 -5866253 -6716260 -3378751
4605 -3378751 1709027 5424182 6737624 6447084 5420535 3862700 1852420 -79193
4597 -79193 -1174879 -1225965 -832792 -629471 -567554 -429744 -591613 -1398546 -2120559 -1698905
4587 -1698905 -464151 115715 -550830 -1677044 -2601389 -3226691 -2835906 -523403 2381538
4578 2381538 2394789 -1952542 -7328313 -8782757 -5126870 267642 3570446 4016329 3375949
4569 3375949 3026918 2192363 -746358 -5309388 -8358921 -7647112 -5036812 -4155322 -5343521
4560 -5343521 -5715705 -4339584 -3829727 -5492942 -6496766 -4373275 -1244979 -270544 -388364
4551 -388364 1427907 4380260 4756744 2019319 -319808 -98057 1133848 1693233 1926166
4542 1926166 1826614 185340 -2376739 -2916792 -627924 1270690 309185 -1420283 -872218
4533 -872218 1083378 1639572 1016269 1790745 4178491 5586104 4848244 3667195 3177532
4524 3177532 1844000 -1913834 -6849907 -10030896 -9938688 -7683643 -5859080 -6487022 -9164354
4515 -9164354 -10974644 -9236752 -4668358 -906027 -674375 -3459056 -7125834 -10367646
4507 -10367646 -12740222 -13540458 -12136372 -9261205 -7066483 -7582562 -11035392 -15317893
4499 -15317893 -17284436 -15454422 -11657377 -9118201 -8629957 -7746145 -4383757 34754
4491 34754 2296282 1443397 -430639 -1189544 -930694 -932430 -1549083 -1948208 -1439840 -409361
4481 -409361 75338 -607175 -1967752 -3007578 -3408062 -3582370 -3417645 -1976126 714387
4472 714387 2521713 1437205 -1352518 -2380599 -169959 3106010 4886864 5337654 5797978
4463 5797978 5674920 3237154 -878843 -3372933 -2209156 925055 3211605 4402846
4455 4402846 6351556 9596607 12373453 13265493 13147676 13523286 14054786 13083913 10100431
4446 10100431 6331290 2953995 41786 -2498102 -4300774 -5514451 -7187182 -9646484
4438 -9646484 -11383179 -10805930 -8593295 -7036718 -7284886 -8396004 -8937162 -8260523 -6143708
4429 -6143708 -2457309 2299883 6856658 9853510 10309343 7859351 3509983 -262638
4421 -262638 -1613365 -1500899 -2347181 -4563218 -6125856 -5798232 -4724949 -4123135 -3508283
4412 -3508283 -2493561 -2351939 -3814346 -4712254 -2183031 3201967 7470257 7438150 3502896
4403 3502896 -1621794 -5553400 -7426143 -7573561 -6693942 -5270070 -3812102 -3242464 -3963640
4394 -3963640 -4563964 -3132146 -467294 -7372 -3183166 -6703788 -6515339 -3017110 94651
4385 94651 1126797 1693961 3080541 4208396 3726658 1787929 -967698 -4243665 -7152845
4376 -7152845 -8238442 -7403629 -6481549 -6996214 -8370416 -8977430 -7991967 -5696643 -2945681
4367 -2945681 -863916 -254040 -848937 -1734142 -2538533 -3398981 -3848404 -2850470 -134807
4358 -134807 3318475 6103322 6991374 5220419 1358099 -2529097 -4849608 -6168768 -7583260
4349 -7583260 -8293999 -6896968 -4503744 -3940330 -5783797 -7829949 -8860414 -10131036 -12254045
4340 -12254045 -13440627 -12400697 -10636949 -10067478 -10339192 -10327714 -10411023 -11046452 -10614129
4331 -10614129 -7291109 -2409843 465207 -123152 -1855052 -1522286 1675765 5909491
4323 5909491 8722824 8811766 6358892 2240434 -2570504 -6605911 -7837068 -5437536 -1492167
4314 -1492167 615276 -105957 -1507999 -1583918 -939635 -1288857 -2924801 -4758260 -5978688
4305 -5978688 -6796933 -7999770 -10009116 -11846682 -11490656 -8477783 -5481910 -5306030 -6787710
4296 -6787710 -6399266 -3896956 -2995406 -5437951 -7872759 -6741646 -3458710 -2009060 -3312213
4287 -3312213 -4720793 -3993904 -1425441 1290381 2577163 2042274 1185842 1962531 3781704
4278 3781704 3758948 1159379 -703570 1030250 4500634 5859393 4534228 2919311 1986049
4269 1986049 227973 -3277838 -7196182 -9556975 -9669150 -8571847 -8313337 -9860063 -11140561
4260 -11140561 -8941663 -3702229 -34468 -812078 -3264826 -3224560 -761391 1229319 1691269
4251 1691269 1256887 -556677 -4105978 -6948993 -6432014 -4136443 -3870931 -5847174 -6892685
4242 -6892685 -6210899 -6615604 -9405480 -11957156 -11691762 -9241295 -6391352 -3781180 -2151864
4233 -2151864 -3307688 -7807838 -13144052 -15855081 -14838791 -11876763 -9612127 -9434260
4225 -9434260 -10697986 -11666010 -11341242 -10152392 -9064903 -9094834 -11472614 -16279783 -20696379
4216 -20696379 -21190510 -18199081 -15823564 -16037950 -16621764 -15923464 -15358385 -15311647 -13425186
4207 -13425186 -9655914 -7846826 -8928356 -8276790 -3972499 -1333653 -4062546 -7893179
4199 -7893179 -9403868 -13074063 -21135486 -25320635 -20226504 -16150602 -24003831 -35917894
4191 -35917894 -39568007 -43716127 -63024710 -79412186 -51863462 23536353 93012337
4184 93012337 105573228 72394132 42238904 35947163 35080207 25214912 16474967 18361866
4176 18361866 22539707 20441840 17734084 20639068 23291755 19180061 13144334 12065604
4168 12065604 13131968 10506359 5901981 4100805 4273741 3253231 2002063 2244909
4160 2244909 1824232 -524075 -944344 2931689 6235426 4108123 14573 71888 3243912
4151 3243912 4458614 4165210 6907217 12162991 14385516 12062115 9953181 11382466
4143 11382466 13894880 14039202 12024814 9999684 9038573 9181551 9866060 9457542 6690826
4134 6690826 3188604 2294285 4743175 7470540 7386577 4691563 1870681 809977 1509764
4125 1509764 2676409 3135974 3094289 3796056 5520565 6737375 6186141 4957631 5188325
4116 5188325 7186471 9148626 9447109 8054025 5888508 3789732 2123907 711206
4108 711206 -791983 -2121689 -2533888 -2142453 -2367286 -4181694 -6315997 -6085114 -2119160
4099 -2119160 3973417 8661383 9437982 7151138 5118806 5355492 6244104 4965308 1588439
4090 1588439 -880581 -327226 2325008 4886242 6100606 5753537 4211757 2462278 1506367
4081 1506367 1462517 2112001 3764399 6134108 7215283 5485825 2606621 1317853 1157886
4072 1157886 -609483 -4083768 -6464137 -6948832 -7730386 -9136083 -8271713 -4454126 -1567320
4063 -1567320 -2080153 -2688987 399239 5167514 6961839 5376175 3509427 2276884 260386
4054 260386 -1723736 -742076 3242929 6367785 5693610 2221938 -1349561 -3364625 -3444072
4045 -3444072 -2375439 -2024535 -3290085 -4260898 -2598328 601153 1996735 1022547 794651
4036 794651 3394324 6915219 8329579 7232854 5515106 4761482 5017709 5261646 4651809
4027 4651809 3944109 5186111 8704392 11164929 8830942 2578422 -2677451 -3780774
4019 -3780774 -2231094 -846676 -104216 966056 2337405 3173713 3310116 3173484 2917036
4010 2917036 2487133 1885619 867667 -812731 -2565301 -3428143 -3651753 -4524657 -6148543
4001 -6148543 -6784363 -5176664 -2255085 392837 2541229 4631143 6009476 5395767 2939442
3992 2939442 649517 499401 2583126 5180453 6261144 4922976 1818401 -1352954
3984 -1352954 -2729209 -1381620 1521671 2857105 306289 -4496484 -7054399 -5286645
3976 -5286645 -2247449 -1997605 -4171147 -5000808 -2914527 -257030 630117 260376 143861
3967 143861 480753 962643 1971458 3501728 4225172 3006354 468113 -1865225 -3005934
3958 -3005934 -2418265 108507 3482587 5558102 5611672 5359056 6190643 6752133 5107756
3949 5107756 2219686 917129 1750055 2262819 734698 -1519903 -2464340 -2131641 -1751956
3940 -1751956 -1421908 -404606 829321 697809 -1126952 -2864866 -2719150 -759166 1910946
3931 1910946 4653350 6757196 6499521 2945190 -1332231 -1767692 2729789 7669769 8172324
3922 8172324 4980766 3009463 4640037 7337870 8275393 8295800 9453578 10736636 9002928
3913 9002928 3666307 -1939734 -4284784 -3078419 -467178 1668187 2581310 1955277 -88160
3904 -88160 -2334237 -2937882 -903922 3266300 8190254 12162856 13426733 11281850 7384944
3895 7384944 4662961 3980052 2898631 -1011567 -6462369 -9638909 -8690914 -5350593 -2226508
3886 -2226508 -373521 192187 -401381 -1313617 -1121457 340378 1458011 1116569 232036
3877 232036 -59644 -350103 -1573350 -2780615 -2166841 140935 1992989 1869787 400930
3868 400930 -754030 -638638 289496 563406 -838955 -3021781 -3918463 -3012286 -2116831
3859 -2116831 -2589980 -3260728 -2596624 -1512228 -1926620 -3471794 -4042176 -3268453 -3025403
3850 -3025403 -4259283 -5470931 -5015507 -3233487 -1509403 -458099 165366 548857 471529
3841 471529 -354824 -1623793 -2100950 -794882 1095139 824245 -2084978 -4245604 -2757788
3832 -2757788 31221 -965892 -6525982 -11581685 -11491185 -7352042 -3786122 -3278755 -4256255
3823 -4256255 -3745255 -585405 3685585 6443404 6539602 5265984 4579284 4921962 5373665
3814 5373665 5113640 3750775 1168372 -1600550 -2327956 -146717 2686300 3486512 2806931
3805 2806931 3308968 5792675 8838347 11735930 14800898 16842827 15320282 9606472
3797 9606472 1849996 -5533642 -10940035 -12608126 -9870002 -5610605 -4066482 -5415489
3789 -5415489 -5767790 -3254794 -462361 475848 1295208 3832142 6237561 5921671 3828655
3780 3828655 2757440 3072161 2804484 935888 -1695790 -4080650 -5996667 -7756794 -9669465
3771 -9669465 -10922742 -9307072 -4125494 963351 1297961 -2234008 -3884695 -1289017
3763 -1289017 1426517 663006 -1376155 -1587824 -1454644 -3202361 -4455732 -2140050 1164953
3754 1164953 645959 -2758492 -3808001 -1644586 -1045821 -4580459 -8932439 -10280210 -8666678
3745 -8666678 -5429463 -569400 5050652 8347222 7611131 5291125 4813579 6074995 6138554
3736 6138554 3548472 174982 -1186408 -20611 1585334 1750296 1154677 1396878 1501142
3727 1501142 -1356748 -6885045 -10500589 -9211445 -5902557 -4818618 -5248116 -3541692
3719 -3541692 315562 2620039 1953825 1146077 2869253 6490572 9617083 10170711 7187786
3710 7187786 2222444 -658962 814140 3653727 3593322 1230035 205206 574555 -771282
3701 -771282 -3389600 -2836123 1970073 6378896 6949665 5920897 6435475 7750728 7919814
3692 7919814 7348514 6828211 5394351 2825132 1130937 1106345 678466 -847301 -509978
3683 -509978 3358247 7460422 8310524 7393359 7648427 7905070 5515642 2240790 2326152
3674 2326152 5748791 8230343 7765387 6758542 7286159 8143016 7628309 6246936 5449947
3665 5449947 5802968 7214508 9242628 10606685 9880417 7130667 3842989 1272572 -153624
3656 -153624 -323807 297636 306663 -1317320 -3718273 -5087855 -4711543 -3165814 -1154734
3647 -1154734 797724 2225041 3335300 4980947 7125085 8404281 8161120 7564063 7581168
3638 7581168 7421853 6405700 5620900 5843275 5482406 2948034 -212590 -1063188 631247
3629 631247 2380806 2427562 1114034 -582966 -1807112 -1645988 -148001 1005942 560298
3620 560298 -427558 -570100 -853787 -3015575 -6161475 -7679374 -7081805 -6396973 -6891688
3611 -6891688 -7676082 -7487740 -5932671 -3275308 -770394 -383778 -2032475 -2106254 2546552
3602 2546552 9858721 14658989 15009190 13303930 11413890 8410162 3714568 -820051
3594 -820051 -3171825 -3027003 -655806 3516203 7406467 8041875 5200617 2300778 2489777
3585 2489777 5377781 8210140 8539988 5413751 -62072 -4901959 -6907917 -7280848 -8528269
3576 -8528269 -10230708 -9915172 -7910609 -7366049 -8741072 -8612854 -5742345 -4103601 -7006454
3567 -7006454 -11719666 -13406130 -11660238 -9398991 -7426517 -4321135 -674199 682796
3559 682796 -1194134 -4183706 -6410181 -8110394 -9700836 -10283699 -9023232 -6616755 -4686558
3550 -4686558 -4408576 -5707790 -7003076 -6098324 -2415219 1826260 3570141 1890168 -1626878
3541 -1626878 -4875454 -6754774 -7295304 -7278838 -7446081 -7498852 -6460439 -4432180 -2890487
3532 -2890487 -2505923 -2006058 -413000 857813 -191587 -3032101 -5042271 -4731391 -3136758
3523 -3136758 -2262190 -3323127 -6275035 -9921436 -12514184 -12967338 -11379377 -8272723 -4266320
3514 -4266320 -751945 732687 722759 1701828 4362207 5732885 3044912 -1947363 -4883055
3505 -4883055 -4061968 -1336044 1483469 4243242 6572399 7265630 6260634 5036284 4229458
3496 4229458 2689454 -245358 -3105088 -3872331 -2126462 957838 3633057 4162171 1691955
3487 1691955 -2647425 -6331762 -7660186 -6734982 -4218057 -413158 3846780 6596839
3479 6596839 6183467 3063443 -495109 -2556733 -3206302 -4060611 -6022641 -7829020 -7609515
3470 -7609515 -5764416 -4810516 -5851945 -6988639 -6415984 -5201492 -5029554 -4922100 -2919103
3461 -2919103 139577 1600496 1164932 865442 1110093 185005 -2046768 -3537535 -3909784
3452 -3909784 -5242950 -7680144 -8022040 -4899059 -1913197 -2674392 -5437245 -5964257 -3635045
3443 -3635045 -1294586 -611000 -1098824 -2643089 -5339164 -7293578 -6150497 -2983331 -1505602
3434 -1505602 -2919186 -4393115 -3380340 -842049 817282 790722 -301838 -1816867 -3173996
3425 -3173996 -3889408 -4376488 -5559905 -7192302 -7819004 -6789573 -4968194 -3227486 -1771946
3416 -1771946 -1086168 -1660088 -2471637 -1888524 -592611 -1163791 -3838933 -5374882 -3711812
3407 -3711812 -1126720 -451774 -483074 1792808 5914915 8267891 7168483 4579529 2722097
3398 2722097 1716950 1014738 753617 917468 996143 1156899 2177965 3768774 4640143
3389 4640143 4778902 5886663 8703055 11449070 11992735 10370033 8153621 6300846 4586353
3380 4586353 2472946 -134259 -2419952 -2772530 -432768 2786360 3954446 2780418
3372 2780418 2238731 4409546 7345960 7678633 5082707 2209803 841568 131897 -1274665
3363 -1274665 -3036637 -3640075 -2317510 28435 1606585 1412909 82611 -1299707 -2897969
3354 -2897969 -5432764 -7852338 -7678392 -4596459 -1765577 -1916922 -3732317 -4079103 -2430755
3345 -2430755 -593368 894183 3014704 5128489 4727224 1144683 -2940415 -4768690
3337 -4768690 -4336816 -3049988 -1471357 389253 2204340 4059349 6618661 9180967
3329 9180967 8931458 3990027 -3393608 -8369128 -8266815 -4915228 -2284138 -2583064 -4681235
3320 -4681235 -5856897 -4947437 -3667700 -4518085 -7670191 -10716924 -11474104 -10175921 -8866695
3311 -8866695 -9448954 -12167440 -14945587 -14505777 -9697245 -3678209 -1008016 -2374613 -4149005
3302 -4149005 -3464602 -1359478 -150098 -438321 -2213358 -6086703 -10948957 -12768462 -9050426
3293 -9050426 -3158608 -765847 -2575734 -3972817 -1992537 773168 327506 -3360037
3285 -3360037 -6787544 -7064129 -4130311 91709 3467858 5068718 5627370 6400106 7498243
3276 7498243 7883793 6869842 4779750 2256011 -75162 -1360851 -1114712 -132919 208725
3267 208725 -454978 -1552783 -2796388 -3823195 -3017395 1139599 7190273 11258786 11268492
3258 11268492 8790673 5951403 2675798 -1594566 -5505853 -7227386 -6908995 -5538701
3250 -5538701 -2491961 3167327 9405949 12047266 9448331 4300868 185083 -1723205
3242 -1723205 -1805437 -128101 2877327 5379071 5816621 4897130 4218100 3583588 1672480
3233 1672480 -995344 -2106981 -926262 589835 843253 621033 806973 207578 -2269908
3224 -2269908 -4847891 -4795005 -2255213 236723 1377922 1633239 681371 -2483762 -6603395
3215 -6603395 -8497025 -7354029 -5836366 -5665269 -4976259 -1826971 2301449 4708233 5008971
3206 5008971 4290993 2865119 1264199 1418984 4050920 6616934 6696382 5748497 6436606
3197 6436606 7936581 7546497 5595673 4687154 4923362 4160122 2505810 1940702 1454449
3188 1454449 -2342899 -8727308 -11987438 -9131897 -4240883 -2758234 -5218103 -9097408
3180 -9097408 -13093565 -16431990 -17188727 -14820814 -11937698 -10487097 -8728283 -5173598
3172 -5173598 -2688081 -4566019 -8748368 -10511483 -9451113 -9068873 -10270667 -10334911 -8520796
3163 -8520796 -7718874 -9207749 -10142537 -8414160 -6429572 -7191422 -9034169 -7496625 -1645893
3154 -1645893 4014514 4315783 -1017139 -6900533 -7786683 -3113000 2300650 3499602 254234
3145 254234 -4023596 -6876988 -8415538 -9150835 -8824140 -7645128 -6446944 -5002650 -2185658
3136 -2185658 1473082 3409328 2326005 135759 -711074 -326665 -270012 -623508 -201701
3127 -201701 846858 720873 -1330544 -3478826 -3457517 -1508522 -41354 -340780 -778634
3118 -778634 810739 3717850 4907720 3075634 417345 -479820 75265 45198 -1253882
3109 -1253882 -3033426 -4955869 -7021836 -8074037 -6690848 -3595451 -1169234 -372404
3101 -372404 18071 915256 1608195 1400257 742401 56713 -997998 -2370046 -3107732
3092 -3107732 -2747518 -2123802 -2268557 -3401575 -5104899 -6415074 -5936680 -3310632 -340507
3083 -340507 995519 1220235 1940164 2369391 346523 -3174239 -4323738 -1969271 486808
3074 486808 520401 -65898 539563 163560 -3471626 -7813176 -8616581 -6093261 -3702872
3065 -3702872 -2194923 632365 4786794 7239220 6605918 4677423 2615214 -445116
3057 -445116 -3791247 -3990355 441225 6070326 8628643 8028878 7153621 7368008 7548217
3048 7548217 6551140 4597947 2601030 1443469 1536154 2300444 2764656 3178753 4901870
3039 4901870 8055709 10686656 11160131 9985025 8278158 6018815 3159918 867035
3031 867035 -87877 -816961 -2317372 -3261238 -2015488 133880 327164 -1817783 -4069130
3022 -4069130 -5219497 -6022328 -6257029 -3956528 1167210 6062544 7884563 7338939 6646996
3013 6646996 5816284 3294510 -502873 -2773448 -1614192 1952068 5552583 7806552
3005 7806552 8740720 8854133 8249749 6314640 2359915 -2919620 -7083884 -8076850 -6532263
2996 -6532263 -4781892 -3576381 -1261492 3198404 7750376 9134732 6749171 3407349
2988 3407349 2146134 3175764 4433453 4552200 4366386 5272375 6964354 7887698 7757322
2979 7757322 8109788 9657469 10577483 8945075 5761227 3444075 1960688 -770943 -4441569
2970 -4441569 -5535794 -2500036 1037957 706788 -2876812 -5601301 -5590924 -4137992 -1830532
2961 -1830532 2170762 6501786 7298001 3523993 -459077 -301673 2515537 3249713 868974
2952 868974 -985139 135110 1918627 793292 -3133111 -6200388 -5275866 -631998 4517851
2943 4517851 6508657 4000615 -651377 -3130874 -1239076 2752518 4468164 2032302
2935 2032302 -2414857 -5684350 -6848867 -6987932 -6661207 -5101471 -1961071 1414227 3174245
2926 3174245 2811507 1256227 -280021 -908698 -212469 1086399 947885 -2080599 -6494728
2917 -6494728 -8619932 -6529241 -2374569 40315 -517178 -1870806 -1618794 -46221 675774
2908 675774 -456988 -2105838 -2775773 -3226156 -5405392 -9058931 -11048812 -9074753 -4904572
2899 -4904572 -2394922 -2969320 -4692947 -5337074 -4339830 -1820060 1925436 5192472 5427882
2890 5427882 2519170 -120350 599425 3735513 6030865 6182535 5555462 5482103 5846409
2881 5846409 5970948 5090941 2203648 -2692510 -7237178 -8509177 -6612243 -4831916 -5593516
2872 -5593516 -7630359 -7916976 -5305553 -1412224 1298346 1477166 -562941 -3456544 -5826807
2863 -5826807 -6868103 -6177052 -3862144 -1340686 -875131 -2801350 -3923955 -795482 5352197
2854 5352197 9192547 7566154 3088619 240592 -207907 -829049 -2888566 -4711405 -4688656
2845 -4688656 -3654083 -3387546 -4175240 -4924563 -4881593 -4158880 -2929939 -1168335 702495
2836 702495 1821991 2119230 2914591 5369435 8491219 9808553 8441265 6458447 6327812
2827 6327812 7847406 8796177 8019394 6319718 4496214 2321993 -90432 -1590257 -1576986
2818 -1576986 -978137 -622163 97658 1575294 2164597 36272 -3452595 -4363172 -753375
2809 -753375 4889091 8678752 9557300 9218927 8702393 7045377 3762948 967669 1347891
2800 1347891 4368618 6170924 3992476 -347926 -2470687 -440618 3409940 5537012
2792 5537012 4855789 3049458 2244436 3025426 4156923 3714170 949923 -2487009 -3683097
2783 -3683097 -1427776 2241485 4046108 2832539 356876 -1180151 -1609505 -2383973 -4147870
2774 -4147870 -5566039 -4943685 -2481860 -149335 563409 -111497 -1219148 -2053767 -1655517
2765 -1655517 1108008 5626774 8878284 8385058 5094179 1646715 -1216372 -4199556
2757 -4199556 -6319478 -5607481 -3131504 -2667026 -5029376 -6086992 -2552591 3160824 6588894
2748 6588894 7270837 7873601 9056902 8978997 7201738 5500715 4672723 3497871 1244776
2739 1244776 -1180158 -2737458 -2769450 -394591 3956982 6827035 4986972 696894 -2233
2730 -2233 4659361 9463318 9307995 5576734 2853380 2259602 1437495 -696493 -2665692
2721 -2665692 -3173891 -2384274 -857342 694236 1170414 443815 115721 1106910 1702959
2712 1702959 213048 -1701330 -1098390 1838419 4516646 6239713 8160245 9176246
2704 9176246 6125327 -815343 -6734936 -7962006 -6423519 -5927644 -6867408 -7246398 -6684866
2695 -6684866 -6225528 -5491133 -3230040 -236885 1088228 255333 -446375 1041693 4319463
2686 4319463 7510187 8952405 7706077 3872030 -1017326 -4821864 -6361973 -5743659
2678 -5743659 -3598548 -1016428 234554 -1077326 -4089208 -6627478 -7565326 -7337623 -6346486
2669 -6346486 -4387867 -1861302 -60654 275336 -415005 -1659442 -3431538 -5061049 -5160745
2660 -5160745 -3613438 -2508185 -3885320 -7097760 -9376113 -8757813 -5903754 -3340171
2652 -3340171 -3203106 -5185556 -6466086 -4426336 239512 4027407 4648418 3414698 2825869
2643 2825869 2989715 1914779 -1191566 -4501323 -5653736 -4280142 -2121379 -1175641 -1945577
2634 -1945577 -3219410 -3431072 -2183817 -246455 1743063 3873044 6169892 8018942
2626 8018942 8703416 7874301 5353936 1433799 -2362576 -4018194 -3157496 -1442059 -402705
2617 -402705 -238146 -1256990 -4384626 -8712094 -10575874 -7622497 -2649600 -690288 -2800832
2608 -2800832 -5396797 -5503531 -3753217 -1834816 -1988 1647298 1959446 605639 -607522
2599 -607522 -154132 789515 197951 -1449453 -1642751 576706 3191511 3643853 1600166
2590 1600166 -1089437 -2484062 -2133645 -852351 515955 1623471 2000794 902878 -1399187
2581 -1399187 -2907979 -1856156 858928 2646863 2644515 2600010 4037257 6151735 7187110
2572 7187110 6463451 4249734 1023219 -2106928 -3444131 -2420142 -544269 279196 -309168
2563 -309168 -1512603 -2715663 -3600234 -3885575 -3856615 -4272599 -4922654 -4262999 -1432844
2554 -1432844 2287857 4871730 5329293 3335521 -1313696 -7339463 -11391343 -10839373 -6664798
2545 -6664798 -2087622 1071508 3237866 5076460 6424401 6960547 6546293 5162781 3473975
2536 3473975 2620148 2295443 308758 -4184721 -8317470 -8777052 -6529285 -5506066 -7031566
2527 -7031566 -8587193 -8239678 -7128719 -6665220 -6128791 -4537022 -2632941 -1348825 -63760
2518 -63760 1960335 3828954 4298225 3689032 3065561 2476862 1434332 344439 77063
2509 77063 645542 1483794 2506976 3741363 4324710 3097893 175445 -2909077 -4653715
2500 -4653715 -4687784 -3612839 -2297132 -1274042 -467156 518850 1802111 3097530 4113841
2491 4113841 4747139 4989013 5053706 5439779 6401268 7565634 8507661 9278124 9862403 9857351
2481 9857351 9481111 9916943 11364832 11734878 9056402 4435395 575648 -1974776 -4612607
2472 -4612607 -7108182 -7266539 -4629863 -1772608 -1051960 -2347721 -4513858 -6426814 -6098817
2463 -6098817 -2045852 3308881 5058716 2400424 342182 2558689 6120025 6454748
2455 6454748 4142203 2646650 2085443 275310 -1649654 -89416 4715415 8075856
2447 8075856 7207786 4126684 1466695 -640188 -2334285 -2358499 -371687 1887892 3238540
2438 3238540 4321783 5124918 4165855 1605410 98122 469040 -564008 -5560754 -11477017
2429 -11477017 -12849612 -8673578 -3100751 181621 1525224 3186152 5881674 8198590
2421 8198590 8307489 5917039 3013987 2224315 3768021 4834125 2975264 -773958 -3513826
2412 -3513826 -4363078 -4880517 -5977687 -6574057 -5848499 -4970107 -5303548 -5949421 -4661381
2403 -4661381 -1138555 1922144 1750511 -1184071 -3684894 -3415944 -915038 2028717 4466781
2394 4466781 5815581 4771735 691367 -4443515 -7435754 -7334434 -5846768 -4397396
2386 -4397396 -2849923 -1428337 -1512353 -3439778 -5502667 -6427428 -7065138 -8142367 -8076928
2377 -8076928 -5004293 162477 4556464 6406074 5728930 3115890 -223810 -2051553
2369 -2051553 -912171 1885265 3773593 3985835 3496486 2671661 1180636 -102235 450102
2360 450102 2567299 3961530 3308554 1527902 -288988 -2284220 -4481926 -5785366 -5233919
2351 -5233919 -2997483 371300 4216994 6916204 6571437 3430770 63910 -1591402
2343 -1591402 -1674598 -359551 3124435 7955322 10713825 9355538 6352407 5148312 5049210
2334 5049210 3003348 -497222 -1430871 1365771 3811510 2413289 -647061 -877970 2189427
2325 2189427 5018288 5303478 4128625 2966640 1333320 -1570760 -4726483 -6163951
2317 -6163951 -5196490 -2955628 -1188037 -917186 -1635465 -1476986 947196 4336331 5261449
2308 5261449 1877723 -3628595 -7419581 -8246613 -7836447 -7347196 -5599025 -1824552 1546833
2299 1546833 899485 -4090715 -9674849 -12021372 -10773712 -8266546 -6457882 -5537350 -4775119
2290 -4775119 -3610201 -1993341 -291506 1221298 2982827 5584859 8051272 7687825
2282 7687825 3082799 -3176366 -6478732 -5041452 -1279875 1853375 3955481 5775718
2274 5775718 6813344 6157789 4412793 2729815 748498 -2396331 -5596449 -6626948
2266 -6626948 -5278217 -3196494 -558125 4216467 10597198 14709102 13768027 9581299
2258 9581299 5739419 3372145 1943924 2219395 5160348 8808192 9672961 7384655 5193631
2249 5193631 5407015 6770729 7009513 5701218 3691251 1525227 -484063 -2007063 -3267672
2240 -3267672 -4681108 -5668903 -5383107 -4747413 -5713384 -8017132 -8981365 -7408152 -5296546
2231 -5296546 -4509886 -4242553 -3454497 -3269307 -4610193 -5650180 -4414420 -2187703 -1337139
2222 -1337139 -1239753 212437 2137359 1610128 -1148230 -2497936 -868238 1221613 1750777
2213 1750777 2156966 3807039 4789199 3005450 155475 -425515 1425692 2874372 2282220
2204 2282220 609372 -997244 -2497392 -3654419 -3555814 -1976993 284805 2748982 5451323
2195 5451323 7575426 7693913 6163067 5520738 6966774 7657311 3680491 -4330978 -10633968
2186 -10633968 -10438532 -5210575 -492364 665152 -26374 -328179 -1137530 -4028322 -7160593
2177 -7160593 -6948563 -3584750 -1576066 -3636186 -6885171 -7195849 -5025910 -3921970 -4520792
2168 -4520792 -3677902 223245 4427760 5612518 4002989 1879574 -30222 -2296368
2160 -2296368 -4124255 -3683221 -1096518 1117549 1171861 -26434 -654633 -290362 369425
2151 369425 892631 1158749 834860 -194564 -1456372 -2752453 -4664320 -7219729 -8814544
2142 -8814544 -7803625 -4778961 -1992300 -841533 -1201323 -2667786 -4549476 -4849060 -1757273
2133 -1757273 3135707 5498040 3489419 293864 -303502 1068829 1137790 -795483 -2474577
2124 -2474577 -2820434 -3062385 -3449721 -2173391 1092472 3408849 2494283 452857 1028708
2115 1028708 4237902 6433868 5546934 3710932 3886668 5780024 6551860 4678394 1707673
2106 1707673 343938 1779172 4956545 7589405 7638816 4662497 445645 -2199050 -2123808
2097 -2123808 -1101397 -1538630 -3277739 -4019399 -2879806 -1632011 -1642951 -1562200 223809
2088 223809 2367106 2215546 34850 -988062 909209 3991137 5782778 5761461 4427940
2079 4427940 1716465 -2137293 -5406088 -6162922 -4338925 -1567792 558966 1407258 1042508
2070 1042508 -143517 -1588739 -2450928 -1281616 3295269 10343279 15785436 15932039 11876342
2061 11876342 8221575 7207672 6687567 4624701 2431415 1880226 1463442 -1231609 -5221366
2052 -5221366 -7197970 -5921856 -2832641 904236 5092625 8622245 9779008 8730437
2044 8730437 7424565 6796500 6161894 5420213 5491961 6201280 6063875 4840158 4115983
2035 4115983 4530865 4574023 3232806 1806764 1598838 1462897 -597666 -4475115 -8215885
2026 -8215885 -10431169 -10910308 -9450359 -5842967 -1147345 2399598 3358038 2337218 854600
2017 854600 -494840 -1962719 -2896389 -1365641 3297059 8263904 9478656 6517076 3196106
2008 3196106 2386155 2431389 573160 -2273078 -3255468 -2821166 -4468684 -9186834 -13509705
1999 -13509705 -13980255 -10937998 -7077831 -4640240 -4677577 -6562911 -7458901 -4878368 -549226
1990 -549226 1155162 -464962 -1110753 2023102 6200856 8001932 8436272 9689476 10091729
1981 10091729 6985933 2466239 1160767 3176073 4148873 2234121 259665 211032 191454
1972 191454 -1385850 -2535155 -1169633 1040589 1068252 -1007501 -2478378 -1934176 -590095
1963 -590095 -114276 -672641 -1100698 -275780 1571235 2874968 2669774 2200177 3333871
1954 3333871 5563911 6381144 4865930 2958718 2523215 3049029 3162266 2562177 1324789
1945 1324789 -939296 -3839068 -5677772 -5626289 -4949040 -4601891 -3340789 -245442 2504049
1936 2504049 2179381 -9653 -82002 2954928 5440861 4087158 217294 -2541068 -2974616
1927 -2974616 -2726011 -3026265 -3138110 -2120778 -517801 372178 47792 -973180 -1997054
1918 -1997054 -2755864 -3497918 -4767759 -6643485 -7931211 -6976046 -4064312 -2064858 -3122216
1909 -3122216 -5311305 -4839831 -1667500 -70639 -2317819 -4677759 -2421520 3246188
1901 3246188 6722660 5496279 2493942 1143723 1745175 3317494 5570291 7811401
1893 7811401 8891196 9509643 11582731 13927897 12085877 4858946 -2169624 -2946112 1545806
1884 1545806 5543172 6405184 6430784 7905798 10323637 12428749 13600020 12927208 9861890
1875 9861890 6178623 4656341 5355273 5518178 3471016 372763 -2085426 -3330788 -2989827
1866 -2989827 -786851 2106814 3844345 4475806 5601024 7217180 7380422 5448904 3104930
1857 3104930 1506213 -82044 -2170469 -4117747 -5868222 -7748663 -7952819 -3733327
1849 -3733327 3661850 8925641 9404555 8164415 8027036 6671308 1420115 -4600674 -6047268
1840 -6047268 -3144806 -956826 -1810516 -3185230 -3027550 -2648670 -3466219 -4545832 -4677048
1831 -4677048 -4159734 -3410886 -1971622 269228 2643719 4824641 6625619 6873535 4720048
1822 4720048 1919023 1186709 2152821 1656566 -1528527 -4990648 -6297101 -5601057 -3844009
1813 -3844009 -1132231 1846697 3213113 2159208 41658 -1663778 -2576716 -2102704 485815
1804 485815 3747680 4599680 2471838 381554 534416 1556792 1566822 953976 92172
1795 92172 -2595761 -7518693 -11466917 -11354829 -8409336 -5802866 -4178701 -2516183 -1336262
1786 -1336262 -1610830 -2218213 -1937026 -2210275 -4182327 -4891992 -1102989 4283932 4895512
1777 4895512 -194440 -5335663 -6554165 -5786641 -5690315 -5388884 -3687486 -2092946 -1758157
1768 -1758157 -1013116 1143361 2283155 381577 -2335708 -2624353 -1035385 -257658 -620194
1759 -620194 -667491 -715322 -2278878 -4771184 -6060554 -5973232 -6366962 -7906852 -9381368
1750 -9381368 -10097931 -10405230 -9738998 -6638179 -1314078 3640528 5722187 4581873 1752888
1741 1752888 -385684 193689 3349089 6415118 7202687 6764771 7274778 7928821 5781555
1732 5781555 716768 -3463859 -3984929 -2605707 -2587297 -4060607 -4381357 -2113491 1098528
1723 1098528 2429457 675834 -2677084 -4780459 -4244574 -2810340 -3467227 -6746300 -9898885
1714 -9898885 -10148385 -7735646 -5191682 -4548381 -5943010 -8156780 -9730328 -9995293 -9511791
1705 -9511791 -9153722 -8760321 -7521193 -5721774 -4777253 -4988360 -4634299 -2398577 289712
1696 289712 675039 -2079186 -6320919 -10270786 -13508948 -15809568 -15808145 -12048067 -5237486
1687 -5237486 1513726 5390071 6576307 7578360 9802458 11721082 10994889 7570937
1679 7570937 3647066 1051720 -168112 -791264 -1353727 -2172001 -3319676 -4272179 -4414532
1670 -4414532 -4076472 -4229192 -5023852 -5500335 -4925897 -3636800 -2430181 -1842213 -2012715
1661 -2012715 -2545005 -2693758 -2447253 -2915719 -4609042 -6066984 -5703355 -4260015 -3475595
1652 -3475595 -3031501 -1380929 793748 1112820 -258925 -312031 1938395 3743478 3315795
1643 3315795 2783605 4257922 6230872 6726252 7030676 8791636 9943423 7558935 3147769
1634 3147769 687469 485045 -610913 -3286222 -4576690 -3114394 -1387249 -1488280 -2060684
1625 -2060684 -1061563 1160576 3046213 3848454 3294472 1346063 -659457 -691169 1207566
1616 1207566 2834163 3196618 3640740 4858100 5524528 5222836 5912797 8519937 10474228
1607 10474228 9045897 5358417 2695383 2181710 2499509 2855002 3757751 5144783 5742963
1598 5742963 4588998 2243173 567740 1595704 5726598 10550518 12622367 11038740
1590 11038740 8070032 5885273 4454807 3361343 3406930 4954874 6572939 6918570 6335757
1581 6335757 5284519 3277889 977115 924571 3911691 6789193 6475180 4138640 2630636
1572 2630636 1872363 170478 -1758149 -2059322 -1725751 -3004394 -4565307 -2859159 1670769
1563 1670769 4333171 2908856 271341 -961713 -2064836 -4350495 -5498685 -2776153
1555 -2776153 2573850 7021823 9202444 10350532 11619885 13020589 14083036 14018192 12056701
1546 12056701 8710806 5753819 4287379 4074621 5048508 7428644 9750484 9362648 6257214
1537 6257214 4031256 5302289 8287628 9792502 9455775 8714764 7378262 4057000 -784582
1528 -784582 -4523855 -4911960 -1736677 3105249 6139922 4456811 -1122637 -6273083 -7804630
1519 -7804630 -6521556 -4496153 -2099423 397273 1162464 -319916 -1138745 875527 2974664
1510 2974664 1361787 -2522596 -4045592 -2619740 -2052078 -3907622 -5460661 -4899525 -3836698
1501 -3836698 -3231289 -1163834 3234011 7286286 8586819 8353457 8703801 9245401 8746888
1492 8746888 7923398 8154220 9201498 10204736 11132256 11400478 9180207 4408441 637616
1483 637616 1247020 5088816 8317851 9379414 9683296 10250110 10364645 9346250 7528135
1474 7528135 5536509 4179461 4646665 7178570 9909105 10602641 9227213 7460251 6221966
1465 6221966 5232031 4481386 4465912 5174501 6210201 7624494 9500419 11337269 13062695
1456 13062695 15698169 19386980 21720263 20133366 15445226 10914001 8138956 6101882
1448 6101882 4098780 3167801 4106459 6052774 7675574 8271420 7384885 4937743 2039093
1439 2039093 131295 -835547 -1775662 -2137025 -448226 2462689 3351183 814371 -2452688
1430 -2452688 -3070628 -864558 2090291 4483154 5923302 5590859 3165950 515741 249119
1421 249119 2593539 5409112 7284156 8830769 10534488 11113986 9230239 5834837 3362361
1412 3362361 2706692 2207391 71041 -3112256 -5131780 -4872319 -3050995 -428313 3048983
1403 3048983 6741966 8662341 7679041 5146853 2831814 489183 -2500699 -4354538
1395 -4354538 -2708774 1143312 3062366 1619642 -203560 151412 1369332 1287889 435734
1386 435734 118703 -578879 -2787909 -4481980 -2549523 2329219 6005680 6140291 4440011
1377 4440011 3210578 2225119 116908 -2949925 -5390790 -6117987 -5406132 -4250716 -3324683
1368 -3324683 -2397037 -861993 997880 1976175 1739587 1629538 2521496 2948471 1152977
1359 1152977 -1686701 -2501996 -533200 1739585 2274642 1968796 2597628 4030983 4717508
1350 4717508 3720887 1154648 -2430775 -5956746 -7730383 -6459956 -2264318 3490082
1342 3490082 8772085 11361585 10069711 6215186 2970149 2405980 3684674 4591405 4116879
1333 4116879 3022207 2602881 3522936 5372616 7000837 7797252 8725761 11229223 14989300
1324 14989300 17898102 18564801 17615217 16058289 13812701 10727777 7765366 5992708
1316 5992708 5266665 4836471 4338467 3403245 1505234 -713510 -1260991 627561 2830328
1307 2830328 2846922 1003251 -548366 -1076346 -1467452 -1865074 -1465478 -535061 -364930
1298 -364930 -1003750 -1135381 -551914 -573079 -1329538 -836495 1928886 4751311 4571852 1121771
1288 1121771 -3148417 -5905084 -6491132 -5478524 -4082448 -3696232 -4855240 -6712467 -8201593
1279 -8201593 -9354259 -10684668 -11645913 -10775434 -7589722 -3661525 -1345595 -1487332 -2631240
1270 -2631240 -2730833 -1501050 -369934 85954 1335198 4367451 7298235 7697490 6552776
1261 6552776 6947746 8768173 8378039 4879340 2834860 5800749 10302731 10489166 6825340
1252 6825340 5060640 6946230 7477629 2991297 -2805492 -4147783 -1256754 901510
1244 901510 146284 -773969 637431 3058630 4226888 4772755 7059914 11214169 14322968
1235 14322968 13939623 11224823 9610201 10561665 11833191 10566008 7092412 4223224
1227 4223224 3324182 3172201 2907117 3687388 6116061 8123815 7551773 5513561 4795509
1218 4795509 5646144 5709182 4054197 2745415 3773587 6472886 8834349 9632483 8314425
1209 8314425 4591005 -288044 -3105512 -1478522 3140710 6679458 6743473 4716326 3447267
1200 3447267 3755615 3825320 1841466 -1358164 -2835796 -905307 2763937 5193954 5757784
1191 5757784 6468450 8614195 10725774 10693802 8692721 6892668 6996498 9021676 11858359
1182 11858359 14001298 14218173 12535186 10338355 8805128 7714813 6539804 5936382
1174 5936382 6908622 8934039 10259677 9939525 8461613 6621275 5094924 4913065 6655692
1165 6655692 8888631 9061218 6684152 4235561 4021371 5364739 6011781 5287495 4507373
1156 4507373 4937771 6768100 9727656 13216820 15777459 15846795 13533066 10638130 8422187
1147 8422187 6319016 3590091 1295691 1278067 3424397 5341036 5206782 3907046 3557061
1138 3557061 4713772 6214177 7340346 8531962 9542276 8454681 3961508 -1982854
1130 -1982854 -5354359 -4236027 -843405 1133533 599237 -202535 1145219 4006068 5237096
1121 5237096 3097062 -39229 76161 4444710 9133186 9642831 6163281 3128451 3862722
1112 3862722 7208713 9738190 9832519 8607757 7612687 6766761 4661956 498590 -4365629
1103 -4365629 -6984395 -5500932 -1370125 1747598 1696282 -35546 -276098 2148476 5262763
1094 5262763 6389992 5226351 4032548 4688917 6140760 5708578 2887335 370537 478893
1085 478893 2096005 2830587 2944242 4533006 7293027 8253606 6344351 4123598 3432768
1076 3432768 2240233 -1612743 -5691662 -5369502 -160635 5427452 7339199 5625916
1068 5625916 2470616 -695664 -3087945 -3779990 -2604394 -672175 1177409 3512344
1060 3512344 6888945 10172917 11459300 10278208 7989408 6234723 5700424 6160694 6952429
1051 6952429 7267585 6447228 4324181 1354133 -1597448 -3769839 -5021367 -5751628 -6167822
1042 -6167822 -5881307 -4536429 -2568383 -887223 43209 433391 688349 1118293 1920962
1033 1920962 3035558 4191387 5351429 6670770 7688737 7262846 5000542 2221344
1025 2221344 778110 1386483 3611817 6553350 8677275 8189910 5121346 2137172 1482574
1016 1482574 1859369 440270 -2601908 -4221972 -3188068 -1769596 -1895757 -2272946 -872851
1007 -872851 1738322 3350076 3013747 1450983 -269234 -1038208 198116 3168972 5940832
998 5940832 7103995 7437513 8253692 9128574 8661010 6654179 4246915 2660128 2883409
989 2883409 5398992 8769957 9802127 7091990 3490071 2897744 5277527 7134216 6544863
980 6544863 5156448 5029518 6056474 7364872 9127105 11568184 13491165 13157988 10108331
971 10108331 5409522 633110 -2997709 -5023135 -5698247 -5281966 -3609113 -914366 1510950
962 1510950 2594786 2963455 3799403 4672191 4266196 3017881 2790883 3606471 3159934
953 3159934 711400 -788710 1629799 6567915 9541736 7950916 3114750 -2044418
945 -2044418 -5572570 -6896542 -6406912 -5236829 -4602199 -4871381 -5503928 -5734221 -4927327
936 -4927327 -2691486 619305 3764268 5788991 7270945 9608820 12963478 15606700
928 15606700 15641613 12967996 9268771 6345467 4805811 4289891 4528080 5724023 7869408
919 7869408 10192571 11735981 12237224 11964850 10919357 8863446 6100032 3531873 1817812
910 1817812 989539 907680 1455844 2196157 2474020 2037000 1098250 -108819 -1215095 -1435279
900 -1435279 -442545 540726 -198448 -2381570 -3471310 -1434670 3081956 7645760 10079572
891 10079572 9335707 5713924 1001310 -2650060 -4726362 -6321526 -7701716 -7394768 -4621150
882 -4621150 -1109848 892482 1209968 903697 153350 -1082230 -1246312 1538316 6389350
873 6389350 9919384 10016874 7878021 5891543 4923470 4378187 3884898 3920024 4856133 5798087
863 5798087 4796242 930895 -3773325 -5761736 -3971475 -1136496 -18342 117285 1475810
854 1475810 3634646 4150650 2662160 1461893 1731378 1891116 495081 -1521332 -2520725
845 -2520725 -2176585 -791345 1573773 4127417 5185393 4316968 3289525 3638038 4612703
836 4612703 4783305 4287809 3960456 3443655 1965135 214264 -315170 572392 1874910
827 1874910 3277436 5399876 8170835 10315048 10819944 10081992 9248513 8777841 7788715
818 7788715 4937058 385770 -3239306 -2938457 1210048 5650915 6869139 4414606 334781
809 334781 -2773568 -2668451 1387939 6929930 9571222 7810966 5027226 4786525 5870460
800 5870460 4469532 -124736 -5045507 -8094173 -9141029 -7866197 -3964215 -21410
792 -21410 -358642 -5500023 -10730657 -11721630 -9024881 -5549593 -2467523 199234 1495891
783 1495891 961780 595427 2630101 6216773 8581249 8659500 7479586 5794563 3617823
774 3617823 1599523 758054 1150794 2466141 5120280 8812424 11083853 10015609 7657804
765 7657804 7608825 9334631 8446166 3368079 -1775800 -2604564 106461 2549663 2976915
756 2976915 2187137 846453 -823117 -1767783 -1254991 -812600 -2575557 -5871741 -7697213
747 -7697213 -6685775 -4545096 -3203702 -2422795 -937836 1459280 3751700 4759985 4086429
738 4086429 2794599 2938991 5164033 7039091 5588749 1591577 -762909 820571 3929955
729 3929955 5135586 4393563 3876784 4146584 4103133 3933361 5273302 8136655 9992150
720 9992150 8852508 5810213 3570914 3447458 4594362 5533827 5754728 6074214 7587059
711 7587059 9977493 11294405 10304136 8640436 9109131 11839917 13896415 13233484 11188154
702 11188154 9954321 9341725 7799794 5437179 3905530 3774891 3993822 3859899 3733038
693 3733038 3677506 3136519 2357869 2563782 4100569 5779158 6646083 7024140 7111371 6110353
683 6110353 3863030 1898410 1370882 1219256 207842 -317839 1773369 5254358 6139597
674 6139597 3200555 266488 1376903 5605829 8826564 9222778 8467982 8100734 7704624
665 7704624 7156475 7888434 10354368 12242555 11269672 8528296 6853922 6587014 5464113
656 5464113 2743910 795817 1541168 3507060 4177712 3771510 4547500 7146751 9885975
647 9885975 11570950 12779001 13806910 13399683 10785095 7533434 5788155 5372020 4167367
638 4167367 1091968 -2654291 -5294796 -6197312 -5675677 -4213124 -2444862 -1116437 -390315
629 -390315 339683 1379586 1866724 625950 -2190197 -4822296 -5376182 -3413771 -196561
620 -196561 2397621 3278562 2771591 1984422 1579681 1284059 574576 -449363 -964404 122571
610 122571 3589030 8968628 13709835 14171851 8880847 880428 -4334425 -3791301 622017
601 622017 4917526 7096537 7998031 9224966 11407800 13971658 15444187 14254207 10361934
592 10361934 6032575 3926431 4362090 5400574 5525914 5023169 4683451 4680727 5195444
583 5195444 6597345 8149847 7979422 5531132 2809672 1776658 1686370 789125 -295203
574 -295203 743982 4080445 6979299 7345934 6095085 5281078 5638606 6894890 8836624
565 8836624 10721780 10898016 8557206 5191783 3054584 2733103 3325627 4295738 5725415
556 5725415 7060722 7052153 5127319 1943215 -1388744 -3813945 -4300410 -2423944 830725
547 830725 3730069 5515361 6844093 8417298 9875901 10314217 9373950 7597089 6000420
538 6000420 5305823 5269219 4923113 3898424 3241993 4309534 7024254 9888156 11562054
529 11562054 11727126 10580186 8442072 5980567 3940720 2357913 698650 -1006525
521 -1006525 -1852597 -1189924 461533 1889914 2207032 1363484 175339 -131584 1045841
512 1045841 3087234 5032185 6748351 8399156 9120864 7618976 4269690 1270774 147618
503 147618 221114 134679 -222845 -103141 775235 2171353 3802104 5077851 5194407 4374499
493 4374499 4169053 5453027 6843387 6288808 3661475 565045 -1881433 -3622259 -4338512
484 -4338512 -3226800 -456894 2436788 4230215 5253247 6420674 7630823 7766388 6205182
475 6205182 4025305 3416399 5458088 8487028 9512221 7725966 5686675 6106970 8306812
466 8306812 9215455 7446600 4821681 3766692 4554712 5539148 5162221 3312460 1291507
457 1291507 636089 1601033 2980842 3710322 3852229 3391679 1475039 -1561062 -2801344
448 -2801344 -47775 4136805 4852567 1555522 -984603 589684 3896331 5088970 4311304
439 4311304 4001758 4153673 2837379 174860 -1797213 -2856703 -4899157 -8287141 -10796173
430 -10796173 -10839658 -9322104 -7579577 -5708443 -3794040 -2747951 -2877848 -3321649 -3764113
421 -3764113 -4923710 -6405417 -6108364 -3251120 -188207 658710 267907 1303442 3924526
412 3924526 5633486 4946139 2984391 1237121 -293829 -2109737 -3936674 -5265701 -6107315
403 -6107315 -6466896 -5924499 -4450963 -2906740 -1934144 -908087 1106108 3610806 4852804
394 4852804 3959339 2237671 1859584 3476559 5565755 6139478 4739708 2605827 1261343
385 1261343 1345446 2575067 4155274 5068423 4570822 2839071 838320 -700226 -1796428
376 -1796428 -2514099 -2425734 -1433158 -541248 -737236 -1230421 -35694 3236550 6190444
367 6190444 6186672 3628474 1723987 2973815 6738988 10516764 12731683 13514070 13315069
358 13315069 12046890 9888072 7860864 6697308 5649059 3501306 717481 -556104
350 -556104 848504 3255890 3849212 2040865 297765 1284867 4673916 7417195 7247350
341 7247350 5258673 4327611 5266341 5788058 3840286 723208 -530593 806836 2652467
332 2652467 3650416 5026008 7893503 10584275 10559230 8085530 6016177 6018318 6716798
323 6716798 5952941 3577065 1328821 739207 1810661 3379144 4236753 3919737 2662629
314 2662629 907902 -748292 -1258756 357087 3749817 7186179 9286826 10131660 10196041
305 10196041 9359487 7955205 7540694 8959724 10474718 9722469 7003753 4637692 3483471
296 3483471 2461560 1398998 1579585 2949357 3631376 3375406 4718740 8892349 12984396
287 12984396 13497191 10852424 7918569 5732785 3525234 1750943 1856483 3438495 4643228
278 4643228 5361746 7135309 9649899 10341296 8369774 6293177 6494855 8210442 9498043
269 9498043 10041162 10270962 9516416 7110611 4174117 2317976 1321280 -107955 -1785639
260 -1785639 -2009121 48398 3236526 5692913 6258384 4905583 2756412 1445360 1555280
251 1555280 1910069 1190116 -148964 -441220 1058877 3419688 5016390 4574077 1887583
242 1887583 -1605447 -3686149 -3786702 -3698669 -4687203 -5125652 -2949521 502623 1733676
233 1733676 -28591 -1930081 -1840581 -803831 -134241 1167082 4176431 7275272 7900303
224 7900303 5869088 3004009 520295 -1206745 -1283422 856283 3617841 4624880 4031653
215 4031653 4291000 6238952 7566964 6152321 3179257 1628185 2742911 5209992 7115091
206 7115091 7594599 6946982 6030832 5463325 4999277 3991657 2632816 2012667 2531527
197 2531527 3119737 2768109 2040189 2063151 2667850 2843968 2719293 3490087 5067252 5332933
187 5332933 2821925 -763836 -2124155 -326914 2020931 1990108 -175893 -1556470 -72581
178 -72581 3438525 6639645 8194109 8353362 7791419 6801775 5584152 4578285 4204855
169 4204855 4517281 5180117 5638854 5481466 4972110 5083003 6561452 8986883 11074023
160 11074023 11804575 10995631 9115091 7055365 5704231 5014186 3833625 1496429 -857822
151 -857822 -1711761 -1506381 -1901190 -2765611 -1974296 1156600 4246134 4870886 3507072
142 3507072 2020715 863699 -338360 -770903 642743 2996110 4313947 4291376 3981553
133 3981553 3189295 736612 -2553436 -3772123 -1671513 1560439 3177287 2792872 1676415
124 1676415 941454 1320575 2971887 4499063 3870799 1382558 -46943 1274463 3509476
115 3509476 4293005 4141277 4933115 6605429 7624870 7610857 7263243 6588988 5391134
106 5391134 4708529 5494294 6523496 5936845 4270843 3456607 3293913 1792799 -971278
$$ [...]
##END NTUPLES=NMR SPECTRUM
##END=
