##TITLE=31Pdec_DE-164_oil_TFA
 DMSO-d6_CCl4, 64 sc
 15.7.2026
##JCAMPDX= 6.0         $$ Bruker NMR JCAMP-DX V2.0
##DATA TYPE= NMR SPECTRUM
##DATA CLASS= NTUPLES
##ORIGIN= UXNMR, Bruker Analytische Messtechnik GmbH
##OWNER= root
$$ XWIN-NMR		Version 3.5
$$ Wed Jul 15 13:20:00 2026 Russian Standard Time (UT+4h)  she@DPX200
##.OBSERVE FREQUENCY= 81.013821
##.OBSERVE NUCLEUS= ^31P
##.ACQUISITION MODE= SIMULTANEOUS
##.ACQUISITION SCHEME= undefined
##.AVERAGES= 64
##.DIGITISER RES= 17
##SPECTROMETER/DATA SYSTEM= spect
##.PULSE SEQUENCE= zgpg30
##.SOLVENT NAME= DMSO
##.SHIFT REFERENCE= (INTERNAL, DMSO, 0, 197.392)
##AUDIT TRAIL= $$ (NUMBER, WHEN, WHO, WHERE, WHAT)
$$ ##TITLE= Audit trail, XWIN-NMR		Version 3.5
$$ ##JCAMPDX= 5.01
$$ ##ORIGIN= Bruker BioSpin GmbH
$$ ##OWNER= she
$$ F:/spectra/data/she/nmr/P31/2/pdata/1/auditp.txt
$$ ##AUDIT TRAIL=  $$ (NUMBER, WHEN, WHO, WHERE, WHAT)
(   1,<2026-07-15 13:19:03.23 +0400>,<she>,<DPX200>,
      <created by zg, POWCHK disabled, PULCHK disabled
       configuration hash MD5:
       00 E9 B6 7A A2 85 ED C7 34 08 36 98 17 FE 4E 26
       data hash MD5: 32K
       1D 92 E8 7D 07 C6 95 B1 7D 29 0A 31 18 1D DB 9C>)
(   2,<2026-07-15 13:19:06.50 +0400>,<she>,<DPX200>,
      <Start of raw data processing
       efp BC_mod = 2 LB = 1.5 FT_mod = 6 PKNL = 1 PHC0 = 1920.807 PHC1 = 160.0991 SI = 64K 
       data hash MD5: 64K
       A0 2F 83 31 DF C3 26 C6 87 D7 3A C2 32 53 81 94>)
(   3,<2026-07-15 13:19:24.23 +0400>,<she>,<DPX200>,
      <pk PHC0 = 49.98161 PHC1 = -8.4 
       data hash MD5: 64K
       C0 82 63 0D EB FD CE 09 99 E3 93 5F 25 B9 B8 48>)
(   4,<2026-07-15 13:19:30.53 +0400>,<she>,<DPX200>,
      <abs ABSG = 5 
       data hash MD5: 64K
       FA BE 93 17 5B 2F AD 22 F8 F9 6C 2D 05 21 42 41>)
$$ ##END=
$$ 
$$ hash MD5
$$ 72 F7 7B B9 F5 90 CF EE C8 19 D4 E6 85 87 95 7D
##$RELAX= 
##$RELAX= 
##$RELAX= 
##$RELAX= 
##$RELAX= 
##$RELAX= 
##$RELAX= 
##$RELAX= 
$$ Bruker specific parameters
$$ --------------------------
##$DU= <F:/spectra>
##$EXPNO= 2
##$NAME= <P31>
##$PROCNO= 1
##$TYPE= <nmr>
##$USER= <she>
##$AMP= (0..31)
100 100 100 100 100 100 100 100 100 100 100 100 100 100 100 100 100 100 
100 100 100 100 100 100 100 100 100 100 100 100 100 100 
##$AQSEQ= 0
##$AQ_mod= 1
##$AUNM= <au_zg>
##$AUTOPOS= <>
##$BF1= 81.014009
##$BF2= 200.13
##$BF3= 200.13
##$BF4= 200.13
##$BF5= 200.13
##$BF6= 200.13
##$BF7= 200.13
##$BF8= 200.13
##$BYTORDA= 1
##$CFDGTYP= 0
##$CFRGTYP= 5
##$CHEMSTR= <none>
##$CNST= (0..31)
1 1 145 1 1 1 1 1 1 1 1 1 1 1 1 1 1 1 1 1 1 1 1 1 1 1 1 1 1 1 1 1 
##$CPDPRG= <waltz16>
##$CPDPRG1= <>
##$CPDPRG2= <waltz16>
##$CPDPRG3= <>
##$CPDPRG4= <mlev>
##$CPDPRG5= <mlev>
##$CPDPRG6= <mlev>
##$CPDPRG7= <mlev>
##$CPDPRG8= <mlev>
##$CPDPRGB= <>
##$CPDPRGT= <>
##$D= (0..31)
0 1 0 0 0 0 0 0 0 0.06 0 0.03 2e-05 3e-06 0 0 0.0002 0 0 0 0 0 0 0 0 0 
0 0 0 0 0 0 
##$DATE= 1784107142
##$DBL= (0..7)
120 120 120 11 120 120 24 19 
##$DBP= (0..7)
150 150 150 150 150 150 150 150 
##$DBP07= 0
##$DBPNAM0= <>
##$DBPNAM1= <>
$$ [...]
##$SUBNAM3= <"">
##$SUBNAM4= <"">
##$SUBNAM5= <"">
##$SUBNAM6= <"">
##$SUBNAM7= <"">
##$SUBNAM8= <"">
##$SUBNAM9= <"">
##$SW= 400.765351723535
##$SWIBOX= (0..15)
0 1 3 0 0 0 0 0 0 0 0 0 0 0 0 0 
##$SW_h= 32467.5324675325
##$TD= 32768
##$TD0= 1
##$TE= 0
##$TE2= 300
##$TE3= 300
##$TEG= 300
##$TL= (0..7)
0 120 53 12 22 120 120 120 
##$TP= (0..7)
150 150 150 150 150 150 150 150 
##$TP07= 0
##$TPNAME0= <>
##$TPNAME1= <>
##$TPNAME2= <>
##$TPNAME3= <>
##$TPNAME4= <>
##$TPNAME5= <>
##$TPNAME6= <>
##$TPNAME7= <>
##$TPOAL= (0..7)
0.5 0.5 0.5 0.5 0.5 0.5 0.5 0.5 
##$TPOFFS= (0..7)
0 0 0 0 0 0 0 0 
##$TUNHIN= 0
##$TUNHOUT= 0
##$TUNXOUT= 0
##$USERA1= <user>
##$USERA2= <user>
##$USERA3= <user>
##$USERA4= <user>
##$USERA5= <user>
##$V9= 5
##$VALIST= <valist>
##$VCLIST= <CCCCCCCCCCCCCCC>
##$VD= 0
##$VDLIST= <DDDDDDDDDDDDDDD>
##$VPLIST= <PPPPPPPPPPPPPPP>
##$VTLIST= <TTTTTTTTTTTTTTT>
##$WBST= 1024
##$WBSW= 4
##$XGAIN= (0..3)
0 0 0 0 
##$XL= 0
##$YL= 0
##$YMAX_a= 7042
##$YMIN_a= -3192
##$ZGOPTNS= <>
##$ZL1= 120
##$ZL2= 120
##$ZL3= 120
##$ZL4= 120
##$ABSF1= 197.3918
##$ABSF2= -203.3724
##$ABSG= 5
##$ABSL= 3
##$ALPHA= 0
##$AQORDER= 0
##$ASSFAC= 0
##$ASSFACI= 0
##$ASSFACX= 0
##$ASSWID= 0
##$AUNMP= <proc_1d>
##$AZFE= 0.1
##$AZFW= 0.5
##$BCFW= 0
##$BC_mod= 2
##$BYTORDP= 0
##$COROFFS= 0
##$CY= -3
##$DATMOD= 1
##$DC= 0
##$DFILT= <>
##$DTYPP= 0
##$F1P= 0
##$F2P= 0
##$FCOR= 1
##$FTSIZE= 65536
##$FT_mod= 6
##$GAMMA= 0
##$GB= 0
##$INTBC= 1
##$INTSCL= 9.790993e-09
##$ISEN= 30
##$LB= 1.5
##$LEV0= 0
##$LPBIN= 0
##$MAXI= 10000
##$MC2= 0
##$MEAN= 0
##$ME_mod= 0
##$MI= 50
##$NCOEF= 0
##$NC_proc= -8
##$NLEV= 6
##$NOISF1= 182.463
##$NOISF2= 159.3651
##$NSP= 0
##$NTH_PI= 0
##$NZP= 0
##$OFFSET= 197.3918
##$PC= 4
##$PHC0= 1970.789
##$PHC1= 151.6991
##$PH_mod= 1
##$PKNL= yes
##$PPARMOD= 0
##$PSCAL= 0
##$PSIGN= 0
##$REVERSE= no
##$SF= 81.014063255964
##$SI= 65536
##$SIGF1= 159.3651
##$SIGF2= -187.1042
##$SINO= 113.3802
##$SIOLD= 16384
##$SREGLST= <1H.CDCl3>
##$SSB= 0
##$STSI= 65536
##$STSR= 0
##$SW_p= 32467.5324675325
##$SYMM= 0
##$S_DEV= 0
##$TDeff= 32768
##$TDoff= 0
##$TI= <>
##$TILT= no
##$TM1= 0
##$TM2= 0
##$TOPLEV= 0
##$USERP1= <user>
##$USERP2= <user>
##$USERP3= <user>
##$USERP4= <user>
##$USERP5= <user>
##$WDW= 1
##$XDIM= 65536
##$YMAX_p= 204723040
##$YMIN_p= -182086830
$$ End of Bruker specific parameters
$$ ---------------------------------
##NTUPLES= NMR SPECTRUM
##VAR_NAME=  FREQUENCY,     SPECTRUM/REAL,   SPECTRUM/IMAG
##SYMBOL=    X,             R,               I
##VAR_TYPE=  INDEPENDENT,   DEPENDENT,       DEPENDENT
##VAR_FORM=  AFFN,          ASDF,            ASDF
##VAR_DIM=   65536,         65536,           65536
##UNITS=     HZ,            ARBITRARY UNITS, ARBITRARY UNITS
##FACTOR=    0.49542278885378, 1,            1
##FIRST=     15991.5117654749, 0,            0
##LAST=      -16476.0207020576, 0,           0
##MIN=       -16476.0207020576, -182086830,  0
##MAX=       15991.5117654749, 204723040,    0
$$ Real data points
##PAGE= N=1
##DATA TABLE= (X++(R..R)), XYDATA
$$ [...]
9580 678946 2052104 924503 -1103447 -1834727 -1586002 -2732578 -5627519 -7281806 -5628726
9571 -5628726 -2943514 -2648826 -4441642 -5624397 -6023587 -7726801 -10168120 -9778266 -5645095
9562 -5645095 -1579445 -589258 -868084 106808 818642 -1408867 -5345583 -7695254 -8164323
9553 -8164323 -8436840 -7551896 -3290051 2316181 4255473 2064860 803242 2780377 3569378
9544 3569378 -605266 -6073587 -6705328 -2622991 679491 57716 -2778656 -5217046 -5931868
9535 -5931868 -3795675 1182080 5748400 5993473 2476798 -485897 -887057 -880845 -2099008
9526 -2099008 -2999544 -2278106 -1334855 -1235420 -215336 3228311 7035804 8077217 6374013
9517 6374013 4278023 2583438 60557 -3536266 -6258197 -6144312 -3453605 -457188
9509 -457188 650174 -127866 -672590 272702 910735 -785990 -2569533 200297 7154208
9500 7154208 11400581 8216929 1932547 133850 3307977 5158264 2428102 -773107
9492 -773107 507476 5437614 9350376 9438044 6341779 2037525 -1729769 -3896420 -4504844
9483 -4504844 -4303101 -3528656 -2023611 -610463 -697327 -2028873 -2584722 -1519387 -507226
9474 -507226 -1127183 -2521835 -2952735 -2272287 -1355838 -242974 1438949 2886038 2618442
9465 2618442 405259 -2488977 -4845204 -6397607 -7451825 -8381675 -9252273 -9379490 -7810973
9456 -7810973 -4930772 -2844582 -3089798 -4478405 -4484725 -2590014 -945313 -1518699 -3746497
9447 -3746497 -5564278 -5894623 -5239888 -4159359 -2170792 1394048 5957492 9894768 12203067
9438 12203067 13211399 13299786 11844792 8371770 4051310 681633 -1497592 -3381751
9430 -3381751 -4423505 -2539336 2466626 7102976 7488831 3707069 -553150 -2299315
9422 -2299315 -1942167 -1912107 -3761317 -6843947 -9130828 -9064182 -6919748 -4451795 -3255223
9413 -3255223 -3755555 -5538744 -7677554 -8535409 -6533244 -2036056 2314689 4079962 3338186
9404 3338186 1956775 1398474 1978250 3205988 3685340 1662514 -2766625 -6684892 -7326724
9395 -7326724 -5648945 -5121723 -7072211 -9157694 -8736254 -5828111 -2040357 1627307 4679221
9386 4679221 6179670 5455673 3227804 1004642 -236601 -102162 1655482 4515041 6676119
9377 6676119 6475778 4293025 2114963 1292719 1624990 2482540 3563582 4242622 3447406
9368 3447406 1049751 -1386669 -2139909 -1124304 594027 2380108 3925095 4089437 1726698
9359 1726698 -1920255 -3412805 -915729 3333679 5686250 5316951 4244598 3821991 3305993
9350 3305993 2082200 1326178 2481788 5240532 7882818 8877374 7662439 4742038 1583795
9341 1583795 -329552 -807066 -682050 -234364 964686 2495834 2904648 1618497 -348376
9332 -348376 -2025847 -3054033 -2146846 2388375 9032802 12579436 9965077 4775070 2946618
9323 2946618 5352761 8013764 8696187 9200812 10882897 12048020 11326330 10256246 10276722
9314 10276722 9615798 5724771 -615488 -5860748 -7605548 -6312528 -3962177 -2487168
9306 -2487168 -2834807 -4084432 -3942750 -1412563 1384852 1250063 -2394924 -6807931 -8805409
9297 -8805409 -7522710 -4374550 -1087830 1799729 4599912 7028595 7855689 6507270
9289 6507270 4307011 3067055 2877072 2487819 1455248 440286 -226183 -550146 136635
9280 136635 2083963 3426478 2284478 388754 1212986 4145645 4671105 1698186 50080
9271 50080 2850291 5947033 4222620 -275811 -1927537 -566981 -625368 -2586526 -2171616
9262 -2171616 1530426 3779976 1953940 -343026 143848 922586 -1075124 -3169467 -617399
9253 -617399 5965138 11448898 12920758 11568074 9097815 6311394 4665736 5464828 7443972
9244 7443972 8242402 8119385 9057213 10313470 8532329 3010885 -2600893 -5247332 -6082769
9235 -6082769 -7293339 -7984025 -5852371 -1398999 2121770 2395363 -119669 -3472897 -5662185
9226 -5662185 -5280457 -2483905 695228 2342366 2915605 4280713 6661940 8127035 7442515
9217 7442515 5954177 5788555 7222953 8816273 9446466 9171179 8452742 7569415 6722592
9208 6722592 5896227 4709988 3294855 3129465 5616283 9478919 11168908 9022130 5803240
9199 5803240 5511500 8464338 11488539 12532416 12598742 12686224 11462731 7580786 2428134
9190 2428134 -1427500 -3351028 -4300150 -4465719 -3500961 -2369282 -2366447 -2482066 -533067
9181 -533067 2637622 3079148 -748582 -5034288 -5467482 -3074367 -2344392 -4616697 -6601394
9172 -6601394 -5598099 -3049631 -1604309 -1083649 456720 2975504 4211350 3067150
9164 3067150 1125739 98642 -686525 -2987936 -6628038 -9243975 -9145364 -7313541 -6013697
9155 -6013697 -6049431 -6045918 -4241255 -503753 3392323 5254200 4357086 2024805 165646
9146 165646 -738469 -1604488 -2602129 -2166594 807968 4525458 5604884 2924802 -1104041
9137 -1104041 -3364221 -2971306 -1060996 1023685 2467181 2852499 2329994 1491661 484084
9128 484084 -1167006 -3350207 -4862176 -4871860 -4011025 -3093363 -1788030 59432 780941
9119 780941 -1305091 -4605378 -5031768 -835151 5008214 8274225 8094175 6939836 7070433
9110 7070433 8530766 10265200 11612781 12296718 12000709 10715948 9063541 7554137 5629561
9101 5629561 2243446 -2148252 -4803765 -3019588 2552788 7869479 9390706 7350011
9093 7350011 4549342 2822005 1865264 914854 -119683 -1294817 -2916504 -4651208 -5414543
9084 -5414543 -4695619 -3233979 -2090231 -1886432 -3112012 -5946168 -9206857 -10627401 -9092224
9075 -9092224 -5885193 -2982355 -784645 1673489 4743458 7119355 6722795 2689461
9067 2689461 -2992130 -6183107 -4181755 1420315 6829725 10714334 14541175 18159125
9059 18159125 18375994 13710904 7648342 4362195 3308412 1205154 -2293306 -4545759
9051 -4545759 -4515891 -3468155 -1396912 3056980 8509616 10714656 8157362 4516094 3698217
9042 3698217 5172201 6101062 5498771 4095747 2343962 900132 1224942 3416091 5101765
9033 5101765 4650812 3735249 4401683 5518694 5011812 3947041 4894930 7167609 7323165
9024 7323165 4258817 527190 -1514593 -1744180 -287681 3106278 6866262 7971153
9016 7971153 5954900 3943373 4284142 5618946 5881678 5692669 6552853 7623964 6891073
9007 6891073 4441212 2264138 1350413 875707 -81020 -1504292 -2783120 -2954335 -1240256
8998 -1240256 1523786 2845959 1330366 -1285394 -2254925 -1190794 236240 1075092 1578698
8989 1578698 1515666 369443 -720931 509380 4387937 8575036 10946474 11429340 10385683
8980 10385683 7352323 2851265 -316320 237984 3165653 4620147 2694372 -812389
8972 -812389 -2965010 -2590522 -470489 1872015 2910850 1775371 -841816 -2981567 -3374825
8963 -3374825 -2634771 -1862216 -857342 1015811 2700086 2112550 -598912 -2324179 -806760
8954 -806760 2208887 3438446 2744016 3115378 6164211 10005339 12176383 12506728 12044469
8945 12044469 11089026 9826952 9358476 10214790 10885420 9713688 7592915 6945478 8388587
8936 8388587 10034633 9781620 6863047 1755929 -3662915 -6483793 -5512695 -3412258 -3782330
8927 -3782330 -6228721 -7021923 -4861035 -2759405 -3078742 -3920213 -2572322 138885 1681951
8918 1681951 1986258 2682077 3490227 2700167 827918 643887 3158345 6029162 6520500
8909 6520500 4145776 123505 -3791087 -5613953 -4387298 -1795250 -740820 -1784163
8901 -1784163 -2830996 -2734777 -2798690 -3745260 -3811326 -1691934 819809 1513936 1434928 3140393
8891 3140393 6315951 8088632 7458169 6516378 6775858 6876009 5037977 1761001 -1342287
8882 -1342287 -3906523 -6462937 -8709213 -9685704 -9224462 -7920824 -5908964 -2909045 416356
8873 416356 2214507 1033922 -2782368 -7476430 -11197485 -12790762 -11873260 -8824532 -4852207
8864 -4852207 -1744938 -1069013 -3110671 -6366810 -8392485 -7854028 -6127680 -6441414 -10664533
8855 -10664533 -16843866 -20665139 -19818550 -16260488 -13437105 -12054255 -10080205 -6618828
8847 -6618828 -3576214 -2592471 -2349859 -873456 775512 -312604 -4152969 -6756161 -4576135
8838 -4576135 1563463 7796267 11099062 11045680 9045922 7051076 6267804 6241302 5722950
8829 5722950 4706997 4368510 4486246 2788273 -1678684 -6113057 -6980476 -4488018 -1797379
8820 -1797379 -444134 833680 2741562 3776881 2928600 1694075 1812663 2562595 1992885
8811 1992885 -162215 -2386548 -3606277 -4124743 -4656295 -5572702 -6911210 -8189712 -8407334
8802 -8407334 -7059785 -4924639 -3029503 -1146950 1655159 5038695 7112838 6553138
8794 6553138 4234374 2140467 1018726 -223353 -2670052 -5397266 -5922376 -2912553
8786 -2912553 1947274 5342988 5448931 3144527 447698 -1252923 -1431567 -269616 1078416
8777 1078416 1166738 136110 78497 2503315 6102568 8175429 7834932 6619711 6117273
8768 6117273 6132445 5361006 3090687 52217 -2047209 -2031163 -647069 23771 -1006561
8759 -1006561 -2517032 -3003694 -2709166 -2645605 -2569805 -1454928 666091 2913328 5054600
8750 5054600 7078758 7857126 6364881 4025719 3509998 4944095 5523662 3341838 -540079
8741 -540079 -4281329 -7102805 -8198506 -6487756 -2917841 -696015 -1464829 -3165340 -3339905
8732 -3339905 -2501784 -2350107 -2808911 -3221916 -4494280 -7163456 -8884296 -6993205 -2623271
8723 -2623271 688305 1612369 1273772 -50323 -2818614 -5324971 -4947270 -2636852 -2369073
8714 -2369073 -5396301 -8701183 -10038570 -10552226 -10897616 -8914707 -3708700 1498754 3665900
8705 3665900 4174738 5612613 7077595 6444789 5019771 5538830 6897312 5503491 1518889
8696 1518889 -794113 461761 2161358 1356400 -439947 -291903 1445305 1914096 -119462
8687 -119462 -2912544 -3879860 -1919995 1759605 4443882 4304992 2425434 1486196 2259321
8678 2259321 2833936 1727727 4502 -675073 -518379 -749919 -1504848 -2120724 -2771437
8669 -2771437 -4234084 -6229658 -7215179 -5932124 -2511299 1817643 5510480 7345569
8661 7345569 6899520 4633291 1537358 -1269172 -2983094 -3687223 -4123080 -4238619 -2651158
8652 -2651158 1132055 4583941 4390999 1004881 -1308311 166369 3289916 4460313
8644 4460313 3333614 2220123 2212761 2240232 1393499 151890 -636711 -522273 662767
8635 662767 2437663 3402871 2463790 104239 -2416505 -4537722 -6104489 -6524046 -5609188
8626 -5609188 -4418691 -3633022 -1935071 1993201 6544251 8712923 8405789 8663738 11244370
8617 11244370 14511374 16443044 17125129 16867501 14311379 8768995 3021113 1201964
8609 1201964 4110500 8439281 10669755 10290430 9057604 8485234 8731537 9164611 9183740
8600 9183740 8548560 7426733 6390747 6075701 6288499 5572820 2663030 -1265960 -3123651
8591 -3123651 -1765213 -8947 -957583 -3366331 -3290203 87594 3460558 4671874 5466381
8582 5466381 7352412 8078568 5195834 791331 -921756 429957 1397033 318682 -665058
8573 -665058 181498 1165548 -123148 -3257583 -5798758 -6299206 -5100396 -3215000 -1755075
8564 -1755075 -1789749 -3567087 -6035446 -7684195 -7648698 -6046780 -4078210 -3769158 -6203536
8555 -6203536 -9546390 -10388443 -7973789 -5493658 -5729229 -6941708 -5360736 -877511 2582926
8546 2582926 2578985 1237074 1558376 2967714 2733710 496443 -1172000 -490298 1528534
8537 1528534 3203899 4327934 5238123 5360746 4091022 2191789 960749 571154 393368
8528 393368 331099 447449 -272074 -3075361 -7253743 -10286262 -10560425 -8827340 -6774410
8519 -6774410 -5412551 -5059897 -5406250 -5139101 -3092892 -433278 35976 -2227065 -4102260
8510 -4102260 -2880660 -135429 553742 -1453648 -3648597 -4432698 -4572986 -4390718 -2285408
8501 -2285408 2559412 7777072 9859232 8030102 4994858 4039969 5986997 8890026
8493 8890026 10412681 10348852 10400782 11340597 11440459 8799741 4434113 1359403 758911
8484 758911 798390 -428258 -2379216 -3238580 -2481085 -1466832 -2062290 -4938527 -8558025
8475 -8558025 -9885272 -7120462 -1793477 2827947 5148208 5691429 4637035 1331099
8467 1331099 -3254494 -6087977 -5533251 -3438599 -2365971 -2431758 -2461355 -2519186 -3125576
8458 -3125576 -3226325 -1420971 1323930 2466326 1316646 -213439 -315130 943353 2606869
8449 2606869 3974241 4512797 4088160 3679345 4741293 7525571 10857115 13515370 14831426
8440 14831426 14114534 10895515 6042562 1569682 -1011775 -1536677 -620982 818234 1802136
8431 1802136 2151987 2709946 3500835 2537573 -1427375 -5490291 -4906999 563828 5498634
8422 5498634 5447202 2259575 785320 2370163 4298987 4376962 3076534 1494186 10061
8413 10061 -541267 1281628 5352975 9016140 9342182 5757239 162469 -4621316 -6288734
8404 -6288734 -4188469 127819 4097308 6386280 7412838 7543749 5991081 2373775
8396 2373775 -1515482 -2886891 -1007030 1664757 1667930 -2262894 -8025272 -11972572 -12174117
8387 -12174117 -10104762 -8865648 -9675658 -10688336 -9533368 -6306072 -3439895 -3156584
8379 -3156584 -5652230 -9190125 -11189972 -9911697 -6272246 -3554069 -3861654 -5076457
8371 -5076457 -3099812 2639555 7901582 8752806 6082382 3492246 2370509 1414118 112978
8362 112978 -254947 473329 47645 -3103534 -7043372 -8313999 -6122117 -3115030 -2136285
8353 -2136285 -3335630 -4656435 -4307323 -2223646 510495 2931501 4567645 5063096 4328252
8344 4328252 3093005 2214493 1011810 -2285251 -7280643 -10132787 -7771144 -2601825
8336 -2601825 -232761 -2434868 -5246318 -4823035 -2158365 -302895 374174 1532953 3337611
8327 3337611 4521944 5022189 5817281 6610318 6161727 4743518 3970399 4251486 4621738
8318 4621738 5116513 6941111 9830051 11444844 10273714 7502509 5277739 4457690 4521928
8309 4521928 4337157 2744027 -151252 -2194354 -1472953 538629 340050 -2690772 -5216487
8300 -5216487 -4590942 -2039292 80278 1613762 3344277 4654646 4740310 4444476 4728179
8291 4728179 4989758 5095882 7056579 11666463 15187379 13225243 7212163 3067739 3320432
8282 3320432 4496236 3130164 420969 -871457 -647901 16790 1766098 5085995 7359971
8273 7359971 5467064 804173 -1593413 686581 4730362 6541010 5533994 3569037
8265 3569037 1636294 -460315 -2290366 -2950947 -2929627 -3909001 -6193976 -7823747 -7194810
8256 -7194810 -5503667 -5271227 -6929232 -8299732 -7515847 -5042318 -2181380 1156120 5804009
8247 5804009 10869023 13409625 11296691 5943851 1582383 1546462 5116252 8117940 7108100
8238 7108100 3136019 745866 2782225 6906996 8269333 5215480 963728 -554672
8230 -554672 967382 2931823 3741438 4372999 6203817 8842726 10875252 11821211 12265149
8221 12265149 12412862 11725591 10174420 8708556 7753855 6134024 2664113 -1555106 -3751758
8212 -3751758 -2570556 479327 2891141 3439296 2298318 194318 -1709015 -2167485 -1342422
8203 -1342422 -1286725 -3640318 -7121087 -8533762 -6246911 -1639047 2840041 5841264 7126584
8194 7126584 6677015 4697321 2047479 -46765 -770098 -157167 985430 1593806 1195157
8185 1195157 380441 146432 734241 1448190 1641614 1496395 1703598 2621930 3811678
8176 3811678 4246426 3125827 799827 -1209010 -1522552 -378488 405074 -918694 -4267627
8167 -4267627 -7429776 -7712212 -4487592 -221561 1636540 45552 -2818477 -4151234
8159 -4151234 -3093414 -699445 1309926 1249627 -1532967 -5244307 -6546620 -4283174 -1197132
8150 -1197132 -455634 -1677073 -2256032 -1366404 -144411 1213042 3483178 5751335 5911273
8141 5911273 4320984 3911770 5724418 7232269 6292056 3802363 891067 -3276321 -8373008
8132 -8373008 -10644057 -7447240 -2180252 -672225 -3469881 -5570443 -3686455 95467
8124 95467 2594029 3759401 4858430 5325289 3892204 1228668 -881208 -2211924 -3985654
8115 -3985654 -6332422 -7447348 -5582341 -1091495 3678366 6212879 5755761 3806977
8107 3806977 2570594 2779770 3399266 3445042 3243666 3435686 3551624 2523231 361843
8098 361843 -1506703 -1704325 -226556 1788135 3226377 3730149 3503683 2778761 1657371
8089 1657371 330988 -855574 -1597858 -1648781 -745821 928529 2201236 1756081 48681
8080 48681 -556752 1446164 4494676 5788955 4914223 4103894 4898433 6169712 5970976
8071 5970976 3944843 1134903 -1380670 -2727337 -2198167 -236445 1207172 541066 -1617694
8062 -1617694 -3560002 -5033323 -7231792 -10179060 -11682812 -9858086 -5928634 -3394296
8054 -3394296 -4367075 -7431390 -9454995 -9048606 -7526529 -6462175 -5405265 -3116184 -516995
8045 -516995 -547100 -4290218 -8628994 -9269916 -5646429 -1499962 -703981 -3631540 -7602717
8036 -7602717 -9686951 -8735584 -5685890 -2516726 -535689 455271 1029748 809859 -513361
8027 -513361 -1227364 1294001 6823960 11382233 11406577 7646892 3658556 1610565 1171540
8018 1171540 1561287 2683786 4493780 6901347 10094642 13481479 14833565 12442145
8010 12442145 7902966 4668942 3881316 3841262 3504005 3611453 3908259 2605871 18322
8001 18322 -604820 1932299 4136126 3151706 1728113 3795656 7364601 6927851 2049917
7992 2049917 -1866771 -1922208 -1597297 -4457127 -8557655 -10067408 -9032463 -8150126 -8074722
7983 -8074722 -7227689 -4931257 -1986640 886552 2982739 3145074 1586962 1043380 3757163
7974 3757163 8194827 10971454 11120500 10148635 8864373 6968817 5251416 5128416 5826326
7965 5826326 4865096 2033690 433832 2483687 6698031 9520840 9101535 6515810 4313090
7956 4313090 4354328 6159059 7174201 5517449 2222812 -253265 -1025449 -610522 1369513
7947 1369513 5627083 10332007 11673743 8291084 2999595 -805472 -2508119 -3307171
7939 -3307171 -4139307 -5633811 -7980691 -9615578 -8168235 -4073488 -1004689 -1091160 -2024290
7930 -2024290 -932947 1257527 1990998 1420456 1213107 610474 -2341529 -6194309 -6771221
7921 -6771221 -2895166 2065200 5118531 6617295 7027130 4480135 -1631952 -7252571
7913 -7252571 -7542999 -3354379 -616245 -3046732 -8001581 -10363015 -8535439 -5149387
7905 -5149387 -2993735 -2096116 -935549 871602 2163574 2156568 1666794 1978046 3224267
7896 3224267 4621051 5771489 6704001 6844066 5290803 2496596 477110 532889 1592816
7887 1592816 1762498 888481 447598 1199665 2206989 2327236 1571237 536458 -579794
7878 -579794 -1678610 -2076212 -979674 1500115 4360386 6558367 7393020 6406936 3750070
7869 3750070 652493 -1252618 -1371171 -465514 541996 1492416 2558008 3498468 3650197
7860 3650197 2311900 -757329 -4539498 -6704637 -5717419 -3289310 -3157380 -6519931 -10113514
7851 -10113514 -10132616 -6846415 -3721144 -2942658 -3673105 -4076724 -3053218 -260683 3626259
7842 3626259 6743409 7813238 7788511 7934235 7026266 3167832 -1955094 -4050578 -2016192
7833 -2016192 694237 1622567 2530602 5038996 6709576 4752579 876505 -1330236 -1842606
7824 -1842606 -2962976 -4086116 -2336502 1793131 4005575 2363741 56929 485759
7816 485759 2787611 4132512 3811253 2821560 1366688 -827940 -2773063 -2830387 -669753
7807 -669753 2574847 5521726 7081046 6707195 5091147 3751551 3074002 1752830 -908494
7798 -908494 -3362846 -3784091 -2614390 -1656304 -1565445 -2043309 -3763799 -7715215 -12502137
7789 -12502137 -14676437 -12797878 -9430810 -7774654 -7732754 -7106593 -5673174 -5576145 -7518231
7780 -7518231 -9047088 -7912397 -5288945 -3804107 -3640543 -2912034 -1216264 -63247 352979
7771 352979 1893512 4958735 6932288 5917572 3788433 3310437 4155447 4488841 4959511
7762 4959511 7650428 11515582 12354408 8060194 1355923 -3495408 -4677611 -2989603
7754 -2989603 -215471 1739407 1834501 967323 838285 1439525 1227253 -69745 -835367
7745 -835367 -180500 969279 2033384 3766110 6142310 7467478 6815299 5347443 4022222
7736 4022222 2103360 -716375 -2961901 -3810738 -4626811 -6035130 -5692853 -1657501 3623181
7727 3623181 5539610 2703365 -2128520 -5484527 -5386259 -1524705 3950061 6688544 4120033
7718 4120033 -1135003 -4265794 -4088069 -3239360 -3340696 -3366678 -2824125 -2973133 -3973617
7709 -3973617 -3899794 -1911046 157374 723164 639173 980830 857268 -748939 -2696346
7700 -2696346 -3163284 -2184528 -970295 330854 2517946 5628096 8770269 11239071 12688025
7691 12688025 12641047 10844833 7871380 4806865 2731489 2610152 4573774 6873473 6993994
7682 6993994 4709864 2586016 2241216 1762813 -1167295 -4885812 -5334873 -1838142 1679945
7673 1679945 2189271 1621771 3353135 6353108 5903586 216704 -6424080 -8618192 -6207364
7664 -6207364 -3607312 -3687061 -4938098 -5015298 -4360275 -4610278 -5323755 -4722274 -2796698
7655 -2796698 -1162372 -23762 2202169 5759910 8349999 8105511 5984485 4000917
7647 4000917 2655033 1569386 1289601 2507268 4169650 4335367 2927177 2001526 2874210
7638 2874210 4298404 4281973 2830408 1766602 2020643 2280147 977886 -1161651 -1849318
7629 -1849318 -437011 1173194 1534542 1966002 4249116 7155401 7533839 4586854 840328
7620 840328 -1344639 -2074196 -2231304 -1697976 -349638 1008604 2012227 3616195 6388626
7611 6388626 9233434 10977717 11930743 12681220 12692084 11404349 9458426 7515736 5239681
7602 5239681 2783869 1600694 2011436 1780350 -554684 -2625540 -1507787 1197721 1137734
7593 1137734 -2401803 -5686177 -6442692 -6652907 -8084079 -8697902 -6044679 -1630913 1103207
7584 1103207 1686567 2565672 4771271 6396296 5731746 3791128 2704283 2768108 2279775
7575 2279775 121265 -2415839 -3118083 -2055655 -2127227 -5374051 -9587193 -10459533 -7122662
7566 -7122662 -3443961 -2981024 -4581063 -4586189 -2059092 240587 -305803 -3109288 -5332014
7557 -5332014 -4824860 -1965606 702906 720516 -1775779 -3968944 -3383075 -646095 1469330
7548 1469330 1376418 139228 -219735 998422 2637979 2907552 1223256 -886565 -1304181
7539 -1304181 -228942 -535320 -4091405 -8707016 -10545080 -8966982 -6648236 -4879762
7531 -4879762 -1672226 4077119 9044112 8785163 3613439 -1388003 -2202069 351646 2983329
7522 2983329 4017814 3988117 3498361 2080205 -939850 -5245378 -9290821 -11148545 -10034723
7513 -10034723 -7225311 -4907469 -3846289 -2905467 -1272277 -92833 -813296 -2661585
7505 -2661585 -3364215 -2280529 -1214128 -1598746 -2292031 -1264637 1332381 3076114 2147637
7496 2147637 -617165 -2714218 -2449094 -262145 2016986 2940881 2508029 1645265 1013230
7487 1013230 730727 1034220 2304345 4059320 4693732 3015994 -234773 -3041819 -4110735
7478 -4110735 -3724395 -2914408 -2525444 -3028001 -4418787 -5925217 -6286771 -4868553 -2511979
7469 -2511979 -968677 -1218060 -2385302 -2733737 -1917157 -1599121 -3140952 -5350251 -5905651
7460 -5905651 -4755183 -4248658 -5546553 -6985085 -7047865 -6822235 -7653759 -8225211 -6599135
7451 -6599135 -3989392 -3474939 -5379796 -6989555 -6942528 -6713391 -7037680 -6121384 -2957743
7442 -2957743 402589 1920351 2485378 3439235 3437623 842110 -2283426 -2059881 1806518
7433 1806518 5743905 7435366 7951385 8112107 6124542 881345 -4776946 -6816673 -5024998
7424 -5024998 -2864254 -2652205 -3184867 -2563362 -1258253 -932911 -1477094 -1173679 334135
7415 334135 1135984 -137229 -2062568 -2270832 -540839 1486511 2854845 3495399 2362279
7406 2362279 -1815577 -7272126 -9527994 -6715281 -2403597 -984708 -2061953 -2028066 170953
7397 170953 2017671 1685410 168177 -1164292 -2380212 -3623306 -4293792 -4483154 -5162976
7388 -5162976 -6072346 -5542620 -3607718 -3226674 -6658595 -11985688 -14913158 -13162709 -7889902
7379 -7889902 -1822836 2630670 4291297 3659708 2147153 267938 -2506730 -5650053
7371 -5650053 -7008348 -5482701 -2683495 -486479 1340135 3230321 3481065 673804
7363 673804 -2856565 -3400243 -1293933 -386629 -1798476 -2035967 1183594 4664722 3918037
7354 3918037 -653210 -4655924 -5515880 -4570139 -3910013 -3814454 -3577183 -2762862 -985446
7345 -985446 2023505 5360003 7022739 5787429 2438599 -1205790 -3889557 -5330744
7337 -5330744 -5811311 -5828388 -5702713 -5203051 -3876489 -1824017 312462 2096990 3312957
7328 3312957 3212634 883402 -3016956 -5874891 -5603727 -3137349 -1431397 -2141540 -4277512
7319 -4277512 -6101033 -7135269 -7763375 -7820157 -6641874 -4316309 -2031769 -884028 -659601
7310 -659601 -139486 1296822 2579783 1986884 -447338 -2198706 -819294 3084136 6602118
7301 6602118 8146299 8749166 9416736 9225345 7399609 5466733 5143651 5258497 3408828
7292 3408828 106846 -1693305 -1297316 -1308071 -3047916 -4116391 -2321745 754920 2573787
7283 2573787 3581742 5221528 5916345 3013749 -1955341 -4049693 -1443733 2356733
7275 2356733 3786331 3334115 2767227 1392104 -2229185 -6770201 -9150600 -8256499 -5602843
7266 -5602843 -2965360 -1129057 -370368 -506793 -905339 -1701730 -4103110 -7957955 -10257002
7257 -10257002 -8419978 -4384536 -2660109 -4309395 -5764124 -4409902 -2507654 -3686696
7249 -3686696 -7489455 -9813268 -8090962 -4032829 -1194432 -1176809 -2482142 -2296514 855743
7240 855743 5829384 10069243 12019232 11958156 10666097 8454399 6051188 5181072 6883754
7231 6883754 9734179 11051373 9862279 7685400 6386401 6235572 6279162 5802913 5067003
7222 5067003 5080664 6826795 10275107 14072109 16586210 17222042 16372303 14479897 11955477
7213 11955477 9758925 8921508 9309741 9826466 10003665 10293942 10514613 9423687 6679064
7204 6679064 3977105 3043343 3431054 3655438 3704730 4747184 6732109 8076389 7834579
7195 7834579 6600214 5030151 3095953 1285210 880167 2060449 3029705 2210757 422971
7186 422971 -211442 1154677 3531477 5388871 5585724 3763697 913880 -1006913 -1037293
7177 -1037293 -277753 -182575 -662184 -1005103 -1662157 -3422301 -5415797 -5723947 -3744876
7168 -3744876 -504576 2808383 4919230 4010357 -154663 -4001569 -3248948 1179802 3517144
7159 3517144 690263 -3543344 -3949691 -551001 2643602 3454799 2887083 2010598 901268
7150 901268 358430 1600284 3835692 4522757 2661420 28860 -1344984 -1358149 -1009681
7141 -1009681 -700971 115589 2324759 6113720 9849291 10692838 7590948 2972528 51474
7132 51474 -660978 -402803 965532 4200293 7361098 6852741 2535968 -1265184 -1141204
7123 -1141204 1515795 3254864 2750428 755049 -1784090 -3710796 -3761050 -2661962 -3423636
7114 -3423636 -7520107 -12307319 -14309031 -13604056 -12633544 -11950710 -9951657 -6288213 -2825114
7105 -2825114 -991976 -258954 442019 1481631 3044998 5381310 7989030 9483795 8697513
7096 8697513 5576317 1262268 -2321434 -3727570 -3602328 -4261921 -6772853 -9346734 -9682193
7087 -9682193 -7960496 -6318451 -6243679 -7641616 -9365832 -9382170 -5840622 194373 4405688
7078 4405688 3796851 527889 -1101590 -354578 42153 -1164073 -2224662 -1802446 -867922
7069 -867922 -703449 -1429007 -2663930 -3286447 -902268 5280835 11105778 10768810 4201098
7060 4201098 -2606682 -5734139 -7618031 -11238867 -14358920 -13090426 -8049930 -2925183
7052 -2925183 982915 4695911 7405706 6682526 2714517 -1279857 -3375096 -4809702
7044 -4809702 -6920309 -8722398 -8580487 -6572623 -4249534 -3052695 -3352492 -4145051 -3624917
7035 -3624917 -962981 2570430 5093934 6392062 7752435 9922738 12215012 13242958
7027 13242958 11743357 7453772 2207852 -823802 -333120 1623408 2685565 3371556
7019 3371556 5139653 6669314 5226304 1419396 -699332 1018518 4171121 5638032
7011 5638032 5566424 5863828 6677441 6576548 5323779 4378929 4589909 4825041 3550793
7002 3550793 1221396 269044 2210589 5117963 5179214 1297442 -3108177 -4021976 -1489902
6993 -1489902 1150164 1763695 1132211 624308 410157 260337 251058 157116 -467557 -1303928
6983 -1303928 -1599103 -1509990 -1794211 -2277178 -2058882 -1018785 386073 2278639 4426403
6974 4426403 4897851 2248776 -1390029 -2405534 -719724 620050 813242 2100234 4477258
6965 4477258 4425854 952331 -1793807 -1032643 -108613 -2651994 -5919217 -5192160 -1875213
6956 -1875213 -1121131 -3020783 -2699155 913928 2858876 105870 -3881281 -4835735 -3200682
6947 -3200682 -1301442 673585 2590053 2013592 -2045419 -5689586 -4637662 -535049
6939 -535049 1190090 -1299194 -4884695 -6858272 -7520848 -7078678 -3937100 2271353 8740777
6930 8740777 12420939 13099928 12242587 10622316 8665767 7433141 7218857 6244213 2792826
6921 2792826 -1928449 -4995149 -5567649 -5615882 -6840883 -8782693 -10357592 -11295304 -11118540
6912 -11118540 -8593049 -3912818 -161813 -421094 -3799305 -6374737 -6143691 -4945538
6904 -4945538 -4856948 -4881036 -2961975 124220 1300210 -511623 -2735308 -2528565 -304709
6895 -304709 1294356 975820 -89946 -349335 507161 2246542 4863871 7645697 8665678
6886 8665678 6884643 4274505 3940476 5931342 6839132 4304378 5311 -3098524 -4502359
6877 -4502359 -5013863 -3631845 1134519 7319542 10453409 9279326 7489907 8383293 10541278
6868 10541278 10846488 9471824 9140994 10790190 12762659 13786897 14268638 14621354 14348976
6859 14348976 13036081 10717986 7200220 2476984 -2119227 -4670039 -4813362 -3883506
6851 -3883506 -2763045 -916908 2075569 5234118 7085918 7221520 6532149 6244974 6797359
6842 6797359 7445749 7247879 6509220 6359570 6561866 5295707 2239411 83852 823379
6833 823379 1939787 -639205 -6140517 -8838558 -5186244 1660559 5780278 4806691 821601
6824 821601 -3205186 -5823467 -6798704 -6259056 -4408926 -1596293 1295983 2875309 2629229
6815 2629229 2085179 3165944 5357011 6174546 4708721 2817257 2193594 2212806 1708656
6806 1708656 1079117 1285941 2203105 3261664 4461795 5539121 5426941 3830967 2146743
6797 2146743 1603006 1725769 1803338 2403257 3984955 5434899 5634778 5192074 4945650
6788 4945650 4178184 2289251 824423 1362789 2386919 984984 -2751598 -5637332 -5671936
6779 -5671936 -4065160 -2792105 -2198261 -1380448 644026 4098422 7207142 6394933 68408
6770 68408 -8012435 -11789676 -9649732 -5616408 -3493810 -2824687 -1786508 -1034826 -2307265
6761 -2307265 -5060572 -6909463 -6560421 -4600431 -2151384 -189414 566120 459150 987483
6752 987483 3023556 5712577 8039843 10228139 12210797 12170868 8891624 4816279 4029348
6743 4029348 6830092 8734655 6057398 720211 -2155730 -468725 2905510 4237370
6735 4237370 3247026 2481218 3598911 5777180 7592106 8876831 9950122 10140269 8432556
6726 8432556 5228770 2218302 523105 61972 708547 2648286 5125549 6249642 5097175
6717 5097175 3092556 2139952 2013729 956216 -1319830 -2692077 -1254405 2069800 4437165
6708 4437165 4257570 2582028 1284377 795225 295418 -472779 -728510 13250 1222296
6699 1222296 2312207 3314800 4072959 3790843 2197559 289835 -914560 -1426982 -1208386
6690 -1208386 682341 4401742 7907530 9063694 8303456 7283139 5913913 3303179
6682 3303179 904298 1438950 4513225 6597176 6125404 5332377 5707780 5038881 1376479
6673 1376479 -2744520 -3105348 620071 4711972 5895159 3852639 187180 -3030131
6665 -3030131 -4261068 -3706311 -2976532 -2638161 -1514272 466153 978567 -1060518 -2813129
6656 -2813129 -1372016 1580065 2433750 1524631 2218939 4733028 5337003 2313268 -1366111
6647 -1366111 -2673891 -2379389 -2525295 -2990553 -2649583 -1740571 -1063526 -525686 -250301
6638 -250301 -1566696 -5026447 -8517704 -9073769 -6091814 -1824273 755971 231725 -2028426
6629 -2028426 -2624584 543484 5504234 8406360 8473758 8394090 9440242 9359642 6565023
6620 6565023 3373407 2684397 3828050 4448333 4574372 5680471 6920953 5603908 1218799
6611 1218799 -3602210 -6210476 -6098921 -4184513 -1861476 -627278 -961231 -1720005 -1891338
6602 -1891338 -2139566 -3050995 -3086078 -690037 2397518 2795202 242793 -2105665 -2344208
6593 -2344208 -1936705 -2465907 -2917007 -1528147 1590536 4986846 7556104 8687864 8114484
6584 8114484 6621751 5730871 5756349 5144543 2431697 -1993205 -6396349 -8927585 -8292820
6575 -8292820 -4743483 -730405 1072027 935382 1675454 4578176 7601686 8462877 7522425
6566 7522425 6302386 4987280 3196539 1886358 2418188 4264875 5265270 4021519
6558 4021519 1087085 -1903618 -3620836 -4032629 -4404812 -5619797 -6504124 -5210692 -2335690
6549 -2335690 -575599 -718479 -542714 1011414 1435777 -1223734 -4337729 -4014764 -782505
6540 -782505 1544616 1565393 1046235 427444 -2227234 -6985119 -10479880 -10335672 -8460281
6531 -8460281 -8102874 -9670769 -11165914 -11071108 -9134839 -5676873 -1739667 1074054 2237980
6522 2237980 2866134 3614081 3219650 465471 -3420674 -5803526 -5436240 -2997134 419683
6513 419683 3861306 5943492 5315083 2141583 -1591517 -3650015 -3442017 -2578760 -3470912
6504 -3470912 -6745088 -10088916 -10556959 -8032302 -5198709 -3973117 -3587509 -2679159 -1333275
6495 -1333275 56781 2015750 4305486 4631455 1368828 -3266043 -5081054 -2669546
6487 -2669546 1587985 4902329 6378093 6112560 4362490 2211293 1183066 1307593 871111
6478 871111 -1216581 -3884147 -5212023 -4277845 -1429413 2087075 4439818 4421523 2836748
6469 2836748 1600165 1198024 371192 -1429503 -2989744 -3356631 -3098945 -2579400 -920740
6460 -920740 1742705 2806051 299139 -3639330 -4918978 -2740533 -277258 -92637 -1294002
6451 -1294002 -1834903 -1344909 -408749 1084852 3018748 3605123 1024491 -3593842 -6640014
6442 -6640014 -6081096 -3888496 -3563526 -5902652 -8248498 -7881983 -5167905 -2742125 -2159864
6433 -2159864 -2419957 -1978743 -1143110 -1490155 -3397255 -5427917 -6378027 -6762551 -7503620
6424 -7503620 -7971508 -6561323 -3122278 305853 1624365 876167 -175759 -168381 781873
6415 781873 1814244 2364436 2365883 1983494 1428102 765420 -197631 -1565270 -2945211 -3892856
6405 -3892856 -4752155 -6252400 -7981795 -8248570 -6261402 -3616362 -2402452 -2330602 -1227547
6396 -1227547 1696438 4657158 5705963 4785841 2749232 -4599 -2618952 -2939624 353431
6387 353431 5204413 7694633 6306189 3236169 1284770 1021049 1640463 3066545 5826211
6378 5826211 9548321 12896320 14870845 15289696 14097455 11185931 7222095 3931201
6370 3931201 2812800 3543864 4119211 2984478 964500 542278 2923592 6387576 8303658
6361 8303658 8381384 8675854 10271985 11536551 10653306 8604269 7864262 8626266 8408303
6352 8408303 5912500 3427179 3993397 7203490 9474162 8250594 4439857 503889
6344 503889 -2353405 -4300598 -5405239 -5492390 -5123716 -5357856 -6298795 -6833946 -6107270
6335 -6107270 -4414782 -2367782 -223742 1353684 1071964 -1167788 -3010503 -1915330
6327 -1915330 1437181 3678681 2971963 996877 -24880 -561647 -2442125 -5337598 -6559838
6318 -6559838 -4388474 -204252 2931474 2894239 -245507 -4416821 -6822959 -6170229 -4081293
6309 -4081293 -3436943 -4977446 -6437620 -5369234 -1757019 2646837 6296910 8184629
6301 8184629 7435934 4291017 1046100 249008 1647294 2263160 69710 -3465906 -5330955
6292 -5330955 -4713558 -3618155 -3750791 -3977313 -1896482 2368520 5382771 4309061 651982
6283 651982 -1528103 -805301 375512 109007 -18678 1658012 2822315 -42129 -5637049
6274 -5637049 -8482629 -6238173 -2874261 -2801295 -4828867 -4698128 -1615572 1028493 739940
6265 739940 -1374924 -3255003 -4714954 -6669743 -9096536 -10756902 -10283266 -7315803 -3257999
6256 -3257999 -665615 -789909 -1956641 -1679562 -93438 431405 -966960 -2412199 -2350047
6247 -2350047 -1714507 -1947460 -2767561 -3396462 -4323165 -5943348 -6722787 -4914355 -1354323
6238 -1354323 1660569 3811630 6626540 9851490 10592610 7159110 1843665 -1473034
6230 -1473034 -1171796 1755257 5715027 9242975 10806768 9879134 7922031 6735769 6149446
6221 6149446 4984476 3861513 4643740 6733545 6612203 2550081 -2472704 -4727495 -4798448
6212 -4798448 -5764044 -7515096 -6751672 -2950186 -349063 -2027493 -5108486 -4763971 -989460
6203 -989460 1903764 1562166 13200 -122983 1251775 3122455 5313284 7732976 9398605
6194 9398605 9481934 8310251 6670962 5173463 4550172 5119114 5663643 4659879 3080654
6185 3080654 3787931 7212781 10030238 9669735 7792207 7122285 7022582 5195476 2233695
6176 2233695 923771 1562295 1497663 -439499 -2417828 -3348714 -4874903 -7871998 -9637978
6167 -9637978 -7086771 -1254221 3777235 5730544 5882571 6351894 7570106 8631766 8668467
6158 8668467 7379512 5114008 2835208 1407554 669368 -350165 -2237474 -4677780
6150 -4677780 -7029004 -8694365 -8919022 -7298773 -5113436 -5153618 -8852525 -13858804 -15998657
6141 -15998657 -14040546 -11061895 -10240884 -10801536 -9767241 -6589900 -3677120 -2658576
6133 -2658576 -2703362 -2909533 -3760459 -5216294 -5852758 -5386714 -5667825 -7199824 -7064291
6124 -7064291 -3068374 1984926 3595485 1969014 1443450 3946845 6764249 7113372 5392969
6115 5392969 3070669 634909 -1206690 -1388359 -953812 -2693069 -6621262 -8710564 -6258636
6106 -6258636 -1887756 293381 188389 567787 2401542 4527836 6666557 9482285 12217714
6097 12217714 13184355 12422062 11448069 10668153 9372305 7868300 7022157 5887538 2575875
6088 2575875 -2289529 -5688840 -6304886 -5908790 -5873957 -4993245 -2201722 875165 2129823
6079 2129823 2138869 2926154 4437017 4467824 2120123 -468006 -566682 1895351 4370187
6070 4370187 4722995 3390964 2141142 1430483 242208 -1550483 -2416535 -1599519 -598037
6061 -598037 -641804 -262631 2203381 4741928 3505154 -1305260 -4552155 -2401343 2929811
6052 2929811 6138979 4641454 -110997 -5279898 -8555785 -8565996 -5567576 -1659662 869154
6043 869154 1192130 -476965 -3682968 -7036013 -8212411 -6567617 -4845293 -6145826 -9600989
6034 -9600989 -11216593 -8953911 -4752952 -1203502 1341595 3209729 3261650 547295 -2980193
6025 -2980193 -3818162 -1056520 2595035 4265946 3909927 3286801 3473629 4520964 6463474
6016 6463474 9104290 11269308 11828618 11376313 11439490 11995861 11465907 9538217 8063817
6007 8063817 8111868 7976902 5801883 2772955 1620990 2822240 4451495 5238111 5445211
5998 5445211 4963034 3088248 539379 -754421 -629880 -1207990 -3448488 -5390657 -5227386
5989 -5227386 -4118201 -4111539 -4882671 -4680829 -3479855 -2984436 -3898013 -5047013 -5199471
5980 -5199471 -4409002 -3588913 -3696257 -5037965 -6613836 -6819079 -5658568 -5224719 -6737261
5971 -6737261 -8340547 -7705372 -5788980 -5552946 -7379029 -8476229 -7103579 -4716353 -3071354
5962 -3071354 -1749436 -93150 552377 -1195698 -3718582 -3657664 -43336 4540533 6985686
5953 6985686 6550988 4685635 3270576 3405108 4908061 6444460 6756240 6173157 6344917
5944 6344917 8096494 10176867 10749343 9640225 8292527 7734373 7591441 7245025 6902879
5935 6902879 6871386 6574448 5295433 3513224 2452916 2369780 2237963 1233183 -358176
5926 -358176 -1805411 -2524586 -1800894 925495 4911183 8176577 9357647 8728194 7033829
5917 7033829 4624558 2568042 3055962 6912473 11505368 13064771 10899734 7721417
5909 7721417 6013688 5916857 6730694 8266249 9732309 9157389 5678057 1542248 106048
5900 106048 1890151 3898964 3142386 -97423 -3065962 -4015669 -3968293 -4801168 -6344813
5891 -6344813 -6388674 -3677419 18242 1437503 -1076035 -6500934 -12422102 -16499021 -17264622
5882 -17264622 -14812448 -10819035 -7073483 -4066093 -1759579 -1176244 -3628109 -8295815
5874 -8295815 -12277161 -13746739 -13708619 -13765385 -13533944 -11676794 -8521092 -5815926 -4091630
5865 -4091630 -2085039 678027 2296012 822257 -2548903 -4276473 -2703810 -73519
5857 -73519 648375 -110605 741596 4444196 8602984 10454046 9959229 8444672 6021684
5848 6021684 2457331 -647208 -1232964 -19510 222426 -1196770 -2076688 -1284744 -820465
5839 -820465 -2473776 -4722355 -5000392 -3418766 -2022033 -1500545 -954478 -216927 16197
5830 16197 267805 2212362 6035311 9590490 10802715 9599463 7079829 4272029 2395689
5821 2395689 2828474 5466794 7925639 7752742 5293698 3363332 4015576 6433609 8291301
5812 8291301 8577756 8413292 9123736 10218835 9950420 7739519 5197858 4276329 4948439
5803 4948439 5363492 4002036 1117045 -1667975 -2613336 -1133667 1323418 1973875 -581962
5794 -581962 -4267557 -5315137 -2549882 1071348 1723520 -1332149 -5599760 -8185873 -7876659
5785 -7876659 -5198398 -1775329 458486 477058 -1143927 -3149918 -4852383 -5747680 -4646313
5776 -4646313 -948353 3075050 3288685 -1711652 -8190368 -10928956 -8611500 -4226583
5768 -4226583 -959026 215948 -925314 -4904846 -10660173 -14500308 -13238826 -7921308
5760 -7921308 -2644196 257492 2174807 5101154 8291179 9306289 7599401 5579603
5752 5579603 5799929 7905535 9142537 7874934 5832837 6087544 9013573 11468701 10584338
5743 10584338 7321003 5071352 5410535 6844200 7617108 7820791 7970867 7202293 4484741
5734 4484741 841176 -1362622 -1373501 -975060 -2068678 -4300755 -5698054 -5042108 -2950470
5725 -2950470 -948151 -128534 -583397 -1469633 -1567420 -422352 861721 683743 -789476
5716 -789476 -1292629 653562 3206231 3016012 -526720 -4395836 -5553384 -3909815 -1110110
5707 -1110110 1872109 4695212 6650654 7325982 7356455 7123173 5773558 3139144 1345855
5698 1345855 2202922 3909746 3216834 568347 -117615 2610784 5177432 3933742 230425
5689 230425 -1505820 772384 5004277 7609573 6278411 1257486 -4557002 -7520108
5681 -7520108 -6535744 -3934246 -2371155 -2028223 -1808108 -1650787 -1890412 -1528048 679810
5672 679810 3895176 5869696 5735684 4468750 2776080 374027 -2312954 -3368891 -1260369
5663 -1260369 3150711 7127833 8502371 7444970 5746902 4265375 1646604 -3418124
5655 -3418124 -9043633 -11155995 -8303097 -3724139 -1438336 -1688198 -1618577 775831 4901821
5646 4901821 8749328 10352433 8965607 6134074 4689871 5522656 6568156 6183095 5722720
5637 5722720 6892934 8372931 7688734 5157494 3169960 2467178 1965358 1539118 1947887
5628 1947887 2377598 1082139 -1613815 -3783877 -5192299 -7088718 -8778857 -7776269
5620 -7776269 -3890602 17796 2134948 3579884 5419219 6821561 7216818 7406444 7373638
5611 7373638 5729999 2482612 -322464 -1732803 -2877432 -3991792 -3758287 -2699510
5603 -2699510 -3433315 -5850241 -6075304 -2708932 -108320 -2110941 -5989702 -6561096 -3440809
5594 -3440809 -66236 2101799 3980598 5267717 4922485 4136355 4741204 5595125 4379144
5585 4379144 1893950 586886 1586 -1838730 -3506136 -1686421 2707732 5222339
5577 5222339 4948256 5473934 7835780 8288744 5231554 2877533 4735146 7989865 8195194
5568 8195194 5776473 3705135 1870717 -1496810 -4890086 -4929404 -1927801 255449 -166953
5559 -166953 -1165063 -1008054 -649127 -1116280 -1399383 -299256 1621043 3297527 5059321
5550 5059321 7990276 11931804 14868492 14320767 9616094 3143413 -1350487 -2603335
5542 -2603335 -3290765 -6441435 -11077863 -13154652 -10712878 -6321521 -3938701 -4746134 -6758394
5533 -6758394 -7465929 -5988021 -3183179 -471145 1333816 2156493 1847892 -70014 -3332781
5524 -3332781 -6284531 -7296233 -6467898 -4850557 -2371552 1852507 6930840 9721692
5516 9721692 8129630 3888749 776595 590946 2200117 4271376 7114288 10970121
5508 10970121 13888758 13239904 9370361 6065863 6438175 9392131 11316070 10461359 8103796
5499 8103796 5820472 3664698 1481418 117635 110512 388572 -458359 -2391041 -4374708
5490 -4374708 -5723565 -5953943 -4366241 -1268908 1173373 1057425 -654595 -1271353 145674
5481 145674 2083612 3152996 3473590 3368817 2647446 1726935 1681352 2415182 2389234 935305
5471 935305 -777057 -1878620 -2980531 -4023616 -3145078 189392 2737688 1092796 -3149240
5462 -3149240 -5004576 -2890539 -671345 -2031826 -5616728 -7538776 -6688180 -5253379
5454 -5253379 -4925927 -4840330 -3427889 -877223 885130 402557 -1238779 -916310 3058464
5445 3058464 8068488 9295222 5222005 -564586 -3938808 -4670301 -4692692 -4029835 -1454734
5436 -1454734 1722891 2025758 -1509742 -5800734 -7808990 -7847442 -7760240 -8069463 -8370159
5427 -8370159 -8544298 -7844744 -4580760 1138375 5738347 5753639 2406340 250601 1438997
5418 1438997 3549801 3368435 872815 -1250608 -748895 2146700 4887282 4508078 274344
5409 274344 -5251422 -8437817 -7905272 -5021449 -1581503 1687030 4401217 5868037 5772508
5400 5772508 4618160 3053224 1438544 219554 -108662 385736 1203647 2206975 3524829
5391 3524829 4734085 5021033 4173254 2678830 1125666 370353 1628739 4859372 7497572
5382 7497572 6779775 3400298 882195 1003350 1903419 1327640 -388358 -1610924 -1761279
5373 -1761279 -1080363 316557 1745624 1683299 -421602 -3140919 -4898933 -5534353 -5137114
5364 -5137114 -3071945 472182 3629118 5138722 5946526 7008725 7385727 6458896 5958044
5355 5958044 7058537 7212422 3226698 -3540254 -8532122 -9977152 -9946830 -9637598 -7590082
5346 -7590082 -3493518 -166823 -67194 -2438360 -5367387 -8210591 -10456327 -10569919 -7922556
5337 -7922556 -4179749 -1184502 923803 2150929 1271839 -1984933 -4951698 -4473272 -637887
5328 -637887 3434534 4705962 2111780 -3118610 -7527086 -7405170 -2713436 2077985 2850606
5319 2850606 332985 -2033344 -3011526 -3653675 -3783239 -1945783 1113423 2156977 -424049
5310 -424049 -4498513 -7131866 -7774916 -7633505 -7469884 -7107192 -6191975 -4778819 -3669808
5301 -3669808 -4025331 -5775806 -6944470 -5885682 -3619606 -2268576 -1826997 -645185 1412156
5292 1412156 2964103 4057138 5992794 7877705 6742494 2189164 -2289816 -4058856
5284 -4058856 -4215018 -4061800 -2342870 1337730 3781681 2565872 461227 1329682 3706221
5275 3706221 3193472 -10187 -1161058 1462023 4004354 3110913 298249 -1308888 -996101
5266 -996101 510714 2808297 4716164 4270211 1778305 328261 1362166 2336428 916993
5257 916993 -1046288 -337603 2894037 5922693 7364299 7803488 7982855 8742847 11168968
5248 11168968 14276184 14289791 9242928 2756293 -146875 318909 99306 -1670673 -1751062
5239 -1751062 882555 2678047 1109414 -1465692 -1906761 -855799 -352615 365045 3187240
5230 3187240 6817454 7688359 4944930 1725755 1131286 2941334 4813779 5141772 4025686
5221 4025686 2488308 1528462 1521140 2007303 2111541 1383916 382979 450779 2537429 5833928
5211 5833928 7965676 7340148 5112436 3896769 4657100 6009212 6571783 6504355 6262701
5202 6262701 5399696 3679119 2219282 2089901 2268178 395551 -4203506 -9087129 -10820726
5193 -10820726 -8496185 -4871807 -3672390 -5758448 -8545229 -9312750 -7978469 -5993893
5185 -5993893 -4045794 -2380462 -1961680 -2899025 -2662166 1081912 5990567 6722705 1828696
5176 1828696 -4132088 -6542475 -5755237 -4504923 -3352044 -1262188 1649582 4839127
5168 4839127 9024777 14211514 17429603 15636267 10152363 5235674 2656805 602156
5160 602156 -2193103 -4310750 -4222144 -2338448 450901 4026675 7605542 8976834 6903668
5151 6903668 3312258 1516809 2507258 4098371 3840192 1915040 541752 838257 1375285
5142 1375285 499191 -928025 -670604 1493672 3609235 4787541 6058262 7237169 5848467
5133 5848467 1069296 -3671749 -4616001 -2577334 -1386830 -2694528 -4787040 -5481043 -3739296
5124 -3739296 511814 5569943 7949276 5953430 2453401 1358845 2320336 2183607 808837
5115 808837 1337612 4519864 6906638 5903980 3242118 1866168 2103758 2481189 2109419
5106 2109419 828682 -1207343 -3029249 -3540119 -3184337 -3031058 -2132187 1464855 6560079
5097 6560079 8821531 6284452 2028059 -150505 -15855 878661 2400734 4778095 6577702
5088 6577702 6670752 6860448 9711534 14335844 16818052 14963823 10858997 8173263 7802629
5079 7802629 6907131 2640606 -3361610 -5785129 -2243234 2597700 2275875 -3007204 -6711521
5070 -6711521 -4634253 653359 4702533 6325483 6195066 4333004 1562802 199162
5062 199162 595158 -29543 -2565089 -2973055 2145698 9478815 12573841 9950694 5833869
5053 5833869 3833511 3585263 3230298 1944190 -62270 -1676637 -1329412 717583 1489690
5044 1489690 -1015050 -4438814 -5074185 -3197420 -2279370 -3507158 -4417807 -3080289 -686780
5035 -686780 552024 -143342 -2108305 -3829159 -3598184 -1327690 707547 805694 650536
5026 650536 2673135 5412643 4908027 903308 -1842025 200199 4489669 5784611 2701673
5017 2701673 -1040779 -1235502 2570872 7517103 10980142 12755759 13726999 13676484 11900714
5008 11900714 9374513 8055438 7858490 6822282 4895607 4556300 6249697 6447160 2688152
4999 2688152 -2303446 -4564368 -4445549 -4703300 -5159715 -3386640 517595 3940285 5984668
4990 5984668 7910188 9613242 9316552 6973294 4841479 4360326 5021241 6204664 7513055
4981 7513055 7568147 5270228 2167659 1048413 2402598 4608551 6952797 9780268 12246139
4972 12246139 12713033 11066898 8444727 5624515 3821822 5149314 9238848 11486702
4964 11486702 8434008 2956457 -49616 -929780 -3061888 -5346570 -3304360 2889930
4956 2889930 7885910 9095738 9252383 10402625 11214213 11286121 12378727 13968953 13068350
4947 13068350 9904795 8355283 9269867 8961601 5981458 3592308 3500504 3065947 1240547
4938 1240547 1345919 4846108 7935531 7732041 6647623 7120943 7174687 5077523 3558685
4929 3558685 5146559 7513451 7553307 6303211 5980941 5737531 4046953 2049526 1293476
4920 1293476 1301073 1871612 4167321 7403206 8758245 8582744 10653117 15067181 16685752
4911 16685752 13399129 9772172 9259773 9404094 8589267 10516599 17024051 23115684 24611975
4902 24611975 24544867 26468684 27765233 25571041 23246883 24643498 27421166 27848331 26767171
4893 26767171 25877452 24457990 24129600 28928880 36208845 37282180 32235629 32224339 40615632
4884 40615632 46055011 42976189 42644044 51949980 59424881 58081236 62166631 80466780
4876 80466780 95257114 96655052 113764830 167047593 204723040 145720287 -5849772
4869 -5849772 -144052155 -182086830 -144415127 -109150935 -102506680 -94989735 -72081620
4862 -72081620 -53799721 -50829093 -47688700 -35227793 -25694396 -27408119 -30942480 -28626924
4854 -28626924 -26338731 -28535506 -29753924 -27501413 -27631173 -31299968 -31236334 -25924626 -23588315
4845 -23588315 -27385839 -30001601 -27553377 -25847081 -27983227 -28444416 -24749171 -22714323
4837 -22714323 -24422487 -22846368 -14879638 -8501345 -9804347 -13107098 -11556996 -8274536
4829 -8274536 -8906775 -11272099 -10787426 -9484443 -11537798 -15256838 -16816440 -17188592 -18848139
4820 -18848139 -20162936 -19155241 -18376068 -20146119 -21292739 -18487488 -14709507 -14478556
4812 -14478556 -16383569 -16316523 -14947590 -16014517 -19460246 -21608335 -20489598 -16763313
4804 -16763313 -11347446 -5947979 -3693302 -5557400 -8262783 -8757291 -8093611 -8017275 -7197493
4795 -7197493 -4465604 -2461392 -3964925 -7268823 -8920784 -8497439 -7301702 -5245652
4787 -5245652 -2565894 -1744082 -4174948 -7700384 -10528766 -14060458 -18393186 -19275061 -14202737
4778 -14202737 -7806229 -5942137 -7616893 -8164595 -7376920 -8355371 -10569679 -10586314 -8600593
4769 -8600593 -8104171 -9429173 -9248536 -6569193 -4098081 -3261775 -2448363 -742699 599390
4760 599390 874370 656319 -253460 -2239633 -3523062 -2026982 547010 183745 -3751885
4751 -3751885 -7687501 -8930179 -8401720 -7971658 -7908528 -7446352 -5861678 -3175014 -1341563
4742 -1341563 -3335489 -8868887 -12967456 -11705658 -7332903 -4432663 -3447344 -2189406
4734 -2189406 -1255031 -2526282 -4029267 -2349165 639012 -278028 -5020593 -7917760 -6748473
4725 -6748473 -5612646 -7078849 -7711894 -4288448 754856 3350598 3100733 1575050 -885550
4716 -885550 -3669412 -4487124 -2358317 563385 2147288 2429355 1159047 -3012699 -8833704
4707 -8833704 -11881401 -10361990 -7889535 -7815075 -8598962 -7942263 -7531371 -9528939 -11587231
4698 -11587231 -9963104 -5358659 -1389080 840974 2512679 3311124 2234154 785226
4690 785226 1059864 1775885 460651 -1545302 -999077 1034210 138149 -3978812 -6275045
4681 -6275045 -4139920 -1573638 -3110269 -7380725 -9745825 -8584440 -5887343 -3536085
4673 -3536085 -2079530 -2152590 -4238997 -7095405 -8379689 -7021994 -3875713 -356293 2402317
4664 2402317 3436442 2402802 256606 -1489969 -2311308 -2754023 -3056837 -2659987 -1417827
4655 -1417827 -473983 -1173596 -3346481 -5350220 -5959763 -5748019 -6252197 -8033759 -10022525
4646 -10022525 -10747943 -9775630 -7821448 -5880731 -4536206 -3857765 -3625140 -3608403 -3649757
4637 -3649757 -3421943 -2379641 -478570 1090201 690770 -1664743 -3466768 -1793665 3577656
4628 3577656 9645654 13092446 13380366 12423796 11406196 9082764 4051104 -2168514 -5971528
4619 -5971528 -5699713 -3340161 -1720358 -1494535 -1700552 -1664215 -917610 1402365 5167287
4610 5167287 8101518 7944643 5309419 2687528 1180243 49720 -1105374 -1913451 -2592039
4601 -2592039 -3475704 -3500782 -1682772 121610 -1044962 -4424234 -5692672 -2884527 907537
4592 907537 2072370 716528 -1278897 -3334116 -5003815 -4618633 -2088841 -808102 -3429491
4583 -3429491 -7379272 -8050644 -5365537 -3570679 -5030146 -7877196 -9987638 -11631994
4575 -11631994 -13063238 -12647676 -9493416 -5984324 -5358348 -7369632 -8134069 -4527132 2188529
4566 2188529 7649321 9066323 7911823 7435790 8329270 8558928 7432933 7289933 9755850
4557 9755850 12547213 12424124 9947595 8501161 9180780 9572674 7850974 5446405 4666396
4548 4666396 5581980 6467878 6088834 4430302 1845312 -1574970 -5730707 -9728625 -11564086
4539 -11564086 -9520813 -4537898 -194349 843937 -346269 -824261 423558 2131340
4531 2131340 3347819 4344209 5208012 5426830 4854795 3571328 1190482 -1860563 -2925820
4522 -2925820 481274 6685676 10719250 9874400 6371814 3895012 3604229 4476024 5457779
4513 5457779 5820661 4891406 2940003 1439924 1382414 2063200 2217530 1548250 643869
4504 643869 212805 618062 1217151 304710 -2829283 -5901401 -5625822 -1936950 1802914
4495 1802914 3145225 2791699 1940939 157687 -2786267 -5502125 -7202012 -9107262 -11709199
4486 -11709199 -12771421 -10375480 -6160125 -3112864 -1747269 -967990 -1042133 -2613051 -3935040
4477 -3935040 -2472778 1205767 4200932 5515844 6299614 6232677 3650549 -53245 -262884
4468 -262884 4583220 9810832 10322485 7255793 5762737 7554984 9030368 6836914 2520023
4459 2520023 466771 2605270 6389803 7863302 6030664 3643838 3507599 4936461
4451 4936461 5229688 4175157 4698000 8227154 11873581 12252390 10272265 9316910 9758696
4442 9758696 8786540 5813888 4328479 6671351 9941114 9765412 6267414 3258700 2544116
4433 2544116 2427864 1935350 3012684 6958626 11227563 12169023 9752858 7445725 7925047
4424 7925047 10672933 13436612 14258529 12093703 7311638 2237242 -208000 683633 2756649
4415 2756649 3752770 3832705 4585802 6426329 8269086 9521097 10969949 13120245 14619600
4406 14619600 13530688 10109371 7141524 6774908 7754592 6993540 3648636 199442 -831684
4397 -831684 236266 1421932 1766717 1599361 1222922 882517 1316872 2809575 4310270
4388 4310270 5033990 6100465 8516306 10211892 7884176 1975291 -3034502 -4225226
4380 -4225226 -3529443 -4008394 -5246806 -4645693 -1715208 1349762 2770762 2926099 3167391
4371 3167391 4267490 5965637 7227500 7256254 6650316 6661096 6852049 5056442 805950
4362 805950 -2832824 -2744269 -3416 1474032 -89771 -2802942 -4235636 -3871534 -2202339
4353 -2202339 544813 3841074 6283216 6541172 4436133 914693 -2378627 -3549884
4345 -3549884 -1569631 2498944 5879367 6190411 3362929 -237863 -1644621 -36277
4337 -36277 2062025 1336516 -2094257 -4447539 -3293301 -1179768 -2345568 -6970553 -11092861
4328 -11092861 -11715551 -9453047 -6148142 -2665213 63823 295974 -2426677 -5824209
4320 -5824209 -7209951 -6557168 -5914173 -6325393 -6733458 -5874893 -3994716 -2120165 -387390
4311 -387390 1894034 4419673 5199424 2801851 -1072077 -2797061 -1042880 1636846 2286696
4302 2286696 1229829 913065 2209141 3696168 4180344 4270753 5411335 8377692 12466205
4293 12466205 15370863 14702700 10863303 7517775 7674693 10084203 11132976 9344033
4285 9344033 6031609 2571321 -296335 -1054573 1556695 5836952 8256964 7822021 6729757
4276 6729757 6214654 4703989 1205770 -2370505 -4079586 -4793774 -6083437 -6996676 -5292941
4267 -5292941 -1076066 2702369 3221151 376970 -3177527 -4151291 -1590196 1922922 3001234
4258 3001234 1443057 73807 548724 1306916 330203 -2069804 -4325117 -5844809 -6991017
4249 -6991017 -8044452 -9094521 -9864453 -9138623 -5733950 -543989 3770939 5464269 4691568
4240 4691568 2093217 -1389240 -3372577 -1623814 2501701 4875525 3649800 961059
4232 961059 -867372 -1671554 -1318864 1011949 3994215 4324298 1631756 -326413 611532
4223 611532 1809440 669799 -1223501 -1640136 -1542294 -2060501 -1225430 2607280 7223538
4214 7223538 9946947 11451188 12997193 13591759 13333201 15256200 19791102 22098128 19616745
4205 19616745 17132691 18818667 20875812 18830616 16205651 17661758 19428210 16464839
4197 16464839 13476323 17151631 22868982 22955220 23000142 32784291 45179365 46499869 47587835
4188 47587835 75875757 126130218 147823359 104310288 25108475 -27471200 -31833053
4181 -31833053 -19338010 -20085702 -28629192 -28358641 -21143950 -17894274 -18153321 -15178911
4173 -15178911 -10447807 -9437895 -10175390 -7520527 -3650957 -4289261 -8395233 -10384139
4165 -10384139 -9548761 -9408952 -10179129 -9234081 -7284197 -7348812 -8833193 -8766379 -7938308
4156 -7938308 -9861403 -14068985 -16096680 -14367202 -12034401 -11336801 -10715158 -8703046 -6737264
4147 -6737264 -6467709 -7179738 -7372225 -6711879 -5302993 -2927954 -105910 1519394 786635
4138 786635 -1804045 -4825339 -7057036 -7916423 -7579458 -6605167 -5003512 -2330901 792265
4129 792265 2490022 1948683 644325 42640 -512741 -2152244 -4332506 -6260096 -8801169
4120 -8801169 -12386131 -14347261 -11563678 -5274385 -97920 1750734 2195295 2958936 2827420
4111 2827420 520107 -2497624 -3940761 -3579842 -2576911 -1616388 -1380404 -3340889 -7917731
4102 -7917731 -12643070 -14261101 -12524823 -10225876 -9399746 -9128998 -7630808 -5118888 -3444279
4093 -3444279 -3523255 -4355210 -4649137 -4389734 -4254271 -4252784 -3918024 -3518798 -3884029 -4786670
4083 -4786670 -4595912 -2188525 1533521 4706424 6500309 7421202 8212472 9194687 10238647
4074 10238647 10688490 9721001 7411291 4971669 3344901 2209216 1078452 531261 1244950
4065 1244950 2511363 3046588 2798051 2511374 1816197 -610217 -4811542 -8908086 -11089581
4056 -11089581 -11249956 -10478490 -9962623 -10460078 -11654488 -11871806 -9736056 -6408694 -4806506
4047 -4806506 -6077235 -8207310 -8797487 -7756064 -6147770 -3749388 469186 5929011
4039 5929011 10153287 11068127 8620542 4090485 -1239469 -6479227 -10927428 -13943037
4031 -13943037 -14957011 -13769402 -11112090 -8581914 -7421459 -7451795 -7624890 -7285856 -6181291
4022 -6181291 -3633456 899824 6062274 8761688 7336523 4005502 2844517 5241541
4014 5241541 8347038 8304658 4273255 -957111 -3519670 -1394077 4092056 8894362 9290509
4005 9290509 5402286 1234312 334811 2042888 3045477 1751455 -555991 -2306950
3997 -2306950 -3188605 -3099886 -1903270 -825680 -1850082 -4616350 -5973234 -4024993 -760857
3988 -760857 945514 1038817 901455 114810 -2473616 -5448876 -5803826 -3243166 -775182
3979 -775182 -536787 -1307524 -811662 1424041 4159425 5789932 5161166 2536712 -416
3970 -416 -596476 59324 327339 1040993 4387400 9146293 10647950 6960339 1823478
3961 1823478 -736947 -1583461 -3326829 -4962611 -3904273 -1695101 -2751731 -7312020
3953 -7312020 -10153065 -7731244 -2999695 -1084731 -2921571 -5524812 -6453725 -5282207
3945 -5282207 -1961627 3228781 8168638 9893249 7952526 5279547 4919421 6879649
3937 6879649 8821886 8921574 7208565 4701546 2192174 -141268 -2415220 -4335806 -4782815
3928 -4782815 -2761268 768594 2889716 1722842 -1069871 -2285434 -1548703 -1760297 -4658399
3919 -4658399 -8098199 -9276255 -8810923 -9186388 -10206193 -9005692 -4729016 -407167 868390
3910 868390 -422425 -1634418 -1295882 306151 2451878 4356069 5178775 5067140 5405955
3901 5405955 6781048 7531088 5726322 1894869 -1705995 -3983895 -5552690 -6671300
3893 -6671300 -6425261 -4326533 -1434098 653148 1154464 242526 -1371045 -2687242 -2931570
3884 -2931570 -2260142 -1717507 -2266392 -3784499 -4817532 -3470134 733907 5686951 8246131
3875 8246131 7351002 4735308 2236380 -190178 -2941849 -4861361 -4461210 -1998287 1264685
3866 1264685 4827270 8183167 9404067 6936402 2295032 -1524175 -4078782 -7294095
3858 -7294095 -11239997 -13147084 -11524796 -8513800 -6737214 -6113959 -5354818 -4488120 -4012896
3849 -4012896 -3319647 -2011193 -1373617 -2442637 -3819435 -3616078 -2569485 -2807845 -4203027
3840 -4203027 -4618299 -3699782 -3742547 -6135999 -9155735 -10276664 -8960568 -6159856 -2681269
3831 -2681269 630830 2352838 1726920 -154455 -1677899 -2674819 -3790452 -4499103 -3575692
3822 -3575692 -1596677 -961441 -2473581 -3603872 -1893860 975969 867109 -3112602 -7035989
3813 -7035989 -7282859 -5145400 -4508349 -6406081 -8242226 -7762732 -5301324 -2041312 1447862
3804 1447862 4195352 4606491 2658852 764868 978266 2409667 2669764 921783 -1622457
3795 -1622457 -3222018 -2521638 783519 4760609 5995416 3365745 -59117 -1020836 -868002
3786 -868002 -3456534 -8747334 -12056520 -10495587 -6797203 -4891970 -4580314 -3415077 -1780426
3777 -1780426 -2334931 -4917702 -5792892 -2981256 674520 1672295 866063 1727725 4816713
3768 4816713 7026943 6362066 4476139 3343468 2078306 -697094 -3237625 -2555533 730152
3759 730152 2674178 1529126 -80129 311334 1190572 -75263 -2717592 -3550094 -1233963
3750 -1233963 2883390 7201113 10616517 11646522 9641934 6641587 5255292 4706203
3742 4706203 1879835 -3386578 -7270153 -7262974 -5487427 -5129684 -6341754 -7774275 -9670073
3733 -9670073 -12688381 -15395505 -15799875 -14338879 -12802193 -11295087 -8946022 -6741859
3725 -6741859 -6526464 -7404891 -6326859 -2690773 571775 1365183 1124489 1832424 2888094
3716 2888094 2885709 2562172 3609658 5588570 6212491 4319773 863817 -2731917 -5564077
3707 -5564077 -6706735 -5373190 -2129300 1166122 3207659 4354475 5530352 6681811
3699 6681811 6858452 5429289 2697780 -487304 -3174468 -4332262 -3115130 210144
3691 210144 3762091 5310966 4393137 2538929 1082966 -269613 -1925773 -2707801 -1437344
3682 -1437344 472634 371056 -1509222 -1759049 1389504 5265781 6506241 5691792 5863893
3673 5863893 7568254 8087547 5469316 1026685 -2500843 -3531683 -2170606 124741
3665 124741 1088826 -424122 -2554454 -2116945 1213915 4047323 3426947 198978 -2816907
3656 -2816907 -4290793 -4425871 -3094543 -281004 2270347 2326126 357772 -570537 1164880
3647 1164880 3498684 3582584 1674613 581133 1786945 3844662 4885690 5241156 6461758
3638 6461758 8499848 9365718 7729975 4584148 1687779 -500939 -2238071 -2773816 -1012498
3629 -1012498 2188620 4162725 3465426 1390338 -240067 -1404540 -2896458 -4245814
3621 -4245814 -4343244 -3683478 -4259541 -6886526 -9767305 -10289303 -7719151 -3770402 -825611
3612 -825611 148501 36534 136078 610643 719878 260862 -96156 50166 392280 925442
3602 925442 2238436 4135749 5075797 3959983 1706246 192373 369472 2045633 4424895
3593 4424895 6067834 5704104 4116258 3529419 3795239 1504309 -4656882 -10034914 -9434521
3584 -9434521 -5082633 -4367720 -9547470 -14719331 -14502780 -10937331 -8923613 -8916985 -8228772
3575 -8228772 -6878603 -7527726 -10563803 -13234006 -13608973 -12333493 -10462282 -8364772 -6915521
3566 -6915521 -7134973 -8236789 -8275275 -7027892 -6024243 -5491921 -3830393 -836458 1088592
3557 1088592 257503 -1865413 -3030751 -3189972 -3413632 -3416688 -2301400 -832598 -757644
3548 -757644 -2092823 -2949479 -2102739 -106029 2255393 4822062 6787799 6380729 3223755
3539 3223755 -110346 -568338 1877298 4773884 6779679 8540132 9786874 8294059
3531 8294059 3381848 -1693952 -3382254 -2542370 -2667327 -4274465 -4522836 -2405091 -481623
3522 -481623 -366116 -254281 1032047 1151186 -1470451 -3396467 -301937 6344097 10825181
3513 10825181 10516980 7699292 4585425 964681 -2722565 -4309871 -3563625 -3510516 -6128160
3504 -6128160 -9364151 -10376264 -9433981 -8555132 -8141784 -7090228 -5009188 -2593759 -645098
3495 -645098 226851 -64748 -526462 -380908 -1117408 -4756885 -9465492 -10260797 -5847010
3486 -5847010 -1305277 -1160384 -2953857 -1601865 2391741 4018061 1870269 -118366
3478 -118366 649958 1979077 1595852 1003868 2114086 3342062 2205442 -239678 -711706
3469 -711706 1495023 3708676 3593324 1532391 -658396 -1549376 -410692 2602508 5864452
3460 5864452 7041065 5367742 2601515 959484 555602 -185280 -1698575 -2083727 565114
3451 565114 5392189 9387911 10518597 9324798 7657887 7037575 8205748 10748741 12670619
3442 12670619 11816956 8530927 5574820 4537915 3786742 1194459 -2579795 -5196555
3434 -5196555 -5783590 -5083013 -3526473 -1443939 -548866 -2657840 -6772193 -9521561 -8897468
3425 -8897468 -5981110 -2961060 -1194615 -1249681 -2868786 -4486020 -4516348 -3506607 -3393097
3416 -3393097 -4454402 -4887603 -3724632 -2147341 -1364311 -1167090 -1209354 -1675620 -1991350
3407 -1991350 -1069593 322773 -78092 -2053961 -1918559 2487639 8023786 9823080 6943401
3398 6943401 2190989 -1925529 -4327114 -3924610 -375632 4167963 6991049 8348247
3390 8348247 10422791 13016298 13411319 10970922 8682266 8750596 9279066 7244870 2875259
3381 2875259 -1081680 -3226369 -4403878 -5174441 -4512786 -1568254 2542973 5545236 6254863
3372 6254863 5565466 5258736 6126554 7421405 7957182 7230355 5275721 2075370 -2168545
3363 -2168545 -6424699 -9204540 -9563512 -7431249 -3403886 1119219 4084735 4238871 2537225
3354 2537225 1208253 1177931 1085217 -972221 -5243528 -9881545 -12139630 -10172469 -4507059
3345 -4507059 2066133 6598497 8097366 7369224 5422858 2946356 846355 -137432 -493445
3336 -493445 -1482810 -3450236 -5555028 -7117480 -7991328 -7635346 -5420394 -2191517 140595
3327 140595 1157852 2371579 4298411 5062910 3372867 1071204 592015 1140734 -73833
3318 -73833 -3375953 -6000916 -6061240 -4757505 -4043754 -4231383 -4887553 -6163732 -7701832
3309 -7701832 -7624002 -4510477 116781 2839363 1822659 -1773225 -5634166 -8352427 -9534308
3300 -9534308 -9013052 -6774130 -3507165 -816007 -480545 -2939693 -6326082 -7741379 -6193487
3291 -6193487 -3819859 -3427463 -5223992 -6930400 -6801268 -5301667 -3811344 -3039430 -3117337
3282 -3117337 -3977472 -4908781 -4779827 -3560730 -2738770 -3275435 -3939838 -2768049 431242
3273 431242 4159253 7253428 9520652 10724784 10454787 9080991 7575089 6216753 4592318
3264 4592318 2907084 1964110 1624511 754751 -751800 -1342561 -150262 1134827 -44512
3255 -44512 -3976093 -8011661 -8794367 -4978801 1502969 6584373 7426970 5170496 3559901
3246 3559901 4648395 7088729 8899211 9957510 10671334 10160937 7756990 5027046 4075382
3237 4075382 4451888 3826243 1431031 -1094890 -2191591 -1904429 -880125 477273 1619528
3228 1619528 2043867 2083387 2370312 2648228 2403784 2337000 3508731 5166827 5337737 3791107
3218 3791107 2541688 2948180 4067412 4524317 4429993 4630112 5212336 5380677 4041324
3209 4041324 626505 -3576298 -5552312 -3839516 -1021642 -489268 -1361263 -63836 3134765
3200 3134765 3620725 -233192 -3832815 -3219856 -1170676 -2694539 -7543817 -11450716 -12524217
3191 -12524217 -11949956 -10055902 -6509534 -3485825 -3677989 -5288078 -3826388 661609
3183 661609 2963738 369539 -3750210 -5874960 -7349925 -10678053 -14544674 -15980367
3175 -15980367 -14861359 -12971084 -10676160 -7780353 -5974153 -7013820 -9424878 -10100075
3167 -10100075 -8583584 -7011266 -6286634 -5064188 -2446564 712054 3287049 4767261
3159 4767261 4905979 4340047 4951515 7412192 9085420 7098661 2934410 615090 472256
3150 472256 -1132484 -4938611 -6239294 -1923975 3775065 4614805 931765 -1685292 -1057776
3141 -1057776 -747843 -3345192 -6123611 -5385897 -1689726 1820096 3845400 4958366 4985582
3132 4985582 3488480 2101161 3378570 7083459 9926387 9506539 6734876 3963498
3124 3963498 2463661 2237979 2537944 1837552 -941339 -4159127 -4107328 645440 6853184
3115 6853184 9998388 8986260 6047171 3341086 1681880 1579545 2976552 4163533
3107 4163533 3353863 1544053 1596166 4022293 5861110 4627692 1494903 -570330 -266948
3098 -266948 1633037 3946340 5730037 6156321 4996835 2783415 -143607 -3967957 -8231983
3089 -8231983 -11368711 -12123738 -10562679 -7247204 -2699881 1782112 4417220 4955784 4835112
3080 4835112 4476300 2478206 -1198382 -3650778 -2805192 -666757 -200434 -921786 -738228
3071 -738228 -383762 -1993806 -4292302 -3766657 -644741 896774 -689836 -2080502 -1023257
3062 -1023257 -97470 -1946393 -4629424 -5048218 -3886046 -3455296 -3206594 -1570560 -471416
3053 -471416 -3349073 -9159327 -12589084 -10669035 -5764085 -1555150 653734 889018 -940649
3044 -940649 -3913794 -5924856 -6162241 -6002655 -6437700 -6526991 -5419129 -3888742 -2694979
3035 -2694979 -1483367 -663791 -2057965 -5663098 -7932846 -6077307 -2581298 -2165631 -4921782
3026 -4921782 -6080198 -3068226 743699 1095413 -1188891 -2092257 -665431 59519 -1535946
3017 -1535946 -2670198 -310947 3921863 5725372 4145933 2628799 3593559 4928314
3009 4928314 3710933 1121519 781110 3376398 6191558 7757140 9423331 11418909
3001 11418909 10906035 6299454 887107 -960692 353468 881225 -548664 -822444 2185201
2992 2185201 6070721 7177161 5183561 2631070 1372553 1363444 2077334 3170292 3804779
2983 3804779 2821710 87780 -3004985 -4744751 -4605903 -3564144 -3105939 -3870204 -5175720
2974 -5175720 -5892640 -5490197 -3927413 -1119423 2494326 5239713 5591606 4398537 3972199
2965 3972199 4320733 2277216 -4098406 -11893010 -16283174 -16116839 -14203663 -12670530 -10865978
2956 -10865978 -8082001 -5388578 -3523156 -1370527 1728872 4053881 3844094 2023822
2948 2023822 404396 -1521280 -5285509 -9599336 -10792454 -7474143 -2335606 1272049
2940 1272049 2372672 1466287 -771687 -2600002 -1506759 2515296 5737424 4916181 1364667
2931 1364667 -1364063 -2373224 -3150331 -3437880 -1005627 4096832 8260081 8492592 5651636
2922 5651636 2578664 1158152 2061982 4929652 7439718 6559745 2424475 -1190690 -1999077
2913 -1999077 -2278966 -4465365 -6493599 -5308760 -2934618 -4123152 -8531239 -10482763
2905 -10482763 -7512583 -4203940 -5114877 -7997171 -7552406 -3133826 1211848 2912747
2897 2912747 3332562 4431845 6105787 7206653 7027654 5444873 3142286 1570783 1185105
2888 1185105 237902 -2781473 -6021484 -5981388 -2368436 1217497 1960727 898866 503806
2879 503806 1331850 2229979 2106721 366803 -2719131 -4900590 -3044721 2984260 9008852
2870 9008852 10883638 8968299 6551110 5152990 3643277 1096767 -2014839 -5197721
2862 -5197721 -8176315 -9837159 -9199372 -7496968 -6912110 -6962405 -4834605 -212500 2938698
2853 2938698 1155570 -4009517 -8187359 -9198349 -7736920 -4588733 38648 4900919
2845 4900919 8002231 8741644 8016346 6269705 3330178 206154 -1084393 -37177 1729865
2836 1729865 2933321 3946904 5022666 5099384 3553475 1565120 403072 -334635 -1414035
2827 -1414035 -2240035 -2141273 -2291922 -4307025 -7440731 -9153091 -8330341 -6214662 -4236191
2818 -4236191 -2703312 -1687018 -1285702 -639064 1407219 3994897 4571346 2628256 1247797
2809 1247797 3190076 6874664 8435956 6958533 5225802 5347200 6155365 5744826 4375753
2800 4375753 3240778 1947844 -498068 -2857720 -2403305 895539 3184375 1394700
2792 1394700 -2281944 -2834123 1025012 5146760 5438590 2912570 1623928 3031775 4705494
2783 4705494 4263311 2268816 590209 -261738 -875438 -1148049 -298154 1611317 3430711
2774 3430711 4413334 5046889 5905176 6241769 4594406 984777 -2194331 -2424263 -279996
2765 -279996 533720 -2943079 -9563351 -15350307 -17646963 -17004543 -15354319 -13796835 -12520141
2756 -12520141 -11610993 -11096655 -10747483 -10326405 -9580836 -7862133 -4586211 -421464 2829725
2747 2829725 4051823 3820975 3159609 2128296 350367 -1697054 -2718219 -1789677 644234
2738 644234 2552085 1336722 -3701103 -9662172 -12170490 -9825172 -5343933 -1834552
2730 -1834552 297298 1815973 2304956 1431436 807723 1813265 2566480 176944 -4235792
2721 -4235792 -6027095 -3132533 1330715 3760455 4465369 5342003 5690161 3530543 -18499
2712 -18499 -1126780 1504316 4430657 3783392 27268 -3221983 -4033195 -3812158 -4304667
2703 -4304667 -5053981 -4854955 -4283999 -5019970 -7060136 -8342670 -7422006 -5110595 -2941045
2694 -2941045 -1303407 104030 1136215 1523161 1434735 829294 -746773 -2716973 -3102144
2685 -3102144 -1114775 935631 213751 -2839466 -5194682 -5203158 -3828933 -2300472 -878219
2676 -878219 -37888 -551689 -1921185 -2762492 -3132970 -4325970 -5984328 -6047304 -4478850
2667 -4478850 -4204386 -6619205 -8784629 -7558199 -4433408 -3204984 -4082197 -3578032 -179372
2658 -179372 3084803 2760454 -667292 -4004278 -5447741 -5743922 -5865290 -5299398 -3222751
2649 -3222751 -395328 1266804 1028518 235034 366322 1182220 1846966 2991882 5887499
2640 5887499 9817333 12189841 11504756 8478842 4088190 -1263379 -5996726 -7372452
2632 -7372452 -4874325 -1577659 -329789 -315621 637490 2189078 2596465 2446964 4180678
2623 4180678 8121441 11716934 13012415 12587487 11588935 9950888 7383731 4474273 1860040
2614 1860040 -534020 -2683660 -3909436 -3962287 -3964776 -5352796 -7945168 -9611489 -8258400
2605 -8258400 -4275951 -586287 362254 -775579 -1743946 -2345518 -4498799 -8361307 -11007312
2596 -11007312 -10334556 -7967504 -6413376 -5525434 -4171660 -3376009 -4712631 -6944404 -7522004
2587 -7522004 -6585416 -6259426 -6567022 -5391705 -2337021 564185 1972938 2060011 499018
2578 499018 -2813277 -5071610 -2710207 2933520 6070180 3940679 129658 -1219863
2570 -1219863 -707227 -932061 -2015670 -2856762 -4092495 -6620591 -9136034 -10004216 -9956798
2561 -9956798 -10381224 -10548871 -9054024 -6536689 -4621448 -3595795 -3233023 -4037136 -5313829
2552 -5313829 -4238696 59422 3500138 1836349 -3025864 -5487603 -4079767 -2531877
2544 -2531877 -3292019 -4452209 -3858425 -2190466 -513534 1721247 4365863 5177963 2884318
2535 2884318 -503154 -2391860 -2834323 -3223361 -3454099 -2468517 -437826 1648028 3784813
2526 3784813 6398779 8471852 8255166 6051228 4615662 6072549 9441004 11956501
2518 11956501 12118986 10524571 8145234 5178286 2012151 14239 81991 1093831 1276615
2509 1276615 677799 507334 359192 -1383164 -3988554 -4216451 -1140434 1764935 1626142
2500 1626142 543831 1766191 3725943 2142596 -2868861 -6219393 -4626571 -50548
2492 -50548 4347241 7840317 10329375 10461974 7888456 4971949 4026449 4585987 5153869
2483 5153869 5817369 7186398 8334009 7916256 6299315 4769383 3530965 2092083 698866
2474 698866 -309737 -1854023 -5109730 -9431370 -12531571 -12551706 -9362643 -4663636 -1498486
2465 -1498486 -2264827 -5769290 -7462055 -4463695 444839 1928524 -1160687 -4388561
2457 -4388561 -3449665 741347 3755218 3092773 401309 -1366648 -1516992 -1626946 -2701358
2448 -2701358 -3570833 -2522839 413761 3712048 6211385 7548277 7272894 5280193 3143184
2439 3143184 3041973 4592893 4421156 132355 -6392000 -10849434 -10891436 -7685151 -3931279
2430 -3931279 -1499168 -629016 -409532 180031 1543332 3741123 6802305 9871369 10819344
2421 10819344 8454279 4777593 2922500 2949088 2257666 357625 -73515 2033006 3819466
2412 3819466 2992270 1255923 440446 -1500365 -6542423 -11073514 -9395855 -2033208 4222766
2403 4222766 4920429 2449583 1100876 1516625 1751147 884873 -388841 -900716 619410
2394 619410 4653292 9416299 11914930 11277391 9469418 8262598 7396984 6222145 4988639
2385 4988639 3772162 2194400 845098 678074 408383 -2572080 -7533760 -9927457 -7629726
2376 -7629726 -4571358 -5152741 -7557781 -6389395 -520990 5648173 8460411 8888667 9576651
2367 9576651 10930700 11337021 9433363 5335712 968706 -582990 2194019 6672955
2359 6672955 8061212 4862324 855383 447877 3261668 4915328 2691895 -1262206
2351 -1262206 -2893796 -1245879 761887 419946 -1412068 -2072907 -1096156 -405941 -732623
2342 -732623 -344421 1726112 3521095 2966364 978854 -403819 -1414859 -3297069 -4635699
2333 -4635699 -2291237 3736415 9201181 10240918 7094240 2619096 -813651 -2202310
2325 -2202310 -1765223 -1077596 -1879902 -3874618 -4999574 -4243483 -2435908 -46745 3204360
2316 3204360 5761909 4433892 -821809 -5093696 -4244289 -244178 2277663 2797845 4299837
2307 4299837 7112664 7971774 5621074 3162606 3370194 5044511 5922415 6332050 7467715
2298 7467715 8088366 5851074 1207144 -2441165 -2657840 -670738 145101 -2051652 -5440778
2289 -5440778 -6206563 -2849842 1650399 3245074 1830718 711050 1238697 1079410 -1254233
2280 -1254233 -3438686 -2999895 -1106469 -9368 797644 2535091 3402421 1050571 -2399350
2271 -2399350 -2316084 1614255 4844384 4677060 3175547 2289801 588787 -2816239 -4973979
2262 -4973979 -3046756 1004019 2969369 1883545 -7044 -1263706 -2116973 -2224537 -640008
2253 -640008 2170704 4702568 6571431 8110678 8263677 5564047 1448373 -17990 3176974
2244 3176974 8238098 10546770 8409923 4192867 1613042 2529519 5825687 8866875
2236 8866875 9958840 9182147 7027597 3475371 -826536 -3774552 -3767129 -1886767 -745096
2227 -745096 -1511249 -3182804 -4189172 -3493577 -856785 2478088 3974594 2293365 -833727
2218 -833727 -2652109 -2649491 -2211413 -1926408 -1339422 -805539 -1332882 -2804362 -4283336 -5546773
2208 -5546773 -6297816 -4962168 -1201275 1341535 -1263154 -6825525 -8556885 -3856122
2200 -3856122 2547556 5639726 6033640 6496976 6630601 4558635 1096102 -1469275 -2923943
2191 -2923943 -4247095 -4820708 -3637023 -1875574 -1211698 -771740 1242830 4065536 5587519
2182 5587519 6046708 7276273 9045254 9448329 8456775 7800589 7596144 6374571 4352991
2173 4352991 3340501 3347927 2792439 2337412 4632032 9197962 11404540 8435015 3166310
2164 3166310 49452 -146134 711442 1827894 3382343 4471501 3938134 2353264 1031649
2155 1031649 -98571 -1770293 -3383790 -3615601 -2372850 -471191 1971651 5151428
2147 5151428 8162774 9639560 9450455 8361322 6566539 4079932 1968850 1323278 1300940
2138 1300940 255522 -1076283 265052 5188065 10225896 11065509 7521254 3404262
2130 3404262 1718992 1678228 1075925 83775 845753 3638968 5788887 5596923 5392076
2121 5392076 8239749 12606551 13532180 9536918 5179362 5128432 8363673 10685019 10849294
2112 10849294 10884619 11318053 9903627 5764028 1730898 904987 2711017 3996689 2934968
2103 2934968 426357 -1563393 -1632980 668805 4621296 8203624 9135226 6707570 2456291
2094 2456291 -1203073 -2944868 -3122150 -2684885 -1989767 -927564 135735 252256 -1059007
2085 -1059007 -3116708 -4723267 -5209830 -4729690 -4025105 -4092252 -5367974 -6798400 -6439384
2076 -6439384 -3666105 -138032 2257868 3731861 5645163 7705548 7804275 5024134 1339937
2067 1339937 -719366 -1319523 -3013598 -7232224 -12075194 -14192583 -12513070 -9369465
2059 -9369465 -7709313 -7840570 -7644206 -5617846 -2602038 -379295 290705 -229102 -1215072
2050 -1215072 -1695618 -787641 1133492 2426813 2297119 1972193 2600425 3062513 1659256
2041 1659256 -739499 -1408369 438131 2649285 3304751 3008830 3393817 4953458 7099324
2032 7099324 8940817 9268767 7154024 3425861 333555 -1071777 -2007460 -3653774 -5171382
2023 -5171382 -5066620 -3273450 -716212 2056545 4623215 6224309 6822284 7521608 8655862
2014 8655862 8756379 7009426 5373914 6174459 8667010 10318409 10579245 10660369 10158064
2005 10158064 7159768 1969968 -2449605 -4617256 -6120997 -7866786 -7906105 -5195234
1997 -5195234 -2806985 -4266606 -8200581 -9790588 -6943053 -2193759 1346182 3234912
1989 3234912 4519941 5721920 6945051 8342033 9570961 9954018 9683788 9608813 9408818
1980 9408818 7583674 4111331 1533415 1957078 4069542 4819304 3473595 2168607 2399348
1971 2399348 2795791 1268398 -1883905 -4379884 -5018549 -4890805 -5251896 -5504562 -4357329
1962 -4357329 -2206039 -834433 -845247 -1071050 -1032592 -2145413 -5106790 -7618980 -6910488
1953 -6910488 -3817728 -1947938 -2824084 -4295463 -4216317 -3116438 -2040767 -273789 2643969
1944 2643969 4532339 3013908 -504945 -2078603 -397852 1748980 1564179 -498632
1936 -498632 -2360505 -3074963 -2560568 -239222 4066792 8463185 9937679 7177209 1598486
1927 1598486 -4243575 -8340123 -9520450 -7474761 -3309402 537804 1921917 714889
1919 714889 -1492358 -3403756 -5063642 -6539702 -6476892 -3346740 1923597 6184019 7695339
1910 7695339 8179993 10017450 12595154 13314548 11582947 9603062 9131640 9566683 9746872
1901 9746872 9603048 9094617 7376472 4347258 1541167 125578 -620578 -1462904 -1422157
1892 -1422157 333759 2316695 2851975 3196930 5530090 8451196 8101735 4260707 1620313
1883 1620313 3231700 5828369 4434649 -527631 -4018021 -3255795 -548082 777619
1875 777619 340138 -291177 -366665 -350282 -713075 -1393919 -1821097 -1027513 1394183 4119149
1865 4119149 4957748 3384256 1116151 -303511 -1146107 -1956570 -1974111 -602729 720819
1856 720819 30586 -2355723 -4301349 -4757264 -4400883 -3670273 -2345128 -1303364 -2352966
1847 -2352966 -5353170 -7479196 -6681569 -4285270 -2738418 -2320178 -1867538 -1434363 -1938638
1838 -1938638 -2882516 -2832072 -2002175 -1991987 -2664311 -1666249 2039504 6267111 8606877
1829 8606877 9554412 10743039 11343578 8835433 3361741 -1153584 -1490134 776450 1411163
1820 1411163 -915044 -3319993 -3364500 -2741710 -4410828 -7536950 -8385005 -6262783 -5102057
1811 -5102057 -7498068 -10272899 -8971820 -4592200 -1906035 -2113759 -1681935 1109502 3017575
1802 3017575 1122437 -2561466 -4599430 -5314490 -6978413 -8778051 -7483360 -2618486
1794 -2618486 2341436 4180917 2956625 710685 -675337 -303497 992226 687100 -2629621
1785 -2629621 -6629874 -7797312 -6601065 -7220723 -11407127 -15674425 -16204889 -13768136 -11331928
1776 -11331928 -8998939 -4629512 1432541 5711049 6147355 4630397 3865877 3708468 2241579
1767 2241579 -609915 -2429034 -1354976 1424156 2842712 1252267 -1927230 -3886599
1759 -3886599 -3454735 -2089337 -1827885 -2810979 -3446449 -2765302 -1621815 -1246357 -1643244
1750 -1643244 -2323688 -3717556 -6182705 -7894511 -6023413 -965840 2690257 1362821
1742 1362821 -2804096 -4830093 -3483192 -1890559 -1903936 -1722958 -277844 -126636 -3233368
1733 -3233368 -6682332 -6168901 -2155507 1134582 2096059 3351493 6835239 10801392 12765824
1724 12765824 12587389 11263817 8970129 5817575 2731236 40945 -3297009 -7531287
1716 -7531287 -10432249 -9521800 -5377039 -1254369 393185 23748 -291592 484759 1359740
1707 1359740 1013340 167957 1080908 4003730 5720124 3519491 -546347 -2097598 -554137
1698 -554137 455853 -995664 -2492652 -1742895 -128821 279106 146239 749620 1166582
1689 1166582 507658 456358 2161451 2811735 -535940 -5198281 -5645819 -1663779 1022608
1680 1022608 -1036333 -4654117 -5477735 -3815018 -2466005 -1855847 -495649 1551517 2725328
1671 2725328 2668564 2444129 2512267 2495407 2609201 3398866 4060134 2792762 -692632 -4235373
1661 -4235373 -5399412 -3968564 -1966267 -1659014 -3677827 -6644394 -8444274 -8125293 -6633454
1652 -6633454 -5573924 -5447012 -5405298 -4500869 -2610777 -185802 2176884 3587468 3059786
1643 3059786 783669 -1124568 -495039 1795005 1836128 -3051128 -10861618 -16913479 -18793549
1634 -18793549 -17482853 -14405220 -10130249 -6408117 -6293703 -10192185 -13914212 -13098913
1626 -13098913 -8250934 -3212794 -94529 1543577 1641766 -653053 -4140345 -5715218
1618 -5715218 -4350767 -2491217 -2521359 -3982596 -5146115 -5152166 -3595011 -307839 3025402
1609 3025402 3273817 -211008 -3832737 -3943199 -1307979 690754 748193 -166668 -2093586
1600 -2093586 -5917462 -9694478 -8802824 -1736532 6534341 9490796 6370243 2266988
1592 2266988 1311598 2295775 1936961 241914 269592 3191130 6104922 5609034 1868814
1583 1868814 -2133687 -4239600 -4483727 -3556722 -1688370 841239 3351951 5239496 6206536
1574 6206536 6279067 6178833 6806088 7227821 4401746 -2932085 -10765466 -13001611 -8420195
1565 -8420195 -1988101 1277635 1095508 -303606 -2069616 -4181403 -5304382 -4157638
1557 -4157638 -2117310 -1952150 -4146331 -6270422 -5961833 -3303285 -467261 90513 -2402113
1548 -2402113 -6039621 -7925129 -7542574 -7282211 -8748636 -10259376 -9670557 -8089899 -8397599
1539 -8397599 -11012176 -13644642 -14812885 -15061203 -14703191 -12914493 -9715397 -6735384 -4999536
1530 -4999536 -3516520 -1164817 1073018 885141 -2642104 -7569689 -10388658 -9071165
1522 -9071165 -5243253 -2823981 -3947374 -6929392 -8900432 -9225542 -9019495 -8520912 -6973194
1513 -6973194 -4466935 -1862382 734796 3480704 5288707 5087143 4229622 5045049 6956905
1504 6956905 6809779 3457579 -831876 -4252102 -7587450 -11066625 -12302150 -9901046
1496 -9901046 -6764443 -6746245 -9345414 -10634601 -8847256 -6378207 -6268921 -8908537 -12453804
1487 -12453804 -14691685 -14115642 -10764917 -6686111 -4487821 -4765102 -5582984 -4920555 -3036353
1478 -3036353 -1872279 -2398514 -3240474 -2387626 -14130 1361054 90164 -2144201 -2313780
1469 -2313780 69641 2591621 3152993 1763922 -730217 -3500082 -5034705 -4089590 -2151864
1460 -2151864 -2455911 -5434043 -7888640 -8191315 -8990077 -12044698 -13656939 -9535018 -2150281
1451 -2150281 1748680 270719 -1954322 -1468998 -191085 -391663 -301705 2278007 5490610
1442 5490610 5978686 3644155 744378 -1897121 -4623105 -6347460 -5574280 -3272187 -1669677
1433 -1669677 -685262 1366855 3806115 3823271 1294716 -8332 2429241 6160987 7150166
1424 7150166 4806681 1592513 -751303 -2259684 -3159082 -3678491 -4872109 -7291427 -9141104
1415 -9141104 -8216822 -5731324 -5483075 -8443775 -10888120 -9494327 -5901863 -3865038 -3759625
1406 -3759625 -2976114 -799689 528347 -250156 -1600614 -2198414 -2905083 -4402696 -5465256
1397 -5465256 -5422006 -5989628 -8326179 -10324745 -9719016 -8250340 -9279431 -12185471 -13022433
1388 -13022433 -10675699 -8296933 -7788505 -7026167 -4560868 -3268553 -6119472 -11065874
1380 -11065874 -13810359 -13812914 -13682479 -13855933 -12309895 -9476585 -8892342 -11589384 -13661990
1371 -13661990 -11639872 -7349375 -4811810 -4567568 -4102334 -2467705 -1215296 -1166165 -1288804
1362 -1288804 -1211864 -2364001 -5623799 -9487633 -11487585 -10320613 -6174988 -410338 4441255
1353 4441255 5946099 4258864 2243662 1871922 1454377 -2038939 -8490697 -14145665 -15627366
1344 -15627366 -13080666 -9118509 -5972098 -4293188 -3740077 -3727968 -3829079 -4025335 -4585123
1335 -4585123 -5624282 -7050121 -8843190 -10733677 -11505788 -9606570 -5125783 -440887
1327 -440887 2046495 2363754 2161269 1909099 424204 -2659435 -5659067 -7028214 -7400340
1318 -7400340 -8022981 -8209294 -6332141 -2910049 -367195 594849 1925030 4384257 5191081
1309 5191081 1740637 -3986317 -7572178 -7942211 -7996740 -9620622 -11355634 -11828208 -12225549
1300 -12225549 -13520353 -13896688 -11392226 -7184558 -3700325 -1044209 1933966 4420298
1292 4420298 4768722 3995730 4507233 5570110 4054679 339782 -741028 3206757 7952561
1283 7952561 8177194 4350436 775959 -1008299 -2898943 -5387890 -6261810 -4501172 -2035658
1274 -2035658 -616227 305896 1363641 1397662 -452997 -2508033 -2312271 272707 3294130
1265 3294130 5326345 6371568 6600165 5829849 4499208 3916432 4849761 6451493 7212953
1256 7212953 6736793 5918334 5306774 4045755 1177156 -2339835 -4041735 -2748079 7351
1247 7351 1965143 2684611 3158376 3631604 3160132 1163022 -1755862 -4536975 -6243131
1238 -6243131 -6025639 -3665439 -294942 2379654 3689616 4022461 3490826 1905385 73751
1229 73751 -489597 280289 486608 -1287678 -4043360 -5591434 -4838830 -2282799 777680
1220 777680 2858563 3118925 2360712 2353441 3503034 4176180 3064490 1078945 -104232
1211 -104232 -334625 -705646 -1975588 -4483850 -8580265 -13539188 -16839206 -16405902 -13368083
1202 -13368083 -11003301 -11028345 -12331417 -13223884 -13388599 -13420631 -13761182 -14379237 -14564797
1193 -14564797 -13087750 -9606635 -5749482 -3621396 -3431927 -3801516 -3944574 -3866861 -2803069
1184 -2803069 238501 4094239 5901738 4725735 2719075 1764832 982784 -1222199 -4541123
1175 -4541123 -7625054 -9806329 -10441353 -8466818 -4681775 -2725013 -5047642 -8916639
1167 -8916639 -9272687 -5201376 -863915 58958 -1728424 -3232764 -2799365 -772019 1542292
1158 1542292 2501601 1114950 -1709066 -3959992 -5026582 -6141126 -7966519 -9310688
1150 -9310688 -8938947 -7223401 -5227993 -3552425 -2847086 -3888397 -5993845 -6741802 -4626826
1141 -4626826 -1013107 1651601 2499014 2068013 798330 -836549 -1787627 -1665280 -1767157
1132 -1767157 -3401957 -5895942 -7619529 -8140368 -7939934 -7046229 -5675835 -5163353 -6169537
1123 -6169537 -6892645 -5403652 -2918939 -2022004 -2312686 -1162958 1324738 1987224 96451
1114 96451 -758539 1686658 4277543 2929557 -1308834 -4084631 -4076470 -3912561 -5223006
1105 -5223006 -6162474 -4603593 -1426299 640053 365289 -746975 -457529 1113607 815349
1096 815349 -3960225 -11008274 -14661058 -12462110 -8377054 -7536998 -9840687 -11407911 -10658842
1087 -10658842 -9434294 -8874011 -8058538 -7049184 -7642960 -9948205 -11194401 -9422983 -5996246
1078 -5996246 -3163491 -1509399 -1201063 -3207458 -7212039 -10356117 -10362406 -8426833 -6904280
1069 -6904280 -5622087 -2932236 710199 2918163 2666667 1038364 -1043467 -3436122
1061 -3436122 -5035135 -3800489 564590 5418851 7483443 5633393 1379755 -2449849
1053 -2449849 -3638204 -2364901 -1068687 -1597778 -2970050 -3258415 -2951881 -4320284 -7657412
1044 -7657412 -10612124 -11654819 -11758401 -11807902 -10871144 -8507843 -6443644 -5849873 -4893142
1035 -4893142 -1620927 2039035 2211250 -1360327 -4561939 -4100821 -1033223 1537129 2066678
1026 2066678 845580 -1419143 -3829638 -5325073 -5785591 -6262763 -7198444 -7481790 -6291733
1017 -6291733 -4661469 -3817123 -3024876 -826366 2286487 4295429 4386227 3398579 1758422
1008 1758422 -965329 -4215507 -6216123 -6199669 -5018730 -2932254 970614 5846839 7868270
999 7868270 4251378 -2745774 -8189301 -10037845 -10033432 -9729025 -8656084 -6881908 -6401571
990 -6401571 -8206253 -9832160 -8021395 -3118927 1099200 1986557 846873 612542 1824736
981 1824736 2159175 -167645 -3793330 -5873941 -5596270 -4568241 -3855251 -2578521 -261977
972 -261977 1388919 808644 -758928 -1138136 -783620 -1808387 -3888462 -4212855 -2019170
963 -2019170 -231459 -1290555 -3817438 -5125278 -5045092 -5280549 -6450104 -7808286 -8883197
954 -8883197 -9475646 -8782542 -6400572 -3843130 -3422253 -5606686 -8482285 -9632765 -7939450
945 -7939450 -4180479 -529816 1345582 2186328 3874298 5856559 5111360 1037950 -2291424
936 -2291424 -1465838 801340 -840523 -6602571 -11278653 -11552522 -9536297 -8298567 -7755989
927 -7755989 -6743483 -5966151 -6520041 -7661499 -8301100 -9044909 -10617960 -11678002 -10509781
918 -10509781 -8066791 -7121994 -8583165 -10340073 -9856169 -6830615 -3369113 -2251614 -4620982
909 -4620982 -8595591 -10653532 -9232724 -6515292 -5847166 -7869008 -10058384 -9708952 -6510501
900 -6510501 -2437012 173492 551291 907 337054 1714284 2603148 2061674 1043810
891 1043810 957273 1959054 3438495 5170027 6929157 7768418 6884194 4732627 2279908
882 2279908 -311911 -3169446 -5450010 -5988345 -5052980 -4191749 -4247448 -4620987 -4672486 -4769419
872 -4769419 -5430017 -6160246 -5856883 -4265747 -2631919 -2595926 -4280837 -5799081 -5356751
863 -5356751 -3778190 -3805355 -6407628 -9054154 -8831952 -6332818 -4719591 -5217005 -5500338
854 -5500338 -3270781 63692 694731 -3037787 -8606872 -11938850 -11221099 -7758938 -4006244
845 -4006244 -1792040 -1974044 -4135692 -6123140 -5511947 -2806487 -1889161 -5482762 -11052790
836 -11052790 -13419935 -11011676 -7070887 -4737062 -3796850 -2930003 -2130968 -1395719 274379
827 274379 2497427 2493004 -1070727 -5107225 -5741848 -3463208 -1774305 -1861456 -1824505 -726539
817 -726539 -186259 -1637799 -4539311 -7588576 -9549839 -8948488 -5423823 -1510796 -549171
808 -549171 -2552522 -4677188 -5922914 -8172934 -11723526 -13250978 -10304199 -5205340 -2022269
799 -2022269 -1506809 -1519910 -1136242 -1649198 -3926175 -7032545 -9740409 -11928729 -14041277
790 -14041277 -15875483 -16279463 -14186548 -10287769 -7240101 -7071289 -8558039 -8724879 -6987064
781 -6987064 -5881874 -7268066 -9942800 -11900006 -12804277 -13013523 -12275493 -10956348 -10599792
772 -10599792 -11547711 -11912642 -10708893 -9853881 -10835630 -11735986 -10595536 -9574588 -11730680
763 -11730680 -14970987 -13942171 -8032421 -2976591 -3328855 -7204967 -10171546 -10878158 -10554658
754 -10554658 -9811110 -8756556 -8380325 -9064567 -8936212 -6162161 -2063241 276504 -78592
745 -78592 -1442146 -2488559 -3583198 -5111411 -6369654 -6558418 -5549034 -3358719 -100845
736 -100845 3134826 4470143 3011221 -82180 -2654113 -3286779 -1961833 297852 2152886
727 2152886 2874743 2953951 3497416 4780058 5689175 4909640 2530785 195748 -451348
718 -451348 589775 1742620 1687589 891173 829519 1724841 1822893 -526633 -4491270 -7189784
708 -7189784 -6587520 -3580689 -1081063 -1194573 -3368664 -5280915 -5430842 -4476581 -3765395
699 -3765395 -3197388 -1603349 962291 2838247 3225806 3529526 4942910 5848959 3559848
690 3559848 -1650535 -6183508 -7174850 -5354992 -3215679 -1806937 -572652 604462 849148
681 849148 -157453 -1289937 -1332019 -811471 -1703291 -4887758 -8294589 -8628838 -5413813
672 -5413813 -2228533 -2657985 -5768507 -7471338 -6078359 -3996945 -3325285 -2658588 -223966
663 -223966 2267678 2020295 37631 5663 2517462 4045817 2458922 173169 147551
654 147551 1611575 2075362 1352115 898675 736115 -127111 -1196862 -1240591 -918058 -1811124
644 -1811124 -3133832 -2471147 -1800 1214834 35834 -844550 596557 2157754 818369
635 818369 -2456841 -4237236 -3641068 -2761012 -2602079 -1711884 678112 2820249 2978422
626 2978422 1935325 1522398 1800518 1206830 -942614 -3380416 -4486983 -4275554 -4425178
617 -4425178 -6438298 -9942766 -13011152 -14147911 -13513584 -11943917 -9477951 -5784118 -1770207
608 -1770207 412730 -569092 -3735441 -6681709 -7617678 -6473275 -4583096 -3631927 -4568043
599 -4568043 -7113041 -10125517 -12223162 -12135858 -9341674 -5192115 -2804438 -4380635 -8372108
590 -8372108 -10496191 -8208480 -3343969 350244 1557950 2338755 5131918 9852029 14087630
581 14087630 15444180 13362360 9154627 4882414 2182534 1560892 2201580 2487679 1343331
572 1343331 -574549 -1460629 -579588 593225 212626 -1281050 -1419282 1231561 5217042
563 5217042 7797914 7616029 5293693 2221578 -367350 -1594040 -1308293 -482721 -620533
554 -620533 -2426063 -5183440 -7419248 -7970439 -6588584 -4076844 -2079548 -2224930 -4680039
545 -4680039 -7336059 -7102797 -2882739 2721469 5463458 3594893 -641055 -3986110 -5684673
536 -5684673 -7118093 -8867731 -9942921 -9915247 -9915964 -10608977 -10563073 -8017021 -3585354 142351
526 142351 1528411 1305083 1009159 1001580 502272 -966522 -2757195 -3722815 -3436297 -2611912
516 -2611912 -2246288 -2570822 -3241975 -4407995 -6785318 -10316014 -13464299 -14620385 -13927260
507 -13927260 -12977424 -12735705 -12454862 -10906124 -8216978 -5974261 -5445986 -6076237 -6253942
498 -6253942 -5603705 -5692710 -7728619 -10273120 -10736558 -9064213 -8071745 -9385032 -10911574
489 -10911574 -9916217 -7108365 -5378957 -5304859 -4738575 -3033081 -2678916 -5291626 -8325785
480 -8325785 -8077411 -4642112 -1446199 -425439 -201263 741818 1528184 726248 -1013632
471 -1013632 -1795456 -1127506 -284731 -373648 -1181059 -1718352 -939083 1741940 5472597 7742857
461 7742857 6605151 3322551 1378006 2342153 4114623 4047887 2369401 1167766 1135909
452 1135909 1135281 448719 -458934 -1437576 -3068355 -5071661 -5879360 -4729332 -3088258 -2928914
442 -2928914 -4225168 -5120515 -4296183 -2423430 -1312186 -2031637 -3874362 -5108241 -4871804
433 -4871804 -4089687 -4070302 -4576544 -4202338 -2489859 -475746 993153 2157935 3124018
424 3124018 3113194 1783113 167579 -696272 -1173663 -2084361 -3236922 -4035160 -4771047
415 -4771047 -6015201 -7231823 -7323297 -6332489 -5439733 -5323062 -5468515 -5109156 -4138744 -3121542
405 -3121542 -2790115 -3239048 -3457061 -2489484 -1317596 -2143037 -4999480 -6816326 -5425744
396 -5425744 -2922444 -2868945 -5372357 -7495132 -7719950 -7095080 -6271021 -4526661 -2057389
387 -2057389 -261555 873997 2751759 4748210 4088074 607455 -1657431 -9299 2621689
378 2621689 1924080 -1514929 -3705112 -3565882 -3843417 -6078140 -8416450 -9167851 -9473849
369 -9473849 -11023876 -13187320 -13903907 -12244164 -9059255 -5936644 -4157840 -3936108 -4234842
360 -4234842 -3889308 -2904922 -1972091 -1124910 -79681 502502 -233320 -1395429 -1070062
351 -1070062 631444 1141948 -1172853 -4864038 -7529425 -8465560 -8116130 -6553431 -4081529
342 -4081529 -2055195 -1350321 -979523 42110 445903 -1469573 -4340544 -4701986 -1783362
333 -1783362 1118770 1067649 -859148 -1943245 -2123391 -3575761 -6680544 -8877811 -7999854
324 -7999854 -4883515 -1743120 643863 2793243 4431517 4275369 2050263 -510344 -1332647
315 -1332647 -156226 1389438 1518545 -162875 -2496120 -3875268 -3720609 -2955079 -2802891
306 -2802891 -3346180 -3981298 -5146661 -8190687 -12781253 -15765406 -14250813 -9390740 -5432257
297 -5432257 -4870855 -6113830 -6486053 -5975590 -6650721 -9227397 -11895638 -12656989 -11535615
288 -11535615 -9850939 -8132857 -5771672 -2621686 42003 779333 -246857 -1540311
280 -1540311 -2229061 -2870752 -4039884 -5086909 -5093631 -4350618 -3803411 -3462495 -2667192 -1820826
270 -1820826 -2318717 -4245039 -5553119 -4624748 -2725609 -2550149 -4660998 -6759612 -6740600
261 -6740600 -5279361 -4563156 -5152275 -5370266 -3978937 -2245288 -2303033 -4107175 -5606595
252 -5606595 -6057035 -7277644 -10444659 -13193161 -11980721 -6747187 -1137379 1839401 2337241
243 2337241 1727344 525022 -761409 -872162 409018 1099214 -623527 -3862462 -6366837
234 -6366837 -7548518 -8389394 -8992278 -8220404 -5808318 -3213603 -2004672 -2402959 -3501628
225 -3501628 -4056609 -3196601 -1288854 48831 -328475 -1627654 -2210916 -1618347 -467961
216 -467961 901555 2187811 2184007 23793 -2870752 -4104377 -3572634 -3279379 -3701788
207 -3701788 -2858694 18458 2211260 637435 -4189422 -8882722 -10812704 -9725257 -6845727
198 -6845727 -3900392 -2386073 -2477498 -2924560 -2712521 -2178583 -1943467 -1811179 -1559846 -1714313
188 -1714313 -2524390 -3193670 -3087261 -2595339 -1885497 -299988 1712900 1782902 -1295167
179 -1295167 -5034908 -6149320 -5027809 -4919745 -7329470 -10733774 -13432270 -14974869 -14823640
170 -14823640 -12383537 -8825963 -6406991 -5398839 -4041191 -2062633 -1570179 -3379500
162 -3379500 -5075131 -4354946 -2164056 -713813 -227986 381756 1105264 1167434 708721
$$ [...]
##END NTUPLES=NMR SPECTRUM
##END=
