##TITLE=31Pdec_DE-162_oil_TFA
 DMSO-d6+CCl4, 64 sc
 9.7.2026
##JCAMPDX= 6.0         $$ Bruker NMR JCAMP-DX V2.0
##DATA TYPE= NMR SPECTRUM
##DATA CLASS= NTUPLES
##ORIGIN= UXNMR, Bruker Analytische Messtechnik GmbH
##OWNER= root
$$ XWIN-NMR		Version 3.5
$$ Thu Jul  9 15:09:48 2026 Russian Standard Time (UT+4h)  she@DPX200
##.OBSERVE FREQUENCY= 81.013821
##.OBSERVE NUCLEUS= ^31P
##.ACQUISITION MODE= SIMULTANEOUS
##.ACQUISITION SCHEME= undefined
##.AVERAGES= 64
##.DIGITISER RES= 17
##SPECTROMETER/DATA SYSTEM= spect
##.PULSE SEQUENCE= zgpg30
##.SOLVENT NAME= DMSO
##.SHIFT REFERENCE= (INTERNAL, DMSO, 0, 197.392)
##AUDIT TRAIL= $$ (NUMBER, WHEN, WHO, WHERE, WHAT)
$$ ##TITLE= Audit trail, XWIN-NMR		Version 3.5
$$ ##JCAMPDX= 5.01
$$ ##ORIGIN= Bruker BioSpin GmbH
$$ ##OWNER= she
$$ F:/spectra/data/she/nmr/P31/2/pdata/1/auditp.txt
$$ ##AUDIT TRAIL=  $$ (NUMBER, WHEN, WHO, WHERE, WHAT)
(   1,<2026-07-09 15:08:47.96 +0400>,<she>,<DPX200>,
      <created by zg, POWCHK disabled, PULCHK disabled
       configuration hash MD5:
       00 E9 B6 7A A2 85 ED C7 34 08 36 98 17 FE 4E 26
       data hash MD5: 32K
       DA 8E DE 35 BE 9B E5 CE 42 4E 65 F0 9E CC 63 96>)
(   2,<2026-07-09 15:08:49.32 +0400>,<she>,<DPX200>,
      <Start of raw data processing
       efp BC_mod = 2 LB = 1.5 FT_mod = 6 PKNL = 1 PHC0 = 1989.712 PHC1 = -24.90225 SI = 64K 
       data hash MD5: 64K
       73 42 7D 27 CD C8 DE EA 0D 93 52 40 7F 86 97 00>)
(   3,<2026-07-09 15:09:11.60 +0400>,<she>,<DPX200>,
      <pk PHC0 = -71.51208 PHC1 = 220.0001 
       data hash MD5: 64K
       2B 61 D7 3F D9 D6 27 4E A7 AB 75 C5 58 0A D2 66>)
(   4,<2026-07-09 15:09:16.51 +0400>,<she>,<DPX200>,
      <abs ABSG = 5 
       data hash MD5: 64K
       A2 6E 3E 8C 1F A4 5B 1B E5 75 54 52 AB AE 4E 16>)
$$ ##END=
$$ 
$$ hash MD5
$$ B9 3E ED 39 AA B5 96 B4 39 B7 C1 7C 4D 23 59 C3
##$RELAX= 
##$RELAX= 
##$RELAX= 
##$RELAX= 
##$RELAX= 
##$RELAX= 
##$RELAX= 
##$RELAX= 
$$ Bruker specific parameters
$$ --------------------------
##$DU= <F:/spectra>
##$EXPNO= 2
##$NAME= <P31>
##$PROCNO= 1
##$TYPE= <nmr>
##$USER= <she>
##$AMP= (0..31)
100 100 100 100 100 100 100 100 100 100 100 100 100 100 100 100 100 100 
100 100 100 100 100 100 100 100 100 100 100 100 100 100 
##$AQSEQ= 0
##$AQ_mod= 1
##$AUNM= <au_zg>
##$AUTOPOS= <>
##$BF1= 81.014009
##$BF2= 200.13
##$BF3= 200.13
##$BF4= 200.13
##$BF5= 200.13
##$BF6= 200.13
##$BF7= 200.13
##$BF8= 200.13
##$BYTORDA= 1
##$CFDGTYP= 0
##$CFRGTYP= 5
##$CHEMSTR= <none>
##$CNST= (0..31)
1 1 145 1 1 1 1 1 1 1 1 1 1 1 1 1 1 1 1 1 1 1 1 1 1 1 1 1 1 1 1 1 
##$CPDPRG= <waltz16>
##$CPDPRG1= <>
##$CPDPRG2= <waltz16>
##$CPDPRG3= <>
##$CPDPRG4= <mlev>
##$CPDPRG5= <mlev>
##$CPDPRG6= <mlev>
##$CPDPRG7= <mlev>
##$CPDPRG8= <mlev>
##$CPDPRGB= <>
##$CPDPRGT= <>
##$D= (0..31)
0 1 0 0 0 0 0 0 0 0.06 0 0.03 2e-05 3e-06 0 0 0.0002 0 0 0 0 0 0 0 0 0 
0 0 0 0 0 0 
##$DATE= 1783595327
##$DBL= (0..7)
120 120 120 11 120 120 24 19 
##$DBP= (0..7)
150 150 150 150 150 150 150 150 
##$DBP07= 0
##$DBPNAM0= <>
$$ [...]
##$SUBNAM3= <"">
##$SUBNAM4= <"">
##$SUBNAM5= <"">
##$SUBNAM6= <"">
##$SUBNAM7= <"">
##$SUBNAM8= <"">
##$SUBNAM9= <"">
##$SW= 400.765351723535
##$SWIBOX= (0..15)
0 1 3 0 0 0 0 0 0 0 0 0 0 0 0 0 
##$SW_h= 32467.5324675325
##$TD= 32768
##$TD0= 1
##$TE= 0
##$TE2= 300
##$TE3= 300
##$TEG= 300
##$TL= (0..7)
0 120 53 12 22 120 120 120 
##$TP= (0..7)
150 150 150 150 150 150 150 150 
##$TP07= 0
##$TPNAME0= <>
##$TPNAME1= <>
##$TPNAME2= <>
##$TPNAME3= <>
##$TPNAME4= <>
##$TPNAME5= <>
##$TPNAME6= <>
##$TPNAME7= <>
##$TPOAL= (0..7)
0.5 0.5 0.5 0.5 0.5 0.5 0.5 0.5 
##$TPOFFS= (0..7)
0 0 0 0 0 0 0 0 
##$TUNHIN= 0
##$TUNHOUT= 0
##$TUNXOUT= 0
##$USERA1= <user>
##$USERA2= <user>
##$USERA3= <user>
##$USERA4= <user>
##$USERA5= <user>
##$V9= 5
##$VALIST= <valist>
##$VCLIST= <CCCCCCCCCCCCCCC>
##$VD= 0
##$VDLIST= <DDDDDDDDDDDDDDD>
##$VPLIST= <PPPPPPPPPPPPPPP>
##$VTLIST= <TTTTTTTTTTTTTTT>
##$WBST= 1024
##$WBSW= 4
##$XGAIN= (0..3)
0 0 0 0 
##$XL= 0
##$YL= 0
##$YMAX_a= 6611
##$YMIN_a= -5782
##$ZGOPTNS= <>
##$ZL1= 120
##$ZL2= 120
##$ZL3= 120
##$ZL4= 120
##$ABSF1= 197.3918
##$ABSF2= -203.3724
##$ABSG= 5
##$ABSL= 3
##$ALPHA= 0
##$AQORDER= 0
##$ASSFAC= 0
##$ASSFACI= 0
##$ASSFACX= 0
##$ASSWID= 0
##$AUNMP= <proc_1d>
##$AZFE= 0.1
##$AZFW= 0.5
##$BCFW= 0
##$BC_mod= 2
##$BYTORDP= 0
##$COROFFS= 0
##$CY= -3
##$DATMOD= 1
##$DC= 0
##$DFILT= <>
##$DTYPP= 0
##$F1P= 0
##$F2P= 0
##$FCOR= 1
##$FTSIZE= 65536
##$FT_mod= 6
##$GAMMA= 0
##$GB= 0
##$INTBC= 1
##$INTSCL= 9.790993e-09
##$ISEN= 30
##$LB= 1.5
##$LEV0= 0
##$LPBIN= 0
##$MAXI= 10000
##$MC2= 0
##$MEAN= 0
##$ME_mod= 0
##$MI= 50
##$NCOEF= 0
##$NC_proc= -8
##$NLEV= 6
##$NOISF1= 182.463
##$NOISF2= 159.3651
##$NSP= 0
##$NTH_PI= 0
##$NZP= 0
##$OFFSET= 197.3918
##$PC= 4
##$PHC0= 1918.2
##$PHC1= 195.0979
##$PH_mod= 1
##$PKNL= yes
##$PPARMOD= 0
##$PSCAL= 0
##$PSIGN= 0
##$REVERSE= no
##$SF= 81.014063255964
##$SI= 65536
##$SIGF1= 159.3651
##$SIGF2= -187.1042
##$SINO= 113.3802
##$SIOLD= 16384
##$SREGLST= <1H.CDCl3>
##$SSB= 0
##$STSI= 65536
##$STSR= 0
##$SW_p= 32467.5324675325
##$SYMM= 0
##$S_DEV= 0
##$TDeff= 32768
##$TDoff= 0
##$TI= <>
##$TILT= no
##$TM1= 0
##$TM2= 0
##$TOPLEV= 0
##$USERP1= <user>
##$USERP2= <user>
##$USERP3= <user>
##$USERP4= <user>
##$USERP5= <user>
##$WDW= 1
##$XDIM= 65536
##$YMAX_p= 332516577
##$YMIN_p= -31914032
$$ End of Bruker specific parameters
$$ ---------------------------------
##NTUPLES= NMR SPECTRUM
##VAR_NAME=  FREQUENCY,     SPECTRUM/REAL,   SPECTRUM/IMAG
##SYMBOL=    X,             R,               I
##VAR_TYPE=  INDEPENDENT,   DEPENDENT,       DEPENDENT
##VAR_FORM=  AFFN,          ASDF,            ASDF
##VAR_DIM=   65536,         65536,           65536
##UNITS=     HZ,            ARBITRARY UNITS, ARBITRARY UNITS
##FACTOR=    0.49542278885378, 1,            1
##FIRST=     15991.5117654749, 0,            0
##LAST=      -16476.0207020576, 0,           0
##MIN=       -16476.0207020576, -31914032,   0
##MAX=       15991.5117654749, 332516577,    0
$$ Real data points
##PAGE= N=1
##DATA TABLE= (X++(R..R)), XYDATA
$$ [...]
7477e229966q33533J151186K514044J819662k70008j242713j34991Q76764j43402
7468a492957j612522q18441J672904K770957J537634L24139R43195K111578J612306
7459G048793o10418k469479j976915R78298M353401N304629K643031j804737m754197
7450H712406m385603j552045J319826K109893N97410j228357j286411j93424m89255
7441C604440k511828l256153q61007K048728J922642o53586k334876j992364j073630
7432e107634q7859J635722L198209K888561J639103J960846L208350J978364j924063
7423I389599m136269k082577J161231J652279j17060j348141j398641j071886
7415B048535R0369K386709L537264J187849l031244n095058l879934k102840j963897
$$ plain form
7477 -5229966 -6063499 -4912313 -2398269 -578607 -848615 -2091328 -2226319 -1349555 -1492957
7468 -1492957 -3105479 -3923920 -2251016 519941 2057575 2381714 3324909 5436487 7048793
7459 7048793 6438375 3968896 1991981 2970279 7323680 12628309 15271340 13466603 8712406
7450 8712406 4326803 2774758 4094584 6204477 6801887 5573530 4287119 4093695 3604440
7441 3604440 1092612 -2163541 -3024548 -975820 946822 293236 -2041640 -4034004 -5107634
7432 -5107634 -5195493 -3559771 -361562 2526999 4166102 6126948 9335298 11313662 9389599
7423 9389599 5253330 3170753 4331984 5984263 5867203 4519062 3120421 2048535
7415 2048535 2138904 4525613 8062877 9250726 6219482 1124424 -2755510 -4858350 -6822247
7406f822247k359573j096430J800825L931521L218075M65169j076961N66523L243966
7397A870868L266612O80820p39601N92100J499986p07841l620537l415118p31446
7388a304157P70761J09305o05381n52097j047183k038800j435668J237249L374391
7379a491580K615207k48089k456841k099055L74857K322463J149314k329673l954452
7370f117849j456380J992668K101118l58060j253894L10610J480414J155280J164021
7361i82072J662101M39408k047159k094590Q08344K047903o90115k920166l08422
7352d084768M046076M301078Q61364q34766J088620K997656K052086l75983k086235
7343G965128k854177k976220k190097r12679r6591N14683J712132K616729J849139
$$ plain form
7406 -6822247 -9181820 -10278250 -8477425 -4545904 -1327829 -862660 -1939621 -1373098 1870868
7397 1870868 5137480 5818300 5078699 5670799 7170785 6462944 2842407 -572711 -1304157
7388 -1304157 -533396 -424091 -1029472 -1581569 -2628752 -4667552 -6103220 -4865971 -1491580
7379 -1491580 1123627 875538 -1581303 -3680358 -3305501 -983038 166276 -2163397 -6117849
7370 -6117849 -7574229 -5581561 -3480443 -3838503 -5092397 -4781787 -3301373 -2146093 -982072
7361 -982072 680029 1119437 -927722 -3022312 -2213968 -166065 -856180 -3776346 -4084768
7352 -4084768 -38692 4262386 5123750 4288984 5377604 8375260 10427346 10051363 7965128
7343 7965128 5110951 2134731 -55366 -968045 -1064636 -549953 1162179 3778908 5628047
7334E628047N33801Q41405J691606j19284l958291m956200j275257K453422J705898
7325B545147j557073k596169j035010n2456l26757N02906K777674L663489J824079
7316E745830l56031n81555J44656k48084j608422k221841j267509Q14161L112959
7307C534164M148044K391771j518763m234977l146080L51833K696425K543884
7299F766301J371538K37085j519898l888016m917927l301354o91692K18983q40807
7290f565787j684100p20176J289057K518459K070101M95315q85349q91603P63430
7281c610653L195659M823892M339134J712909j299771k192830l38452J677433
7273H307321R12902j720578k323892K18366K155894N56353j732988l43806L272611
$$ plain form
7334 5628047 6161848 7003253 8694859 8575575 4617284 -338916 -1614173 839249 2545147
7325 2545147 988074 -1608095 -2643105 -2695561 -3022318 -2519412 258262 3921751 5745830
7316 5745830 5389799 4808244 4952900 4704816 3096394 874553 -392956 421205 3534164
7307 3534164 7682208 10073979 8555216 4320239 1174159 1525992 4222417 6766301
7299 6766301 8137839 8374924 6855026 2967010 -1950917 -5252271 -5943963 -5724980 -6565787
7290 -6565787 -8249887 -8970063 -7681006 -5162547 -3092446 -2597131 -3482480 -4374083 -3610653
7281 -3610653 -414994 4408898 8748032 10460941 9161170 6968340 6629888 8307321
7273 8307321 9220223 7499645 5175753 5394119 7550013 8106366 6373378 6029572 9302183
7264I302183L449629j017673m719615l454359K43302J814919J148696R86193J620943
7255I374218J109803o28046j575952j020170k64132j99957o00266j452517k654617
7246B088364k814998p90490J904447K686841J642394J101090J639641J356499
7238H813788n89973k568848l288685l382839l293336k115900K27004J906437J658367
7229b633985M90301k53204o91610j134975r27615J08252Q43520P83858J091653
7220b323805K320337K974337J913290M36222K13162P49935P43219M14837N32677
7211G974211N38607k76425j016920o63673j4233m1006J93512J485876J907507
7202A0087456n36871l758779l793050q00181J024548q2752j088149L98664K134438
$$ plain form
7264 9302183 12751812 11734139 7014524 3560165 3803467 5618386 6767082 7753275 9374218
7255 9374218 10484021 9855975 8280023 7259853 6995721 6795764 6195498 4742981 2088364
7246 2088364 -726634 -1517124 387323 3074164 4716558 5817648 7457289 8813788
7238 8813788 8223815 5654967 2366282 -1016557 -4309893 -6425793 -6198789 -4292352 -2633985
7229 -2633985 -2143684 -2396888 -3088498 -4223473 -5151088 -5042836 -4199316 -3415458 -2323805
7220 -2323805 -3468 2970869 4884159 5320381 5533543 6283478 7026697 7441534 7974211
7211 7974211 8512818 8236393 7219473 6555800 6541567 6500561 6694073 8179949 10087456
7202 10087456 9550585 5791806 1998756 1198575 2223123 2140371 1052222 1450886 3585324
7193C585324J207082r65478r62376R44767J056777j922454m542011l286049N97987
7184d286431K928043K251041J324998K558691M201420K938703r77123l843124
7176G096218l629543k144812j321163l32954J726485K968127J348955j563785
7168D147528k514436j147049K42943O15992P70500O98464l57865j505423j169826
7159b19172l76922j554555l790823l068357J698443O271268O299613K270454k024631
7150E505318l513573j421798K446385M068485P61549m615984o127439k448621
7142e345678J457130J676317K48861N57583J988645K357337K081040K329998J982551
7133I333784L5268j631558j441655j338836l094955m296207k301059N28191M01730
$$ plain form
7193 3585324 4792406 3826928 2864552 3809319 4866096 2943642 -1598369 -4884418 -4286431
7184 -4286431 -1358388 892653 2217651 4776342 8977762 11916465 10939342 7096218
7176 7096218 3466675 1321863 700 -332254 1394231 4362358 5711313 4147528
7168 4147528 1633092 486043 728986 1344978 2115478 2813942 2456077 950654 -219172
7159 -219172 -596094 -2150649 -5941472 -9009829 -7311386 -1040118 5259495 7529949 5505318
7150 5505318 1991745 569947 3016332 7084817 7846366 3230382 -2897057 -5345678
7142 -5345678 -3888548 -2212231 -1963370 -1405787 582858 2940195 5021235 7351233 9333784
7133 9333784 9369052 7737494 6295839 4957003 1862048 -2434159 -4735218 -4207027 -3805297
7124c805297j455714j222149O60247Q41559j41635J301489M738404N798756L530870
7115A0246530J489204Q72901j041555m317174m722530j032088K061635J302588
7107D859511m18159l4902M68440j057321j852187Q44792L792601K218673k465890
7098F355558m877792l727100k407116k584118k252797j60996K074534K872505
7090d707322K599387K068706J382517M14088j132128l544899n610703m749343
7082a3279697n06798L785143M997079L949067K816089J261848j514785l237381
7074a729435j394804J866422K266921n5743j167076k4395M52399o88192n10963
7065i84866K403061N074111M602890J935940p14452k932241m659656m725610k898059
$$ plain form
7124 -3805297 -5261011 -6483160 -5822913 -4981354 -5122989 -3821500 916904 6715660 10246530
7115 10246530 11735734 12608635 11567080 7249906 2527376 1495288 3556923 4859511
7107 4859511 4441352 4406450 4874890 3817569 1965382 2810174 6602775 8821448 6355558
7098 6355558 1477766 -2249334 -4656450 -7240568 -9493365 -9654361 -7579827 -4707322
7090 -4707322 -2107935 -39229 1343288 1757376 625248 -2919651 -8530354 -13279697
7082 -13279697 -13786495 -10001352 -5004273 -1055206 1760883 3022731 1507946 -1729435
7074 -1729435 -3124239 -1257817 1009104 953361 -213715 -238110 214289 -473903 -984866
7065 -984866 1418195 6492306 11095196 13031136 12316684 9384443 4724787 -823 -2898882
7056b898882r17788K21516J493820K856471K086158j299969l870657k696819L99071
7047d627079J748368R81314M29287J053745J897813K368122K254482M65887l424867
7038C147072o960834o772590k600550K649596O274642P126175M595821p41402
7030F717930n560371n900212j764117K479250L106151P47972j514896j968673
7022c656966j192161n41281q07595j668220j882119o38853J222977K302686K803990
7013d057542M043785N563985M743997M70118m392284n919465l727008j035339
7005d309753n45983j800100k609665j676941N78312K697179L186549J695922k92918
6996c077398o60028R69583K744324L015347K316839J961805J632809J29368j808598
$$ plain form
7056 -2898882 -3816670 -3595154 -2101334 755137 2841295 1541326 -2329331 -5026150 -4627079
7047 -4627079 -2878711 -1897397 -1468110 -414365 1483448 3851570 6106052 6571939 3147072
7038 3147072 -3813762 -10586352 -13186902 -10537306 -4262664 2863511 7459332 6717930
7030 6717930 1157559 -4742653 -6506770 -4027520 -921369 -173397 -1688293 -3656966
7022 -3656966 -4849127 -5390408 -6198003 -7866223 -9748342 -10387195 -9164218 -6861532 -4057542
7013 -4057542 -13757 5550228 10294225 10764343 6372059 452594 -3274414 -4309753
7005 -4309753 -4855736 -6655836 -9265501 -10942442 -10364130 -7666951 -4480402 -2784480 -3077398
6996 -3077398 -3737426 -2767843 -23519 2991828 5308667 7270472 8903281 9032649 7224051
6987G224051j672541J031515L116807J461894k749071n364686m260757j212608
6979b425396R40943J119745j41984j764949k392667j162895R06658J580710L47489
6970b992346n61368P83198L105083L577506J637487n30608j087468m98843j88874
6961C243767o40920j446771k208069k548266j842435J28253K388781L439732K925327
6952C439399K037743J840645J713640L28575j954256k884668j168838J467662
6944D819902K244708Q27201n54709l95769K33099l34183j801646k343628j007305
6935A687670J152081K171288J040129j338619k947665k698384j502434q05173
6927c241107n28877M52043K144589L281595L312948K786209J535311j282777m511999
$$ plain form
6987 7224051 5551510 6583025 9699832 11161726 8412655 3047969 -1212788 -2425396
6979 -2425396 -1484453 -364708 -506692 -2271641 -4664308 -5827203 -4920545 -3339835 -2992346
6970 -2992346 -3553714 -2770516 334567 3912073 5549560 5018952 3931484 3432641 3243767
6961 3243767 2602847 1156076 -1051993 -3600259 -5442694 -5314441 -2925660 514072 3439399
6952 3439399 5477142 7317787 9031427 9360002 7405746 4521078 3352240 4819902
6944 4819902 7064610 7891811 7337102 6941333 7174432 6840249 5038603 2694975 1687670
6935 1687670 2839751 5011039 6051168 4712549 1764884 -933500 -2435934 -3241107
6927 -3241107 -3769984 -3317941 -1173352 2108243 5421191 8207400 9742711 8459934 3947935
6918C947935m873610j410976K002671J244654k249511l287616j53474L080965
6910a698962K218595j620633l770270j808801K031735L888158K625431P78080
6902B643333J147337K971531K792388m56142l224397k070529J095752J579757
6894F479030j079386k556192p23217J019852m70805k697960j509055K024958L120557
6885C607782P01373j216610j4945J790679R79423j492399k475633j297826J32305
6876G14149N46501K34821m44921j308873j619567j013672n79636j090059r39408
6867e500665J662998M945604N114062J877705q72264q70698m70773j898729k953224
6858A034016o92812L103814M166452K059283J63215j17820q71031k991416m128340
$$ plain form
6918 3947935 -925675 -2336651 -333980 910674 -1338837 -4626453 -4779927 -1698962
6910 -1698962 519633 -1101000 -4871270 -6680071 -4648336 -760178 1865253 2643333
6902 2643333 3790670 6762201 9554589 9098447 5874050 3803521 4899273 6479030
6894 6479030 5399644 2843452 2120235 3140087 2669282 -28678 -1537733 487225 3607782
6885 3607782 4309155 3092545 3077600 4868279 5847702 4355303 1879670 581844 714149
6876 714149 1260650 1495471 1050550 -258323 -1877890 -2891562 -3471198 -4561257 -5500665
6867 -5500665 -3837667 1107937 6221999 8099704 7227440 6356742 5885969 3987240 1034016
6858 1034016 341204 3445018 7611470 9670753 9833968 9716148 8845117 5853701 1725361
6849A725361k750653q20585n28473j178521j284669j200703j503205j118304M88755
6840h170997J344626q8984j796178j054045J041826J299438j99015j79939K350882
6831e452386M381198L584333J606251J090744J852647J931419P99781m37546j129127
6822H227314j662932k310370k673804k210132p15209J445500L248939L653194
6814G002500K676810J343899L59368m49879j165337j275136p66181p58338j993480
6805D974226l246447k517844J43966K177319J494475q11702j783712m37558J020226
6796A012949L90314j405058j869466p34990j8324l60673L1674J853242K782601
6787A682269J070485j189135j087735M54205L56510j289125j361087Q00779J993329
$$ plain form
6849 1725361 -1025292 -1845877 -2374350 -3552871 -4837540 -6038243 -7541448 -8659752 -8170997
6840 -8170997 -6826371 -6915355 -8711533 -9765578 -8723752 -7424314 -7623329 -7803268 -5452386
6831 -5452386 -1071188 2513145 4119396 5210140 7062787 8994206 9793987 9356441 8227314
6822 8227314 6564382 4254012 1580208 -629924 -1345133 100367 3349306 7002500
6814 7002500 9679310 11023209 11382577 10932698 9767361 8492225 7726044 6967706 4974226
6805 4974226 1727779 -790065 -646099 1531220 3025695 2213993 430281 -7277 1012949
6796 1012949 1403263 -1795 -1871261 -2606251 -2624575 -2985248 -2953574 -1100332 1682269
6787 1682269 2752754 1563619 475884 930089 1286599 -2526 -1363613 -562834 1430495
6778A430495L70706j527942r73077P46228R34450n7447j45446K94306q79458l168076
6768b975261l327457l88652K297867J669380p14459j222165M07534J025977o60857
6759c888093j716732O70107M437851M711506J50618n044880n990973k336281K077255
6750f929622L411035R63491k570377l191763O64210N668022O546484K522486j325987
6741E757979p86132J915035K025440n19534j800425n89783K79475p62112j839461
6732C680482j697891j739892k474030j902269M46771J571593k50477k077427q52824
6723e295964J486415J162195j259815j870400M37275K625085K176487N1124j239190
6714a726788l02593K334094M381677L344630l45673k801885j352711J534889J599587
$$ plain form
6778 1430495 1801201 273259 -699818 46410 980860 923413 777967 1072273 192815 -2975261
6768 -2975261 -6302718 -6691370 -4393503 -2724123 -3438582 -4660747 -4253213 -3227236 -3888093
6759 -3888093 -5604825 -4934718 -496867 4214639 4365257 -679623 -6670596 -9006877 -6929622
6750 -6929622 -3518587 -2555096 -5125473 -8317236 -7653026 -1985004 4561480 7083966 5757979
6741 5757979 4971847 6886882 8912322 8392788 6592363 6002580 6282055 5519943 3680482
6732 3680482 1982591 242699 -2231331 -4133600 -3686829 -2115236 -2365713 -4443140 -5295964
6723 -5295964 -3809549 -2647354 -3907169 -5777569 -5340294 -2715209 -538722 -487598 -1726788
6714 -1726788 -2029381 304713 4686390 8031020 7685347 4883462 3530751 5065640 6665227
6705F665227j165030k994410k124514n20164P9036K72289O22741M71901N7937
6696A365013Q24427K448235K332894m74453l287188l339100j336977J80116L43135
6687i43898J52221M09345R18678J027480K33094r18598n41416K303100M985974
6678G625980L519113j765935n444815l606592J056829K949914N92516k550881
6670B376129l190392j633849k50740l85538j163664o70383J560063L254959J788956
6661A685541j934446l872362j935154J370266K675700J968243J246707J029236
6653B233731N95540J11859k9491p05029k377794l220168j693467K23109m14180
6644e275890k635482k806353l48805J600985J447283J111465J826130J770703
$$ plain form
6705 6665227 5500197 2505787 381273 -138891 -59855 212434 835175 1307076 1365013
6696 1365013 2189440 4637675 6970569 6496116 3208928 -130172 -1467149 -1287033 -943898
6687 -943898 -791677 -382332 536346 1563826 1796920 878322 336906 2640006 7625980
6678 7625980 11145093 9379158 3934343 327751 1384580 4334494 4927010 2376129
6670 2376129 -814263 -2448112 -2698852 -3084390 -4248054 -4918437 -3358374 -103415 1685541
6661 1685541 -248905 -4121267 -6056421 -4686155 -2010455 -42212 1204495 2233731
6653 2233731 2829271 2941130 2911639 2206610 -171184 -3391352 -5084819 -4861710 -5275890
6644 -5275890 -7911372 -10717725 -11066530 -9465545 -8018262 -6906797 -5080667 -3309964
6636c309964l10453k302697j774194M42847J741971J042971r17324k763131k701376
6627a0851350K63358L991215M536687J426067j075014O0383K380039K399715J163944
6618D295044J497662K272466L36894l168192l727105o60580J645260O73348p54314
6609B410483K45800J995001J470307j023909l123295l929440l714714k183820
6601g853587L86119J978028J359665L77348J258116K881961K366764n24907l191648
6592i62141l876835l041697j368780J011205L032827K753887k28843l819749n497841
6583a1997967m465013j664244J299494L161486L755755L741205L173210J257803
6575a738271j550568k549745J90601M554082O289718M031221M64992j454088j459012
$$ plain form
6636 -3309964 -3620417 -5923114 -7697308 -7254461 -5512490 -4469519 -5386843 -8149974 -10851350
6627 -10851350 -10587992 -6596777 -2060090 -634023 -1709037 -1648654 731385 3131100 4295044
6618 4295044 5792706 8065172 8402066 5233874 1506769 846189 2491449 3164797 2410483
6609 2410483 2656283 4651284 6121591 5097682 1974387 -1955053 -5669767 -7853587
6601 -7853587 -7467468 -5489440 -4129775 -3752427 -2494311 387650 2754414 2229507 -962141
6592 -962141 -4838976 -7880673 -9249453 -8238248 -5205421 -2451534 -2680377 -6500126 -11997967
6583 -11997967 -16462980 -18127224 -16827730 -13666244 -9910489 -6169284 -2996074 -1738271
6575 -1738271 -3288839 -5838584 -5647983 -1093901 5195817 9227038 9692030 8237942 6778930
6566F778930q91791n69457m88388n11602p44608j582252l003496l465861r96857
6557e475382L344158N022102J443802l810957n259696k668664j97391N39375J807798
6548e254855M163034M727738K398168j711p02472j562037l296205k888100Q36042
6539a580398L419625R44084l499269m290723j487315M92539K55862J21045O79659
6530d944891J24614j291929j180763L36899M75207j249015k221212j515194j168326
6521a2634610j751328r79012J775001L589692K551425P05535M11539R03047O51861
6512d776850L07366R07772J495098Q16232m09899p84464j35191J180233K894972
6503A495269L679753J898215j198924j979347J73883J253434j211831l823370
$$ plain form
6566 6778930 5887139 5317682 4829294 4317692 3573084 1990832 -1012664 -4478525 -5475382
6557 -5475382 -2131224 2890878 4334680 523723 -4735973 -7404637 -7602028 -7062653 -5254855
6548 -5254855 -1091821 3635917 6034085 6032374 5329902 3767865 471660 -2416440 -1580398
6539 -1580398 1839227 2783311 -715958 -5006681 -6493996 -6001457 -5745595 -5624550 -4944891
6530 -4944891 -4820277 -6112206 -7292969 -6956070 -6480863 -7729878 -9951090 -11466284 -12634610
6521 -12634610 -14385938 -15364950 -13589949 -10000257 -7448832 -6743297 -6331758 -5428711 -4776850
6512 -4776850 -4469484 -3561712 -2066614 -1250382 -1660281 -2444745 -2579936 -1399703 1495269
6503 1495269 5175022 7073237 5874313 3894966 4068849 5322283 4110452 287082
6495B87082k515391R34098J860968L1092p79236N62121J203726k85691j633896
6486c35127r53985N50658J251250J410856J469384O85763r75366j823128q59491
6477D20814N70279Q73926K74921m01413j150449j621558n37211J790556K218370
6468B438235j278138n570324n435176m91095M047311M226816J913285Q59602J067796
6459A778312P5050j910986k118378l36730P9484k250839l713944r10770L664313
6450e644488M653591J210577k312832k675506j152415k10797j63022l11279o15661
6441g221832p51126J77069J586841J359907o87393j633280L70207K963665K902155
6432i33787O25295j008976j004938n29893j02435O73931J230376N98573m70907
$$ plain form
6495 287082 -2228309 -1294211 566757 597849 -181387 380734 1584460 1298769 -335127
6486 -335127 -1289112 -738454 512796 1923652 3393036 4078799 3103433 1280305 420814
6477 420814 991093 1865019 2139940 1738527 588078 -1033480 -1570691 219865 2438235
6468 2438235 1160097 -4410227 -9845403 -10336498 -6289187 -2062371 -149086 710516 1778312
6459 1778312 1853362 -57624 -2176002 -2512732 -2433248 -4684087 -8398031 -9308801 -5644488
6450 -5644488 -990897 219680 -2093152 -4768658 -5921073 -6131870 -6294892 -6606171 -7221832
6441 -7221832 -7972958 -7795889 -6209048 -4849141 -5536534 -7169814 -6799607 -3835942 -933787
6432 -933787 -308492 -1317468 -2322406 -2852299 -2954734 -2280803 -1050427 -451854 -922761
6423i22761m45292J86456m18461j990582j983453N25715L022467K690535j18844
6414E45780k480800k083161O72640L165382L117717J083034k50032K18401M20829
6405D409790j325634k936949j413199J931295K469421j272288n270761n213148
6397h621473j594427J786883K566186J497840N73253Q29101J572780J180673r10183
6388a119367l046696l055710r39106J248074K029313J692672J007474K88205j89340
6379b084481k42303l28439q57683j244670r29990o58363j056289q85556R69318
6370g318456K698446J772138o02596p81511J567470K897883J530923j70309n79846
6361A014142j416881l490066m063765j474198J314184J299907L87922J763961
$$ plain form
6423 -922761 -1368053 -1181597 -1600058 -3590640 -5574093 -5048378 -2025911 664624 545780
6414 545780 -1935020 -4018181 -3345541 -180159 2937558 4020592 3770560 3988961 4409790
6405 4409790 3084156 147207 -1265992 665303 3134724 1862436 -3408325 -8621473
6397 -8621473 -10215900 -8429017 -5862831 -4364991 -3791738 -2962637 -1389857 -209184 -1119367
6388 -1119367 -4166063 -7221773 -8160879 -6912805 -4883492 -3190820 -2183346 -1895141 -2084481
6379 -2084481 -2326784 -2655223 -3512906 -4757576 -5687566 -6345929 -7402218 -8287774 -7318456
6370 -7318456 -4620010 -2847872 -3450468 -4231979 -2664509 233374 1764297 1593988 1014142
6361 1014142 -402739 -3892805 -7956570 -9430768 -8116584 -6816677 -6428755 -4664794
6353d664794M061839L677240R87252m24109M29895J468677K029939L063779L217758
6344A3847476p4186m909474n495007l10587M796251M337632K18829k213035k020253
6335H177646k439389m531683n487236l307511L58945K966472M002382L910090
6327C649716K305114p24848k832376j431596K448800M553101K581470q36973j967738
6318G744670j221773j989405m909122o566903m547807p08371K009771L176145
6310g012795L348206J897672p48058j304346K071975N519879L998239r07012k687217
6301D176543N02238L258582J390713k104232k410222j32154O73344r96649k530458
6292A827705k182980o53915R48069J786750P09165k230381m263769k700537J107209
$$ plain form
6353 -4664794 -602955 3074285 4061537 3637428 4067323 5536000 7565939 10629718 13847476
6344 13847476 13773290 8863816 3368809 3058222 7854473 12192105 12410934 10197899 8177646
6335 8177646 5738257 1206574 -4280662 -7588173 -7229228 -4262756 -260374 3649716
6327 3649716 5954830 5229982 2397606 966010 3414810 7967911 10549381 9712408 7744670
6318 7744670 6522897 4533492 -375630 -6942533 -11490340 -12198711 -10188940 -7012795
6310 -7012795 -3664589 -1766917 -2514975 -3819321 -1747346 3772533 7770772 6863760 4176543
6301 4176543 4678781 7937363 9328076 7223844 4813622 4681468 5354812 4358163 1827705
6292 1827705 -355275 -1009190 -61121 1725629 2434794 204413 -4059356 -6759893 -5652684
6283e652684L228523K342083P45401K33719j9655q45579j228507l96910N42150
6274a051459O39553R23985K430153L837559L016615J02235k754537m205260m614827
6265a675983m446386l491569j940680o91129R279J013806K605414L456518K398472
6256b762258M82379j84153O17763J072572L16933l04927J04926J6573j913290
6247b553482l678885k228597J486298L046439R25291r09621J269694N269946N958511
6238H585594K306012j835487l350342k956953k446506j889337p38437N12443J131218
6229f81795J171444P95040p4741q24651n05433K42809m28586k308808k484027
6220e098748L67340L145542K206298j450980l647282k770671j098630o85301j020241
$$ plain form
6283 -5652684 -2424161 -82078 663323 897042 877387 31808 -1196699 -1593609 -1051459
6274 -1051459 -411906 512079 2942232 6779791 9796406 9898641 7144104 2938844 -1675983
6265 -1675983 -6122369 -9613938 -11554618 -12245747 -12236468 -11222662 -8617248 -5160730 -2762258
6256 -2762258 -2279879 -2464032 -1846269 -773697 -456764 -761691 -656765 -640192 -2553482
6247 -2553482 -6232367 -8460964 -6974666 -3928227 -3002936 -3912557 -2642863 2627083 8585594
6238 8585594 10891606 9056119 5705777 2748824 302318 -1587019 -2325456 -1813013 -681795
6229 -681795 489649 1284689 1209948 385297 -120136 122673 -305913 -2614721 -5098748
6220 -5098748 -4731408 -1585866 620432 -830548 -4477830 -7248501 -8347131 -9032432 -10052673
6211a0052673j230184j640964j955995m78232K995556N430154L924644k65176
6203c272870l173919k950032j187265K46280J407704K726006L234178J848455
6195a121463m98052j550697n16809J006486J242943M79148L31611J264175J918991
6186B556333J063009p95653k279990k754191k198623l32371K653626M850898M005363
6177F768401N79461k239027k422008j380847j141545j003831P13460K702665J620074
6168D196803k588755n336496l084803J792565M241765L239897K237029L146336
6160G844341L335462J10615m510119o265988m534672k550339j900151k66717L883135
6151d854433P273676N456342p49879n554908n039958j166594J668480J733317
$$ plain form
6211 -10052673 -11282857 -12923821 -14879816 -15358048 -12362492 -6932338 -3007694 -3272870
6203 -3272870 -6446789 -9396821 -10584086 -10337806 -8930102 -6204096 -2969918 -1121463
6195 -1121463 -1619515 -3170212 -3687021 -2680535 -1437592 -958444 -626833 637342 2556333
6186 2556333 3619342 2823689 543699 -2210492 -4409115 -4741486 -2087860 2763038 6768401
6177 6768401 7347862 5108835 2686827 1305980 164435 -839396 -125936 2576729 4196803
6168 4196803 1608048 -3728448 -6813251 -5020686 -778921 2460976 4698005 7844341
6160 7844341 11179803 11290418 6780299 514311 -4020361 -6570700 -8470851 -8737568 -4854433
6151 -4854433 2419243 7875585 7125706 1570798 -3469160 -4635754 -2967274 -1233957
6143a233957L01860j152964j977005j399068J170948M519661N772686L157474
6135I159635j675289m766317l689597k49621J285882q56288l581929k800555R91670
6126f182409L261376J771444m74887j43951J300818L17474k614986l437116p89161
6117f991398J955844J916687O09109P13382J651003J129061n70520r52996N30718
6108i110J584435P29744o04562p30892m51594j425915k972522k627058J76545
6099f330929K812231K582766j2629k077980j718419L38677K137790K443832J285973
6090A461312m94044j866234k271411j879894j026822K35321J498153J618232K15745
6081b509642r33779J95700K580713K892165J66024k547171k551469j332236j801318
$$ plain form
6143 -1233957 -932097 -2085061 -4062066 -5461134 -4290186 229475 6002161 9159635
6135 9159635 7484346 2718029 -971568 -1221189 64693 -791595 -4373524 -7174079 -6182409
6126 -6182409 -2921033 -1149589 -1624476 -1768427 -467609 -150135 -2765121 -6202237 -6991398
6117 -6991398 -5035554 -3118867 -2509758 -1796376 -145373 983688 413168 -539828 -9110
6108 -9110 1575325 2305069 1700507 969615 518021 -907894 -3880416 -6507474 -6330929
6099 -6330929 -3518698 -935932 -948561 -3026541 -4744960 -4406283 -2268493 175339 1461312
6090 1461312 967268 -898966 -3170377 -5050271 -6077093 -5841772 -4343619 -2725387 -2509642
6081 -2509642 -3443421 -3247721 -667008 2225157 2391181 -155990 -2707459 -4039695 -5841013
6072e841013l340624k560285J350462M816334M207805K51933k903766k304541
6064f323695Q28742K736631J625487j78314L22505K028260J176835k235312l330538
6055c349399L31786M213256L241196m84558j392546N12325M09494k438035l287266
6046b243747l30951J969633L87152j918524j141037J057903J197567p7755m8498
6037a148257R29705O34184o65529j000709l74445k12358n40271p65499j622651
6028d765830l227090l062907N20543M454164M458006J160600j154816q18270K73249
6019b162351J057628K175681K691623N38824l166306m401289j889227J063805
6011d091612J453449O2464j008594j197176o22221Q49039K388945K421591J047140
$$ plain form
6072 -5841013 -9181637 -11741922 -10391460 -5575126 -1367321 -1115388 -4019154 -6323695
6064 -6323695 -5494953 -2758322 -1132835 -1311149 -988644 1039616 2216451 -18861 -3349399
6055 -3349399 -3017613 1195643 4436839 3952281 2559735 3072060 3481554 1043519 -2243747
6046 -2243747 -2574698 -605065 -217913 -2136437 -3277474 -2219571 -1022004 -1099759 -1148257
6037 -1148257 -218552 415632 -249897 -1250606 -1625051 -1837409 -2377680 -3143179 -4765830
6028 -4765830 -7992920 -11055827 -10535284 -6081120 -1623114 -462514 -1617330 -2435600 -2162351
6019 -2162351 -1104723 1070958 3762581 4301405 1135099 -3266190 -5155417 -4091612
6011 -4091612 -2638163 -2575699 -3584293 -4781469 -5403690 -4554651 -2165706 255885 1303025
6002A303025O5482R633l82376j287624j212662Q1679J016178J270050K246372
5993C109757L572596K678980o61423k920296j962547l11806r03281k651824k983723
5984c033567k021980j233641l07890J405591K370886J101737p39437p86743J0397
5975c234647o41237j698454j67765L302572M434513J482380k331734l669880l088052
5966e612304k559444j843111K73224K880096L696479K372950J015703J296242
5958A519835K430897K452825O51344j757123k977151k220545j73314J616251J807374
5949C350393K94679j520790j929177p45249N22734O80818K37933J48334K01743
5940A241418j77029n40186m23380p78389k321673l282189j502988J579771K220518
$$ plain form
6002 1303025 1368507 1378140 995764 -291860 -1504522 -1422843 -406665 863385 3109757
5993 3109757 6682353 9361333 8699910 5779614 3817067 3505261 2601980 -49844 -3033567
5984 -3033567 -5055547 -6289188 -6597078 -5191487 -2820601 -1718864 -2458301 -3245044 -3234647
5975 -3234647 -3875884 -5574338 -5742103 -2439531 1994982 3477362 1145628 -2524252 -5612304
5966 -5612304 -8171748 -10014859 -9741635 -6861539 -3165060 -792110 223593 1519835
5958 1519835 3950732 6403557 7054901 5297778 2320627 100082 -73232 1543019 3350393
5949 3350393 3645072 2124282 195105 -550144 -27410 653408 891341 1039675 1241418
5940 1241418 1064389 524203 100823 -677566 -2999239 -6281428 -7784416 -6204645 -3984127
5931c984127j30033j999319j382524l61922n81416O7722L285829O008822M125464
5922E048496j193476m730287l996799j340171M05871J109179J796424K579090
5914c21673K943217K457441P94476j692841l508149l432042k130797j060723l26713
5905f277804Q25267J975072J841001L82708j081540j656814j274997K14843K563892
5896b488372M054150K915529o6427k105410j837898o80116m53915j003970p07734
5887b374163J407514M330400N588568L566697l30609k755116k222551n87263J8970
5878F642447l9419N23026J467206J964964K192515K029032K15468k785410l480235
5869H729594k48011K685198N61110m182439m721073L9117L699555J614687l286814
$$ plain form
5931 -3984127 -4114160 -6113479 -7496003 -7857925 -8439341 -8371619 -5085790 923032 5048496
5922 5048496 3855020 -875267 -4872066 -6212237 -5806366 -4697187 -2900763 -321673
5914 -321673 2621544 5078985 5873461 4180620 672471 -2759571 -4890368 -5951091 -6277804
5905 -6277804 -5452537 -3477465 -1636464 -1253756 -2335296 -3992110 -5267107 -5052264 -2488372
5896 -2488372 1565778 4481307 4414880 2309470 471572 -208544 -662459 -1666429 -2374163
5887 -2374163 -966649 3363751 8952319 12519016 12188407 9433291 7210740 6623477 6642447
5878 6642447 6603028 7126054 8593260 10558224 12750739 14779771 14995239 12209829 8729594
5869 8729594 8481583 11166781 11727891 7545452 2824379 2863496 6563051 8177738 4890924
5860D890924n755035m732812k253632K11732J593267P06606j380755j306104J775748
5851f250061M192182L099605P60847M15860R04066o75439l270105l305948n54921
5842d683914J750183K101642J888335J481259o02916l756349m391132r04765L268553
5833c849104L781304P66487j900121j538326J007485L284469L683230K026325
5825G261749q01258l208389l661645j905264N90054J858357J313341J44960k69291
5816A322614J29629N42888O64720P22411N65241j78220j136574j502794j306297
5807a76382j251872j303588p21876M05997J075362R66898O83291L12260m68785
5798d78695p28634R88947L689657M232277J756583p66303j010926o33978j812633
$$ plain form
5860 4890924 -864111 -5596923 -7850555 -7638823 -6045556 -5338950 -6719705 -8025809 -6250061
5851 -6250061 -2057879 1041726 1802573 2218433 3122499 2447060 -823045 -4128993 -4683914
5842 -4683914 -2933731 -832089 1056246 2537505 1934589 -1821760 -6212892 -7117657 -3849104
5833 -3849104 -67800 698687 -1201434 -2739760 -1732275 1552194 5235424 7261749
5825 7261749 6460491 3252102 -409543 -2314807 -1724753 133604 1446945 1591905 1322614
5816 1322614 1452243 1995131 2659851 3382262 3947503 3769283 2632709 1129915 -176382
5807 -176382 -1428254 -2731842 -3453718 -3047721 -1972359 -1005461 -322170 -9910 -478695
5798 -478695 -1207329 -218382 3471275 7703552 9460135 8693832 7682906 7048928 5236295
5789E236295l009364j467034J817085L317259K351399J563310K192035K439168
5781A4440153J105485l88968p02116n58073p69885o83354m6803k69417k080972
5772A0046050l715546l325164j806770j225334j479038p24245J379841L026786
5764B176580K976005K070426J551667J320553N79763q82279k772499m742891n990987
5755c713662n291546k485599O60326K247390K465779K704909K842277J369132
5747G99006j477156k931050j347798J184187J729709N73597R7561O28668K83536
5738d59740j245529j755060p4608K018330K507177J619938N02707n29072j169508
5729A414635n66601R70429J618025R11594R38350K818972M126292K297554j126001
$$ plain form
5789 5236295 2226931 759897 2576982 5894241 8245640 9808950 12000985 14440153
5781 14440153 15545638 15156670 14454554 13896481 13126596 12443242 12396439 12127022 10046050
5772 10046050 6330504 3005340 1198570 -26764 -1505802 -2230047 -850206 2176580
5764 2176580 5152585 7223011 8774678 10095231 10674994 9792715 7020216 2277325 -3713662
5755 -3713662 -9005208 -11490807 -10830481 -8583091 -6117312 -3412403 -570126 799006
5747 799006 -678150 -3609200 -4956998 -3772811 -2043102 -1469505 -1371944 -743276 -459740
5738 -459740 -1705269 -3460329 -3534937 -1516607 990570 2610508 3113215 2584143 1414635
5729 1414635 848034 1818463 3436488 4348082 5286432 8105404 12231696 14529250 13403249
5720A3403249k538351j308613J53108L97756j08083j307737l345654m197709j286875
5711a38909L780045N635641J850027l699823n939735m504819k438530j299142
5703f755245l50745P05565J085142P49112O81951J243445J825174K128845K355534
5694C668778K155117Q42587j162636k446473k468342k111145j989820j512927
5686e024861l29226N99624O11924J002492L218042N718267M884575r9513n149041
5677E432283n740650k351884N78503N69420m57225J803J302768J355825L38751
5668A029594L98223K076472L170099J774751q76005j750598J01224K055442R95610
5659H974812k504547m429458k405208Q99893J203753j537974l332053k082356
$$ plain form
5720 13403249 10864898 9556285 9709393 10107149 9999066 8691329 5345675 1147966 -138909
5711 -138909 3641136 9276777 11126804 7426981 1487246 -3017573 -5456103 -6755245
5703 -6755245 -7105990 -6400425 -5315283 -4566171 -3884220 -2640775 -815601 1313244 3668778
5694 3668778 5823895 6666482 5503846 3057373 589031 -1522114 -3511934 -5024861
5686 -5024861 -5354087 -4754463 -4142539 -3140047 77995 5796262 10680837 10581324 5432283
5677 5432283 -308367 -2660251 -2081748 -1512328 -1969553 -1967750 -664982 690843 1029594
5668 1029594 1427817 3504289 6674388 8449139 7573134 5822536 5923760 7979202 8974812
5659 8974812 6470265 2040807 -364401 535492 1739245 201271 -3130782 -5213138
5651e213138j86804j78704q62614P7529K081686L027249K732984K233353R67686
5642D679227j991670m702005l956528k60102K166463J130265p87209m51012J550941
5633b621630K652294K276092J853444J945330J422107n63106l045909l971648
5625e3026k152165J328477L667886K875679j23581k414524k079225K44798K464721
5616C759040K885413J281603r28890j828197j158062p81382j940765k992313j665248
5607c368801J109382K027691R5575j963275j646691J20908P98687l74839j920327
5598e121690j974567Q5119K871270L588742P76278l326227m808071k810746l12507
5589a1032399K63323j34267J90484P49615N01817L70617J598844K882586J958846
$$ plain form
5651 -5213138 -5399942 -5578646 -6441260 -6363731 -4282045 -1254796 1478188 3711541 4679227
5642 4679227 2687557 -2014448 -5970976 -6231078 -4064615 -2934350 -3721559 -4172571 -2621630
5633 -2621630 30664 2306756 4160200 6105530 7527637 6964531 3918622 -53026
5625 -53026 -2205191 -876714 2791172 5666851 5543270 3128746 1049521 1294319 3759040
5616 3759040 6644453 7926056 6997166 5168969 4010907 3229525 1288760 -1703553 -3368801
5607 -3368801 -2259419 -231728 -136153 -2099428 -3746119 -3625211 -2826524 -3201363 -5121690
5598 -5121690 -7096257 -7011138 -4139868 -551126 225152 -3101075 -7909146 -10719892 -11032399
5589 -11032399 -10769076 -10903343 -10712859 -9963244 -9461427 -9090810 -7491966 -4609380 -2650534
5580b650534l88252p36669J987934M293095K386257k645750n774690m003583K45029
5571g287163K465048J483302j23289l92527k52223p91675q81493N91247K170252
5562c018521K019419J084201J223657J608871M55546p54526R14361M102532M064880
5553A1700420J33522k711421j598141j69575k169304n057921m298695p20891J248972
5544c643034O62949M31449J569258J816525K21132r70046n9169J426097J083212
5535B538373j192469l309748l186752o03599K425830L526836K710999K007446
5527D916916J775032j59385l991072n545894j728275L821009M661654P0204m457512
5518f37323m656001j392957K605832N629363O183915L496990k22118j666465j305066
$$ plain form
5580 -2650534 -3038786 -3775455 -1787521 2505574 4891831 2246081 -3528609 -7532192 -7287163
5571 -7287163 -4822115 -3338813 -3462102 -3854629 -4106852 -4898527 -5780020 -5188773 -3018521
5562 -3018521 -999102 85099 1308756 2917627 3373173 2618647 3533008 7635540 11700420
5553 11700420 11833942 9122521 7524380 7354805 5185501 127580 -4171115 -4892006 -3643034
5544 -3643034 -2980085 -2548636 -979378 837147 1058279 88233 29064 1455161 2538373
5535 2538373 1345904 -1963844 -5150596 -5754195 -3328365 198471 2909470 4916916
5527 4916916 6691948 6532563 2541491 -3004403 -4732678 -911669 3749985 3820189 -637323
5518 -637323 -5293324 -6686281 -4080449 1548914 7732829 11229819 11007701 9341236 8036170
5509H036170k514049n161985m817598j56852L708152K428962j156463j649673
5501a283336J111070L122995K689687J430834L90385o54250j030374k74604m85652
5492E016755l484277o408841m833062j42162J508011j326620k551628J949352
5484a0272472P062363N510114j175328m594318j281767L183914K688473j734094
5476f13115m890656m300661j165020K776169N933350O067361K391321k046664
5468D152085l236985j377420k00443j090149j320697R31810L394796L531361K454224
5459G238582K186577J581997j369240m828802m946191j975241l12466j796228
5451d221012l022823j037314J890292J947477l11984j111440P65226K712420K689394
$$ plain form
5509 8036170 5522121 360136 -4457462 -4614314 -906162 1522800 366337 -1283336
5501 -1283336 -172266 2950729 5640416 7071250 7461635 6807385 5777011 5502407 5016755
5492 5016755 1532478 -4876363 -9709425 -9851587 -8343576 -9670196 -12221824 -10272472
5484 -10272472 -3210109 2300005 1124677 -3469641 -4751408 -1567494 1120979 -613115
5476 -613115 -5503771 -9804432 -10969452 -8193283 -2259933 3807428 6198749 4152085
5468 4152085 915100 -462320 -662763 -1752912 -3073609 -2141799 1252997 4784358 7238582
5459 7238582 9425159 11007156 9637916 4809114 -137077 -2112318 -2424784 -4221012
5451 -4221012 -7243835 -8281149 -6390857 -4443380 -4755364 -5866804 -5101578 -2389158 300236
5442C00236J809926J648796J337919q54051m154512n462052l133006O46314K170107
5433e690323M94655j636969j409105O14845J708848R59619K98756J320031K794149
5424e45494K511207M96089j158059j277667q65305j083528j316750k34452J797666
5415a676293K590140P62174k232512l474505j824716R33284K350367J957225J119900
5406E05064Q45436O72293k16212j501577j838711m48811J598674K164391N84805
5397B365352r97557k0550K794100L838820J519970j110522m70903K176190K168639
5388A2263539j964715o125424n772752j390874K548996K841700L72764j711307
5380A061927j483369J66805R71208J06106r18071o01927K29904j85030j476856
$$ plain form
5442 300236 2110162 3758958 5096877 4242826 88314 -5373738 -8506744 -7860430 -5690323
5433 -5690323 -5195668 -6832637 -8241742 -7626897 -5918049 -4958430 -4659674 -3339643 -545494
5424 -545494 1965713 2461802 1303743 26076 -839229 -1922757 -3239507 -3473959 -1676293
5415 -1676293 913847 1676021 -556491 -4030996 -5855712 -4922428 -2572061 -614836 505064
5406 505064 1350500 2022793 1806581 305004 -1533707 -1982518 -383844 1780547 2365352
5397 2365352 1367795 1347245 4141345 7980165 9500135 8389613 7918710 10094900 12263539
5388 12263539 10298824 4173400 -1599352 -2990226 -441230 2400470 2773234 1061927
5380 1061927 -421442 -254637 716571 822677 -95394 -697321 -467417 -652447 -2129303
5371b129303j473956L25508J753037J145473l88023r08491j82777R16834J960479
5362A018781K432256J077318k331253n424164n351814k221371J045117K132474
5354g622656J432339R19069J972809M161367N433857L956039M56184k019036j593278
5345G096694J62904O28332l80852j291747j841678k932025l853691k610690M35175
5336d587578K005578L23692k148738k159699j32262R16986j39599j352838p14237
5327g988695J485735L515185M131008L379463K275176J766355J574820N15567
5319A0654614j453876k431810j020408J251179J605940l81032k667031l818781
5311A738795m038536l308739j232005P99842K54691k431660l287145l27628L051939
$$ plain form
5371 -2129303 -3603259 -3277751 -1524714 -379241 -767264 -1675755 -1858532 -941698 1018781
5362 1018781 3451037 4528355 2197102 -3227062 -8578876 -10800247 -9755130 -7622656
5354 -7622656 -6190317 -5271248 -3298439 862928 6296785 10252824 10709008 8689972 7096694
5345 7096694 7259598 7887930 7507078 6215331 4373653 1441628 -2412063 -5022753 -4587578
5336 -4587578 -2582000 -2258308 -4407046 -6566745 -6699007 -5782021 -5921620 -7274458 -7988695
5327 -7988695 -6502960 -2987775 1143233 4522696 6797872 8564227 10139047 10654614
5319 10654614 9200738 6768928 5748520 6999699 8605639 8224607 5557576 1738795
5311 1738795 -2299741 -5608480 -6840485 -6040643 -5785952 -8217612 -11504757 -11832385 -8780446
5302h780446K857289K33539r34577j70501m0233q44601l27162J491269J948895
5293d566528R07252J508718M246840N046643J814632j557298j267569K54202j200074
5284E186818m113318l656657K7585J730496o51585l181113k362106l8915L46295
5275f712500j051035j679034p63951L35711Q13911J255742K064709K522065J689581
5266a524801k25391j646376j120361P65242J693697M16869j714975k819300k742788
5257h918184j996619o9432L126540N493369N005125K811398J443467P75206j209212
5248F461658m159741n207405l156710J59301K791884M034830L081996k31992l287176
5239D86645k996278n91902j49831j927353j855524J220068L084360J327928k46857
$$ plain form
5302 -8780446 -5923157 -5689618 -6624195 -6794696 -6834929 -7679530 -8006692 -6515423 -4566528
5293 -4566528 -3659276 -2150558 2096282 7142925 8957557 7400259 6132690 6386892 5186818
5284 5186818 1073500 -2583157 -2555572 -825076 -1476661 -4657774 -7019880 -7058795 -6712500
5275 -6712500 -7763535 -9442569 -10206520 -9870809 -9056898 -7801156 -5736447 -3214382 -1524801
5266 -1524801 -1750192 -3396568 -4516929 -3751687 -2057990 -1641121 -3356096 -6175396 -8918184
5257 -8918184 -10914803 -10984235 -7857695 -2364326 2640799 5452197 6895664 7670870 6461658
5248 6461658 2301917 -2905488 -6062198 -5902897 -3111013 923817 4005813 3773821 486645
5239 486645 -2509633 -3101535 -3251366 -5178719 -7034243 -5814175 -2729815 -1401887 -1648744
5230a648744J859491M431051K470234k680727n347373l700284r70344L76856R44328
5221d265512J206283L40604j231296j515220J34464K194963L334519L473900K607560
5212F280265P45273j030138j401134o01178J73107M83094K15949j324994l770621
5203b30377m499140j834344J693358K396631Q69233Q07449K771672L160695J21218
5194E256395l281166l427975p82163J710861K599109K322092J301351k80659j606221
5185C811624j808146j179919p37374p23162l56741P64752J479957k1148l560679
5176b330836n887729l841172J238233M308397K786201k74322p86617Q76315J549585
5167b361945M89504n09573j118061k727809m710265m125511j65645M024545N262465
$$ plain form
5230 -1648744 210747 4641798 7112032 4431305 -916068 -4616352 -5586696 -5209840 -4265512
5221 -4265512 -3059229 -2718625 -3949921 -5465141 -5330677 -3135714 198805 3672705 6280265
5212 6280265 7025538 5995400 4594266 3993088 4166195 4649289 4865238 3540244 -230377
5203 -230377 -4729517 -6563861 -4870503 -2473872 -1604639 -797190 1974482 5135177 5256395
5194 5256395 1975229 -1452746 -2234909 -524048 2075061 4397153 5698504 5417845 3811624
5185 3811624 2003478 823559 86185 -636977 -993718 -228966 1250991 1229843 -2330836
5176 -2330836 -8218565 -12059737 -10821504 -6513107 -3726906 -4001228 -4787845 -3911530 -2361945
5167 -2361945 -1872441 -2382014 -3500075 -6227884 -10938149 -15063660 -15229305 -11204760 -5942295
5158e942295L865627K133321J221677P64006J53406r01774k171777k723372j861065
5149e462246l42766M90410O83091J347319K530586L079631K626334J952391J271496
5140H176246m8425j816509k832768k676810k034612j049859Q37114L068761L862856
5131E485994K572254O03032o14490j177219j714062k158118k124709j623507j095184
5122a846009j269307k497450l452699j699544K835894O266700N007277P02894
5114D047756j862664j088683M13408P47231Q85576J344701N69130j768863l089020
5105A98572j631429N99983P90090o89882j351841k65610J285215J916615J332339
5096B184052j3744j319561j918653j924501j853466j528654l44907J299499K017171
$$ plain form
5158 -5942295 -2076668 56653 1278330 2042336 2195742 1293968 -877809 -3601181 -5462246
5149 -5462246 -5805012 -5314602 -4631511 -3284192 -753606 2326025 4952359 6904750 8176246
5140 8176246 8127821 6311312 3478544 801734 -1232878 -2282737 -1445623 1623138 5485994
5131 5485994 8058248 8661280 8046790 6869571 5155509 2997391 872682 -750825 -1846009
5122 -1846009 -3115316 -5612766 -9065465 -10765009 -7929115 -1662415 3344862 4047756
5114 4047756 2185092 1096409 1509817 2257048 3142624 4487325 5056455 3287592 198572
5105 198572 -1432857 -832874 -42784 -732666 -2084507 -2350117 -1064902 851713 2184052
5096 2184052 2170308 850747 -1067906 -2992407 -4845873 -6374527 -6719434 -5419935 -3402764
5087c402764J106372p02618k101036k024326k76312J656909J547299m73374j403249
5078f073099J62749J338899l33827k057890j39260K916950J586471l251110m836710
5069a0686827j151616K016343Q13509p75320J438512M419384L242502p82899k828143
5060d294555j975637n92198R47882L456302M907377K768205p98311j304573J033102
5051D147594J634934j070307l462750k730221o94725q7400n24121k24641P50250
5042b261387J080286N36363J8283j6442L6178k68537r53182j786258k413412k247208
5032h275316o63563K021526L824699K673882n14711j964561J26034K631609J943809
5023A803408l93178k70597J972974K005079j121465l378720k554232j260112j376594
$$ plain form
5087 -3402764 -2296392 -2999010 -5100046 -7124372 -7400684 -5743775 -4196476 -4669850 -6073099
5078 -6073099 -5910350 -4571451 -4905278 -6963168 -7102428 -4185478 -2599007 -5850117 -10686827
5069 -10686827 -11838443 -9822100 -9008591 -9783911 -8345399 -3926015 -683513 -1466412 -4294555
5060 -4294555 -6270192 -6862390 -5914508 -2458206 2449171 5217376 4419065 3114492 4147594
5051 4147594 5782528 4712221 1249471 -1480750 -2175475 -2262875 -2786996 -3011637 -2261387
5042 -2261387 -1181101 -644738 -626455 -642897 -606719 -875256 -1828438 -3614696 -6028108 -8275316
5032 -8275316 -8938879 -6917353 -3092654 -418772 -933483 -2898044 -2772010 -140401 1803408
5023 1803408 1410230 1139633 3112607 5117686 3996221 617501 -1936731 -3196843 -4573437
5014d573437r53794P19516M29089k982834n082302k692175M03351k85773k156188
5005a7174547Q6357N339155P736375N515172K288286N40182o34860j818313k221132
4996c43325k169901k569985k448575p15593Q48877L44078r6442K481013N879921
4987A210068N180811L96125l489713l847843k748759k085310j446865j158399
4979g989885k438838l811956k057759K334229N068965M334205K832062K465390
4971G36413J508208j136425k910327j310096K162820L931630K449954q34549l095245
4962A502383k305021O04485K024195q5220l145320l472954j426210J05120Q49477
4953e349065K641325M624045L676847j40322k896472k351599n87100k85754j515187
$$ plain form
5014 -4573437 -5527231 -4807715 -4378626 -7361460 -12443762 -15135937 -14732586 -15018359 -17174547
5005 -17174547 -17088190 -11749035 -4012660 1502512 3790798 4330980 3696120 1877807 -343325
4996 -343325 -2513226 -5083211 -7531786 -8247379 -7398502 -7054424 -7150866 -4669853 1210068
4987 1210068 6390879 6787004 3297291 -550552 -3299311 -5384621 -6831486 -7989885
4979 -7989885 -10428723 -14240679 -16298438 -13964209 -8895244 -4561039 -1728977 736413
4971 736413 2244621 1108196 -1802131 -3112227 -949407 2982223 5432177 4597628 1502383
4962 1502383 -802638 -198153 1826042 1740822 -1404498 -4877452 -6303662 -6198542 -5349065
4953 -5349065 -2707740 1916305 5593152 5452830 2556358 204759 -382341 -668095 -2183282
4944b183282k843598l000645j270285J392685K240867L05066j202177P46049L825639
4935a989681L556455K32996j906303j435583q30591j309244j384316n40263k0976
4926e627506P4145P09258J356882J007622O54367J305626J361628l00597j272401
4917g30976M0412L71308k895441n918057m238889m85432O74032Q91434L411271
4908h880338M695656M56012m251754j988043L634188L418097j676507l213781
4900g806470r75458j802257m714489k431157L282689L683023j52199O44668M503018
4891e768632J729208n110473l821803L563865K606529n738583n008007M942175
4883a2605721N084583o650719q742826L368300N943188p722652j0588185O214603
$$ plain form
4944 -2183282 -5026880 -8027525 -9297810 -7905125 -5664258 -5359192 -6561369 -5815320 -1989681
4935 -1989681 1566774 1799770 -106533 -1542116 -2372707 -3681951 -5066267 -5606530 -5627506
4926 -5627506 -5553361 -4844103 -3487221 -2479599 -1825232 -519606 842022 541425 -730976
4917 -730976 -690564 -319256 -3214697 -9132754 -13371643 -13857075 -13183043 -12291609 -8880338
4908 -8880338 -4184682 -3728670 -7980424 -9968467 -6334279 -2916182 -4592689 -7806470
4900 -7806470 -8781928 -10584185 -15298674 -17729831 -14447142 -10764119 -10916318 -10271650 -5768632
4891 -5768632 -4039424 -9149897 -12971700 -9407835 -6801306 -12539889 -17547896 -12605721
4883 -12605721 -7521138 -14171857 -22914683 -19546383 -13603195 -21325847 -31914032 -25699429
4875b5699429J0022747q593939M016985Q1711474J53363433J17695306r673418
4868C22843159j03638801r1403986l1249708p316801j8981196j8791641j874097
4861D9586929J959360q595190q878666J900925K063176r156604j1125406j080790
4853A6673734K614347m251958n922046K136401N601402j195436o015885k215694
4845G424865J209575j105884j779337K887882N195253J173753k187578p42414
4837A2076115k218k712822l026153J393540L887231J018432j185694J218636K940438
4828A5607505l74315m318794l830652j002049K73981K62935j12252j866518l753323
4819H86518k333396J151087J233102k187680k720052J389751L541693p2071l808493
$$ plain form
4875 -25699429 -15676682 -24270621 -20253636 61457838 214821271 332516577 322843159
4868 322843159 219204358 127800372 96550664 89233863 70252667 51461026 49586929
4861 49586929 51546289 42951099 34072433 35973358 38036534 28879930 17754524 16673734
4853 16673734 19288081 15036123 9114077 11250478 16851880 15656444 9640559 7424865
4845 7424865 8634440 7528556 5749219 8637101 13832354 15006107 12818529 12076115
4837 12076115 12073897 9361075 6334922 7728462 11615693 12634125 11448431 12667067 15607505
4828 15607505 15233190 10914396 7083744 6081695 6355676 6618611 6506359 4639841 886518
4819 886518 -1446878 -295791 937311 -1250369 -3970421 -2580670 961023 888952 -2919541
4810b919541j758438L529092O361937N772711L505845j88310m252477n286835
4802D763984k470419J89412l02099k077316k780527k976103k900723r55615K180081
4793g329325L095321J483589J027590K518621K210557o81039j553673J416378
4785B188019L433808J212748j573285j275521l99313j885908l170066j316858
4777b786376J134901R15120j41589O12107J078901j257045l663519k559473J74691
4768f492282R01664O16552J917856L110260J433516q68403k4282K197583J268662
4759D061126k143472l307221j275530L87363k1717p65073r28139j163733o87984
4750e844380J606531L603590K369836m22310m37161K267397L251407R54715j179098
$$ plain form
4810 -2919541 -4677979 -1148887 5213050 10985761 14491606 14303296 10050819 4763984
4802 4763984 2293565 2482977 2180878 103562 -2676965 -5653068 -8553791 -9509406 -7329325
4793 -7329325 -4234004 -2750415 -1722825 795796 3006353 2325314 771641 2188019
4785 2188019 5621827 6834575 5261290 3985769 3586456 1700548 -1469518 -2786376
4777 -2786376 -1651475 -736355 -877944 -265837 813064 -443981 -4107500 -6666973 -6492282
4768 -6492282 -5590618 -4974066 -3056210 54050 1487566 619163 594881 2792464 4061126
4759 4061126 1917654 -1389567 -2665097 -2277734 -2299451 -3064524 -3992663 -5156396 -5844380
4750 -5844380 -4237849 -634259 1735577 1313267 876106 3143503 6394910 7349625 6170527
4741F170527p59108J25978q07366k222923j695062O06561K463810K164577k68961
4732E778033l001247l547720j506173M68585J00453j226246p76222J288242K622915
4723B00620K432141J628714M95712q02075p62173J030125J547703j598244n100730
4714i28207l785351J205381L390497M07860k926844k334335L34251J566260J703758
4705a366730K691291L664298K513145l9077j278121o10811j96027j586563l609070
4696A82335l970028k042878M69160J597276J351853J099259J025863J10040j022668
4687a199788j4373K911207L687247K78189l171718k043559J402068J386459k300915
4678I34817m307691k341126J27128L88268L1787N33976O05013j31509L00639J866031
$$ plain form
4741 6170527 5411419 5537397 4730031 2507108 812046 1418607 3882417 6046994 5778033
4732 5778033 2776786 -770934 -2277107 -1808522 -1708069 -2934315 -3710537 -2422295 200620
4723 200620 2632761 4261475 4757187 3955112 3192939 4223064 5770767 4172523 -928207
4714 -928207 -4713558 -3508177 -117680 290180 -2636664 -4970999 -4636748 -3070488 -1366730
4705 -1366730 1324561 4988859 7502004 7462927 6184806 5573995 5377968 3791405 182335
4696 182335 -3787693 -5830571 -5361411 -3764135 -2412282 -1313023 -287160 -177120 -1199788
4687 -1199788 -1214161 1697046 5384293 5662482 2490764 447205 1849273 3235732 934817
4678 934817 -3372874 -5714000 -5586872 -5198604 -5166817 -4632841 -4027828 -4159337 -3858698 -1992667
4668a992667J494325j214999k175619L58919K104720k78351l121341j478637K734757
4659c568893L734649N48698k639065l312376k679488j658045L46138K523598K678972
4650d025812Q50447k63466Q60791K756304L309075J912756o21956k512920j952605
4641C12614M79551J336785j453789m965189m703011q38388K134495J624280l50482
4632f423134q03110Q11453L224356M790293L910885M73457k752426k532041O19368
4623A319101K921692K349888P72754O31136J906770L068096K827271L96167l748887
4614A2443988o843086o035621k306264L25134J97661k64867P39724J317660m22046
4605h47717k640109k641237j191806p23987q71977O36918L441616M511912K767774
$$ plain form
4668 -1992667 -498342 -1713341 -3888960 -3530041 -1425321 -1703672 -4825013 -6303650 -3568893
4659 -3568893 165756 714454 -1924611 -5236987 -7916475 -9574520 -9228382 -6704784 -4025812
4650 -4025812 -3175365 -3438831 -2578040 178264 3487339 5400095 4778139 2265219 312614
4641 312614 792165 2128950 675161 -4290028 -8993039 -9831427 -7696932 -6072652 -6423134
4632 -6423134 -7226244 -6414791 -3190435 1599858 5510743 5984200 3231774 699733 1319101
4623 1319101 4240793 6590681 7363435 7994571 9901341 12969437 15796708 16192875 12443988
4614 12443988 5600902 -434719 -2740983 -2415849 -2218188 -2483055 -1743331 -425671 -847717
4605 -847717 -3487826 -6129063 -7320869 -8044856 -8916833 -8279915 -4838299 -326387 2441387
4596B441387N07805m56222j156338k667243l486779j788569J240258K558285J233263
4587a574153o09251p48253P72374K492629L349446L000377J466444n33569j572062
4578F043982r59645J19173Q764j079272j391026l31913O06673P1633j426604k749975
4568a088210l635358l852099k319067J213793M564428N129050L079480Q92621
4560C984638J05735K42778N36775P27338K81824j122980k254834j519508L00465
4551A282231O94114p72271j634286k81643J816719K720264K499013J716522r9705
4542G940958k448805k643112N56275L706064K400890k406645n103987k696772
4534f95134J561369K795396L78695k343957k618283q09437J039472J744433J823523
$$ plain form
4596 2441387 2949192 2492970 1336632 -1330611 -4817390 -6605959 -5365701 -2807416 -1574153
4587 -1574153 -2183404 -2931657 -2159283 333346 3682792 6683169 8149613 7616044 6043982
4578 6043982 5084337 5203510 5212274 4133002 2741976 2410063 3016736 3088369 1661765 -1088210
4568 -1088210 -4723568 -8575667 -10894734 -9680941 -5116513 12537 3092017 3984638
4560 3984638 4090373 4333151 4869926 5597264 5879088 4756108 2501274 981766 1282231
4551 1282231 1976345 1204074 -430212 -711855 1104864 3825128 6324141 8040663 7940958
4542 7940958 5492153 2849041 3405316 7111380 9512270 7105625 2001638 -695134
4534 -695134 866235 3661631 4040326 1696369 -921914 -1731351 -691879 1052554 2876077
4525B876077K292177K953025K350858j49703k835817l319439j601592j17366m03655
4516B044565j142986m28721J246179J812737Q76285K69811J024463J549317M3498
4507G295148k512938l579321k697255j729009j289971M92621M263328O740821
4499F983424M334421j594007n841794n588083l020925j501388j549234j526258
4491i303844l67656J515843K842458K315708o172k057067j920373m90077l2052
4482g503232m06175M90235K504779L038732J810226J707925L266894K823608r37812
4473F795180l169156K951M360537L227940k434054n819703m627652k869677k614488
4464g148122j060605K655829M398116J813616j246407p58316J443359J630440
$$ plain form
4525 2876077 5168254 8121279 10472137 10322434 7486617 4167178 2565586 2448220 2044565
4516 2044565 901579 472858 1719037 3531774 4408059 4677870 5702333 7251650 7295148
4507 7295148 4782210 1202889 -1494366 -3223375 -4513346 -4020725 242603 6983424
4499 6983424 11317845 9723838 3882044 -1706039 -4726964 -6228352 -7777586 -9303844
4491 -9303844 -9671500 -8155657 -5313199 -2997491 -3003663 -5060730 -6981103 -7471180 -7503232
4482 -7503232 -7909407 -7419172 -4914393 -1875661 -65435 1642490 4909384 7732992 6795180
4473 6795180 3626024 3628975 7989512 11217452 8783398 2963695 -1663957 -4533634 -7148122
4464 -7148122 -8208727 -5552898 -1154782 658834 -587573 -1345889 97470 1727910
4456A727910M66335R15079K577013K634140P90523q52381j747622k936438l899501
4447c24942l024880q98725K33619J98136Q28990K032323J336603j682709l630775
4438d932360j724951K182942M066851K882867J154167Q75177R21910o84152l198627
4429A543824l511586l44727L388484L868776J278191o70620j67596L21571j598913
4420D107404l950542l013594R69542L704173K517126m11403j342750L63236K224611
4411E167803K218713Q48107l30222j006193k037006l373917l372629j040518J923562
4402a002300K883505J750950Q76375J313659J357030l39516k334991k680258j914515
4393i0061j820993k406911k241304j074568o8258K27400K82920K15146k14850
$$ plain form
4456 1727910 2194245 3109324 5686337 8320477 9111000 8258619 6510997 3574559 -324942
4447 -324942 -3349822 -4248547 -4014928 -3816792 -2987802 -955479 381124 -1301585 -4932360
4438 -4932360 -6657311 -4474369 -407518 2475349 3629516 4504693 5426603 4742451 1543824
4429 1543824 -1967762 -2312489 1075995 4944771 6222962 5552342 5384746 5706317 4107404
4420 4107404 156862 -2856732 -1887190 1816983 4334109 3922706 2579956 2943192 5167803
4411 5167803 7386516 8234623 7904401 6898208 4861202 1487285 -1885344 -2925862 -1002300
4402 -1002300 1881205 3632155 4508530 5822189 7179219 6839703 4504712 1824454 -90061
4393 -90061 -1911054 -4317965 -6559269 -7633837 -7702095 -7474695 -7191775 -6976629 -7191479
4384g191479l06281J090771L492020M692398L325344N17891j461444j549869o22014
4375A987337k95918j093750j734866p26327J298942J940180K74544j550497j064219
4366i64574J254953K749164J810446q47714l282820l528621q23252K919233M042122
4357C328937J344148j755881j377008J499952K537048L85823j582652m82564J946297
4348E844100J973348j040883l934758l577791k85002K663576K574074J60282j616901
4339B760045j353932n49558p25526j075075m17404K48580o20976k126447k142614
4330f002907q49790l80037j179170j400554j30559J282695J641550J418137J190755
4321d409880N26320p79280j923080k219101j728635n22534J272028K612719K390258
$$ plain form
4384 -7191479 -7497760 -6406989 -2914969 1777429 5102773 5620664 4159220 2609351 1987337
4375 1987337 1691419 597669 -1137197 -1863524 -564582 1375598 1650142 99645 -964574
4366 -964574 290379 3039543 4849989 4002275 719455 -2809166 -3632418 -713185 3328937
4357 3328937 4673085 2917204 1540196 3040148 5577196 5963019 4380367 3897803 5844100
4348 5844100 7817448 6776565 2841807 -735984 -1020986 1642590 4216664 4376946 2760045
4339 2760045 1406113 856555 131029 -944046 -1361450 -1112870 -1733846 -3860293 -6002907
4330 -6002907 -6852697 -7232734 -8411904 -9812458 -9943017 -8660322 -7018772 -5600635 -4409880
4321 -4409880 -3883560 -4662840 -6585920 -8805021 -10533656 -11056190 -9784162 -7171443 -4781185
4312d781185J309470J182784K064591J913169l05675k778689k922929l30321K796342
4303a852443L544557R19010k661886l343084m30079K355371J971835N99813K083441
4294C186535N220342M762711q18217o595499p336335l220412J753972M238737
4286A191834L216378j06296k680456k048285N62248J605849J82612r79732j35528
4277H08624R97182O52925q0126M12047J536054J979442J871629J738407J119953
4268A1036137k60481j586656k325588k794178k644515r98051J145985J235988
4260B808641j021633k834355k533378j818144k285526k565051r16016J716280
4252i449182L275864L269748K226159M75365j075563j032708K56144O46386n10005
$$ plain form
4312 -4781185 -3471715 -2288931 -224340 1688829 1383154 -1395535 -4318464 -4648785 -1852443
4303 -1852443 1692114 2611124 -50762 -3393846 -3823925 -1468554 503281 1103094 3186535
4294 3186535 8406877 13169588 12351371 5755872 -1580463 -4800875 -3046903 1191834
4286 1191834 4408212 4301916 1621460 -426825 135423 1741272 1923884 944152 808624
4277 808624 1805806 2458731 2378605 2790652 4326706 6306148 8177777 9916184 11036137
4268 11036137 10775656 9189000 6863412 4069234 1424719 426668 1572653 2808641
4260 2808641 1787008 -1047347 -3580725 -5398869 -7684395 -10249446 -11165462 -9449182
4252 -9449182 -6173318 -2903570 -677411 -202046 -1277609 -2310317 -2054173 -1407787 -1917792
4243a917792j297435m17859J133508K455412L872323M725135L307313K29187j482398
4234A0607394q84104k65996p59059p96519j86734j184068l769292m554059k402282
4225d194719k99846M21570K231288N228715M945133l5908m194724l143053m4P94242
4215A752654L16103Q47150N75072j713544k215806J474800M727154K828391j492822
4206G099152l469984l652278l797982j847540K305429L142892j028225l008514
4198d257050Q35179K846059j364128k642556M203120O844411j259701J331201
4190F536535L3793721O9062147N7064869l992997n5886645n3886968j9810264
4183C2880398j104440o068902r360032j553731K176227m369033q328011k983414
$$ plain form
4243 -1917792 -3215227 -3633086 -2499578 -44166 3828157 8553292 11860605 12089792 10607394
4234 10607394 9723290 9457294 8698235 7901716 7714982 6530914 2761622 -1792437 -4194719
4225 -4194719 -4494565 -4072995 -1841707 3387008 8332141 8296233 4101509 958456 958412 1752654
4215 1752654 2068757 2915907 3490979 1777435 -438371 1036429 5763583 8591974 7099152
4206 7099152 3629168 -23110 -3821092 -5668632 -3363203 -220311 -1248536 -4257050
4198 -4257050 -3421871 -575812 -1939940 -4582496 -379376 6465035 5205334 6536535
4190 6536535 40330256 109392403 166457272 162464275 106577630 52690662 32880398
4183 32880398 31775958 25707056 16347024 14793293 16969520 12600487 4272476 1289062
4175A289062K110730P47392m13053K666866L471626j389948m867197k081141J739987
4166C274324J757384J285297L328220L949878J14570l925306l825488j891307
4158D067572j491894j005630J629112L798769K541194m27241k092825k525279
4150D493778k466670o82605K823276M718399K841380l84470j855784j974311k310047
4141E202946k184996m38437J775981K465376J443842M573n17851O38708K523193
4132A0913335K182966j755342n772614n321206j568409N9828j925730l235670
4124f422842r36518K484050L647990K427015J2519k865648m245708j808055K775473
4115d931724M545476K099271m07908J92256J962294K241331J536065O56591j437162
$$ plain form
4175 1289062 3399792 4147184 3734131 6400997 9872623 8482675 3615478 1534337 3274324
4166 3274324 5031708 6317005 9645225 13595103 13709673 9784367 5958879 4067572
4158 4067572 2575678 1570048 3199160 6997929 9539123 9111882 7019057 4493778
4150 4493778 2027108 1344503 4167779 8886178 11727558 11343088 9487304 7512993 5202946
4141 5202946 3017950 2579513 4355494 6820870 8264712 8269285 7751434 8390142 10913335
4132 10913335 13096301 11340959 5568345 247139 -1321270 -1261442 -3187172 -6422842
4124 -6422842 -7359360 -4875310 -1227320 1199695 1212214 -1653434 -5899142 -7707197 -4931724
4115 -4931724 -386248 1713023 1305115 1497371 3459665 5700996 7237061 7893652 6456490
4106F456490m153169m126696p08647J690153J08181k349109k094075r46192j954618
4097h077682l257192j460462J735872J968620m51866j116472J257040L142418
4089f259724J968075m60599j008023J092001L985105M793818J878404k859039
4081C130018n008951k754567O11467J265563j12533n76813l4413m79321j526887
4072e486437p70559J778120L268345K230354K02189j087273j476012j096131J51103
4063b286301J490229J710998Q90571l0873r84488k103700k059475K92500K998593
4054h1946K744248l01934k324874j163722J036627J462266K30416j095261k143627
4045a637807k881993k056163R71138L840623L342505n1646k189694n88025K195640
$$ plain form
4106 6456490 2303321 -1823375 -2532022 -841869 -733688 -3082797 -5176872 -6123064 -8077682
4097 -8077682 -11334874 -12795336 -11059464 -9090844 -9542710 -10659182 -9402142 -6259724
4089 -6259724 -4291649 -4752248 -5760271 -4668270 -683165 4110653 5989057 3130018
4081 3130018 -1878933 -4633500 -4022033 -2756470 -2869003 -3445816 -3480229 -3959550 -5486437
4072 -5486437 -6256996 -4478876 -1210531 1019823 1222012 134739 -1341273 -2437404 -2286301
4063 -2286301 -796072 914926 1805497 1774624 790136 -1313564 -3373039 -3080539 -81946
4054 -81946 2662302 2360368 35494 -1128228 -91601 1370665 1601081 505820 -1637807
4045 -1637807 -4519800 -6575963 -5604825 -1764202 1578303 1526657 -663037 -1251062 944578
4036I44578K166868m63516j729184J18935J967603O25110k183783k391083K03700
4027g40772J788056M87828j184636q86297k3946o36984j451620m0496K650685
4018c8182L085600J11867l331339l779190r64124K241475K672174j95897l505732
4009c703348l724697o00345K543593L043350J942199J692043K433453K395276
4001F021524R18272q75127j855163j726852o82194L73209M8267j548030k005580
3992a331674L32969L393666L712722J255030o10748J8878J304129R68135m12832
3983H630275q41542p3484L73435k18373p16850J42883J870146K588307J122707
3974A2877504j660753l713898l715078j920101M26840J948329J797518L70411
$$ plain form
4036 944578 3111446 2647930 918746 1037681 3005284 3630394 1446611 -944472 -740772
4027 -740772 1047284 1535112 350476 -535821 -559767 -1196751 -2648371 -2688867 -38182
4018 -38182 3047418 3159285 -172054 -3951244 -4915368 -2673893 -1719 -197616 -3703348
4009 -3703348 -7428045 -8028390 -5484797 -2441447 -499248 1192795 3626248 6021524
4001 6021524 6939796 6064669 4209506 2482654 1800460 2173669 2221936 673906 -1331674
3992 -1331674 -998705 2394961 6107683 7362713 6751965 6770843 8074972 9043107 8630275
3983 8630275 7788733 7715249 8088684 7870311 7153461 7296344 9166490 11754797 12877504
3974 12877504 11216751 7502853 3787775 1867674 2294514 4242843 6040361 6410772
3966F410772p72761n47269L01521M14652p0053l9546L47858j38221j339785j623226
3956B943942p08496l34472j206294j483901K91308K572094K700733J75738l216583
3947A734069n367880n024177k389325N25492J564736J157457J723102L783322
3939b293204M861868L136075k26064l409220n864788o575646l739596J580007
3931a2530568M715069L265110Q37389J522051L380812J746596k928273n424899
3923e416713l358626J32712J636795J492650J633052K473593L163881K939024
3915D696368J475084o75276j921606j282027J21701N55765m0117o92770j274519
3906I62603k023337k271753j463001l63249L21968J072663J777049R55883j345934
$$ plain form
3966 6410772 5638011 5090742 5392263 5806915 5736862 5697316 6045174 5906953 4567168 2943942
3956 2943942 2235446 1900974 694680 -789221 -497913 2074181 4774914 4950652 1734069
3947 1734069 -3633811 -8657988 -11047313 -10521821 -8957085 -7799628 -6076526 -2293204
3939 -2293204 2568664 5704739 5478675 2069455 -3795333 -10370979 -14110575 -12530568
3931 -12530568 -7815499 -4550389 -3713000 -2190949 1189863 2936459 8186 -5416713
3923 -5416713 -8775339 -8642627 -7005832 -5513182 -3880130 -1406537 1757344 4696368
3915 4696368 6171452 5496176 3574570 2292543 2414244 2970009 2929892 2237122 962603
3906 962603 -1060734 -3332487 -4795488 -5158737 -4836769 -3764106 -1987057 -1031174 -2377108
3897b377108k490867j414516p77335j985945j742821K235390N787857M171942
3889A406597J81389k30659K059631J491508j485070p26857M123240N540935m713
3880A2356001o279994p032293m184579j986265J33155L465243M745130J341279
3872B557677k703622k239820P46754Q01618j764311k015018P01887J791147m77064
3863b600752k015611K64577L393002K611942k119198o232984n850614j439223
3855a3988861L295107N303144M778753L778025K945323J131471j787830l910538
3847A544594l888314k443898m38594K244141M705819M559964J367036j705991
3839E944757j828906k59717l7143j617825l001268k852794j498264J31813J008887
$$ plain form
3897 -2377108 -4867975 -6282491 -7059826 -9045771 -10788592 -8553202 -2765345 1406597
3889 1406597 1587986 1357327 3416958 4908466 3423396 2696539 6819779 12360714 12356001
3880 12356001 6076007 -956286 -5140865 -7127130 -6993975 -3528732 1216398 2557677
3872 2557677 -145945 -2385765 -1639011 -837393 -2601704 -4616722 -3914835 -2123688 -2600752
3863 -2600752 -4616363 -4351786 -958784 1653158 -466040 -6699024 -12549638 -13988861
3855 -13988861 -10693754 -5390610 -611857 3166168 6111491 7242962 5455132 1544594
3847 1544594 -2343720 -4787618 -5226212 -2982071 1723748 6283712 7650748 5944757
3839 5944757 4115851 3856134 3818991 2201166 -800102 -3652896 -5151160 -5019347 -4010460
3830d010460N21981n06646o55244j50696j60797K69719L185705O894117O460362
3821A1848041R44787m187164m563634k463468j546276o60106K359558M693131
3813F424869K249336l041114n407061l303898k01936J378342J671439P31218j341407
3804h40212k231325k10378K097100J532963K14041J820967L903800J051817m967304
3795B371469o288890j122329L208225J809281q84096M02559L248865K599040r67258
3786D376866l466063m025142l963023k593506Q88595L755694K890146j43506j509518
3777c789457r56202j008265j771634j041387J159217K399950J967349J354917
3769a685512P48513j174216l594589l414562J07073L560123L672281J203332q10957
$$ plain form
3830 -4010460 -3488479 -3995125 -4650369 -4801065 -4961862 -4692143 -1506438 5387679 11848041
3821 11848041 12792828 8605664 4042030 1578562 32286 -627820 1731738 6424869
3813 6424869 8674205 5633091 226030 -3077868 -3279804 -1901462 -230023 501195 -840212
3804 -840212 -3071537 -3281915 -1184815 348148 562189 2383156 6286956 7338773 2371469
3795 2371469 -3917421 -5039750 -1831525 -22244 -906340 -503781 2745084 5344124 4376866
3786 4376866 910803 -3114339 -7077362 -9670868 -8782273 -5026579 -2136433 -2279939 -3789457
3777 -3789457 -4745659 -5753924 -7525558 -8566945 -7407728 -5007778 -3040429 -1685512
3769 -1685512 -936999 -2111215 -5705804 -9120366 -9013293 -5453170 -1780889 -577557 -1388514
3760a388514r68407j97727L66564Q01003J828488L447256M359201L162511K76910
3751A1687285k127322k630349j977103j284008k78444J292547J962576M31205
3743G076387j730578j753519K05806J149858k57561j793450j290399J067o26327
3734I81284l246422m988912l565534J32244L094101L210105J120141o55384l61302
3725d279679J271660K126991J260114k68778j053976r16849m10823L85012J639966
3716b46362K667903K136350k34414k796725l421443j751388L71401Q19591o59666
3707c114753k285644k177781l70699J239604J112303k6401j15451J389113K662197
3698a687512K152994Q90585P09995J090457m0890k557130l762029k395376m60094
$$ plain form
3760 -1388514 -2356921 -2554648 -2188084 -1387081 441407 3888663 8247864 11410375 11687285
3751 11687285 9559963 6929614 4952511 3668503 3390059 4682606 6645182 7076387
3743 7076387 5345809 3592290 3798096 4947954 4690393 2896943 1606544 1607611 981284
3734 981284 -2265138 -7254050 -10819584 -10687340 -7593239 -4383134 -3262993 -3918377 -4279679
3725 -4279679 -3008019 -881028 379086 110308 -943668 -1860517 -2271340 -1886328 -246362
3716 -246362 2421541 4557891 4323477 1526752 -1894691 -3646079 -3274678 -2455087 -3114753
3707 -3114753 -5400397 -7578178 -7948877 -6709273 -5596970 -5623371 -5738822 -4349709 -1687512
3698 -1687512 465482 1356067 2066062 3156519 3115629 558499 -3203530 -5598906 -6059000
3689f059000J82142N32944J907817K985761J913475m71255k212727l314652m212455
3680h747950l036985J474299N542746L906938k017841m756054r40921M112425
3672d463343M413223J230092n02770J58649N45640k19475q72153j523393l032283
3663d265813l702283j009122L509094N270634L021680L50142J1983M93213l27154
3654C352374j536383j348592k14437N45086J109335J876788J656467l57018k242038
3645B841582j689610K32316M29693j493988k658378j286245R28396J648988R51389
3636i5857M09267P59167J646389K430506K273570P03311j049646q85985Q80253
3627G070975J120452j329433k716977N26583N190330M261638l180349r533819
$$ plain form
3689 -6059000 -5876858 -5343914 -3436097 -450336 1463139 991884 -1220843 -4535495 -8747950
3680 -8747950 -11784935 -10310636 -4767890 -860952 -2878793 -7634847 -8575768 -4463343
3672 -4463343 -50120 1179972 677202 835851 1381491 1162016 289863 -1233530 -4265813
3663 -4265813 -7968096 -8977218 -5468124 -197490 2824190 3174332 3186315 3679528 3352374
3654 3352374 1815991 467399 252962 798048 1907383 3784171 5440638 5083620 2841582
3645 2841582 1151972 1384288 1813981 319993 -2338385 -3624630 -2696234 -1047246 -95857
3636 -95857 313410 1072577 2718966 5149472 7423042 8126353 7076707 6190722 7070975
3627 7070975 8191427 6861994 4145017 4671600 9861930 14123568 10943219 1409400
3619A409400q080705j199897L578225K866597n70567k993815k955810l76604L663153
3610d660023O051101M041953o39152k906791n56871L043243L702231J598971O6090
3601I740752Q08707K258000K052813k79737l059188m175729l058611r87612O08070
3592C907465J521850J939997J411960j1119p43149K39964J137516m11775l371447
3583E621262m392189k636529n28538L29305O61112O14916q61555k767280k145037
3574f104533R19569K394422N94659q21053P92470K053945o14581l859654k001045
3565f645801L415008N199669J265149k545797j486402J894937K848223J025070
3557D970056j016586k267862k817404j572729J916552M826816L729009n06730
$$ plain form
3619 1409400 -6671305 -7871202 -4292977 -1426380 -1996947 -4990762 -7946572 -8323176 -4660023
3610 -4660023 1391078 5433031 4793879 1887088 1330217 4373460 8075691 9674662 9740752
3601 9740752 10549459 12807459 14860272 14580535 11521347 7345618 4287007 3299395 3907465
3592 3907465 5429315 7369312 8781272 8770153 8027004 8266968 9404484 8992709 5621262
3583 5621262 1229073 -1407456 -1935994 -1606689 -945577 -330661 -1192216 -3959496 -6104533
3574 -6104533 -5184964 -2790542 -2195883 -3016936 -2224466 -170521 -785102 -4644756 -6645801
3565 -6645801 -3230793 1968876 3234025 688228 -798174 1096763 3944986 4970056
3557 4970056 3953470 1685608 -1131796 -2704525 -787973 4038843 7767852 7261122
3549G261122l336059k280763K83420P97447q41993j725004k60106J580053R88589
3540B466706j656488l040718j374922J046768R52726j508392l310966k786262
3532i211548j140858J73829J338314K769147L736869L422052K079128L18069j611579
3523A873423l087377k948030j108934O20105M39461j281114k548361j919813M75708
3514i484932L416747N347316N174656L077634M00273j490712j985118j132430
3506C323434K98967P63473o74718k562145k182999Q00615L353496K817254K15791
3497F153168j642148j976143j909675j547507J32864K481958K945936N93972k162198
3488C070227k676061j321870k09127j7491O8069K07560j83651o90655j78230J010562
$$ plain form
3549 7261122 3925063 1644300 1927720 2725167 1883174 158170 -101936 1478117 2466706
3540 2466706 810218 -2230500 -3605422 -2558654 -1605928 -3114320 -6425286 -9211548
3532 -9211548 -10352406 -10178577 -8840263 -6071116 -2334247 1087805 3166933 3485002 1873423
3523 1873423 -1213954 -4161984 -5270918 -4650813 -4211352 -5492466 -8040827 -9960640 -9484932
3514 -9484932 -6068185 -720869 4453787 7531421 7931694 6440982 4455864 3323434
3506 3323434 3622401 4385874 3711156 1149011 -1033988 -233373 3120123 5937377 6153168
3497 6153168 4511020 2534877 625202 -922305 -789441 1692517 4638453 5232425 3070227
3488 3070227 394166 -927704 -1136831 -1154322 -1086253 -878693 -1062344 -1752999 -1931229 -920667
3478i20667J152020k7188o23243L61952J164936L5139j808321k033823p70413
3469c469608M6508P3295N61148J193957n3367l220104n289717m133638j241170
3460a5532696J010483K617603M423191N213991L169152n53194k431071j035351
3452c117892J116723P39855k433914n480426n140452q26981M538633O908860N001545
3443A305951J408038p65586j342745j917128k393972j028489K131931M247589
3435A645589L169665L21482j234454o39944K81836j1846q82557j012819n90230
3426A046722p27399j123233m7106K675516M335089K682962n24527j658311l59813
3417F299900L14135q86804j360377P22796K804773J490256k376215m949951m353290
$$ plain form
3478 -920667 231353 204165 -419078 -57126 1107810 1142949 -665372 -2699195 -3469608
3469 -3469608 -3423100 -3349805 -2788657 -1594700 -1648067 -4868171 -10157888 -14291526 -15532696
3460 -15532696 -14522213 -11904610 -7481419 -2267428 901724 348530 -2082541 -3117892
3452 -3117892 -2001169 -1261314 -3695228 -9175654 -14316106 -15143087 -10604454 -3695594 1305951
3443 1305951 2713989 1948403 605658 -1311470 -3705442 -4733931 -2602000 1645589
3435 1645589 4815254 5136736 3902282 3262338 3544174 3532328 2649771 1636952 1046722
3426 1046722 319323 -803910 -851016 1824500 6159589 8842551 8318024 6659713 6299900
3417 6299900 6614035 5727231 4366854 5089650 7894423 9384679 7008464 2058513 -2294777
3408b294777j831107Q97804K736098K499361q234k454125k105438M68072K075083
3399a7263J275862j89094m88525N8342L78895L71720M56357O96966R35060R66913
3389D445233N38115j48972m12225l68373j240135l243308m498751l672129k223654
3380a0824199j912999j583169Q18993M217566N582824M452011L074276K455932
3372F281235J550649K80500L1508Q02344Q05934o96127k617811l935111l877054
3363a373933j158243L728559O580356M012618r09147k349577l62575j55996k783563
3354E228499l390134j35330K219330M90828j847712j528327r93378k360907k123042
3345d440173K146369N269207J825740m102589m335358R77875M216376K097711
$$ plain form
3408 -2294777 -4125884 -3228080 -491982 2007379 1999145 -454980 -2560418 -2092346 -17263
3399 -17263 1258599 1069505 580980 639322 1018217 1389937 1846294 2543260 3478320 4445233
3389 4445233 4983348 4834376 4422151 4053778 2813643 -429665 -4928416 -8600545 -10824199
3380 -10824199 -12737198 -14320367 -13501374 -9283808 -3700984 751027 3825303 6281235
3372 6281235 7831884 8112384 8143892 8946236 9752170 9056043 6438232 2503121 -1373933
3363 -1373933 -2532176 1196383 7776739 11789357 10880210 8530633 8168058 8012062 5228499
3354 5228499 1838365 1703035 3922365 4413193 2565481 1037154 43776 -2317131 -4440173
3345 -4440173 -2293804 2975403 4801143 698554 -3636804 -2658929 1557447 3655158
3337C655158j142145k044754j960096k030304r15509R55988P93801j137399r04206
3328d729466K361599M255081J988979j212953j411555M42694J274825Q67967Q53586
3319D690757J225612Q33329l44501j590656k549863k520793p30326J356604N83058
3310I53221l257776n898672l909169P40054L711734L729922K460383J053204j38249
3301e55348J05393K447547M567542L346979m81584k674851r88713K008999K527329
3292A0303293R3415k655124l402685k052920Q3077J604570J560635j12931k077856
3283C343474k298862k99220J638744Q98993j757843k717296n74309J443639J46183
3274a76497k322910j185197L503743N970590K450514l574632o163729m449301
$$ plain form
3337 3655158 2513013 468259 -1491837 -3522141 -4437650 -3481662 -2687861 -3825260 -4729466
3328 -4729466 -2367867 1887214 3876193 2663240 1251685 1694379 2969204 3837171 4690757
3319 4690757 5916369 6749698 6405197 4814541 2264678 -256115 -986441 370163 953221
3310 953221 -2304555 -8203227 -12112396 -11372342 -7660608 -3930686 -1470303 -417099 -555348
3301 -555348 -449955 1997592 6565134 9912113 9430529 6755678 5766965 7775964 10303293
3292 10303293 10396708 7741584 4338899 2285979 2369056 3973626 5534261 5421330 3343474
3283 3343474 1044612 745392 2384136 3283129 1525286 -1192010 -1766319 -322680 -176497
3274 -176497 -2499407 -3684604 -180861 5789729 8240243 4665611 -1498118 -5947419
3266e947419k283756j742820p59305K248431M720650L287203q20196k627546P5646
3257c849112L683087L750492R74087n62997k6887q48359m430987o837219m261648
3248a2409543J168846M367889M008509K673222J777855M16338j312784j912770
3240a222438j576974j910714k246694j89107L376199M006654J53401l905788l894085
3231g409546j034946Q66713R07081O18227M03477k01895k86606J157130K657162
3222b323203J936256l58759j254259M10392K670938L230465J768004m49411j773165
3213C857258j212725M89518J278597L63286n23207K35619J405100P06382j522281
3204E077547k684464j602022K28611J009345M80288o03509j189761j72321K408560
$$ plain form
3266 -5947419 -8231175 -9973995 -10733300 -8484869 -3764219 -477016 -1297212 -3924758 -3849112
3257 -3849112 -166025 3584467 4558554 3995557 3968670 3120311 -1310676 -8147895 -12409543
3248 -12409543 -11240697 -6872808 -2864299 -191077 1586778 2003116 690332 -1222438
3240 -1222438 -2799412 -4710126 -6956820 -7145927 -3769728 236926 390327 -3515461 -7409546
3231 -7409546 -8444492 -7577779 -6670698 -6052471 -5648994 -5850889 -6137495 -4980365 -2323203
3222 -2323203 -386947 -745706 -1999965 -1589573 1081365 4311830 6079834 5630423 3857258
3213 3857258 2644533 3134051 4412648 4775934 4252727 4488346 5893446 6599828 5077547
3204 5077547 2393083 791061 1019672 2029017 2509305 1905796 716035 543714 2952274
3195B952274M371579L315303j88242k863547k554983l71556J340234J662667J075511
3186H739240J13573q56656j258080p26436K89053R46414R12835M61924k18622
3177H403245j386217l148080m642730m393739j999257Q79907K071460J359490
3169b855921M28506L21652K69492n19105j336524j201190m46706N6096L41660
3160d942040Q17835J106005P32918L54236R08032J970069K313571J824175J464377
3151F549178J407323O33138j279320l095202l281498j825360j56703N39954N47249
3142C8759R44556J791297J641910m01090k708570k668480k63098J612549J049493
3133A037326l67148j23806J628053K642771J740826k57147k106952l075243k716824
$$ plain form
3195 2952274 7323853 10639156 10450914 7587367 5032384 4660828 6001062 7663729 8739240
3186 8739240 8852813 7996157 6738077 6011641 6300694 7247108 8159943 8621867 8403245
3177 8403245 7017028 3868948 -773782 -5167521 -7166778 -6286871 -4215411 -2855921
3169 -2855921 -2427415 -2105763 -1836271 -2355376 -3691900 -4893090 -5339796 -5283700 -4942040
3160 -4942040 -4124205 -3018200 -2285282 -1931046 -1023014 947055 3260626 5084801 6549178
3151 6549178 7956501 8589639 7310319 4215117 933619 -891741 -1048444 -508490 38759
3142 38759 983315 2774612 4416522 4015432 1306862 -1361618 -1624716 -12167 1037326
3133 1037326 670178 546372 2174425 4817196 6558022 6300875 4193923 1118680 -1598144
3124a598144j210952K23902M24173l44968r51303q63868j83953J024213K203343
3115a277557J872531n85810l030681k303152J755834N432758N040518R81692k741449
3106E144684k889020l86143J039093l83934k115098q51310K526775L897453J746051
3097G728551q09317q38872M83203P41315L84395J081634J897225N31603k515769
3088H683968m314088l806168k774282k351648j375886J024057L419882L785796
3080B291631J974192k61263j120308n11898k14960j660808l461408k865611k36604
3071f067037O54845j522198k752996K42056M036643L186457j181933k984804n73870
3062f962837J431245K65911r29978Q20963L379166L547968K013943J012901K89176
$$ plain form
3124 -1598144 -2809096 -2585194 -2161021 -2505989 -3457292 -4321160 -4505113 -3480900 -1277557
3115 -1277557 594974 9164 -3021517 -5324669 -3568835 1863923 6904441 7886133 5144684
3106 5144684 2255664 1869521 2908614 2524680 409582 -441728 2085047 5982500 7728551
3097 7728551 6919234 6080362 6563565 7304880 7689275 8770909 10668134 11199737 8683968
3088 8683968 4369880 563712 -2210570 -4562218 -5938104 -4914047 -1494165 2291631
3080 2291631 4265823 4004560 2884252 2372354 2157394 496586 -2964822 -5830433 -6067037
3071 -6067037 -5412192 -6934390 -9687386 -9445330 -5408687 -2222230 -3404163 -6388967 -6962837
3062 -6962837 -5531592 -5265681 -6195659 -5374696 -1995530 1552438 3566381 4579282 4868458
3053D868458j331101k806197k474260j033369l05299m95516p60090q69823m40809
3044e648006J605176M786121O135628L729509m39429l106249l664087l544379
3036a45716l371450k827186j934192o19678J612176M091271M851250L526483K176251
3027G359209J682325J31739l089906m779738k609543M80531K99633k437435l861822
3018f825007k888499j272920N45853L133517M791438L314982M50059N2353K057657
3009C359433K707780O75827j503709k206862k402438k307409r69042M22776l92427
3000b616071j915682m60938K717824K111399k458369l828757J396586O383950
2992A329942M030504k154906l698316L14553L498089K504459o7296j977094l628308
$$ plain form
3053 4868458 3537357 731160 -1743100 -2776469 -3081768 -3577284 -4337374 -5207197 -5648006
3044 -5648006 -4042830 743291 6878919 10608428 10168999 7062750 3398663 -145716
3036 -145716 -3517166 -6344352 -8278544 -8898222 -7286046 -3194775 1656475 5182958 7359209
3027 7359209 9041534 9173273 6083367 1303629 -1305914 -825383 -525750 -2963185 -6825007
3018 -6825007 -9713506 -10986426 -10440573 -7307056 -2515618 799364 1249423 1301776 3359433
3009 3359433 6067213 6743040 5239331 3032469 630031 -1677378 -2646420 -2223644 -2616071
3000 -2616071 -4531753 -4992691 -2274867 -163468 -2621837 -6450594 -5054008 1329942
2992 1329942 5360446 3205540 -492776 -178223 3319866 5824325 5757029 3779935 151627
2983A51627m026237r43111L845270N185790J903262j520146k132058k243730l858933
2974c638266m511337j987070J033959J064947n39844j31399K194968L181657J808680
2965a523705L78862O25019J754630K301393J665178L3740j461399j182416P15958
2956C307260J533303m40270l004833l147491j594085j050614j117755Q73558M168653
2947d72274M371128J39413m045278l937495r29778J145354J612532K172231K757913
2938B813746J838581j65487j139687p38845p95971k104134l121874k330808j43519
2929e887998J905387K576350J508880l87327j284388l21099J283602K098713K470251
2920C962371L014900K441590m89082l672809l621395o71834J205313L11195p75674
$$ plain form
2983 151627 -3874610 -4817721 -972451 4213339 6116601 4596455 2464397 220667 -3638266
2974 -3638266 -8149603 -10136673 -9102714 -8037767 -8577611 -8709010 -6514042 -3332385 -1523705
2965 -1523705 -1144843 -519824 1234806 3536199 5201377 5235117 3773718 2591302 3307260
2956 3307260 4840563 4400293 1395460 -1752031 -3346116 -4396730 -5514485 -4640927 -472274
2947 -472274 3898854 4038267 -7011 -3944506 -4874284 -3728930 -2116398 55833 2813746
2938 2813746 4652327 4486840 3347153 2608308 1812337 -291797 -3413671 -5744479 -5887998
2929 -5887998 -3982611 -1406261 102619 -284708 -1569096 -1890195 -606593 1492120 3962371
2920 3962371 6977271 9418861 8929779 5256970 1635575 963741 2169054 2480249 1704575
2911A704575l23559n48810l057203m813936k482372J709395K870355Q67958R5740
2902c977857J954492K484477r62472m889239m394088l9973L305894L113827J479354
2893a925585J102229J888047K280482J857054J256447O00771o71684k587865m089749
2884b89853l972449k272542o02033p16976k403208l258906j403257J919996L684134
2875i315094L007937K053377K397848K560875Q74282r36651J03960L196238M176704
2866H119476J384031k083313l179741k845660l067168k970648j045363Q80840
2858d807546j50409k991775l417012m12941K428714K556501J769626K325294L071661
2849C72113J857566o25996k052387j926739j407733q26550K27769J066134M43309
$$ plain form
2911 1704575 1381016 832206 -2224997 -7038933 -9521305 -7811910 -4941555 -4073597 -3977857
2902 -3977857 -2023365 461112 -501360 -5390599 -9784687 -9824660 -6518766 -3404939 -1925585
2893 -1925585 -823356 1064691 3345173 5202227 6458674 7059445 6387761 3799896 -289853
2884 -289853 -4262302 -6534844 -7136877 -7853853 -10257061 -13515967 -14919224 -12999228 -9315094
2875 -9315094 -6307157 -4253780 -1855932 704943 1579225 642574 746534 3942772 8119476
2866 8119476 9503507 7420194 4240453 1394793 -1672375 -4643023 -5688386 -4807546
2858 -4807546 -4957955 -7949730 -11366742 -11779683 -9350969 -6794468 -5024842 -2699548 372113
2849 372113 2229679 1603683 -448704 -2375443 -3783176 -4609726 -4381957 -3315823 -2872514
2840b872514j249988k247162j880252j190064r41602n25706O80274J967117K067816
2831f192081Q38425m51061n75363K20658O59186K29795k23053m7023J81342N0716
2821e308459M57686J805697K357192O75961j325520p22902J672982K402657J015820
2812C031114N23055J622519J130204k083679m221598k455239M61325R81500L95017
2803f15782J495725K937562J821925n56753q05045L70743o07647l629635m752162
2794d341069k424763Q53214L042743M243912M000618J618152p51637j70685J711847
2785G782332N06535l159690l480229J413156N901048M951241N47982k879307m486768
2776G096300m977294l235775O61216K902718J015068j597492p36796J744636J134327
$$ plain form
2840 -2872514 -4122502 -6369664 -8249916 -9439980 -10381582 -10907288 -10227014 -8259897 -6192081
2831 -6192081 -5353656 -5804717 -6380080 -6159422 -5500236 -5270441 -5493494 -5540517 -5359175 -5308459
2821 -5308459 -4850773 -3045076 -687884 -11923 -1337443 -2060345 -387363 2015294 3031114
2812 3031114 3554169 5176688 6306892 4223213 1615 -2453624 -1992299 -1010799 -615782
2803 -615782 879943 3817505 5639430 5082677 4277632 4648375 4040728 411093 -4341069
2794 -4341069 -6765832 -5912618 -2869875 1374037 5374655 6992807 6241170 6070485 7782332
2785 7782332 8288867 5129177 1648948 3062104 8963152 13914393 14462375 11583068 7096300
2776 7096300 2119006 -1116769 -455553 2447165 3462233 1864741 1127945 2872581 4006908
2767D006908k218027l459489p34953K774490M086334L372381J560254j070913
2759H316985l301238l281125j253430M86723P22988J95545o08620k052161l535689
2750d310022l482179j664812K75812J014479Q42797Q08644J747956L680092M999554
2741C912321L377302r30869m075770l056853J92680J657552P62999q779J82163
2732B012746q7173q84964m63710J330394K520263K235032J418779J68731k253877
2723E996221m432555l530932N5757K318623J155346j025240j535274q80015l66231
2714b244300M35992J770604K203898J250917P98123J783281K209684P20293p44552
2705H183940m73171k23793j798877l183432j890309K03760l01917k372537k125452
$$ plain form
2767 4006908 1788881 -1670608 -2405561 368929 4455263 7827644 9387898 8316985
2759 8316985 5015747 1734622 481192 967915 1690903 1886448 1277828 -774333 -4310022
2750 -4310022 -7792201 -9457013 -9181201 -8166722 -7323925 -6515281 -4767325 -1087233 3912321
2741 3912321 7289623 6358754 2282984 -773869 -581189 1076363 1839362 1830583 2012746
2732 2012746 1925573 1040609 576899 1907293 4427556 6662588 8081367 8250098 5996221
2723 5996221 1563666 -1967266 -1911509 407114 1562460 537220 -998054 -1878069 -2244300
2714 -2244300 -1808308 -37704 2166194 3417111 4215234 5998515 8208199 8928492 8183940
2705 8183940 7710769 7486976 5688099 2504667 614358 818118 516201 -1856336 -3981788
2696c981788N35774J727534j0078j803722j634710j061714j502919j837767j421154
2687a0990544j700553k620593r87971M552108R724177R335728M010052j159193
2679A0163211l378892m068023m710099m598640l239987j840645j248562p64421
2671a3686058p3844j38036q66789j21359L026733N791143M849608J024927j710312
2662a903987j428979J42600J202230K154258L328670L101592L34072l014446l972381
2653e6371k320344k11208J205300K461405L408894K781608O70662p92817l06710
2644F840419P09508K48674j581548l161559l530890k708048q09665J688103L346784
2635A041778K881614Q88031n52446j55551J234192J657510J10711k346169l556135
$$ plain form
2696 -3981788 -3446014 -1718480 -1728558 -3532280 -5166990 -6228704 -7731623 -9569390 -10990544
2687 -10990544 -12691097 -15311690 -16299661 -11747553 -2023376 7312352 11322404 10163211
2679 10163211 6784319 2716296 -1993803 -6592443 -9832430 -11673075 -12921637 -13686058
2671 -13686058 -13759902 -13897938 -14764727 -14886086 -11859353 -6068210 -1218602 -193675 -1903987
2662 -1903987 -3332966 -3190366 -1988136 166122 3494792 6596384 6930456 3916010 -56371
2653 -56371 -2376715 -2587923 -1382623 1078782 4487676 7269284 7939946 7147129 6840419
2644 6840419 7549927 7798601 6217053 3055494 -475396 -3183444 -3993109 -2305006 1041778
2635 1041778 3923392 4811423 4258977 4103426 5337618 6995128 7105839 4759670 1203535
2626A203535k568744o51639N35340J023397J518730J238368p91450k642914j150664
2617b286041K541618L080582j227068m670598k119555K679099K282276k962496
2609b682183n193900q32157M593429N328165K954052J619188J000500j117100
2601E669994l073394j779768J177001J375606j396360l063069k080054j367443
2593d537487k669764l573568j829116J092296K777410L194242L205823K381682
2585D1518M74309j032947r56019k41166L8602O21471K005059K392171J94408k803268
2575G34138l365891j056166J646996K641008J570534r87618l341219k798092J157162
2566c799148M552904L048638j845037m134634j372858K243800K094338q63024
$$ plain form
2626 1203535 -1365209 -2016848 -1481508 -458111 1060619 2298987 1507537 -1135377 -2286041
2617 -2286041 255577 3336159 2109091 -2561507 -4681062 -2001963 280313 -2682183
2609 -2682183 -7876083 -8708240 -4114811 1213354 4167406 5786594 6787094 5669994
2601 5669994 2596600 816832 1993833 3369439 1973079 -1089990 -3170044 -4537487
2593 -4537487 -7207251 -10780819 -12609935 -11517639 -8740229 -5545987 -2340164 41518
2585 41518 515827 -517120 -1473139 -1714305 -1675703 -1054232 950827 3342998 3537406 734138
2575 734138 -2631753 -3687919 -2040923 600085 2170619 1183001 -2158218 -4956310 -3799148
2566 -3799148 753756 3802394 1957357 -2177277 -3550135 -1306335 788003 -75021
2558g5021k489352j326237O39939J568876J450025P41828m81468j851830k444206
2549d267446j463570J084221L979751N030248K872042j101755l857668m091002
2541a815179k964763j351694J165800L634293L134408q61514m100118k646562
2533e805329J431065K963144R93467p56499k22167N43852j20060o94952O0802
2524a606677L78706j323679l158434k476276o0871J185718N90968O160L72104
2515f092281O95349M95933P96963J939469K348187O99155j837492k813925j484109
2506e252751N53378J637121J870111K077729J816040q0862k831798l415468m26162
2497d052662K997380K430674j880116m909997l399357M5537J029713o29611j544860
$$ plain form
2558 -75021 -2564373 -3890610 -3250671 -1681795 -231770 510058 28590 -1823240 -4267446
2549 -4267446 -5731016 -4646795 -667044 4363204 7235246 6133491 2275823 -1815179
2541 -1815179 -4779942 -6131636 -4965836 -1331543 1802865 941351 -3158767 -5805329
2533 -5805329 -4374264 -1411120 -417653 -1174152 -1396319 -852467 -972527 -1667479 -1606677
2524 -1606677 -1227971 -2551650 -5710084 -8186360 -8247231 -7061513 -6470545 -6464385 -6092281
2515 -6092281 -5396932 -4900999 -4104036 -2164567 183620 882775 -954717 -3768642 -5252751
2506 -5252751 -4699373 -3062252 -1192141 885588 2701628 2620766 -211032 -3626500 -4052662
2497 -4052662 -1055282 1375392 -504724 -5414721 -8814078 -8768541 -7738828 -8368439 -9913299
2488i913299j78616J396844J218665K56890N15055K084729L346358L102929J477429
2479C306984o55861k274797k704931k211132j735955j540338o64978J498350L611149
2470c371509L543325J167087j172880j505382n30426r9608k11550Q21892L198899
2461A839848M470768K612852j003734l152693k569476p81364L84775M89083j50869
2452B139190j034153j220646j14885J207238J096923N114l209J036131L57257
2443C468960k967218n442457l708527K73486J831577K53911p82747P07867K274706
2434d090442J375709p79714j606037r96657o25417r10816p79411L62637K073269
2425e976879L662807M268540K972649K30480j614172q09701J339814K017185M78303
$$ plain form
2488 -9913299 -10091915 -8695071 -7476406 -7219516 -6704461 -4619732 -1273374 1829555 3306984
2479 3306984 2651123 376326 -2328605 -4539737 -6275692 -7816030 -8481008 -6982658 -3371509
2470 -3371509 171816 1338903 166023 -1339359 -1869785 -1969393 -2180943 -1359051 1839848
2461 1839848 6310616 8923468 7919734 4767041 2197565 1416201 1800976 2290059 2139190
2452 2139190 1105037 -115609 -230494 976744 2073667 2078781 2075572 3111703 3468960
2443 3468960 501742 -4940715 -8649242 -8375756 -6544179 -6290268 -7073015 -6365148 -4090442
2434 -4090442 -2714733 -3494447 -5100484 -6097141 -6722558 -7633374 -8412785 -8050148 -5976879
2425 -5976879 -2314072 1954468 4927117 5157597 3543425 2733724 4073538 6090723 6569026
2416F569026j462906k228119k055262j773614j638149j682143j809449j192451
2408g273067J036557M029408N502837M412786K154019M37234p88517k412449m273228
2399B825580n250097m459158j614750K691587O171997N849686J648380k197821
2391E665404j614914K023571L597812J098306k120253k658651j604974j781857
2383B604444k878351k346802j06654Q76166r09954l022461k327453Q29195L225903
2374d055967K835636Q96573r5067O16668J705316J985543J949371K525775L050952
2365A1414800J820377j254115l963049m439226l217086j747859k65276J369228
2357b82206J997948O09753j177969o30645K075338L885204L365937K398202K254046
$$ plain form
2416 6569026 5106120 2878001 822739 -950875 -2589024 -4271167 -6080616 -7273067
2408 -7273067 -6236510 -2207102 3295735 7708521 9862540 10299774 9511257 7098808 2825580
2399 2825580 -2424517 -6883675 -8498425 -5806838 365159 6214845 7863225 5665404
2391 5665404 4050490 6074061 9671873 10770179 8649926 5991275 4386301 2604444
2383 2604444 -273907 -2620709 -2727363 -1851197 -2761151 -5783612 -8111065 -7281870 -4055967
2374 -4055967 -1220331 -323758 -418825 197843 1903159 3888702 5838073 8363848 11414800
2365 11414800 13235177 11981062 8018013 3578787 361701 -1386158 -1651434 -282206
2357 -282206 1715742 2325495 1147526 516881 2592219 6477423 9843360 12241562 14495608
2348A4495608R79510k887030o310063m994871J62071L409699J429212k721908
2340C562228m235376k601261q92023o37512k57495J472755K932743J888526j119083
2331A13502l151933k323973K93972K258323K262963P71157j020031k232997k707874
2322e736891k757410k329816n98502K670773N330080M198818o23441m370614k646517
2313f863520K934777O490484M998445J128657j319018j886289k000954j658472
2305A824110n2377J800596J621132j085945m223217n357765l752190m85613K433220
2296g278049L479305L068743L055088L923448L533021J57234m124909n248988
2288E64893k342602R74089J113349j226496k385665m45561K544840L083917L76961
$$ plain form
2348 14495608 15475118 12588088 6278025 1283154 1445225 4854924 6284136 3562228
2340 3562228 -673148 -3274409 -4166432 -4803944 -5061439 -3588684 -655941 1232585 113502
2331 113502 -3038431 -5362404 -5068432 -2810109 -547146 224011 -796020 -3029017 -5736891
2322 -5736891 -8494301 -10824117 -11422619 -8751846 -3421766 777052 153611 -4217003 -6863520
2313 -6863520 -3928743 2561741 7560186 8688843 7369825 5483536 3482582 1824110
2305 1824110 1771733 3572329 5193461 4107516 -115701 -5473466 -9225656 -9711269 -7278049
2296 -7278049 -3798744 -730001 2325087 6248535 9781556 9938790 5813881 564893
2288 564893 -1777709 -803620 309729 -916767 -3302432 -3747993 -1203153 1880764 2257725
2279B257725k610210k627653j50048J336510P7246j770937j623991j84520K10595
2270e085283n44626o13168M42392J284389J509863K028161K554321J499451q85588
2261B189912j883570j45526K038059J925666O1999r48893j91968P80743K64776
2252D091198j793876l818344l692507p32246K766491L277262L58757k222120j110941
$$ plain form
2279 2257725 -352485 -2980138 -3130186 -1793676 -1716430 -3487367 -5111358 -5295878 -5085283
2270 -5085283 -5629909 -6243077 -5800685 -4516296 -3006433 -978272 1576049 3075500 2189912
2261 2189912 306342 160816 2198875 4124541 4186540 3237647 3045679 3826422 4091198
2252 4091198 2297322 -1521022 -5213529 -5945775 -3179284 97978 456735 -1765385 -2876326
$$ [...]
##END NTUPLES=NMR SPECTRUM
##END=
