##TITLE=31Pdec_DE-145rm_3d
 ,24 sc
 27.4.2026
##JCAMPDX= 6.0         $$ Bruker NMR JCAMP-DX V2.0
##DATA TYPE= NMR SPECTRUM
##DATA CLASS= NTUPLES
##ORIGIN= UXNMR, Bruker Analytische Messtechnik GmbH
##OWNER= root
$$ XWIN-NMR		Version 3.5
$$ Mon Apr 27 14:37:24 2026 Russian Standard Time (UT+4h)  she@DPX200
##.OBSERVE FREQUENCY= 81.013821
##.OBSERVE NUCLEUS= ^31P
##.ACQUISITION MODE= SIMULTANEOUS
##.ACQUISITION SCHEME= undefined
##.AVERAGES= 24
##.DIGITISER RES= 17
##SPECTROMETER/DATA SYSTEM= spect
##.PULSE SEQUENCE= zgpg30
##.SOLVENT NAME= DMSO
##.SHIFT REFERENCE= (INTERNAL, DMSO, 0, 197.392)
##AUDIT TRAIL= $$ (NUMBER, WHEN, WHO, WHERE, WHAT)
$$ ##TITLE= Audit trail, XWIN-NMR		Version 3.5
$$ ##JCAMPDX= 5.01
$$ ##ORIGIN= Bruker BioSpin GmbH
$$ ##OWNER= she
$$ F:/spectra/data/she/nmr/P31/2/pdata/1/auditp.txt
$$ ##AUDIT TRAIL=  $$ (NUMBER, WHEN, WHO, WHERE, WHAT)
(   1,<2026-04-27 14:35:05.26 +0400>,<she>,<DPX200>,
      <created by zg, POWCHK disabled, PULCHK disabled
       configuration hash MD5:
       00 E9 B6 7A A2 85 ED C7 34 08 36 98 17 FE 4E 26
       data hash MD5: 32K
       B8 68 53 67 CE 95 FF 70 C0 2F 60 7B 7D 7C 5D 7A>)
(   2,<2026-04-27 14:35:14.10 +0400>,<she>,<DPX200>,
      <Start of raw data processing
       efp BC_mod = 2 LB = 1.5 FT_mod = 6 PKNL = 1 PHC0 = 1458.71 PHC1 = -85.29953 SI = 64K 
       data hash MD5: 64K
       69 69 BB D2 17 FA 77 AE 80 66 74 41 2E AB A5 C8>)
(   3,<2026-04-27 14:35:44.51 +0400>,<she>,<DPX200>,
      <pk PHC0 = -46.02589 PHC1 = 125.4 
       data hash MD5: 64K
       62 88 E8 43 9D 14 B3 57 03 F5 95 CF 05 41 BE A2>)
(   4,<2026-04-27 14:35:48.57 +0400>,<she>,<DPX200>,
      <abs ABSG = 5 
       data hash MD5: 64K
       9A 3D 51 45 84 28 22 8F 8E 29 8E B9 03 F4 C8 24>)
(   5,<2026-04-27 14:36:02.12 +0400>,<she>,<DPX200>,
      <abs ABSG = 5 
       data hash MD5: 64K
       80 98 1A F0 BB 68 DB 36 BB 72 2E 2C AB EA 59 42>)
$$ ##END=
$$ 
$$ hash MD5
$$ 2D 10 7A 1B 88 BE 2A 87 D5 8D EF 5A A0 27 F5 81
##$RELAX= 
##$RELAX= 
##$RELAX= 
##$RELAX= 
##$RELAX= 
##$RELAX= 
##$RELAX= 
##$RELAX= 
$$ Bruker specific parameters
$$ --------------------------
##$DU= <F:/spectra>
##$EXPNO= 2
##$NAME= <P31>
##$PROCNO= 1
##$TYPE= <nmr>
##$USER= <she>
##$AMP= (0..31)
100 100 100 100 100 100 100 100 100 100 100 100 100 100 100 100 100 100 
100 100 100 100 100 100 100 100 100 100 100 100 100 100 
##$AQSEQ= 0
##$AQ_mod= 1
##$AUNM= <au_zg>
##$AUTOPOS= <>
##$BF1= 81.014009
##$BF2= 200.13
##$BF3= 200.13
##$BF4= 200.13
##$BF5= 200.13
##$BF6= 200.13
##$BF7= 200.13
##$BF8= 200.13
##$BYTORDA= 1
##$CFDGTYP= 0
##$CFRGTYP= 5
##$CHEMSTR= <none>
##$CNST= (0..31)
1 1 145 1 1 1 1 1 1 1 1 1 1 1 1 1 1 1 1 1 1 1 1 1 1 1 1 1 1 1 1 1 
##$CPDPRG= <waltz16>
##$CPDPRG1= <>
##$CPDPRG2= <waltz16>
##$CPDPRG3= <>
##$CPDPRG4= <mlev>
##$CPDPRG5= <mlev>
##$CPDPRG6= <mlev>
##$CPDPRG7= <mlev>
##$CPDPRG8= <mlev>
##$CPDPRGB= <>
##$CPDPRGT= <>
##$D= (0..31)
0 1 0 0 0 0 0 0 0 0.06 0 0.03 2e-05 3e-06 0 0 0.0002 0 0 0 0 0 0 0 0 0 
0 0 0 0 0 0 
$$ [...]
##$SUBNAM3= <"">
##$SUBNAM4= <"">
##$SUBNAM5= <"">
##$SUBNAM6= <"">
##$SUBNAM7= <"">
##$SUBNAM8= <"">
##$SUBNAM9= <"">
##$SW= 400.765351723535
##$SWIBOX= (0..15)
0 1 3 0 0 0 0 0 0 0 0 0 0 0 0 0 
##$SW_h= 32467.5324675325
##$TD= 32768
##$TD0= 1
##$TE= 0
##$TE2= 300
##$TE3= 300
##$TEG= 300
##$TL= (0..7)
0 120 53 12 22 120 120 120 
##$TP= (0..7)
150 150 150 150 150 150 150 150 
##$TP07= 0
##$TPNAME0= <>
##$TPNAME1= <>
##$TPNAME2= <>
##$TPNAME3= <>
##$TPNAME4= <>
##$TPNAME5= <>
##$TPNAME6= <>
##$TPNAME7= <>
##$TPOAL= (0..7)
0.5 0.5 0.5 0.5 0.5 0.5 0.5 0.5 
##$TPOFFS= (0..7)
0 0 0 0 0 0 0 0 
##$TUNHIN= 0
##$TUNHOUT= 0
##$TUNXOUT= 0
##$USERA1= <user>
##$USERA2= <user>
##$USERA3= <user>
##$USERA4= <user>
##$USERA5= <user>
##$V9= 5
##$VALIST= <valist>
##$VCLIST= <CCCCCCCCCCCCCCC>
##$VD= 0
##$VDLIST= <DDDDDDDDDDDDDDD>
##$VPLIST= <PPPPPPPPPPPPPPP>
##$VTLIST= <TTTTTTTTTTTTTTT>
##$WBST= 1024
##$WBSW= 4
##$XGAIN= (0..3)
0 0 0 0 
##$XL= 0
##$YL= 0
##$YMAX_a= 26054
##$YMIN_a= -29423
##$ZGOPTNS= <>
##$ZL1= 120
##$ZL2= 120
##$ZL3= 120
##$ZL4= 120
##$ABSF1= 197.3918
##$ABSF2= -203.3724
##$ABSG= 5
##$ABSL= 3
##$ALPHA= 0
##$AQORDER= 0
##$ASSFAC= 0
##$ASSFACI= 0
##$ASSFACX= 0
##$ASSWID= 0
##$AUNMP= <proc_1d>
##$AZFE= 0.1
##$AZFW= 0.5
##$BCFW= 0
##$BC_mod= 2
##$BYTORDP= 0
##$COROFFS= 0
##$CY= -3
##$DATMOD= 1
##$DC= 0
##$DFILT= <>
##$DTYPP= 0
##$F1P= 0
##$F2P= 0
##$FCOR= 1
##$FTSIZE= 65536
##$FT_mod= 6
##$GAMMA= 0
##$GB= 0
##$INTBC= 1
##$INTSCL= 9.790993e-09
##$ISEN= 30
##$LB= 1.5
##$LEV0= 0
##$LPBIN= 0
##$MAXI= 10000
##$MC2= 0
##$MEAN= 0
##$ME_mod= 0
##$MI= 50
##$NCOEF= 0
##$NC_proc= -7
##$NLEV= 6
##$NOISF1= 182.463
##$NOISF2= 159.3651
##$NSP= 0
##$NTH_PI= 0
##$NZP= 0
##$OFFSET= 197.3918
##$PC= 4
##$PHC0= 1412.684
##$PHC1= 40.10047
##$PH_mod= 1
##$PKNL= yes
##$PPARMOD= 0
##$PSCAL= 0
##$PSIGN= 0
##$REVERSE= no
##$SF= 81.014063255964
##$SI= 65536
##$SIGF1= 159.3651
##$SIGF2= -187.1042
##$SINO= 113.3802
##$SIOLD= 16384
##$SREGLST= <1H.CDCl3>
##$SSB= 0
##$STSI= 65536
##$STSR= 0
##$SW_p= 32467.5324675325
##$SYMM= 0
##$S_DEV= 0
##$TDeff= 32768
##$TDoff= 0
##$TI= <>
##$TILT= no
##$TM1= 0
##$TM2= 0
##$TOPLEV= 0
##$USERP1= <user>
##$USERP2= <user>
##$USERP3= <user>
##$USERP4= <user>
##$USERP5= <user>
##$WDW= 1
##$XDIM= 65536
##$YMAX_p= 415102582
##$YMIN_p= -15418782
$$ End of Bruker specific parameters
$$ ---------------------------------
##NTUPLES= NMR SPECTRUM
##VAR_NAME=  FREQUENCY,     SPECTRUM/REAL,   SPECTRUM/IMAG
##SYMBOL=    X,             R,               I
##VAR_TYPE=  INDEPENDENT,   DEPENDENT,       DEPENDENT
##VAR_FORM=  AFFN,          ASDF,            ASDF
##VAR_DIM=   65536,         65536,           65536
##UNITS=     HZ,            ARBITRARY UNITS, ARBITRARY UNITS
##FACTOR=    0.49542278885378, 1,            1
##FIRST=     15991.5117654749, 0,            0
##LAST=      -16476.0207020576, 0,           0
##MIN=       -16476.0207020576, -15418782,   0
##MAX=       15991.5117654749, 415102582,    0
$$ Real data points
##PAGE= N=1
##DATA TABLE= (X++(R..R)), XYDATA
$$ [...]
46946B310112j844347j570827o49717l677j34522k36346M41923J176423Q61671
46937C50693k06199q52868p28480l03894K50090R47021J276491Q78370M44171
46928B055395O61209P92346k02349j574194j567076j78939O57881r3733j229547
46919f79007j290391m39803L08996N39168L77539o8805n60927p03414n00377l13170
46909c330191j17962L88929R02860P67184K20293J94438O85905O81156K8576j58131
46899B63057M43935N52712n13943j399072p99024L77900N52035O0887L41888J248810
46889A129185J211539r7031j132744p71855K95919Q69175O77350P1739o62453
46880A590824j177824j081983n38198j94017k19940j00423L73444O71873M46906
$$ y = [2310112, 465765, -1105062, -1754779, -1758456, -1892978, -2129324, -1687401, -510978, 350693, 144494, -708374, -1436854, -1740748, -1490658, -543637, 732854, 1611224, 2055395, 2716604, 3508950, 3306601, 1732407, 165331, -13608, 644273, 550540, -679007, -1969398, -2409201, -2100205, -1561037, -1183498, -1252303, -1813230, -2516644, -3017021, -3330191, -3448153, -3059224, -2156364, -1389180, -1168887, -974449, -288544, 392612, 421188, 263057, 706992, 1259704, 745761, -653311, -1452335, -1074435, -522400, -461513, -119625, 1129185, 2340724, 2243693, 1110949, 339094, 635013, 1504188, 2181538, 2253277, 1590824, 413000, -668983, -1207181, -1401198, -1621138, -1721561, -1348117, -676244, -229338]
46871b29338J57322K99812O15076N72363J73901k22011m98305p13696p40213m43820
46861a028909l7832J49700J16430M7771q8834l93343n68073j19181Q08556J232937
46851A19222M17180r87222j436661l55032R84850R67289k76383j058107m03951
46842b028815P83021J184488P80459L77521J70509j87466m95325j46122O96251
46833A134521J121769P98333L11302J1522m44453j046851r97471o131Q66676N71301
46823B320518l45816n20707K32515P69530L95399k35887k76822Q8582J08188l43784
46813B191716o54610m33902q2086k34241q83509j336987j073888m04536k3316
46804b935359k5537J94787R28274J489281J021186k48855j101040p42477K76236
$$ y = [-229338, -72016, 227796, 842872, 1415235, 1589136, 1367125, 868820, 155124, -585089, -1028909, -1066741, -917041, -800611, -752840, -841674, -1235017, -1803090, -1922271, -1113715, 119222, 536402, -450820, -1887481, -2242513, -1257663, -290374, -566757, -1624864, -2028815, -1245794, -61306, 719153, 1096674, 1267183, 1079717, 584392, 438270, 1134521, 2256290, 3054623, 3365925, 3377447, 2932994, 1886143, 888672, 882541, 1749217, 2320518, 1974702, 1453995, 1686510, 2456040, 2851439, 2615552, 2338730, 2427312, 2535500, 2191716, 1537106, 1103204, 1021118, 786877, -96632, -1433619, -2507507, -2912043, -2935359, -2960896, -2766109, -1837835, -348554, 672632, 423777, -677263, -1419740, -1143504]
46795a143504P67455K64468n85769q72658l96741K77434N84363N60600O09082
46786F4730Q32772Q82080N02017n3407l46828l04157j86805j41833p7001L2594
46776A204162K903k85359o33515o64123j90977N39456R61667O80987m7192n11930
46766A056079m09337k73538p01680j375031j414185o61732N1963P9520k75672
46757c923613m63865m50540k72415M12448J488604J735169K42471j775315j996366
46748e003422m4520J809473J563844j03880j169159r11798r4996O61702J286483
46739b006273J469483Q87637J09551K5899M15351L07025k61315k57138M15797
46730A106017N57018k64432q32586k94398L96976J48109m55876l41349J41586
$$ y = [-1143504, -376049, -111581, -697350, -1570008, -1966749, -1689315, -1104952, -544352, 64730, 897502, 1779582, 2281599, 2228192, 1881364, 1577207, 1390402, 1248569, 1171568, 1204162, 1207065, 921706, 288191, -375932, -566909, -27453, 934214, 1615201, 1568009, 1056079, 646742, 373204, -328476, -1703507, -3117692, -3779424, -3727461, -3647941, -3923613, -4387478, -4838018, -5110433, -4697985, -3209381, -1474212, -1231741, -3007056, -5003422, -5047942, -3238469, -1674625, -1778505, -2947664, -3859462, -3954458, -3292756, -2006273, -536790, 350847, 460398, 486297, 901648, 1208673, 947358, 690220, 1106017, 1663035, 1398603, 566017, 271619, 668595, 816704, 360828, 19479, 161065]
46721A61065N1891k59397J69654R21343P16750l48548r13283o36656n21277q00855
46711a459313m53417O68278J120411J52661r78171j039897o15549n99810l74039
46702c578846Q85480K208207K008449O07861k56022j08511j30884q98703j443642
46693g06611r27181J44965Q66121R99052O89910Q3699l85122k02717L69212M82457
46683A413785K9444j29144L98505Q41097N00681k11489n52869m70368k65838o60
46673A553144J81052j00987o76506o76531J42209P46775K90517o19987j030984
46664a91298j098409j272913r45666N13116J990304J757596J68391o59705J0566
46655B71982O23024L9048p44344n21217J43578J20390m03011n99134n14582n32928
$$ y = [161065, 212956, -46441, 123213, 1044556, 1761306, 1412758, 499475, -137181, -658458, -1459313, -1912730, -1244452, -124041, 28620, -949551, -1989448, -2604997, -3204807, -3578846, -2693366, -485159, 1523290, 2131151, 1875129, 1766618, 1635734, 737031, -706611, -1633792, -1488827, -622706, 376346, 1066256, 1149955, 764833, 562116, 931328, 1413785, 1443229, 1314085, 1712590, 2553687, 3054368, 2842879, 2290010, 1819642, 1553804, 1553144, 1734196, 1633209, 956703, 280172, 422381, 1169156, 1459673, 839686, -191298, -1289707, -2562620, -3508286, -2995170, -1004866, 752730, 921121, 261416, 271982, 895006, 934054, 189710, -331507, -187929, -67539, -470550, -1069684, -1584266, -2117194]
46645b117194k49522O33917J083173O0956j461007j575770k41337P87108P40997
46636b338679O31656R97724Q47818l55090j371733r90699J42101O95859O23710
46627a117333P21629J018244Q73987J94229n46352j099941j354245r33094J55665
46618b087211R58162O81629o6933j90209J95577J35860m52470p52803n39467l63470
46608b481335l03053J23154P27591P01083Q2453j64681J87866K83223j50552k73306
46598a267557J66851J75363n93134q26491L55975J663673J454111K12793l94411
46589I47173j08640J4614k95007l60714k49690p60309j600677j354036K57012
46580c510274J597770J326912J69743l01116K70086R57225Q77996p1561j278258
$$ y = [-2117194, -2366716, -1732799, -649626, -588670, -2049677, -3625447, -3866784, -3079676, -2338679, -1707023, -709299, 138519, -216571, -1588304, -2579003, -2436902, -1741043, -1117333, -395704, 622540, 1496527, 1690756, 1144404, 44463, -1309782, -2242876, -2087211, -1129049, -447420, -514353, -704562, -508985, -373125, -825595, -1578398, -2117865, -2481335, -2784388, -2661234, -1933643, -1232560, -1150107, -1314788, -1126922, -843699, -994251, -1267557, -1100706, -925343, -1518477, -2344968, -1988993, -325320, 1128791, 1341584, 947173, 838533, 853147, 558140, 197426, -52264, -812573, -2413250, -3767286, -3510274, -1912504, -585592, -415849, -716965, -446879, 510346, 1388342, 1316781, 38523]
46571C8523j728053q23088O90097J225367K62020q77388p13990M96307J241886
46562a88319P28771l39165p99297k77593N98932Q96554K83319o27383r53423n53311
46552a230915o2051M9529l4150k776J06821J59918J57022N9894j15510J4441P27966
46541a69811J348749Q24182n71009j213408l73451O67771N95094J304J17750O03104
46531A830275K55737o47303o05608N49006J175896L26150q67798j016197l63222
46522F36936M4880J5749j1644p7671m76478q51033n49155K77492P87431O28272
46512D24779K88559K33163L09639J70195j75221m33853l95386r0301K54894L67501
46502I53969J54435k12351n01024o34227o28320m66835j79407O7291J17325J3574
$$ y = [38523, -1689530, -2512618, -1822521, -597154, -335134, -1212522, -1926512, -1430205, -188319, 540452, 201287, -598010, -875603, -276671, 619883, 903202, 275819, -677604, -1230915, -1292966, -1243437, -1277587, -1280363, -1173542, -1013624, -856602, -796708, -912218, -897777, -169811, 1178938, 2003120, 1432111, 218703, -154748, 513023, 1108117, 1109421, 1227171, 1830275, 2086012, 1438709, 833101, 1382107, 2558003, 2884153, 2016355, 1000158, 636936, 681816, 697565, 685921, 608250, 131772, -719261, -1268416, -990924, -203493, 424779, 713338, 946501, 1256140, 1426335, 1251114, 817261, 421875, 331574, 586468, 953969, 1108404, 896053, 395029, -239198, -867518, -1334353, -1513760, -1446469, -1329144, -1315570]
46492a315570n3643N2712K59080K35728l61063j321321j683892o39628J254166
46483c573431K340907J700052K40435n11005k91047j03966n73947j123969r77031
46474b873002l09619N2383k21857n81485l22716N76866J422736J477322O20725
46465a58647n63383j249744r53446J30100J177936J265215J81669j196390j632377
46456b999067p83004M89566J173389J154216R58635P99571L88398l80343j061800
46447b60439j131930n28618M00340J235108J639044J425235O92974j98531r22767
46438B350416j351719j369600p89155K62944J068222R09439K5305m93371m2006
46429E70475O81300O64348J8105l24446j90270m28067j315795j779104r64328
$$ y = [-1315570, -1369213, -1316501, -1057421, -821693, -1182756, -2504077, -4187969, -4827597, -3573431, -1232524, 467528, 707963, 196958, -94089, -198055, -772002, -1895971, -2873002, -3182621, -3130238, -3352095, -3933580, -4256296, -3679430, -2256694, -779372, -158647, -722030, -1971774, -2925220, -2795120, -1617184, -351969, -170300, -1366690, -2999067, -3782071, -3292505, -2119116, -964900, -6265, 793306, 1181704, 801361, -260439, -1392369, -1920987, -1520647, -285539, 1353505, 2778740, 3471714, 3273183, 2350416, 998697, -370903, -1160058, -897114, 171108, 1080547, 1105852, 612481, 570475, 1251775, 1916123, 1934228, 1609782, 1419512, 991445, -324350, -2103454, -3067782]
46420c067782K61325M74283j84443l25679M85313J221809J187827R28891R30056
46411A911600O98064j61383j048890j363520j417928j497232r93971M13285J586630
46402a873345J283957J03548l37751K04225N02891K874m58699k34916K17291L77451
46392b12474M17079M68501K02069l69109n95414j97078K57412K91951J17301o4343
46382C15895m17424p38104m02770M03790M96623n33051j396620q85811L65816
46373b791656R42032O27205J78972j30528m37106l38686N23120J277699P09366
46364E60418p67119j445678p15591K73220N25957L74642L23945J19572l15155
46355a065789k33008O78559J326744O08271q24582j302959l51778Q51345J157850
$$ y = [-3067782, -2806457, -2332174, -2516617, -2842296, -2356983, -1135174, 52653, 981544, 1911600, 2609664, 2448281, 1399391, 35871, -1382057, -2879289, -3873260, -3459975, -1873345, -589388, -485840, -823591, -619366, -116475, -113601, -572300, -807216, -589925, -212474, 204605, 673106, 875175, 506066, -89348, -286426, -29014, 262937, 380238, 315895, -101529, -839633, -1242403, -838613, -341990, -875041, -2271661, -3157472, -2791656, -1849624, -1222419, -1043447, -1173975, -1611081, -1949767, -1426647, -148948, 560418, -206701, -1652379, -2367970, -2094750, -1568793, -1194151, -870206, -750634, -1065789, -1298797, -620238, 706506, 1314777, 490195, -812764, -1164542, -313197, 844653]
46346H44653O87632K30337J21160P8611j92434n78732p13550m60176j61038k34804
46336c78341n30876m28610K51096Q23445N96846j46497n27376k80384j8298k29253
46326h68248n60543l96449K26076O98756O86406M62016L56604K62785p1236m98449
46316B97718n91858k75615K414j60875o28164r32652p86851k51758L85413P36166
46306b206062N44612M0850j18216M55730J343086J715870J208204J99631o69718
46297B513987j071032j142766j199617j223270p30730M98409J632915J436799
46289G14695j9333j079109n43230P02874R45105n8974j092571j375473j193243
46280b999259p87747J9510R23709J130555O08377J88173N7933n46474j597443
$$ y = [844653, 1532285, 1762622, 1883782, 1962393, 1769959, 1191227, 477677, 17501, -143537, -378341, -909217, -1337827, -1086731, -263286, 333560, 187063, -340313, -620697, -638995, -868248, -1428791, -1825240, -1599164, -900408, -214002, 248014, 604618, 867403, 796167, 297718, -294140, -569755, -567341, -728216, -1356380, -2289032, -3075883, -3327641, -2942228, -2206062, -1661450, -1620600, -1738816, -1283086, 60000, 1775870, 2984074, 3183705, 2513987, 1442955, 300189, -899428, -2122698, -2853428, -2355019, -722104, 714695, 695362, -383747, -926977, -224103, 721002, 662028, -430543, -1806016, -2999259, -3787006, -3767496, -2843787, -1713232, -1104855, -916682, -858749, -1405223, -3002666]
46271c002666j682926j84930J244157Q22928o61444r66805K82151J172420M43959
46262b533156q22317j009767j57813N06231M06759O8854Q1558M01525P07114R28243
46252a422769J174246J303744R02454p7298q59476n74856M61945Q77236K3389
46243A808615j035899r68570J3690O81806O41979N09897M58330o7598r94331j275772
46233b27853m67163M12057L20760l49093n95862l96849m91083r86894j196083
46224c978063p45471P803O89409J282801J688960J592282R80279K72926k39160
46215A551766n87209o35280o0905Q41598J015126o5768j403195j540345m00448
46206a284660P10680Q50025L29553k23292p23496j117156r17827j2676P24245
$$ y = [-3002666, -4685592, -4870522, -3626365, -2803437, -3464881, -4431686, -4149535, -2977115, -2533156, -3355473, -4365240, -4523053, -4016822, -3610063, -3541209, -3459651, -3058126, -2351012, -1422769, -248523, 1055221, 1957675, 1880377, 1020901, 446045, 907990, 1785226, 1808615, 772716, -195854, -182164, 499642, 1141621, 1651518, 2109848, 2042250, 1047919, -227853, -695016, -282959, 37801, -311292, -907154, -1304003, -1795086, -2781980, -3978063, -4723534, -4715731, -4026322, -2743521, -1054561, 537721, 1518000, 1790926, 1551766, 964557, 329277, 268372, 1109970, 2125096, 2059328, 656133, -884212, -1284660, -573980, 276045, 605598, 382306, -341190, -1458346, -2376173, -2388849, -1664604]
46197a664604N14690r0802k1232O30706Q50482M63391L82318R31004J180761M38837
46187C615551o90478j346970j547593j576769j165164j63759O92217O42418N951
46178a534596l99306m15274l16075j6625N59110Q46082L62485l87606o88075p44674
46168b734554r83807q55397K94640J642585J761399Q40981L83606P34517O63570
46159A747540l86387j395025j569719j385318j201090m73851Q16305J479044Q66192
46150a502309j1243j30939O8401o0138K107P10935J082778J67976j016852p58626
46140a447910P27066J610916J058797l3084p43256j094342j286384j216785q96282
46131c321264m28988L15002J176861J295936L08896n56680N063J177783J025737
$$ y = [-1664604, -1149914, -1240716, -1261948, -631242, 219240, 682631, 1064949, 1995953, 3176714, 3615551, 2925073, 1578103, 30510, -1546259, -2711423, -2875182, -2182965, -1540547, -1534596, -1933902, -2349176, -2665251, -2681876, -2122766, -1276684, -914199, -1301805, -1989880, -2734554, -3718361, -4573758, -4279118, -2636533, -875134, -34153, 349453, 1083970, 1747540, 1361153, -33872, -1603591, -2988909, -4189999, -4663850, -3847545, -2368501, -1502309, -1513552, -1644491, -1576090, -1636228, -1634121, -923186, 159592, 327568, -689284, -1447910, -720844, 890072, 1948869, 1915785, 1172529, 78187, -1208197, -2424982, -3321264, -3750252, -3435250, -2258389, -962453, -653557, -1210237, -1205174, -27391, 998346]
46122I98346m47611j155591j41394R77864N62814p02875j137472m84231K35697
46113a294453M52606M21972L53760K07043J30257L39567O84516Q29864O89733
46104B814865L57304j13145n98894r13502j061936j069458n70920O97868J924343
46095A466525J749623J81672j047367p06457L05989M54120j72518k99205L39637
46086B272019O14644j72354j222631j364671n09383M25528O34333J33626m77782
46077C33329p50951p84959q20662o51257P2962R82684J175645N33719N6032L65022
46067E11564O96714J70561o79530p32095j16137O6616l67898m75949J3253J10358
46057h02543o86410j310559o83549N66142J002309M23038j17042n1978Q5230j17486
$$ y = [998346, 550735, -604856, -746250, 231614, 794428, 91553, -1045919, -1530150, -1294453, -841847, -419875, -66115, 140928, 271185, 610752, 1295268, 2125132, 2814865, 3172169, 3059024, 2460130, 1546628, 484692, -584766, -1155686, -457818, 1466525, 3216148, 3397820, 2350453, 1643996, 1949985, 2404105, 2231587, 1932382, 2272019, 2886663, 2714309, 1491678, 127007, -382376, 43152, 677485, 811111, 333329, -417622, -1202581, -2023243, -2674500, -2601538, -1618854, -443209, 90510, 146542, 511564, 1208278, 1378839, 699309, -32786, -148923, -82307, -450205, -926154, -912901, -802543, -1488953, -2799512, -3483061, -2916919, -1914610, -1491572, -1608614, -1660592, -1575362, -1692848]
46047a692848j99518K47918P26322N83514J12257J27028O86008J018872P00012
46038B309565J06990m43727j176320k028090k141395r84174N42458J069562N67308
46029b177823J84234L88197M23539j55865n81391j15804P00098Q39273K26019
46020b69523l68554m31660m6562M92770Q04244N29070j34206m30752q6853K37178
46010B95152J14164J66957Q08078J015430k53735j995155k176173o67504N78961
46001b113825M52836n520K43756N76907K17007j59600K62761P17444R1430r23439
45991f40243p07535O14746J187848K21825q74319o57452M19700R99404P00918
45982A264892J35391k32237l35156q0354M58062O53555o9294j275102j813408
$$ y = [-1692848, -1892366, -1644448, -918126, -334612, -222355, -95327, 590681, 1609553, 2309565, 2416555, 1972828, 796508, -1231582, -3372977, -4357151, -3814693, -2745131, -2177823, -1993589, -1605392, -1181853, -1337718, -1919109, -2034913, -1334815, -495542, -269523, -638077, -1069737, -1116299, -623529, 180715, 709785, 575579, 144827, 57974, 295152, 409316, 576273, 1384351, 2399781, 2146046, 150891, -2025282, -2692786, -2113825, -1660989, -1666509, -1422753, -845846, -628839, -788439, -525678, 191766, 283196, -640243, -1347778, -733032, 454816, 676641, -197678, -855130, -435430, 563974, 1264892, 1400283, 1168046, 832890, 752536, 1210598, 1864153, 1794859, 519757, -1293651]
45973a293651j160541K3661P54961O79109N4421p21429j244087j101584k05938
45964d215078R04135J431879J104666M11423k3105j08955j50262j94334Q1494
45955g58137P08477J051426N38929l91527o59527L0668P15238M93735k01344l08346
45945A219592K25136M01721j93159o61944j57973P51319Q13009j98408j243062
45936I56231j377233p06189N4691M15604L42674L1064l38162p20163j074698j085481
45926c501662l53938Q59039J530478J054107J47159j16618J60639M9848n37771
45917g08719o73734J5883P69536R83024R46824Q66235L37337n73046r33179m75992
45907E54169l23828j109587j578158n03646J045086J158393Q5380k65513M96796
$$ y = [-1293651, -2454192, -2430531, -1675570, -996461, -942040, -1663469, -2907556, -4009140, -4215078, -3310943, -1879064, -774398, -362975, -386080, -495035, -645297, -839631, -758137, -49660, 1001766, 1540695, 1149168, 489641, 520309, 1235547, 1729282, 1527938, 1219592, 1444728, 1846449, 1653290, 991346, 833373, 1584692, 2397701, 2199293, 956231, -421002, -1127191, -1072500, -656896, -314222, -283158, -621320, -1341483, -2416181, -3501662, -3855600, -2996561, -1466083, -411976, -264817, -381435, -220796, -170948, -708719, -1382453, -1366570, -597034, 385990, 1332814, 2199049, 2536386, 1963340, 1030161, 554169, 230341, -879246, -2457404, -2961050, -1915964, -757571, -672191, -937704, -440908]
45898d40908P61977k28163j200076j136324p79283r08488q56515L4801R17438
45889c835541P85067K04994K93130Q38881Q64488L58422M3471l4579k78505l47627
45879a107799L24035J095994P67346l72518p08688K27785R62988L22318q69310
45870F42151j184526o37678k65387l33200j27619O35893J204536Q28236k03366
45861E59040r33871q85399m76925l17402m24978m24244l00823m08389o63896m13190
45851d690077N18411J277864J104164M51171K10675L05803O3226l73740k44115
45842a376618L21244L50426k37666l73953K41890M36127m19791j105612m73855
45833b637808N45699M27614l69602j71436J034999J543487Q04123K72760P72821
$$ y = [-440908, 321069, 92906, -1107170, -2243494, -3022777, -3931265, -4787780, -4752979, -3835541, -3050474, -2845480, -2552350, -1713469, -848981, -490559, -447088, -481667, -760172, -1107799, -783764, 312230, 1079576, 707058, -1630, 226155, 1189143, 1511461, 642151, -542375, -1180053, -1445440, -1778640, -1906259, -1270366, -65830, 762406, 559040, -374831, -1260230, -1737155, -2054557, -2479535, -2903779, -3204602, -3612991, -4276887, -4690077, -4171666, -2893802, -1789638, -1338467, -1127792, -821989, -758763, -1132503, -1376618, -1055374, -704948, -942614, -1316567, -1074677, -638550, -1058341, -2163953, -2637808, -2092109, -1664495, -2034097, -2205533, -1170534, 372953, 1177076, 1449836, 2222657]
45824B222657R72924k85443j723845j384052L12509J106884J38845j118078j239114
45815i96713n57985l8802J70343K84627O0217o26690j108749p73602o4489K37970
45805c413873K51846N42559Q47625M41654l60173l63467O08045J207437N06720
45796B68373o10957p81873n6178M68147L33424N1630M6251J90209K94004K85671
45786D88701j1051n81490q42197l23489L95039L25481l61693m35674M96880J244121
45776C94628P34431m08454p76177p8003O85667O21954k18501j217336j749141
45767b010932j458935n44494K59930M11433J91124K22365N38953O39166L29215
45758a422175p4659l33635m45974k04162O63972J684217J734959M91696q09007
$$ y = [2222657, 3195581, 2910138, 1186293, -197759, 114750, 1221634, 1360479, 242401, -996713, -1554698, -1593500, -1423157, -1138530, -1078313, -1705003, -2813752, -3587354, -3651843, -3413873, -3162027, -2619468, -1771843, -1330189, -1690362, -2053829, -1445784, -238347, 268373, -342584, -1124457, -1180635, -712488, -379064, -327434, -281183, -90974, 203030, 488701, 477650, -103840, -946037, -1269526, -874487, -549006, -910699, -1346373, -849493, 394628, 1129059, 720605, -55572, -133575, 552092, 1174046, 955545, -261791, -2010932, -3469867, -4014361, -3754431, -3342998, -3151874, -2929509, -2390556, -1751390, -1422175, -1496834, -1830469, -2276443, -2480605, -1816633, -132416, 1602543, 2094239, 1285232]
45749A285232p74807L04813Q46307J32845p79932o07601M46792J109021P25753
45740B688423j62088p70909q80442o18956j24726K83842J52863m72732q79807
45731g84532o01525j05724k9997j32857K19689P74446N96874l54470q84494k32334
45721a534924P89876J004585N25025L26903N86925M68165m39508j356135j309364
45712i38452l34616O93249J101376R31333N41470M6872o64108j436360j689572
45703a748808j051582R969O57850P60212Q94429J188606R77522K0773p96226p14677
45693A98068k95202l79810n35329J62056J215273J170969n68o52062j0544O20323
45683A493174K4211j000602j058499l79029k13281p37856j011293o34637r4927
$$ y = [1285232, 510425, 815238, 1661545, 1794390, 1014458, 406857, 853649, 1962670, 2688423, 2526335, 1755426, 874984, 256028, 131302, 415144, 568007, 95275, -784532, -1386057, -1491781, -1521778, -1654635, -1434946, -660500, -63626, -418096, -1302590, -1534924, -745048, 259537, 784562, 1111465, 1698390, 2166555, 1727047, 370912, -938452, -1273068, -579819, 521557, 1452890, 1994360, 2041232, 1377124, -59236, -1748808, -2800390, -2790421, -2132571, -1372359, -477930, 710676, 1688198, 1708971, 912745, 198068, -97134, -476944, -1012273, -850217, 365056, 1536025, 1535457, 883395, 872851, 1493174, 1517385, 516783, -541716, -920745, -1134026, -1871882, -2883175, -3517812, -3612739]
45674c612739L66277R47146J383872J082922K85075k4843L98354O99662L39211
45665A864937j31136j23853N7400j10838m83303n62917j84122M79829J063602
45656A869599R62553j34742j411416j499676l18448N88773J37285q25654r21351
45647a553077k05823K96733K90658K41736K04863j45945n78497n44409j99357
45638b193118j19232j87889J17237N21632K99128k59970j16561O81789R03648
45629c53336J79328l76974j35499R011n70616q72160Q5095J430054J659049Q14205
45619A868157M1786l04213o35717p68843j97721N45069M01266l86268n14321J98265
45609B47460M62601k62992p87538j78535O29189K99792p98195j165987l33925
$$ y = [-3612739, -3246462, -2299316, -915444, 167478, 452553, 427710, 826064, 1525726, 1864937, 1733801, 1609948, 1667348, 1556510, 1073207, 510290, 326168, 805997, 1869599, 2832152, 2697410, 1285994, -213682, -532130, 56643, 193928, -631726, -1553077, -1758900, -1462167, -1171509, -929773, -724910, -870855, -1449352, -1993761, -2193118, -2312350, -2500239, -2383002, -1861370, -1562242, -1822212, -1938773, -1256984, -353336, -174008, -550982, -686481, -677470, -1248086, -2120246, -2035151, -605097, 1053952, 1868157, 1909943, 1605730, 970013, 201170, 3449, 548518, 949784, 563516, 49195, 247460, 710061, 447069, -340469, -519004, 110185, 409977, -388218, -1554205, -1888130]
45600a888130O65336Q10247J98900l78072l67380J23414M84189J81827o30911
45591h00580j210476j052162l85183K81286P57313J112100J362367J477306J425593
45582B967564J060765K98280m77576o55286k39951O9328r1514k46336r143J09985
45572B786116n16652j480612j710924q51768L31450Q75450N21725k25993o08580
45563h79788k75151L45044N42223L03244L09403P38264P84965o0151r47192p48988
45553A11873K57358P87095L94036j01786j2599L78327N72645O06143O97139P60008
45543D450239O18236L11852r562k05761j41362J15731K13198J8696o0651K02781
45533E513397K14779n31061j254576p61163N81711J083136J82184p17828m32457
$$ y = [-1888130, -1222794, -412547, -213647, -591719, -959099, -835685, -351496, -169669, -800580, -2011056, -3063218, -3448401, -3167115, -2409802, -1297702, 64665, 1541971, 2967564, 4028329, 4326609, 3849033, 3193747, 2953796, 3023124, 2931610, 2685274, 2676131, 2786116, 2269464, 788852, -922072, -1773840, -1442390, -566940, -45215, -271208, -879788, -1154939, -809895, -267672, 35572, 344975, 1083239, 1868204, 1808053, 860861, 111873, 369231, 1156326, 1550362, 1448576, 1435977, 1814304, 2386949, 2993092, 3690231, 4450239, 5068475, 5380327, 5370765, 5165004, 5023642, 5139373, 5352571, 5371267, 5310616, 5513397, 5728176, 5197115, 3942539, 3181376, 3763087, 4846223, 5028407, 4310579, 3878122]
45524C878122L22282L50528o6119J21033Q06183Q72373l7178j059892j363969
45515C823363r22988p7523Q19974J279037R53275J83973l02743k83987j21268
45506E351113k9164J28593L28640L09292Q1151n0097n4293k19804n31186n69778
45496D744467k00200J65614J85131j6623k56868n88214r10143q04258j83379K86285
45486B421812o5693r32561j294526o36669N05141J270870J377506J107584O99371
45477D452835J38363m83899q30767p71407o58466p81583p85194j84561O46701
45468G42022P40866p0190q12189p79462m63553m54464k50998Q22137K099398K237506
45458C811073J167336J09450l37548p60035j337622j160048J30509J265775J008572
$$ y = [3878122, 4200404, 4550932, 4484813, 4605846, 5412029, 6284402, 6247224, 5187332, 3823363, 2900375, 2822852, 3642826, 4921863, 5875138, 6059111, 5756368, 5472381, 5351113, 5321949, 5450542, 5779182, 6088474, 6169625, 6119528, 6065235, 5845431, 5314245, 4744467, 4544267, 4709881, 4895012, 4878389, 4621521, 4033307, 3123164, 2318906, 2135527, 2421812, 2356119, 1423558, 129032, -507637, -2496, 1268374, 2645880, 3753464, 4452835, 4591198, 4107299, 3276532, 2505125, 1846659, 1065076, 279882, 95321, 742022, 1482888, 1412698, 600509, -178953, -642506, -1096970, -1347968, -525831, 1573567, 3811073, 4978409, 5087859, 4750311, 3990276, 2652654, 1492606, 1623115, 2888890, 3897462]
45449C897462K1195j23907P29068J215096M81267q06481j569162j496669r10557
45440A437312k01372K79793K95073j3484k50542k93114l76171o01963p27302n26556
45430i78326n6290M91109R09957R68791N96192O0989l30421n98492p85410n32218
45420b54119L94282J279381J030974k46531j096104n41866O60793J166961P74251
45411C168022K73542O3302j78022o03426q37373o16159j93555J6684k05290q50764
45401C6961j533745j474413k61776J324126J904069J085602j27130o76366n37107
45392b59779j86215K47824P28312Q20438K32718m93723n92200j68916L6795j32411
45382B32843p5438M63731Q91106O37149o4050n91638o55420k99840L38240R10475
$$ y = [3897462, 3918657, 3794750, 4523818, 5738914, 6220181, 5413700, 3844538, 2347869, 1437312, 1235940, 1515733, 1810806, 1797322, 1546780, 1253666, 877495, 275532, -451770, -978326, -1034616, -543507, 366450, 1335241, 1931433, 1992422, 1662001, 1063509, 278099, -254119, 140163, 1419544, 2450518, 2203987, 1107883, 566017, 1226810, 2393771, 3168022, 3441564, 3504866, 3326844, 2723418, 1886045, 1269886, 1076331, 1093015, 887725, 36961, -1496784, -2971197, -3232973, -1908847, -4778, 1080824, 953694, 277328, -259779, -445994, -198170, 530142, 1350580, 1583298, 1089575, 497375, 328459, 365254, 232843, 157405, 621136, 1512242, 2149391, 2085341, 1493703, 838283, 538443, 876683, 1787158]
45372A787158R05804K47748m48422o05048l92627l08925l42491r7440L99279O16153
45362A761189L01144j63949l79255m89123q22966j210652j041153n9327J132159
45353i71933J593995J083982L53016K28716N81567N56512k19930j125321j356242
45344G24362q14300K6031O67637P10202n9812j197050j638950q37282M39172J032582
45334i47408Q16577M94106L20767l034l13745j9793O52559O09754m06340j119710
45324H3733m98910O37092P95623r242m18799J54078P40023L35908p10038j277904
45314a68436q78820k4991N18145M88922K17986J49637L09961L13992m0916l80370
45304E05110j79929N41074J212450J313239P45960k53047j258805j777260j551845
$$ y = [1787158, 2692962, 2940710, 2492288, 1887240, 1494613, 1185688, 843197, 745757, 1145036, 1761189, 2062333, 1898384, 1519129, 1030006, 207040, -1003612, -2044765, -2104092, -971933, 622062, 1706044, 2059060, 2287776, 2869343, 3425855, 3205925, 2080604, 724362, -89938, -63907, 603730, 1313932, 1254120, 57070, -1581880, -2419162, -1979990, -947408, -130831, 363275, 684042, 681008, 367263, 347470, 1000029, 1609783, 1203443, 83733, -415177, 221915, 1017538, 1008296, 589497, 743575, 1483598, 1819506, 1109468, -168436, -1047256, -1072247, -554102, -65180, 152806, 302443, 612404, 926396, 885480, 505110, 325181, 866255, 2078705, 3391944, 4137904, 3884857, 2626052, 848792, -703053]
45295g03053q09784l9547M48634O49363P33140R38347J319690J405301N24916
45286D467007j121399k188522j652741k28335N13095K43627N4206M54835M56288
45277I98061o73387j754596r94189J398155L061710K200888l22413k057212j684979
45268A72038j52026P81079N55021O4571J82532O25440N33844k29203q81398p49521
45258I02377l1650N56442N59086J04385k83438j25763N26819J042654Q66227J44630
45248D261769n80491j094547j438858j339715m78153O55379J033681M68171j00435
45239A386801l9975J03473k70259o64868l02561N12966P88867K61577m12385o29854
45229G33782k68039N41515J272799J004669m65528j768915j346518L79795J382712
$$ y = [-703053, -1512837, -1552384, -1103750, -454387, 278753, 1217100, 2536790, 3942091, 4467007, 3345608, 1157086, -495655, -723990, -210895, 32732, 86938, 541773, 998061, 324674, -1429922, -2424111, -1025956, 2035754, 4236642, 3914229, 1857017, 172038, 20012, 801091, 1356112, 1420683, 1603215, 2228655, 2762499, 2533296, 1651898, 902377, 870727, 1427169, 1986255, 2090640, 1807202, 1681439, 2208258, 3250912, 4117139, 4261769, 3681278, 2586731, 1147873, -191842, -669995, -14616, 1019065, 1487236, 1386801, 1346826, 1450299, 1180040, 515172, 212611, 725577, 1514444, 1776021, 1363636, 733782, 465743, 1007258, 2280057, 3284726, 2819198, 1050283, -296235, 83560, 1466272]
45220A466272O89410n22551p99120j95004L78571N44008M43720J51899j32631
45211B024574K8307N27927M96724l70845r93090l62470Q06731J069840M56906
45202C684604L11024J009812J313265L92002p55629p14653L47810J017861N74017
45193G180113k47035l74562L18571J029047J023978M43884R8114M88981J223905
45184A1184996J619222J696407K103109L051681L906311M052433L709801L581690
45176C4905650M085396N221161O756064Q094920Q340173P046402M746883K282747
45168H1479396j56530k790438n291986o836820p146017o779210o221137n353160
45160D0904098m133816l143140k923524l223642l428504l381507l228092k794760
$$ y = [1466272, 2155682, 1633131, 834011, 639007, 1017578, 1561586, 2005306, 2157205, 2024574, 2052881, 2580808, 3077532, 2706687, 1713597, 1351127, 2157858, 3227698, 3684604, 3995628, 5005440, 6318705, 6710707, 5955078, 5240425, 5588235, 6606096, 7180113, 6933078, 6558516, 6877087, 7906134, 8930112, 9373996, 9472110, 9961091, 11184996, 12804218, 14500625, 16603734, 19655415, 23561726, 27614159, 31323960, 34905650, 38991046, 44212207, 50968271, 59063191, 67403364, 74449766, 79196649, 81479396, 81322866, 78532428, 73240442, 66403622, 59257605, 52478395, 46257258, 40904098, 36770282, 33627142, 30703618, 27479976, 24051472, 20669965, 17441873, 14647113]
45152A4647113j842158p62168k44627k40474l3766N06502N77393k54068j163040
45143A1190707j163780n61829m73654j150485j676273j399180q46310q44242j285241
45134A789713j289864m08137P39178J062731J36962j270895j859176j103599J84447
45125b018640Q11791N46133J26336P8938J50549L0360m6348J71960L52463Q1382
45115B84924l60727l41971J61211N46622M99551L47782L97795M29262R7399n16072
45105A545776j021270j156671q82477k43292N93339J267605J469375J273544J055083
45096C901012J021071R79760O75446K10206r1493j98351m30529q70164j063421
45087D133537o51903k6770J48479r0146j30099J59819K35805j02789l08980q6857
$$ y = [14647113, 12804955, 12042787, 11798160, 11557686, 11523920, 12030422, 12607815, 12353747, 11190707, 10026927, 9465098, 8991444, 7840959, 6164686, 4765506, 3919196, 3074954, 1789713, 499849, 91712, 830890, 1893621, 2030583, 759688, -1099488, -2203087, -2018640, -1206849, -660716, -534380, -455442, -304893, -274533, -320881, -148921, 203542, 284924, -75803, -417774, -256563, 290059, 789610, 1137392, 1535187, 1964449, 2061848, 1545776, 524506, -632165, -1514642, -1757934, -1164595, 103010, 1572385, 2845929, 3901012, 4922083, 5901843, 6577289, 6787495, 6696002, 6497651, 6067122, 5196958, 4133537, 3481634, 3454864, 3603343, 3513197, 3383098, 3542917, 3778722, 3675933, 3366953, 3280096]
45077C280096j1380n47672j130697r83135l17520R5008J00290L2586j56804o28486
45067b67714q49129k07713P35472Q29275J17066k39640J03059K23074k79071n26697
45057c62018o659M50305J75445j38693K39339P26104N42876J17275Q5190q7547
45047A741617r85264j647355q64296N71884Q70997J49181J95445J295379J559844
45038B887432N1094j536076j466636n03652l72891r87135r17978J00771Q64688
45029a880383P14069L80793N92542R36933O10253l10880q46870k48677J047478
45020I95258J720801R83224m28491j102641p21270k80319m23393m83947K72583
45011E31805J281424J408970N43089m13426q25144p79973m76650J0861L78360
$$ y = [3280096, 3268716, 2721044, 1590347, 607212, 289692, 384700, 484990, 517576, 360772, -267714, -1116843, -1324556, -589084, 240191, 357257, 117617, 220676, 443750, 164679, -362018, -368677, 81628, 257073, 118380, 357719, 1083823, 1626699, 1743974, 1829164, 1741617, 756353, -891002, -1755298, -1183414, -312417, -163236, 32209, 1327588, 2887432, 2938526, 1402450, -64186, -567838, -940729, -1927864, -2845842, -2745071, -1880383, -1166314, -785521, -192979, 743954, 1354207, 1043327, 196457, -52220, 995258, 2716059, 3699283, 3270792, 2168151, 1446881, 1166562, 743169, 259222, 531805, 1813229, 3222199, 3765288, 3351862, 2526718, 1746745, 1270095, 1280956, 1659316]
45002A659316K09517m42841j056987j239305r77876m40354J07703L78865M23894
44993a378068O26314R64066P60336k33669j030231n54864P38242J385993Q79327
44984B157446Q9352k07806j42747K1379L53608O13477J94191p78760j210768n24544
44974E64828M10037N35785R8065L7790M19472M31642k38941r28593r84846n69755
44964b24516k56598k67105l90399m37345m62456m67917j11098Q97494J999764
44955B79824J947206L30973j424187j477935J01357J418827J276813M73853J42303
44946C069034K8732n93880j265829r46240J66353P74937M01228l8548K22825P19424
44936B538036O22486q1998p62260r61864o52536o7351L90490L97697J26970J18436
$$ y = [1659316, 1868833, 1425992, 369005, -870300, -1848176, -2288530, -2180827, -1801962, -1378068, -751754, 212312, 972648, 738979, -291252, -846116, -107874, 1278119, 2157446, 2246798, 2038992, 1896245, 1917624, 2271232, 2884709, 3078900, 2300140, 1089372, 564828, 974865, 1510650, 1608715, 1646505, 2065977, 2497619, 2258678, 1330085, 345239, -224516, -481114, -748219, -1138618, -1575963, -2038419, -2506336, -2617434, -1719940, 279824, 2227030, 2558003, 1133816, -344119, -242762, 1176065, 2452878, 2926731, 3069034, 3097766, 2503886, 1238057, 291817, 458170, 1233107, 1634335, 1595787, 1818612, 2538036, 3160522, 3078524, 2316264, 1354400, 701864, 634513, 1025003, 1422700, 1549670, 1668106]
44926A668106N37489Q78395O28061n9257n86813o05290k80907k7160r9630l42639
44916A710355l20379J43813O37355O43977K73659J11906L69206O67948P47299
44907D985139Q31368J076657J191985R86004Q50346J206143J752880J780790J099437
44898A5760749K02558m33802q01799j096047j365957j541079j568701j436487
44890G719435j197847r81461q36243o19060k30327R8623L1942l35477m84338j67276
44880B997971J68756n7787p10741r97410m52251M39180Q27722N33343J55724J66326
44870C070833K80659l5949p11669j098698p99611j09993M22557N76932M60481
44861B055542J93216j72602n30439p28247o98423m93985k35011o3866n4926r2624
$$ y = [1668106, 2205595, 3083990, 3712051, 3652794, 3065981, 2460691, 2179784, 2152624, 2052994, 1710355, 1389976, 1533789, 2171144, 2815121, 3088780, 3200686, 3569892, 4237840, 4985139, 5816507, 6893164, 8085149, 9071153, 9921499, 11127642, 12880522, 14661312, 15760749, 15963307, 15529505, 14727706, 13631659, 12265702, 10724623, 9155922, 7719435, 6521588, 5540127, 4703884, 4084824, 3854497, 3953120, 3985062, 3649585, 3165247, 2997971, 3166727, 3108940, 2398199, 1400789, 948538, 1387718, 2215440, 2748783, 2904507, 3070833, 3351492, 3315543, 2603874, 1505176, 705565, 595572, 1018129, 1595061, 2055542, 2248758, 2076156, 1545717, 817470, 119047, -374938, -609949, -673815, -728741, -821365]
44851h21365M9253L95621O43095M99880Q5981j89350j36560K6024M4348k2651
44841E74276J1686R8028N5955k1307J45456M22686K09532o53136j327835r72409
44831a457068m6469K48368j53222K1445J229122J939445P32623j284464j742411
44822e12631l99004N18996l03592j323041o03574J168413J699756L90381j053589
44813d17885j176442m14587J27630K60584M16183O65777P86243P73936O51447
44804A672886J77187o32601j036971l37431J009841J714138J143416l5320q13165
44795B861980r20996p32751n64699m85277n50766p64873q70786n76102p835L88196
44785b223909M45259M24989M78288L73615J4700j68896K14497Q21460R56001N23021
$$ y = [-821365, -772112, -376491, 266604, 766484, 852465, 663115, 526555, 552579, 596927, 574276, 585962, 683990, 739945, 718638, 864094, 1286780, 1496312, 843176, -484659, -1457068, -1503537, -1255169, -1408391, -1386946, -157824, 1781621, 2514244, 1229780, -512631, -911635, -392639, -696231, -2019272, -2622846, -1454433, 245323, 635704, -417885, -1594327, -2008914, -1881284, -1620700, -1204517, -538740, 247503, 1021439, 1672886, 1850073, 1217472, 180501, -156930, 852911, 2567049, 3710465, 3675145, 2861980, 1940984, 1208233, 643534, 158257, -392509, -1157382, -2028168, -2604270, -2612105, -2223909, -1778650, -1353661, -875373, -501758, -487058, -655954, -441457, 380003, 1336004, 1859025]
44775A859025N7693j46338l13403n04813l53334K14407O24697M99078K98833N10546
44765B746391O58500l3847j220242j619450p50805L63708N92208R5519j97576
44756F34406n279J30822r8012k50270J56182Q98721J331456J168174O62255J22392
44746D750847l71107o98872n53948R8629O46273M06894m15466q46150l66140M48492
44736C099452P82782O06708M09529L13996O3862k97196l51746Q6648P42692J213068
44726F669795J162356L94958p41795j253031n08047P59381J265546R36786Q87782
44717I573731J552693K014530J634766J135674J227786J249416L79517o04569
44709A8163544k98359R46025J219373j80478j627281j391453J30488J191545Q96904
$$ y = [1859025, 1916718, 1770380, 1456977, 952164, 598830, 813237, 1437934, 1937012, 2235845, 2746391, 3404891, 3371044, 2150802, 531352, -219453, 144255, 736463, 831982, 634406, 629127, 759949, 661937, 411667, 567849, 1466570, 2798026, 3966200, 4628455, 4750847, 4379740, 3680868, 3126920, 3225549, 3871822, 4278716, 3863250, 3017100, 2650960, 3099452, 3882234, 4488942, 4898471, 5212467, 5276329, 4979133, 4627387, 4714035, 5456727, 6669795, 7832151, 8227109, 7485314, 6232283, 5724236, 6483617, 7749163, 8685949, 9573731, 11126424, 13140954, 14775720, 15911394, 17139180, 18388596, 18768113, 18163544, 17865185, 18811210, 20030583, 19850105, 18222824, 16831371, 16961859, 18153404, 19050308]
44700A9050308k39325j417696k280262k634251k274568j340485m45575j79234
44692H238912n55542j028649j033192n23463L0898K17233J28970R1340J11674
44683E678181n7468l80801m91924k50121K9652J0145l16078p42259r60778o01263
44673A917286L29204J050213P49627j43796k83168O20845J096062n3076j817079
44664C466118k194571q51960O61222J185467J151399J314045J479396J055357
44656G266473O5443r49127j493103j239860k31241P05538N07303o58293j268003
44647B705130m75806N15956J05149j298341j779891o26917Q05361J135548O49469
44638A735658M07044O25196P50052N48256K85919O7696k90342p55881r61573o55409
$$ y = [19050308, 18810983, 17393287, 15113025, 12478774, 10204206, 8863721, 8418146, 8238912, 7683370, 6654721, 5621529, 5098066, 5128964, 5346197, 5475167, 5566507, 5678181, 5620713, 5239912, 4747988, 4497867, 4527519, 4537664, 4221586, 3479327, 2518549, 1917286, 2246490, 3296703, 4046330, 3902534, 3619366, 4240211, 5336273, 5283197, 3466118, 1271547, 419587, 1080809, 2266276, 3417675, 4731720, 6211116, 7266473, 7331916, 6382789, 4889686, 3649826, 3418585, 4124123, 4631426, 3973133, 2705130, 2229324, 2745280, 2850429, 1552088, -227803, -854720, -49359, 1086189, 1735658, 2142702, 2767898, 3517950, 4066206, 4352125, 4419821, 4129479, 3373598, 2412025, 1756616]
44628A756616J5290O43124P91602K70296n25707p54480k8935R24391R84018J7131
44618D093346r53187j083409o76633m89940n63155l46826K11723M53279N6219
44609G01417l23309P3559R63553J327827P34435k08578p30544o58379j76380N44226
44599B247827J131313J001839J14336o75189o07729l1590K46199K68237O81901
44590D377144J364707J407409O27229l0875m2823j48912r06258j418110o45270
44581D584241O84719Q29125n08851j741816j553511l97277M92416O55024M51383
44572C495453K31567N7174q3088k14626l63922m25115k65060n790J24717J99852
44562B751162M07697N24033K04724j97426O3391Q12231Q89303j21433j020638
$$ y = [1756616, 1771906, 2415030, 3206632, 3476928, 2951221, 2196741, 2167806, 3092197, 4076215, 4093346, 3140159, 2056750, 1380117, 890177, 327022, -19804, 191919, 645198, 701417, 378108, 451667, 1415220, 2743047, 3477482, 3268904, 2538360, 1879981, 1703601, 2247827, 3379140, 4380979, 4495315, 3820126, 3212397, 3180807, 3427006, 3695243, 4377144, 5741851, 7149260, 7776489, 7745614, 7702791, 7553879, 6647621, 5229511, 4584241, 5268960, 6098085, 5589234, 3847418, 2293907, 1896630, 2389046, 3044070, 3495453, 3727020, 3784194, 3701106, 3486480, 3122558, 2697443, 2432383, 2426593, 2551310, 2751162, 3158859, 3682892, 3887616, 3690190, 3753581, 4565812, 5455115, 5333682, 4313044]
44553D313044o15938N42845J013742N04006k4709P015J95966J71296J34709J84305
44543F426281L0050k98118k74017K01545M39139O630n09327l65577K42909O04095
44533F503610N98467O46719P74376N33417r0467m02389Q7488R53927J392048J148202
44523A2145398O01379J61440m5859k2539J71932L04244J16321l03393n84207o31506
44513A1913210p77069j134372j208439o39440k7507k69375j113978j250264j24847
44504E367919J164417J359778O99862K76090L16748J90162j65829o1979N64945
44495I712113P70437O5785p15705o78171k05230k44554q29096j201981j066078
44486E607520p92789n16308P1692Q89619J194712M94798p24538j488816j291436
$$ y = [4313044, 3697106, 4239951, 5253693, 5757699, 5732990, 5740005, 5935971, 6107267, 6241976, 6426281, 6456331, 6158213, 5884196, 6085741, 6524880, 6531510, 6022183, 5656606, 5899515, 6503610, 7102077, 7748796, 8523172, 9056589, 8966122, 8563733, 8651221, 9605148, 10997196, 12145398, 12746777, 12908217, 12862358, 12839819, 13011751, 13315995, 13432316, 13128923, 12544716, 11913210, 11136141, 10001769, 8793330, 8153890, 8126383, 7857008, 6743030, 5492766, 5367919, 6532336, 7892114, 8591976, 8868066, 9184814, 9374976, 9209147, 9147168, 9712113, 10482550, 10548335, 9832630, 9154459, 8949229, 8704675, 7875579, 6673598, 5607520, 4814731, 4298423, 4370115, 5259734, 6454446, 6949244, 6224706, 4735890, 3444454]
44477C444454m29823L34370L74897k18589n94887m8105R59352J180429K16145
44468E218243p97882o44219K78004M90125m51303j303015r39570K1575K10022
44459B081980l58683k85564R55984J946093J246280m41730j186203n13896J29732
44450C573993k89481r40374o22902L69782Q56826N42139J35200J00355K78953
44441D004491N01462O20298J58421j036982j956479j441825l1699N51806k8586
44432A340907k04104Q53061J686641Q48945o32880p40012M83636J222654P87020
44423E645868K58120K47788j705p91090j067685k60947N22589K88091j61367K98890
44413D978552J015230N98372n75630p31116N41086J592976J127258j43000q27371
$$ y = [3444454, 3014631, 3349001, 3723898, 3505309, 2910422, 2862317, 3821669, 5002098, 5218243, 4420361, 3776142, 4054146, 4544271, 4092968, 2789953, 1850383, 1871958, 2081980, 1723297, 1437733, 2393717, 4339810, 5586090, 5144360, 3958157, 3444261, 3573993, 3284512, 2344138, 1721236, 2091018, 2947844, 3489983, 3625183, 3725538, 4004491, 4505953, 5126251, 5284672, 4247690, 2291211, 849386, 817687, 1369493, 1340907, 1136803, 1989864, 3676505, 4525450, 3892570, 3152558, 3636194, 4858848, 5645868, 5903988, 6151776, 6150071, 5358981, 4291296, 4030349, 4552938, 4841029, 4679662, 4978552, 5993782, 6592154, 6016524, 5285408, 5826494, 7419470, 8546728, 8403728, 7576357]
44404G576357o93255m34768m68162p20555j036675j158484p68588n4039K82400
44395B524231M2772l9570N28133J049327O64776j98618m01480J52742L89979k77878
44385D434414j129241j237592o57294j30082j05469l92094m87248p7177N65223
44376G83440P17724P1626o99089p29092j27966L42132N70090J068156J599852
44367C596873J108981m65437j536368r64410K02623K89354m90376n57929M18751
44358A602062J116076Q14470M06794O26912P56841L2416q12509n94296M55319
44349D404085J083410Q58328M44028K28444j42560p60682j034928o05756J18574
44340D592943O62658J003564J072337N12913n58622j246462r77210l63465k63449
$$ y = [7576357, 6883102, 6448334, 5980172, 5259617, 4222942, 3064458, 2295870, 2241831, 2524231, 2567003, 2527433, 3055566, 4104893, 4769669, 4571051, 4169571, 4322313, 4712292, 4434414, 3305173, 2067581, 1410287, 1280205, 1174736, 782642, 295394, 218217, 783440, 1501164, 1572790, 873701, 144609, 16643, 358775, 928865, 1997021, 3596873, 4705854, 4240417, 2704049, 1739639, 1942262, 2231616, 1741240, 1183311, 1602062, 2718138, 3532608, 3939402, 4566314, 5323155, 5355571, 4543062, 3948766, 4404085, 5487495, 6345823, 6789851, 7018295, 6875735, 6115053, 5080125, 4474369, 4592943, 5255601, 6259165, 7331502, 7844415, 7285793, 6039331, 5062121, 4698656, 4435207]
44331D435207m74795k32068L47871L74115l00896p32885l27283K90802L12509
44322C692577j08786l33920k53803j53167j504L93807P88775P55884M07429K42667
44312E429959L57542M03078K71535K06568K33649J16376n9063Q4409M55533M49540
44302G949126p7364m67453k95230r4755m67338r69517o37493O01795J727343J786867
44292I055981P38567p86412j981276k112975r27198Q94367K094358K005079J148428
44283A0128919M47393J06728l32717r46561j005716M4830J490798J859240O90541
44274A2483455p39120r34358l4958N50319J85661k56301P6583P04330O84499J05685
44264A2825795j50818K23222O91914Q05801O09085J91163l82056o88260l22673
$$ y = [4435207, 3960412, 3728344, 4076215, 4450330, 4149434, 3416549, 3089266, 3380068, 3692577, 3583791, 3249871, 2996068, 2842901, 2841397, 3235204, 4023979, 4779863, 5187292, 5429959, 5787501, 6190579, 6462114, 6668682, 6902331, 7018707, 6959644, 7044053, 7499586, 7949126, 7871762, 7404309, 7109079, 7014324, 6546986, 5577469, 4939976, 5541771, 7269114, 9055981, 9794548, 9008136, 7026860, 4913885, 3986687, 4881054, 6975412, 8980491, 10128919, 10576312, 10683040, 10350323, 9403762, 8398046, 8442876, 9933674, 11792914, 12483455, 11744335, 10809977, 10775019, 11325338, 11510999, 11254698, 11331281, 12035611, 12720110, 12825795, 12674977, 12898199, 13590113, 14395914, 15004999, 15196162, 14814106, 14125846, 13803173]
44255A3803173K42862O0134p49730p81620P18409K479330K639551J103996m68958
44246A9047147q45499l97264J3919L53215J035173J855990K116353J671476J167270
44237B6017780J115348J285948J273788J188719J360916J702179J895424K015228
44229C7855330K355119K736536K690955K365097K449294L009902L302540L184951
44221E9949724L709492N464669P201532P321480O187436N603528O280633P297853
44213A09016347Q076702R267797J1221259J3083615J4243402J5438770J7424743
44206A97772635J9560768K0862859K1640979K2814424K4149632K4491735K3437643
44199C54730675K1466313J8496776J3653804O755014j012804q264099j4415751
$$ y = [13803173, 14046035, 14106169, 13356439, 12574819, 13293228, 15772558, 18412109, 19516105, 19047147, 18201648, 17804384, 17818303, 18171518, 19206691, 21062681, 23179034, 24850510, 26017780, 27133128, 28419076, 29692864, 30881583, 32242499, 33944678, 35840102, 37855330, 40210449, 42946985, 45637940, 48003037, 50452331, 53462233, 56764773, 59949724, 63659216, 69123885, 76325417, 83646897, 89834333, 95437861, 101718494, 109016347, 117093049, 126360846, 137582105, 150665720, 164909122, 180347892, 197772635, 217333403, 238196262, 259837241, 282651665, 306801297, 331293032, 354730675, 376196988, 394693764, 408347568, 415102582, 414089778, 405825679, 391409928]
44192C91409928j9210164k2157870k3090642k2718498k2028562k1387375k0586316
44185B40230501j9448534j8002830j6287536j4372019j2523409j1117096j0343183
44178A38135894j0015703r639350q775373p478876o235805n327443m537169l725352
44170H2400823l248469l292369l220666k373695j250950r59358j572689k071663
44162F4410964j973808j844338j875492j250463L45438J720908J727444R47336
44154F2207989O64885Q32229M14050o36761j226963r43522o45173r53942j368687
44145E8344105j330118j099655j011679q05097l73792l28360j008030j651147
44137E0736227j453592q74490q87831j370499j372033p98146o14806j231093j783689
$$ y = [391409928, 372199764, 350041894, 326951252, 304232754, 282204192, 260816817, 240230501, 220781967, 202779137, 186491601, 172119582, 159596173, 148479077, 138135894, 128120191, 118480841, 109705468, 102226592, 95990787, 90663344, 86126175, 82400823, 79152354, 75859985, 72639319, 70265624, 69014674, 68055316, 66482627, 64410964, 62437156, 60592818, 58717326, 57466863, 57812301, 59533209, 61260653, 62207989, 62872874, 63705103, 64119153, 63482392, 62255429, 61311907, 60666734, 59712792, 58344105, 57013987, 55914332, 54902653, 54097556, 53723764, 53395404, 52387374, 50736227, 49282635, 48408145, 47520314, 46149815, 44777782, 43979636, 43364830, 42133737, 40350048]
44128D0350048j439594n29120J17123K40973M5268l46842p30212o52754m0855
44119C7014035M50309L27018N3340K67828O62744N38919J53168M25653J354056
44110D1247070J863641J483813J092445J497583K244729K545500K590903L028082
44102E7593766L657070L630437K710722J429372R2207j486530l170801m260669
44094F0195574m391344m066767l910363l836601l410866k739245k465271k839439
44086C2535678l174713k533697r20718N24822P61489M4537n53617o78676r92283
44077B5012822j748546k010865j019970L65815O58788j73649p65110m45033q8660
44068A9785592n81088j504969j931717j703220j258472p90442k76092M9459j05741
$$ y = [40350048, 38910454, 38381334, 38498457, 38739430, 38784698, 38437856, 37707644, 37054890, 37014035, 37464344, 37791362, 37844702, 38112530, 38775274, 39314193, 39467361, 39893014, 41247070, 43110711, 44594524, 45686969, 47184552, 49429281, 51974781, 54565684, 57593766, 61250836, 64881273, 67591995, 69021367, 69113574, 67627044, 64456243, 60195574, 55804230, 51737463, 47827100, 43990499, 40579633, 37840388, 35375117, 32535678, 29360965, 26827268, 25906550, 26431372, 27192861, 27237398, 26683781, 26005105, 25012822, 23264276, 21253411, 20233441, 20599256, 21258044, 21084395, 20319285, 19874252, 19785592, 19204504, 17699535, 15767818, 14064598, 12806126, 12015684, 11739592, 11789051, 11683310]
44059A1683310o20485j120000j354093j107867j74503J126357J842468J406933
44051A1682120M60211L8938J84864M4342p52680j530020j506817p50965L5930
44042G905923L35745J93758m3818k01877m33647q20228r26085j93348J080020
44033F896443J706871R83901l38283r81918o52629j5670M49990P54837P66264
44024I569806K13953n88357q47351l38233K97136M66786K20238j90922o27070
44015H175986p57305k26560N83282P60502K05118j06081K87398M58283l14063
44006I066560r86610j05607J764870K467430J161637n48523q29132J52928Q95193
43997A3038746O43987k8683l20908q8439L06727N22993N24974N16935N80234M46779
$$ y = [11683310, 11062825, 9942825, 8588732, 7480865, 7306362, 8432719, 10275187, 11682120, 12142331, 12181269, 12366133, 12410475, 11657795, 10127775, 8620958, 7869993, 7905923, 8241668, 8435426, 8391608, 8189731, 7756084, 6935856, 6009771, 5816423, 6896443, 8603314, 9587215, 9248932, 8267014, 7614385, 7598715, 8048705, 8803542, 9569806, 9783759, 9195402, 8348051, 8009818, 8306954, 8773740, 8993978, 8803056, 8175986, 7418681, 7192121, 7775403, 8535905, 8741023, 8634942, 8922340, 9380623, 9066560, 8079950, 7974343, 9739213, 12206643, 13368280, 12819757, 11990625, 12143553, 13038746, 13682733, 13654050, 13333142, 13244703, 13551430, 14074423, 14599397, 15116332, 15696566, 16143345]
43987A6143345o6208m69283l7943J017933J528303R15922Q8837J43920P94043
43978B0058869R72911N75549N01691J080263J584980J508258J272430J274883
43970B8829834J168427O78906L59947Q34683J868673K853826L648937M230013
43962D4473246M100457K987707J711135J299568J449022R54937l47044j230092
43954E5398936r03609r3546J80618o3250l36762p66552j721453k832870l288411
43945D5573101k932468k352143j960162j656833j405024j497038k053953k714972
43937B9000508l062209l042326k752009k103757j068001j24777Q422o74646j164745
43928A5016460n97472M24652M07654r42364k052534j528821r7435N11132N5132
$$ y = [16143345, 16077137, 15607854, 15569911, 16587844, 18116147, 19032069, 19120906, 19264826, 20058869, 21031780, 21607329, 22109020, 23189283, 24774263, 26282521, 27554951, 28829834, 29998261, 30677167, 31037114, 31871797, 33740470, 36594296, 40243233, 44473246, 48573703, 51561410, 53272545, 54572113, 56021135, 56976072, 56629028, 55398936, 54495327, 54401781, 54582399, 54519149, 54182387, 53415835, 51694382, 48861512, 45573101, 42640633, 40288490, 38328328, 36671495, 35266471, 33769433, 31715480, 29000508, 25938299, 22895973, 20143964, 18040207, 16972206, 16847429, 16855851, 16181205, 15016460, 14418988, 14843640, 15251294, 14308930, 12256396, 10727575, 10630140, 11141272, 11196404]
43919A1196404k08232J90039K33683o62518j576216j643083j353780j328028j010030
43910C838239J73821J329786J215898K24693j84189L63256R41604R73206O97664
43901I573978J61531q22768j678376j424777k41499O00839N92692M89950P03928
43892G955498N87543j48944o45117k63926L73741N23150M43133N30676L36590
43883I692344m99753j150559o33162N46250R14271k2460j258136j581744o92367
43874E314684P99332J892642J934044J296098R77638J160112Q22805o00806j979674
43865A1616875j877587n72309M85393Q08011J143160J757900J864848J044564
43857A6270855O2447k34656L6730L51594O61046J194015J883811K460768K792693
$$ y = [11196404, 10988172, 11178211, 11411894, 10749376, 9173160, 7530077, 6176297, 4848269, 3838239, 4012060, 5341846, 6557744, 6782437, 6598248, 6961504, 7903108, 8876314, 9573978, 9735509, 8912741, 7234365, 5809588, 5568089, 6168928, 6761620, 7251570, 7955498, 8543041, 8394097, 7748980, 7485054, 7858795, 8381945, 8825078, 9355754, 9692344, 9192591, 8042032, 7408870, 7955120, 8869391, 8846931, 7588795, 6007051, 5314684, 6114016, 8006658, 9940702, 11236800, 12214438, 13374550, 14197355, 13596549, 11616875, 9739288, 9166979, 9652372, 10460383, 11603543, 13361443, 15226291, 16270855, 16333302, 16098646, 16135376, 16486970, 17148016, 18342031, 20225842, 22686610, 25479303]
43848B5479303K854385K686388K568816K873066L572453M230294M558610M626319
43840E3449634M494296M082988L415663K525436J193013n97052k028307k185407
43832F4350264j552925j716791l077860l922468k676524k64057J008654N18287
43824E2666580p8977O16783J931663K439973K114109K122480K836721L087850
43816F7737182J663456j107518l710136n036373n145584m630443l870887l108013
43808D2791684k720400k924601l378037l501831l144166k603402k102793j645026
43800B0771428j325770j301346j372748j089533m52776o6993l24229q40385j044739
43791A2952909r63944r73139j050203q44758l99838k31845n86213j070757j201721
$$ y = [25479303, 28333688, 31020076, 33588892, 36461958, 40034411, 44264705, 48823315, 53449634, 57943930, 62026918, 65442581, 67968017, 69161030, 68563978, 66535671, 64350264, 62797339, 61080548, 58002688, 54080220, 51403696, 51139639, 52148293, 52666580, 52587603, 53204386, 55136049, 57576022, 59690131, 61812611, 64649332, 67737182, 69400638, 68293120, 64582984, 59546611, 54401027, 49770584, 45899697, 42791684, 40071284, 37146683, 33768646, 30266815, 27122649, 24519247, 22416454, 20771428, 19445658, 18144312, 16771564, 15682031, 15229255, 15162262, 14838033, 13997648, 12952909, 11988965, 11015826, 9965623, 9120865, 8721027, 8489182, 7902969, 6832212, 5630491]
43782E630491r24747l92225L57245J137399J385818P39761k93729q05754o34001
43773F200258m69970p04610q38431m08883J42335J63212j36836j03327K18927
43764D062675K96817K63911P28730J371427J026826l78643j249936n24120O60540
43755F258227O41460l02829n74699K03897Q40961O10928R0389k26247o94214j433764
43745E414109j749623j284968o88975m35135J5216J022947J680703J014641l68516
43736D620399j022342o75236l07700l68145j77349O46353J301592R64732O9000
43727E051304l54177k09494l80133j235100j841391j116359N83935J650467J103220
43718C252272k09192o76305J21861J097919J219550P34046N87881J134750J843631
$$ y = [5630491, 4705744, 4313519, 4670764, 5808163, 7193981, 7933742, 7640013, 6834259, 6200258, 5730288, 5025678, 4187247, 3778364, 3920699, 4083911, 3947075, 3843748, 4062675, 4359492, 4623403, 5352133, 6723560, 7750386, 7371743, 6121807, 5597687, 6258227, 6899687, 6596858, 6022159, 6226056, 7067017, 7677945, 7768334, 7542087, 6847873, 5414109, 3664486, 2379518, 1690543, 1255408, 1270624, 2293571, 3974274, 4988915, 4620399, 3598057, 2922821, 2615121, 2246976, 2069627, 2715980, 4017572, 4982304, 5051304, 4697127, 4487633, 4107500, 2872400, 1031009, -85350, 498585, 2149052, 3252272, 3043080, 2366775, 2488636, 3586555, 4806105, 5540151, 6128032, 7262782, 9106413]
43709I106413K029292J495713N88068j13412k51010m2019o2794n55623j145355
43700A1049273j375688j247939j013885p37242l95457j95389l93355q80279j255264
43691C554775j258067q94584k57249M83142R99045J053136Q11812O19407M67492
43682E578909K3825p28216j224943r50219j30311N12583O43433O02975P22738
43673E050774P48734L14711k84121l84665J3333K11456J641R4813Q40558J290042
43663G897276M41733j081706j691152r47664R4265O00675Q03235R66016P86272
43654G868950L04979K40839P39053Q61584J63565k39081P23631K210969K517849
43645A5392338J510467O79204R35709J648537J975936J985091K075784K218529
$$ y = [9106413, 11135705, 12631418, 13219486, 13106074, 12855064, 12813045, 12750251, 12194628, 11049273, 9673585, 8425646, 7411761, 6674519, 6279062, 6083673, 5690318, 4810039, 3554775, 2296708, 1402124, 1144875, 1628017, 2627062, 3680198, 4492010, 5111417, 5578909, 5602734, 4874518, 3649575, 2699356, 2569045, 3081628, 3725061, 4328036, 5050774, 5799508, 6114219, 5830098, 5445433, 5458766, 5670222, 5671863, 5766676, 6607234, 7897276, 8339009, 7257303, 5566151, 4618487, 4712752, 5313427, 6116662, 7082678, 7868950, 8173929, 8414768, 9153821, 10015405, 10178970, 9939889, 10663520, 12874489, 15392338, 16902805, 17582009, 18517718, 20166255, 22142191, 24127282, 26203066, 28421595]
43637B8421595K283972K491224K973285L232514K503468O30982j582959k948986
43629C8005095k929411k201159j971894k602276l249383l098902k451211k106979
43621A7393880k128775j902569j183540l81862R7544J96193m0353m84010p67630
43612A0798878o31082l60134m11952p35816r54474j030678j177745j262137r15601
43603C319259j71131N60579J053187J306017J218983P76104L23204R3661k19622
43594H260241p72604r15577j44340P06362L92280q02254j316311n31450N21654
43585E398001Q63635P19021O12616N17158M19836O56866J090940R41446O9007
43576A1288526n00678l9783P39531P62447O9831n56254p91493p96945n93321j95197
$$ y = [28421595, 30705567, 33196791, 36170076, 39402590, 41906058, 42537040, 40954081, 38005095, 35075684, 32874525, 30902631, 28300355, 25050972, 21952070, 19500859, 17393880, 15265105, 13362536, 12178996, 11797134, 11894678, 12090871, 12050518, 11566508, 10798878, 10167796, 9807662, 9395710, 8659894, 7705420, 6674742, 5496997, 4234860, 3319259, 3148128, 3708707, 4761894, 6067911, 7286894, 8062998, 8386202, 8479863, 8260241, 7487637, 6572060, 6427720, 7134082, 7526362, 6724108, 5407797, 4876347, 5398001, 6261636, 6980657, 7593273, 8110431, 8530267, 9187133, 10278073, 11219519, 11288526, 10787848, 10748065, 11487596, 12250043, 12319874, 11763620, 10972127, 10175182, 9581861, 9386664]
43566I386664N0691m2499n5792L66922Q07881O61064O6802l38133k81686O5770
43556A0687684N24566Q86906Q15259L02650o6690J75194O74737P04124P5735p27993
43546A4052172j061432n30075O80178J661627J498484L96346m51289l50518K19666
43537A6115159O51675J037209J527092J796567J732204J756806J862193J333955
43529B7812860K11576r4841J259289K986579L340640K551297K146287K455047
43521D2668734K383207J420270L66773K3493L49613R39485J325496R34048k51605
43512E0159514j197708j032867m48776p08062j578209j660958o41038K86163L15540
43503D3493599o0177k38119k55766j04976M19387R23400P24202J83378L91041
$$ y = [9386664, 9437355, 9394856, 9339064, 9705986, 10513867, 11174931, 11241733, 10903600, 10621914, 10687684, 11212250, 12099156, 12914415, 13217065, 13150375, 13325569, 14000306, 14704430, 14780165, 14052172, 12990740, 12460665, 13140843, 14802470, 16300954, 16697300, 16246011, 15895493, 16115159, 16766834, 17804043, 19331135, 21127702, 22859906, 24616712, 26478905, 27812860, 28024436, 27929595, 29188884, 32175463, 35516103, 38067400, 40213687, 42668734, 45051941, 46472211, 46838984, 46862477, 47212090, 48151575, 49477071, 50411119, 50159514, 48961806, 47928939, 47480163, 46772101, 45193892, 43532934, 42891896, 43178059, 43493599, 43433422, 43195303, 42939537, 42834561, 43253948, 44177348, 44901550, 45084928, 45475969]
43494D5475969J253638J378981L31928n04022j3170J100118J671754J712596J769663
43485E4177455J829897J866271K435433L672849M587684M411396L870860M115392
43477H0967237N109996O076830O799974P452824P814593P772439Q038541R250803
43469A39283237J0817445J1719445J2007864J2384539J2695133J2088383J0524542
43462B21520588Q945048P884517O894627N453260L617478J659604k63750k020726
43454B53690646l645266n495218p717452r740048j0908880j1380274j1680074
43447A93123434j1685009j0962189r949924r721706j0423963j0905767j0242442
43440A19232434q866676p783349p264592o793327n943135m905727m247543m287968
$$ y = [45475969, 46729607, 48108588, 48440516, 47936494, 47923324, 49023442, 50695196, 52407792, 54177455, 56007352, 57873623, 60309056, 63981905, 68569589, 72980985, 76851845, 80967237, 86077233, 92154063, 98954037, 106406861, 114221454, 121993893, 130032434, 139283237, 150100682, 161820127, 173827991, 186212530, 198907663, 210996046, 221520588, 230465636, 238350153, 245244780, 250698040, 254315518, 255975122, 255711372, 253690646, 250045380, 244550162, 236832710, 227092662, 216183782, 204803508, 193123434, 181438425, 170476236, 160526312, 150804606, 140380643, 129474876, 119232434, 110365758, 102582409, 95317817, 88524490, 82581355, 77675628, 73428085, 69140117]
43432F9140117m667937m647313l979358l212390k830802k513654j813405j182374
43424D4292884j447222k366174k689518j904693j061203j338960k396917k813640
43416B8274557j919528n61458K7686l28359p58982o44879m30633q59663j756939
43407B1041802k189185j754424r67588k42685O14716J484087J469104J99203j168274
43398A8486756j331686p26107q04789j709998k026792r99824K80387M09300n67718
43389A1009529j525905j703601j168915l34893L94272P33117P11626O68190Q27690
43380I611110R93521P66007j3075r85855j367115o01425P83849J372356M29724
43371A0989097j054053j542995q47178j1407L85073O89708R66884O33729k75936
$$ y = [69140117, 64472180, 59824867, 55845509, 52633119, 49802317, 47288663, 45475258, 44292884, 42845662, 40479488, 37789970, 35885277, 34824074, 33485114, 31088197, 28274557, 26355029, 25793571, 25821257, 25492898, 24733916, 24089037, 23658404, 22798741, 21041802, 18852617, 17098193, 16130605, 15887920, 16502636, 17986723, 19455827, 19655030, 18486756, 17155070, 16428963, 15624174, 13914176, 11887384, 10887560, 11167947, 11577247, 11009529, 9483624, 7780023, 6611108, 6276215, 6670487, 7403604, 8115230, 8783420, 9611110, 10604631, 11370638, 11357563, 10371708, 9004593, 8403168, 9187017, 10559373, 10989097, 9935044, 8392049, 7544871, 7533464, 7918537, 8608245, 9575129, 10208858, 9932922]
43362I932922o56684J12290J031485P72193m86114j378531j155844l51762J85903
43353H005858K18293M5476J6529K12274L84249K38809j05869j65908K26786N79794
43343I656291L58036l09213q68028j076092j121354j126332r44785m98961N765
43334D075327L72984P29665J282780J769516J487563J79552j296099j673979p19225
43325F208084N21084J016541P42801K03871k76651l79410K54386J201818J197137
43316A0689661j95051j583073j522140n78822k77392o25343m00722M45554O50218
43307F602890k1497l02771K69635N33020r3859m84892P9981M60970l45539j317965
43297E379973j070887j18004J84245j00420n669M07288M11320K55904O50014J082376
$$ y = [9932922, 9276238, 9388528, 10420013, 11192206, 10706092, 9327561, 8171717, 7819955, 8005858, 8224151, 8269627, 8286156, 8498430, 8882679, 9121488, 9015619, 8849711, 9076497, 9656291, 10014327, 9705114, 8837086, 7760994, 6639640, 5513308, 4568523, 4069562, 4075327, 4448311, 5177976, 6460756, 8230272, 9717835, 9897387, 8601288, 6927309, 6208084, 6729168, 7745709, 8488510, 8692381, 8415730, 8036320, 8290706, 9492524, 10689661, 10494610, 8911537, 7389397, 6810575, 6533183, 5907840, 5507118, 5952672, 6602890, 6581393, 6278622, 6548257, 7081277, 6987418, 6502526, 6582507, 7043477, 6697938, 5379973, 4309086, 4191082, 4375327, 4274907, 4269238, 4676526, 5087846, 5343750, 5993764, 7076140]
43287G076140N12218n36384m90829O44471J097037J31393p50838j76489J010622
43278H517341J093727l5611q51983k68776J113044J847293J320239L95617L15243
43269A3446134J105914J615215J258495Q83942J347344K132354K332025K206942
43261B6328365K540792L062762K928089K357848K276160K542538K162491J242413
43253D5441458J061402J943480K646668K302378J506811J003581P19803O84688
43245E7310269J443350K758005L212086K045289L06676o86259j019621j478323
43237F3891472k204221k985128l935135m919032n150892m322654l347410l090904
43229C3936096l200906l074064k981220l144607k752272j302755m0500l91731
$$ y = [7076140, 7588358, 7051974, 6561145, 7205616, 8302653, 8434046, 7683208, 7506719, 8517341, 9611068, 9575457, 8723474, 8454698, 9567742, 11415035, 12735274, 13130891, 13446134, 14552048, 16167263, 17425758, 18309700, 19657044, 21789398, 24121423, 26328365, 28869157, 31931919, 34860008, 37217856, 39494016, 42036554, 44199045, 45441458, 46502860, 48446340, 51093008, 53395386, 54902197, 55905778, 56625581, 57310269, 58753619, 61511624, 64723710, 66768999, 67075675, 66389416, 65369795, 63891472, 61687251, 58702123, 54766988, 49847956, 44697064, 40374410, 37027000, 33936096, 30735190, 27661126, 24679906, 21535299, 18783027, 17480272, 17439772, 17048041]
43221A7048041j584790j629100l48907M59515m8461o03089j12071N85128K07199
43212A3973465r75504j745868j718483j415296j054135l46207N91562J016395
43204H325929M71212o11950j452222j716122j542996j072461l49115L66029O41244
43195C059548M14734J28245N5877r8348n12871o32497K4800Q01396O43255k20122
43185C664017n10940O4583L24580m03650j122268p73461J43366N51046M06176
43176B343449K43384q314n34475p06322L5661R43196R33174K99876Q3044K06310
43166C838983j90280q68861o73656M02665J037985P17392M16507O95366O80559
43157F056660l20659j523306j842502j322747o03738R1478O48250O16121p2515
$$ y = [17048041, 15463251, 13834151, 13485244, 13944759, 13896298, 13293209, 13181138, 13766266, 13973465, 12997961, 11252093, 9533610, 8118314, 7064179, 6717972, 7309534, 8325929, 8797141, 8185191, 6732969, 5016847, 3473851, 2401390, 2052275, 2418304, 3059548, 3474282, 3602527, 3658404, 3560056, 3047185, 2414688, 2439488, 3240884, 3884139, 3664017, 3153077, 3217660, 3542240, 3138590, 2016322, 1242861, 1386227, 1937273, 2343449, 2586833, 2578519, 2044044, 1337722, 1373383, 2316579, 3249753, 3549629, 3632673, 3838983, 3648703, 2779842, 2106186, 2508851, 3546836, 4264228, 4680735, 5376101, 6056660, 5736001, 4212695, 2370193, 1047446, 443708, 535186, 1183436, 1799557, 1727042]
43148A727042o16222l43178L75273Q30962R53952R29819N13831m64747j379511
43139B527221j374106m22926O99250J257137J026738L12711k10958j20804J11076
43130C805339k95452j069815j042763J3759P96077L58738m82675n32186j5551
43121A535471J07420j74490j80344J07323K11760K55817O25741Q85311L35295
43112C709304n62945o73328j6430K55775k14837m93758n5599L83275K32237k1597
43102B542097J03375J53627k93792o65252l10752L23867L92460j2527j57081P9590
43092B155612J97621J18593L00150P98719J038055O87399J28557j76264k65754
43083D982688l81858n22766n90378o68088q32355q81242n59361J5241L86518K30573
$$ y = [1727042, 1110820, 767642, 1142915, 1973877, 2927829, 3857648, 4371479, 3906732, 2527221, 1153115, 730189, 1429439, 2686576, 3713314, 4026025, 3815067, 3694263, 3805339, 3509887, 2440072, 1397309, 1411068, 2207145, 2565883, 2083208, 1551022, 1535471, 1642891, 1468401, 1288057, 1395380, 1607140, 1862957, 2488698, 3374009, 3709304, 3146359, 2473031, 2456601, 2712376, 2497539, 2003781, 1948182, 2331457, 2563694, 2542097, 2645472, 2799099, 2505307, 1840055, 1529303, 1853170, 2245630, 2233103, 2076022, 2155612, 2353233, 2471826, 2771976, 3570695, 4608750, 5296149, 5424706, 5248442, 4982688, 4600830, 4078064, 3487686, 2819598, 1987243, 1106001, 546640, 561881, 948399, 1178972]
43073A178972l34896q79972r91032n37460K08916P15962O37243J90405n7774J25562
43063B55926L42392J21660l79369n23839l0365O36285Q18221L96017j76326m25639
43053A034963k96709r2852q0872j70794l6828L92587P18025N55610J26371L4586
43043B184087M65670R42708R50360N00257j1675k48143j70600o8476l10544p97099
43033C436545q48131j08486O75111N37953j79218k22725N56186Q27644q4782r98690
43023C591407p06967J49157K83025j16818R177N27007L67048m42234p49778l06251
43013B604773q7431l51833j29800Q07141J197556L96497l60250J0286N42448j31602
43003D497785j332547j309195m0567P71030L37752l18378k99618q0606k92954
$$ y = [1178972, 844076, -35896, -1026928, -1564388, -1355472, -639510, -2267, 188138, 130364, 255926, 598318, 719978, 340609, -183230, -213595, 422690, 1240911, 1636928, 1460602, 1034963, 738254, 645402, 564530, 393736, 356908, 749495, 1467520, 2023130, 2149501, 2184087, 2649757, 3592465, 4542825, 5043082, 5031407, 4783264, 4612664, 4544188, 4233644, 3436545, 2588414, 2479928, 3155039, 3692992, 3513774, 3291049, 3847235, 4674879, 4590097, 3591407, 2884440, 3033597, 3316622, 3199804, 3208981, 3735988, 4103036, 3660802, 2911024, 2604773, 2517342, 2165509, 2035709, 2842850, 4040406, 4436903, 4076653, 4086939, 4629387, 4497785, 3165238, 1856043, 1815476, 2586506, 2924258, 2605880, 2306262, 2225656, 1932702]
42994A932702n72504l79394k945N5904k287K41743N71229N23540K22253O3519
42984B653760r9736o29818j136741p60404M62903J358396J092236K19425k26809
42975B933212j36770j75344n89675r07212p39334k29743L32770P59425P59039
42966B006368J25460p08168r52163n61566l75776p71112r20585n6199J172004
42957a041737J491289P65394L13k14029k79100n73993p91005n33692R6593P24828
42947c55139R97047O40352j51967m67335L61557J505007J341572l10279j664505
42938A896310j197672M42251J430241J026103J19345j06570N49481J209390Q38815
42929F207694n20922j529470j098989N1721L71829j47555n7300Q68903R19191
$$ y = [1932702, 1360198, 980804, 977859, 1033763, 1031476, 1273219, 1844448, 2367988, 2590241, 2653760, 2554024, 1924206, 787465, 27061, 489964, 1848360, 2940596, 3160021, 2933212, 2796442, 2621098, 2031423, 1124211, 384877, 155134, 487904, 1247329, 2006368, 2131828, 1423660, 471497, -90069, -465845, -1236957, -2157542, -2213741, -1041737, 449552, 1214946, 1215259, 1001230, 722130, 148137, -642868, -1176560, -1079967, -355139, 641908, 1282260, 1130293, 662958, 1024515, 2529522, 3871094, 3560815, 1896310, 698638, 1140889, 2571130, 3597233, 3716578, 3610008, 4159489, 5368879, 6207694, 5686772, 4157302, 3058313, 3110034, 3481863, 3334308, 3277008, 4145911, 5065102]
42920E065102o59625j909869r30651J079046J589590N31530J2625P74506J383144
42911F935398J006679O31697R33293J013585J86061o89837p09172l57778l95005
42902H554921n28203k89661j48474o03507j087810r11713m76577m28779m32755
42893C647442k7120J01015q08610j833486j390719K24023J085654N40743Q0596
42884A619538P85469J582592J080549j90503p35065m30581m00793r23824r88641
42875A398741q2777Q83495R33391L02178k78203p47670j342892j656900j085655
42866a676292L8895P39369P57769O83064O99339L19183l45097k62784Q49990J641131
42856C444567R66989k39730l02750N65805N91204o96881j627468r07858M70024
$$ y = [5065102, 4405477, 2495608, 1564957, 2644003, 4233593, 4765123, 4777748, 5552254, 6935398, 7942077, 8573774, 9507067, 10520652, 10706713, 10016876, 9307704, 8949926, 8554921, 8026718, 7737057, 7588583, 6985076, 5897266, 4985553, 4508976, 4080197, 3647442, 3620322, 3721337, 2912727, 1079241, -311478, -87455, 998199, 1538942, 1619538, 2405007, 3987599, 5068148, 4877645, 4142580, 3711999, 3311206, 2387382, 1398741, 1315964, 2199459, 3132850, 3435028, 3156825, 2409155, 1066263, -590637, -1676292, -1637397, -898028, -140259, 542805, 1242144, 1561327, 1216230, 953446, 1803436, 3444567, 4411556, 4171826, 3869076, 4434881, 5026085, 4329204, 2701736, 1793878, 2263902]
42847B263902P40111k34142j101775r75765k47721L13163M60540M26375M49071
42838B093759M58343J44853n51435j112125r81412l63794Q1769K96551P87120
42829H53629J451312J418970M32885n80859q63140p77235p31013j97127J145294
42820B152716K190036J688713K30313m71679j1767L96989P977m98236m24726j26141
42810E134195j02954p5119L32565P47158O27616J80365J5080J77715R0957o43592
42800F483986j715700k318873j824019m73736O00843M68630m36711p49937P8536
42791A13019J066139J065064K60600k81516j86541j44610p15128j397575j230956
42782a451504n2311J195388J437909N61428n67625j031582o16243K57308R91998
$$ y = [2263902, 3004013, 2769871, 1668096, 692331, 444610, 757773, 1218313, 1644688, 2093759, 2552102, 2696955, 2145520, 1033395, 51983, -311811, -230042, 66509, 853629, 2304941, 3723911, 4156796, 3575937, 2712797, 1935562, 1204549, 1007422, 2152716, 4342752, 6031465, 6261778, 5790099, 5778332, 6175321, 6183298, 5685062, 5260336, 5134195, 5031241, 4956122, 5288687, 6035845, 6663461, 6843826, 6858906, 7036621, 7127578, 6483986, 4768286, 2449413, 625394, 151658, 752501, 1221131, 784420, 34483, 113019, 1179158, 2244222, 2504822, 2223306, 2036765, 1892155, 1177027, -220548, -1451504, -1503815, -308427, 1129482, 1690910, 1123285, 91703, -524540, -267232, 724766]
42773G24766J121839N44120k97129p18080n09897r0703J93910M57405O90116M21512
42763B537859m52565j062905n97353M48520R46132P60153O69092Q30095N35608
42754D614636l56947r59144p50610m10116o63043j147523j076663l72841M39696
42745f82555R04446P31173j35834j082618j160882l64460J98024l4113j69427
42736a796246N62987J306585Q30449m49316j090733p95814m75603m02902P7215
42727b233378R07889J039416K56920k05739L83043J014732O19091j70942j46396
42718A464636M68072N37599P312j40377K47339J86518o48171j207232p30579J6953
42708B02070k064m85478m21679K40144O16117L36157l6105j9761K22634M51778
$$ y = [724766, 1846605, 2390725, 2093596, 1375516, 865619, 774916, 968826, 1426231, 2116347, 2537859, 2085294, 1022389, 425036, 873556, 1819688, 2579841, 3248933, 4079028, 4614636, 4257689, 3298545, 2547935, 2137819, 1474776, 327253, -749410, -1122251, -682555, 221891, 953064, 817230, -265388, -1426270, -1790730, -1592706, -1626819, -1796246, -1233259, 73326, 903775, 454459, -636274, -1432088, -1907691, -2310593, -2233378, -1325489, -286073, -29153, -234892, 148151, 1162883, 1781974, 1611032, 1464636, 1932708, 2470307, 2477619, 2337242, 2584581, 2771099, 2122928, 915696, 185117, 202070, 200006, -285472, -707151, -467007, 149110, 485267, 449162, 429401, 652035, 1103813]
42698A103813P07142R16133Q31834N42040L83709K22634l94029j180241j178807
42689A954228l00849K55567j84592o06980L6216R72602P80753k66211o09335J71533
42679B202932R49886R90647O93101L10190m03403r58922k94908J208288J566665
42670F264476m5444j911277k214673j386924p49226k77092O29778J341368Q85918
42661B536904j26172l72370o1384l79458j092080p87644N36837J235433O51200
42652B141266O322J21286J67502m56973p74812O0396J109887J046103J87450j70532
42642C437895K69094P21562P17049M73167J55233l27199r21053j420733j653458
42633A451557j348401l20011Q75990J187856M68318j47817J31978O16163L77876
$$ y = [1103813, 1810955, 2727088, 3558922, 4100962, 4484671, 4707305, 4313276, 3133035, 1954228, 1653379, 1908946, 1724354, 1117374, 1153590, 2126192, 2906945, 2640734, 2031399, 2202932, 3152818, 4143465, 4836566, 5146756, 4743353, 3784431, 3489523, 4697811, 6264476, 6219032, 4307755, 2093082, 706158, -43068, -320160, 309618, 1650986, 2536904, 2410732, 2038362, 1976978, 1597520, 505440, -282204, 254633, 1490066, 2141266, 2147588, 2268874, 2436376, 1979403, 1204591, 1264987, 2374874, 3420977, 3608427, 3437895, 3706989, 4428551, 5145600, 5618767, 5774000, 5446801, 4525748, 3105015, 1451557, 103156, -216855, 659135, 1846991, 2315309, 2167492, 2299470, 2915633, 3293509]
42624C293509k51889m31791k40253k13894j77373J85759K47094n93199j345840
42615D72123n59284J197539J814810P35060l00483o4233M78482K00054k31877
42606C742191J84614P35697J37786j079982j167461J21525J077005M99410p65499
42597C485286j210195n27151M59163R34566O18144k69681j044971r95574j98565
42588A251022M66456M17226j788l07969o25749j040615q83059L52484J760885
42579A388893J897229Q57221K07335N43939N04236r68119k606502k437131o73640
42570a286539N95113L73989k04320o093N26309N76557L85427M94273N62388P2137
42560B089241m79121k69933L95579M91889r4525m59467j73791J78303R2197j68791
$$ y = [3293509, 3041620, 2609829, 2369576, 2155682, 1978309, 2164068, 2411162, 1817963, 472123, -87161, 1110378, 2925188, 3660248, 3359765, 3295532, 3774014, 3974068, 3742191, 3926805, 4662502, 4800288, 3720306, 2552845, 2674370, 3751375, 4250785, 3485286, 2275091, 1747940, 2207103, 3141669, 3759813, 3490132, 2445161, 1449587, 1251022, 1717478, 2134704, 2132916, 1824947, 1199198, 158583, -724476, -371992, 1388893, 3286122, 4143343, 4350678, 4894617, 5398853, 4430734, 1824232, -612899, -1286539, -691426, -317437, -521757, -527850, -1541, 575016, 960443, 1454716, 2017104, 2089241, 1610120, 1340187, 1735766, 2227655, 2133130, 1673663, 1499872, 1678175, 1770372, 1601581]
42550A601581k30235j48116q783L01709O38717N82994K07758K15965R04687J542541
42540E608818J229958k6023j452906k321004k284151j370223p2489Q60655J100211
42531A272846R66020P98914N39576J90379J27502M71577O41950J52397n26922
42522D634239n92931j32873M4397k88730m58901m9719L38842o6767j030531j493986
42512I03040q76271K06059O75273K62768k42365p6822M99907O71132L24821K05430
42502B552972O78080J018180L87664r49034j927424j911735j143173k43240K30637
42493a307073J3379n19936m72593N08147J515874J419807M13142k82071j44075
42484A144601J69807J47114J56551M66747N22086j04802p72970o03766K16335
$$ y = [1601581, 1371346, 1223230, 1214447, 1516156, 2154873, 2737867, 2945625, 3161590, 4066277, 5608818, 6838776, 6812753, 5359847, 3038843, 754692, -615531, -688020, 172635, 1272846, 2238866, 3037780, 3577356, 3767735, 3895237, 4366814, 5008764, 5161161, 4634239, 4041308, 3908435, 3952832, 3664102, 3205201, 3155482, 3494324, 3427557, 2397026, 903040, 26769, 232828, 908101, 1170869, 928504, 851682, 1351589, 2022721, 2347542, 2552972, 3231052, 4249232, 4636896, 3687862, 1760438, -151297, -1294470, -1537710, -1307073, -1293694, -1813630, -2286223, -1778076, -262202, 1157605, 1570747, 1288676, 1144601, 1314408, 1461522, 1618073, 2084820, 2606906, 2502104, 1729134, 1125368, 1341703]
42475A341703P52319O29521K66727l769k83231n91274o79249m72830j91179P3041
42465H41779M42044Q35741R18617O08759K35636J4568k53055p14297j045169q52603
42455A032020l01065N1130J2162j1003L15311O29910K78879o85896j308090p93536
42445g80178M68670J343162J288904P86135M40126K74286J29744J24917K46566
42436D322332K5197p30637j282360q35158J74942N65847J40037n3285N81554J209337
42426D117806Q65712m5415l85081L5078K94870k06663r58540j141745o54606m6701
42416A874715K21725J40601p3719k72233l90867l25331L2659N72975R24777Q13107
42406C518409L70786j10196n95477j119685j312993p11926L62607R00457M90961
$$ y = [1341703, 2094022, 2723543, 2990270, 2986501, 2703270, 2111996, 1432747, 959917, 768738, 841779, 1283823, 2119564, 3038181, 3646940, 3882576, 3897144, 3644089, 2929792, 1884623, 1032020, 730955, 782085, 794247, 783244, 1098555, 1728465, 2007344, 1321448, 13358, -780178, -311508, 1031654, 2320558, 3106693, 3546819, 3821105, 3950849, 4075766, 4322332, 4347529, 3616892, 2334532, 1499374, 1674316, 2240163, 2380200, 2326915, 2908469, 4117806, 4983518, 4938103, 4553022, 4588100, 4882970, 4676307, 3717767, 2576022, 1921416, 1874715, 2096440, 2237041, 2163322, 1891089, 1500222, 1174891, 1207550, 1780525, 2705302, 3518409, 3889195, 3778999, 3183522, 2063837, 750844, 38918, 401525, 1301982, 1792943]
42397A792943j09310j49301K8490k31694o05466k61141O58665J116185P42467
42388B981838K52188R0443k36245r71638j272764m21474Q19691J066609J93153
42379B501801n98778m84411Q9573L12367M4098l17515m18512q4770O65248J404949
42369C114050J452252O11988m47194q80465n83104j36764J8001L939J07547K95834
42359C556084L13563J07345p0081j2592J32062O3441k02606l04082q2143J13631
42349C614622k2964j32621L13832R14092N00510j164041k532209j947660J48169
42340c08270J673984J573736R25683R81893J219707L65771j316960k111909j191433
42331A812202L12725R37662O39492L41238M43679N38675K70341j75823l64966
$$ y = [1792943, 1683633, 1534332, 1562822, 1331128, 725662, 464521, 1123186, 2239371, 2981838, 3234026, 3324469, 3088224, 2116586, 843822, 422348, 1242039, 2308648, 2501801, 1903023, 1418612, 1508185, 1820552, 1864650, 1547135, 1128623, 1043853, 1709101, 3114050, 4566302, 5178290, 4731096, 3850631, 3267527, 3130763, 3148764, 3152703, 3260250, 3556084, 3869647, 3976992, 3906911, 3894319, 4026381, 4089822, 3887216, 3583134, 3500991, 3614622, 3591658, 3459037, 3772869, 4686961, 5187471, 4023430, 1491221, -456439, -308270, 1365714, 2939450, 3865133, 4847026, 6066733, 6432504, 5115544, 3003635, 1812202, 2124927, 3062589, 3702081, 4043319, 4486998, 5025673, 5296014, 5120191, 4755225]
42322D755225k7198O72660J050364M20407r84511j998811j827090r52132k91507
42313H17407K0253L21185M22632o5544o70187m65681M07223P60396J43993m93772
42303A197905l81113p2504l13118p11227n08657K6660P6920k82159k46509K80433
42293i33369N37788K67321J50012N32925O64328j41687j204109j178608J10833
42284a194566J305453J186454J90715k28855M29284J031133L84287j022790j571087
42275E10028o60146N44563P49971J06009m07834m78991n14489n96914l45126K17291
42265h75638M89829J73666k88345l41752R2009P81101J432809J621458R89180
42256D074317j95625j076373j106685o24439k74214j32497K59154J095927J838333
$$ y = [4755225, 4728027, 5400687, 6451051, 6871458, 5886947, 3888136, 2061046, 1108914, 817407, 837660, 1158845, 1581477, 1515933, 845746, 380065, 787288, 1547684, 1691677, 1197905, 816792, 744288, 431170, -280057, -788714, -762054, -685134, -967293, -1213802, -933369, -395581, -128260, 21752, 554677, 1219005, 1077318, -126791, -1305399, -1194566, 110887, 1297341, 1488056, 1259201, 1688485, 2719618, 3103905, 2081115, 510028, -150118, 394445, 1144416, 1250425, 842591, 363600, -150889, -747803, -1092929, -875638, -385809, -212143, -500488, -842240, -750231, 30870, 1463679, 3085137, 4074317, 3878692, 2802319, 1695634, 1071195, 796981, 664484, 923638, 2019565, 3857898]
42247C857898J665198M17160r80285j290987l22345P70674Q24850J0670o11185
42238D341648n76738l77019m35503n28827l99630k35346k11886j41653N5429M3332
42228A533807l41927o22811k70584N28884J114995J114732O13805j44563q15894
42219B710444r56667m52282J68379K65536j23420l86094j56887L36582P23466
42210B129057Q95089Q85190O92252M00637K47076L43512M33771J30936n94156
42201E563364j303905j529925j215296o45909p8048L75045N97077N43747M72922
42192B779072O96762R86665P07847j74167p47531l20956M97858N58845k81902
42183D702493j110411j289058j050655p82057n11984k43655j03657M425K93293
$$ y = [3857898, 5523096, 5940256, 4959971, 3668984, 3346639, 4117313, 4942163, 4952833, 4341648, 3764910, 3387891, 2952388, 2423561, 2023931, 1788585, 1576699, 1435046, 1490475, 1533807, 1191880, 569069, 298485, 827369, 1942364, 3057096, 3670901, 3526338, 2710444, 1753777, 1301495, 1469874, 1735410, 1611990, 1225896, 1069009, 1405591, 2129057, 3024146, 3909336, 4601588, 5002225, 5249301, 5592813, 6026584, 6157520, 5563364, 4259459, 2729534, 1514238, 868329, 790281, 1165326, 1762403, 2306150, 2779072, 3475834, 4462499, 5170346, 4996179, 4248648, 3927692, 4425550, 4984395, 4702493, 3592082, 2303024, 1252369, 470312, -41672, -285327, -388984, -384559, -91266]
42174i1266N58641L98279N738m522L57684M27615L5386k51759k60028n12885r86978
42163c24095p15538O25848J751285J355748o0270r42095o99977j7213M23246N42947
42153A939886M07369j4608o48055j293331j624126j086554N27889K173319K247913
42144B629702P65093l44876M0584N27576m52736j858397j500161M92726J818157
42135B117668J368580L68032K2478J6712j82048k79219j04190j74899o15883p23096
42125A814135k11252K38894K14827K25600O04476Q87266P96534P07089O54796
42116E932365J26694o43124n70042L84283O80025m79450j706059j482017l68839
42107A873836J72917J1007j04160k12062p17658j033658l35323Q11099J160517
$$ y = [-91266, 467375, 865654, 871392, 866870, 1224554, 1652169, 1687555, 1435796, 1175768, 662883, -324095, -1039633, -413785, 1337500, 2693248, 2632978, 1690883, 990906, 973693, 1396939, 1939886, 2347255, 2332647, 1684592, 391261, -1232865, -2319419, -1791530, 381789, 2629702, 3394795, 3049919, 3090503, 3618079, 3165343, 1306946, -193215, 299511, 2117668, 3486248, 3854280, 3876758, 3893470, 3711422, 3432203, 3328013, 3153114, 2537231, 1814135, 1602883, 1841777, 2056604, 2282204, 2886680, 3773946, 4570480, 5277569, 5932365, 6059059, 5415935, 4845893, 5230176, 5910201, 5430751, 3724692, 2242675, 1873836, 2046753, 2057760, 1953600, 1741538, 1023880, -9778, -345101, 465998, 1626515]
42098A626515P31309M82482M42925j28575r29716q01533J59447M68755l69167
42089A682442j017365m70639M44302N87478K45520L19606P41714Q04238M42834
42080C780130J66925Q4089j16968m04456l70218Q1074N46684O52079M37447K30596
42070E087382K98036N33930M70838j46974q11075p22420O7412N41323N1342p59166
42060D610628q56086k18362L11756L71524M94538J031098J346892O51939o87811
42051G056116j364991p65088K22220M26348o4790k80674J0144L7567m99307p56837
42041D020708q8117Q30935J017083O16553L64558J70483n74419j543308j602427
42032C212049n00150O69416R37954M45470k94904j105386j682148j384549j74249
$$ y = [1626515, 2357824, 2840306, 3283231, 3154656, 2224940, 1423407, 1582854, 2051609, 1682442, 665077, 194438, 638740, 1226218, 1471738, 1791344, 2533058, 3337296, 3780130, 3947055, 4031144, 3914176, 3509720, 3139502, 3220576, 3767260, 4419339, 4856786, 5087382, 5385418, 5919348, 6390186, 6243212, 5432137, 4709717, 4777129, 5318452, 5369794, 4610628, 3754542, 3536180, 3847936, 4219460, 4713998, 5745096, 7091988, 7743927, 7056116, 5691125, 4926037, 5148257, 5574605, 5509815, 5229141, 5239285, 5276852, 4777545, 4020708, 3932591, 4763526, 5780609, 6397162, 6761720, 6932203, 6357784, 4814476, 3212049, 2711899, 3381315, 4319269, 4764739, 4469835, 3364449, 1682301, 297752, 123503]
42023A23503R08785R12578J71972k43910Q7321O45178P62812K65743m66404p69728
42013B397850k99432M26995M87878k34866q40450o86632k12858K174K85388J150574
42003B476621K042565J842371N19242o81793q57029m47725l22575n38232n41620
41994C491825k16581r8057n17605r82537p12484L09526J161733J045483K89039
41985C770342q5689K80948O72038L80008l17934o64657n24648m31234o68232q57204
41975A553738n81571m2528J68357j55182m96562j84663P05159J252204P60230
41966B979182k37081n31680J69529Q25662N18270k97598n76901k31634m8860k44228
41956B324661q8104P52320J358324P22110o97553j377349o21231O61268J254889
$$ y = [123503, 1032288, 1944866, 2116838, 1872928, 1960249, 2605427, 3368239, 3633982, 3167578, 2397850, 2098418, 2525413, 3013291, 2778425, 1937975, 1251343, 1038485, 1040659, 1326047, 2476621, 4519186, 6361557, 6880799, 6199006, 5341977, 4894252, 4571677, 4033445, 3491825, 3275244, 3177187, 2659582, 1677045, 964561, 1274087, 2435820, 3481303, 3770342, 3684653, 3965601, 4637639, 5017647, 4699713, 4035056, 3510408, 3079174, 2410942, 1553738, 972167, 929639, 1097996, 942814, 446252, 261589, 966748, 2218952, 2979182, 2742101, 2210421, 2379950, 3205612, 3723882, 3426284, 2849383, 2617749, 2568889, 2324661, 2236557, 2988877, 4347201, 5069311, 4371758, 2994409, 2373178, 3034446, 4289335]
41947D289335J079997Q68857Q69663O31613J6932l54334J5365P28014J021348
41938I166790O90577P4696n02628q07374n77531Q1025M72764J40855l28047o4349
41928H346778P28190J061768P22318N16147Q34848J050493P22565L94577N92515
41919A4970199Q88763O71003J44883j55813k48341l42668j64684N35282J226585
41910A7525209J182187N11032j39340n75441r56314j019144l43526P03670J145113
41901A8033446N65380n41680j528588k021655j709481n35323P94583J212258M16781
41892A4685721q54207j689347j656568p47342O00369J422338R58304l35301j134438
41883A1249529p99979l234L57549K37062J69112M57847R92116J525608J898362
$$ y = [4289335, 5369332, 6238189, 7107852, 7739465, 7756397, 7402063, 7417428, 8145442, 9166790, 9857367, 9932063, 9429435, 8622061, 8044530, 8125555, 8598319, 8739174, 8411127, 8346778, 9074968, 10136736, 10859054, 11375201, 12210049, 13260542, 13983107, 14377684, 14970199, 15858962, 16529965, 16674848, 16519035, 16270694, 15928026, 15763342, 16298624, 17525209, 18707396, 19218428, 19079088, 18503647, 17547333, 16528189, 16184663, 16888333, 18033446, 18598826, 18057146, 16528558, 14506903, 12797422, 12262099, 13056682, 14268940, 14685721, 13831514, 12142167, 10485599, 9738257, 10338626, 11760964, 12719268, 12383967, 11249529, 10449550, 10446316, 10803865, 11040927, 11210039, 11667886, 12660002, 14185610, 16083972]
41874A6083972K185897K630691L149880L100119K033201N01214n46345j023887
41866B8114742j586496k352626k721031k530027k338483k309740j934633j277046
41858A1064660j270603k041444k139431n89337J220972J151021o69766j937359
41850D788713j256443K65630Q37615K11188n58179p34786m48916j9184M44351
41841C529989P24189L92584o18962j577635j518006l88788O99390P23867L4923
41832B001551j39742N82461J212712Q13365k47867r36275q64642l69069K36990
41823B289484P39879P14385O154o23090k36473Q40522J213113L02471p87626p61728
41813C697091J69151P15308K28257o76002j056887o28843K03779Q21530P94011
$$ y = [16083972, 18269869, 20900560, 24050440, 27150559, 29183760, 29684974, 29138629, 28114742, 26528246, 24175620, 21454589, 18924562, 16586079, 14276339, 12341706, 11064660, 9794057, 7752613, 5613182, 5023845, 6244817, 7395838, 6726072, 4788713, 3532270, 3797900, 4635515, 4846703, 4288524, 3553738, 3104822, 3085638, 3529989, 4254178, 4646762, 4027800, 2450165, 932159, 543371, 1242761, 1966628, 2001551, 1861809, 2444270, 3656982, 4470347, 4222480, 3286205, 2421563, 2052494, 2289484, 3029363, 3743748, 3749902, 3126812, 2890339, 3730861, 4943974, 5246445, 4458819, 3697091, 3866242, 4581550, 4809807, 4133805, 3076918, 2448075, 2651854, 3473384, 4267395]
41804D267395J56260n63543q05475n72771l83177n53728p71540n40358J53095
41795C86158Q58799J203213J129761P22455J73935j02907J85461O40658M64512
41786E662045l99359r78129o05568K1143j11953o85538n35724L48273O29428k34229
41776C110389r41904k61340J043332J330040M45231l26395l49790k90662o06928
41767C151973p30781k41404K52017J51272k8536M87928J299163J248762J25601
41758E715995r81102j126151n34162M2718K80764K05854k14301q02656r35884
41749A651075k82496M85228M99108P4305L26484J298806J587421M06886r91505
41740E055312r58294K17785Q58092L99363o3439K19569N41158J38323m93233m97040
$$ y = [4267395, 4423655, 3860112, 3054637, 2481866, 2098689, 1544961, 773421, 233063, 386158, 1244957, 2448170, 3577931, 4300386, 4474321, 4371414, 4556875, 5197533, 5662045, 5262686, 4284557, 3678989, 3700132, 3588179, 2902641, 2366917, 2715190, 3344618, 3110389, 2168485, 1907145, 2950477, 4280517, 4725748, 4399353, 4049563, 3758901, 3151973, 2421192, 2179788, 2431805, 2583077, 2554541, 3042469, 4341632, 5590394, 5715995, 4734893, 3608742, 3074580, 3117298, 3398062, 3603916, 3389615, 2586959, 1651075, 1368579, 1853807, 2352915, 2427220, 2753704, 4052510, 5639931, 6046817, 5055312, 4097018, 4314803, 5172895, 5572258, 5508819, 5728388, 6269546, 6407869, 5914636, 5417596]
41730E417596r338K89093L97589Q49348J634470K089803J798374J008984J84769
41721A3660688m41503q87942j266030j534285j355321n12807M86934P74198K58710
41712I182642k08870q1622J92999R7722j41378j83517j74662q5228O18341J784811
41702A1001238K045912O62334r35872q90293M20950J043180L61781l70614k94002
41693A3044614P5765L24782Q49947J579121J559011N52151k62596N8897J004520
41684A8786212J728562K283831K976422L506659L525406L153811K326021O40337
41676C8927261j477344k637052k369678j984783k550091l213186k780253j820882
41668B0093992j632531j989337j684768p80670n02810j080075j408481r59373
$$ y = [5417596, 5408258, 5697351, 6094940, 6944288, 8578758, 10668561, 12466935, 13475919, 13660688, 13219185, 12331243, 11065213, 9530928, 8175607, 7662800, 8149734, 8923932, 9182642, 8973772, 8892150, 9085149, 9182871, 9041493, 8857976, 8683314, 8598086, 9216427, 11001238, 13047150, 13709484, 12773612, 11883319, 12304269, 13347449, 13709230, 13338616, 13044614, 13120379, 13445161, 14295108, 15874229, 17433240, 17985391, 17722795, 17781692, 18786212, 20514774, 22798605, 25775027, 29281686, 32807092, 35960903, 38286924, 38927261, 37449917, 34812865, 32443187, 30458404, 27908313, 24695127, 21914874, 20093992, 18461461, 16472124, 14787356, 14006686, 13503876, 12423801, 11015320, 10055947]
41660A0055947m73392m90268n64668l35014j91391m28307o93260o68366m90508
41651E720773k50045J18486L03621j27926q06640q64896l26379j08887l98909
41642C259198k64837O10408J091469L39316o92757o36587J82602K77202p26617
41633C439397j574495j204283j01812N14622K68951q3570K03514Q10101P27485
41624B999910k86762j116576o66812N14367Q65049L498p64111m17455L81918N08090
41614B021116L6636k13968j06699j12789k45472j20095J11790j31837q33414j287815
41604h82547j105528n91120p4111M43502Q83818J002327Q46393P27224O38958
41595A888916L21248k931K98491J152951J469090M82564j079216j779415j125584
$$ y = [10055947, 9582555, 9092287, 8527619, 8192605, 8001214, 7572907, 6879647, 6211281, 5720773, 5470728, 5589214, 5892835, 5764909, 4958269, 4093373, 3766994, 3658107, 3259198, 2994361, 3604769, 4696238, 5035554, 4342797, 3706210, 3888812, 4166014, 3439397, 1864902, 660619, 558807, 1073429, 1342380, 1258810, 1462324, 2272425, 2999910, 2713148, 1596572, 929760, 1444127, 2309176, 2312674, 1548563, 1131108, 1513026, 2021116, 2057752, 1843784, 1737085, 1624296, 1378824, 1258729, 1370519, 1238682, 405268, -882547, -1988075, -2579195, -2653306, -2209804, -1325986, -323659, 522734, 1249958, 1888916, 2210164, 2207233, 2505724, 3658675, 5127765, 5610329, 4531113, 2751698, 1626114]
41586A626114J11239J012480J326621J190299O66491j30649p85077q39398k91721
41577C886399L59658N95207L09494k05756n74309n98175l54327j28088j34715
41568C155388k08262N7118O83928J082528Q04823K89912K69138N42065J85625
41559F862263q28810j210236j80552J120995J081724r6601p94321m14536r69k18296
41549E320661j93694Q47773J977238J784383N28082k27098J09500M82085n5293
41540A0573637r95695j277848p65310k09881j74500n61886r73344j043939n60329
41531D010905L04056R17023P52760N9377l80164k17019O5498j39223p51455j141915
41521C479843q99581k21683L66859M72645Q5192m08351m79526N9715P89755J037956
$$ y = [1626114, 1737353, 2749833, 4076454, 5266753, 5933244, 5802595, 5017518, 4178120, 3886399, 4246057, 4841264, 5150758, 4945002, 4370693, 3772518, 3418191, 3290103, 3155388, 2947126, 3004244, 3688172, 4770700, 5575523, 5865435, 6134573, 6676638, 6862263, 6033453, 4823217, 4642665, 5763660, 6845384, 6748783, 5954462, 5539926, 5538957, 5320661, 5126967, 5974740, 7951978, 9736361, 10264443, 10037345, 10146845, 10628930, 10573637, 9577942, 8300094, 7534784, 7324903, 7150403, 6588517, 5615173, 4571234, 4010905, 4314961, 5231984, 5984744, 6044121, 5663957, 5446938, 5512436, 5373213, 4621758, 3479843, 2580262, 2358579, 2725438, 3198083, 3283275, 2874924, 2395398, 2455113, 3244868, 4282824]
41511D282824N32603l76229j087285j203338p13570L8528N83683P35853P38527
$$ y = [4282824, 4815427, 4439198, 3351913, 2148575, 1435005, 1473533, 2057216, 2793069, 3531596]
$$ [...]
##END NTUPLES=NMR SPECTRUM
##END=
