##TITLE=31Pdec_DE-145_TFA
 Cl4,64 sc
 29.4.2026
##JCAMPDX= 6.0         $$ Bruker NMR JCAMP-DX V2.0
##DATA TYPE= NMR SPECTRUM
##DATA CLASS= NTUPLES
##ORIGIN= UXNMR, Bruker Analytische Messtechnik GmbH
##OWNER= root
$$ XWIN-NMR		Version 3.5
$$ Wed Apr 29 14:24:42 2026 Russian Standard Time (UT+4h)  she@DPX200
##.OBSERVE FREQUENCY= 81.013821
##.OBSERVE NUCLEUS= ^31P
##.ACQUISITION MODE= SIMULTANEOUS
##.ACQUISITION SCHEME= undefined
##.AVERAGES= 64
##.DIGITISER RES= 17
##SPECTROMETER/DATA SYSTEM= spect
##.PULSE SEQUENCE= zgpg30
##.SOLVENT NAME= CDCl3
##.SHIFT REFERENCE= (INTERNAL, CDCl3, 0, 197.392)
##AUDIT TRAIL= $$ (NUMBER, WHEN, WHO, WHERE, WHAT)
$$ ##TITLE= Audit trail, XWIN-NMR		Version 3.5
$$ ##JCAMPDX= 5.01
$$ ##ORIGIN= Bruker BioSpin GmbH
$$ ##OWNER= she
$$ F:/spectra/data/she/nmr/P31/2/pdata/1/auditp.txt
$$ ##AUDIT TRAIL=  $$ (NUMBER, WHEN, WHO, WHERE, WHAT)
(   1,<2026-04-29 14:23:00.07 +0400>,<she>,<DPX200>,
      <continue with go, POWCHK disabled, PULCHK disabled
       configuration hash MD5:
       00 E9 B6 7A A2 85 ED C7 34 08 36 98 17 FE 4E 26
       data hash MD5: 32K
       7F E4 20 11 6B 35 E9 1B E2 A2 7B 88 AB 00 08 62>)
(   2,<2026-04-29 14:23:29.59 +0400>,<she>,<DPX200>,
      <Start of raw data processing
       efp BC_mod = 2 LB = 1.5 FT_mod = 6 PKNL = 1 PHC0 = 1434.866 PHC1 = 54.50049 SI = 64K 
       data hash MD5: 64K
       E4 54 2E A7 61 68 A9 09 55 C3 9E C3 CB 44 5F 05>)
(   3,<2026-04-29 14:24:05.25 +0400>,<she>,<DPX200>,
      <pk PHC0 = 97.72441 PHC1 = -276.4 
       data hash MD5: 64K
       77 D9 69 81 B8 25 7A 6F 67 DF F4 BD 45 47 2A 6C>)
(   4,<2026-04-29 14:24:09.68 +0400>,<she>,<DPX200>,
      <abs ABSG = 5 
       data hash MD5: 64K
       61 B7 3B 1A 1A 17 71 26 5F 86 58 80 34 FF EA DC>)
$$ ##END=
$$ 
$$ hash MD5
$$ D8 DF 61 0D 43 B2 B9 4E 67 83 18 A9 C8 84 7B 0B
##$RELAX= 
##$RELAX= 
##$RELAX= 
##$RELAX= 
##$RELAX= 
##$RELAX= 
##$RELAX= 
##$RELAX= 
$$ Bruker specific parameters
$$ --------------------------
##$DU= <F:/spectra>
##$EXPNO= 2
##$NAME= <P31>
##$PROCNO= 1
##$TYPE= <nmr>
##$USER= <she>
##$AMP= (0..31)
100 100 100 100 100 100 100 100 100 100 100 100 100 100 100 100 100 100 
100 100 100 100 100 100 100 100 100 100 100 100 100 100 
##$AQSEQ= 0
##$AQ_mod= 1
##$AUNM= <au_zg>
##$AUTOPOS= <>
##$BF1= 81.014009
##$BF2= 200.13
##$BF3= 200.13
##$BF4= 200.13
##$BF5= 200.13
##$BF6= 200.13
##$BF7= 200.13
##$BF8= 200.13
##$BYTORDA= 1
##$CFDGTYP= 0
##$CFRGTYP= 5
##$CHEMSTR= <none>
##$CNST= (0..31)
1 1 145 1 1 1 1 1 1 1 1 1 1 1 1 1 1 1 1 1 1 1 1 1 1 1 1 1 1 1 1 1 
##$CPDPRG= <waltz16>
##$CPDPRG1= <>
##$CPDPRG2= <waltz16>
##$CPDPRG3= <>
##$CPDPRG4= <mlev>
##$CPDPRG5= <mlev>
##$CPDPRG6= <mlev>
##$CPDPRG7= <mlev>
##$CPDPRG8= <mlev>
##$CPDPRGB= <>
##$CPDPRGT= <>
##$D= (0..31)
0 1 0 0 0 0 0 0 0 0.06 0 0.03 2e-05 3e-06 0 0 0.0002 0 0 0 0 0 0 0 0 0 
0 0 0 0 0 0 
##$DATE= 1777458059
##$DBL= (0..7)
120 120 120 11 120 120 24 19 
##$DBP= (0..7)
150 150 150 150 150 150 150 150 
##$DBP07= 0
##$DBPNAM0= <>
##$DBPNAM1= <>
$$ [...]
##$SUBNAM3= <"">
##$SUBNAM4= <"">
##$SUBNAM5= <"">
##$SUBNAM6= <"">
##$SUBNAM7= <"">
##$SUBNAM8= <"">
##$SUBNAM9= <"">
##$SW= 400.765351723535
##$SWIBOX= (0..15)
0 1 3 0 0 0 0 0 0 0 0 0 0 0 0 0 
##$SW_h= 32467.5324675325
##$TD= 32768
##$TD0= 1
##$TE= 0
##$TE2= 300
##$TE3= 300
##$TEG= 300
##$TL= (0..7)
0 120 53 12 22 120 120 120 
##$TP= (0..7)
150 150 150 150 150 150 150 150 
##$TP07= 0
##$TPNAME0= <>
##$TPNAME1= <>
##$TPNAME2= <>
##$TPNAME3= <>
##$TPNAME4= <>
##$TPNAME5= <>
##$TPNAME6= <>
##$TPNAME7= <>
##$TPOAL= (0..7)
0.5 0.5 0.5 0.5 0.5 0.5 0.5 0.5 
##$TPOFFS= (0..7)
0 0 0 0 0 0 0 0 
##$TUNHIN= 0
##$TUNHOUT= 0
##$TUNXOUT= 0
##$USERA1= <user>
##$USERA2= <user>
##$USERA3= <user>
##$USERA4= <user>
##$USERA5= <user>
##$V9= 5
##$VALIST= <valist>
##$VCLIST= <CCCCCCCCCCCCCCC>
##$VD= 0
##$VDLIST= <DDDDDDDDDDDDDDD>
##$VPLIST= <PPPPPPPPPPPPPPP>
##$VTLIST= <TTTTTTTTTTTTTTT>
##$WBST= 1024
##$WBSW= 4
##$XGAIN= (0..3)
0 0 0 0 
##$XL= 0
##$YL= 0
##$YMAX_a= 5337
##$YMIN_a= -23451
##$ZGOPTNS= <>
##$ZL1= 120
##$ZL2= 120
##$ZL3= 120
##$ZL4= 120
##$ABSF1= 197.3918
##$ABSF2= -203.3724
##$ABSG= 5
##$ABSL= 3
##$ALPHA= 0
##$AQORDER= 0
##$ASSFAC= 0
##$ASSFACI= 0
##$ASSFACX= 0
##$ASSWID= 0
##$AUNMP= <proc_1d>
##$AZFE= 0.1
##$AZFW= 0.5
##$BCFW= 0
##$BC_mod= 2
##$BYTORDP= 0
##$COROFFS= 0
##$CY= -3
##$DATMOD= 1
##$DC= 0
##$DFILT= <>
##$DTYPP= 0
##$F1P= 0
##$F2P= 0
##$FCOR= 1
##$FTSIZE= 65536
##$FT_mod= 6
##$GAMMA= 0
##$GB= 0
##$INTBC= 1
##$INTSCL= 9.790993e-09
##$ISEN= 30
##$LB= 1.5
##$LEV0= 0
##$LPBIN= 0
##$MAXI= 10000
##$MC2= 0
##$MEAN= 0
##$ME_mod= 0
##$MI= 50
##$NCOEF= 0
##$NC_proc= -8
##$NLEV= 6
##$NOISF1= 182.463
##$NOISF2= 159.3651
##$NSP= 0
##$NTH_PI= 0
##$NZP= 0
##$OFFSET= 197.3918
##$PC= 4
##$PHC0= 1532.59
##$PHC1= -221.8995
##$PH_mod= 1
##$PKNL= yes
##$PPARMOD= 0
##$PSCAL= 0
##$PSIGN= 0
##$REVERSE= no
##$SF= 81.014063255964
##$SI= 65536
##$SIGF1= 159.3651
##$SIGF2= -187.1042
##$SINO= 113.3802
##$SIOLD= 16384
##$SREGLST= <1H.CDCl3>
##$SSB= 0
##$STSI= 65536
##$STSR= 0
##$SW_p= 32467.5324675325
##$SYMM= 0
##$S_DEV= 0
##$TDeff= 32768
##$TDoff= 0
##$TI= <>
##$TILT= no
##$TM1= 0
##$TM2= 0
##$TOPLEV= 0
##$USERP1= <user>
##$USERP2= <user>
##$USERP3= <user>
##$USERP4= <user>
##$USERP5= <user>
##$WDW= 1
##$XDIM= 65536
##$YMAX_p= 293256507
##$YMIN_p= -21471987
$$ End of Bruker specific parameters
$$ ---------------------------------
##NTUPLES= NMR SPECTRUM
##VAR_NAME=  FREQUENCY,     SPECTRUM/REAL,   SPECTRUM/IMAG
##SYMBOL=    X,             R,               I
##VAR_TYPE=  INDEPENDENT,   DEPENDENT,       DEPENDENT
##VAR_FORM=  AFFN,          ASDF,            ASDF
##VAR_DIM=   65536,         65536,           65536
##UNITS=     HZ,            ARBITRARY UNITS, ARBITRARY UNITS
##FACTOR=    0.49542278885378, 1,            1
##FIRST=     15991.5117654749, 0,            0
##LAST=      -16476.0207020576, 0,           0
##MIN=       -16476.0207020576, -21471987,   0
##MAX=       15991.5117654749, 293256507,    0
$$ Real data points
##PAGE= N=1
##DATA TABLE= (X++(R..R)), XYDATA
$$ [...]
7501G969136J457044P75862p57244j526081r92658K8248R22569J584317J267995
$$ 7969136 9426180 10202042 9444798 7918717 6926059 6954307 7876876 9461193 10729188
7492A0729188r00844l828647m831902l037198p38001k53754r56372q20551L21756
$$ 10729188 9828344 5999697 1167795 -1869403 -2607404 -2861158 -3817530 -4638081 -4316325
7483d316325Q50726J26863m89656M45743K576958M161489L954779K431331J120309
$$ -4316325 -3465599 -3338736 -3828392 -3382649 -805691 3355798 7310577 9741908 10862217
7474A0862217P92546P12687l7515j192442j998947k485631k840190k334828o22989
$$ 10862217 11654763 12367450 12329935 11137493 9138546 6652915 3812725 1477897 854908
7465H54908N34537q21257l358152l540959o47191K045316J970846L55750p61265
$$ 854908 1389445 568188 -2789964 -6330923 -6978114 -4932798 -2961952 -2606202 -3367467
7456c367467j622362k735036k495400K35769L120674L044981N76258j175916j025430
$$ -3367467 -4989829 -7724865 -10220265 -9984496 -6863822 -3818841 -3242583 -4418499 -5443929
7447e443929q9449J165269K860781L438878J225321j850926j989210N76139J412007
$$ -5443929 -5533378 -4368109 -1507328 1931550 3156871 1305945 -683265 -107126 1304881
7438A304881j221617l431980j853442R97623Q30771j726858k510083l59787J780073
$$ 1304881 83264 -3348716 -5202158 -4204535 -3373764 -5100622 -7610705 -7970492 -6190419
7429f190419J926299J396742J500937J251207j80926j322521o61246P05285P71223
$$ -6190419 -4264120 -2867378 -1366441 -115234 -296160 -1618681 -2279927 -1574642 -803419
7420h03419j20828J00942J790290K890487J978354K34117l65480M73350J520167
$$ -803419 -924247 -823305 966985 3857472 5835826 6069943 5704463 6177813 7697980
7411G697980J624242L34321k059533m129870m024376j841763k41405j055439k377207
$$ 7697980 9322222 9656543 7597010 3467140 -557236 -2398999 -2640404 -3695843 -6073050
7402f073050j311661J213869J536456q14074j900316O69239M020520M438224K498593
$$ -6073050 -7384711 -6170842 -4634386 -5448460 -7348776 -6679537 -2659017 1779207 4277800
7393D277800R27964l6687j562490k531069j189873O32998m46291l324258l119411
$$ 4277800 5205764 5169077 3606587 1075518 -114355 518643 72352 -3251906 -6371317
7384f371317J268592M887606L784787K07981j677468j544497j218877m38465J691627
$$ -6371317 -5102725 -215119 3569668 3777649 2100181 555684 -663193 -1101658 589969
7375E89969L123247J131482k699919l854493j210240J699778K179251J533272
$$ 589969 3713216 4844698 2144779 -1709714 -2919954 -1220176 959075 2492347
7367B492347J606435J490093k33688k398477k902397j996765j531763j758264
$$ 2492347 4098782 5588875 5355187 2956710 54313 -1942452 -3474215 -5232479
7359e232479j204793N21848J986783K255266K114005K330613K271988J230353
$$ -5232479 -6437272 -5915424 -3928641 -1673375 440630 2771243 5043231 6273584
7351F273584r1715n89320l82134k42925j50432J80920r3918k020877m562583n118037
$$ 6273584 6181869 5592549 5210415 4967490 4817058 4997978 4904060 2883183 -1679400 -6797437
7341f797437k862304K2409J177450O66692p5464l37000M902J236101K875808L161778
$$ -6797437 -9659741 -9637332 -8459882 -7793190 -7868654 -8205654 -8200752 -6964651 -4088843 -927065
7331i27065J160100j476879k462890j743216q31347l06031J63834L06795q7118
$$ -927065 233035 -1243844 -3706734 -5449950 -6281297 -6587328 -6423494 -6116699 -6203817
7322f203817Q1759J439468K087333J64362k405203k135320N39098J901423J050521
$$ -6203817 -6122058 -4682590 -2595257 -2430895 -4836098 -6971418 -6432320 -4530897 -3480376
7313c480376Q82729K211745J875613j222821l018556n64463K673759J942193j573620
$$ -3480376 -2597647 -385902 1489711 266890 -2751666 -3316129 -642370 1299823 -273797
7304b73797l195447k014704q74554p32137n0959R72309N01156p32862l3706K103299
$$ -273797 -3469244 -5483948 -6358502 -7090639 -7141598 -6169289 -5668133 -6400995 -6434701 -4331402
7294d331402K115552m76397j736787K65641K264578J470547K12179J458686L172597
$$ -4331402 -2215850 -2692247 -4429034 -4163393 -1898815 -428268 -216089 1242597 4415194
7285D415194J553177k140166k788302R42123M411965L372504p52304l557623l387970
$$ 4415194 5968371 3828205 1039903 1982026 6393991 9766495 9014191 5456568 2068598
7276B068598k345386k603292l633510l262562m56989L420816N841907N315000
$$ 2068598 -276788 -2880080 -6513590 -9776152 -10233141 -6812325 -970418 4344582
7268D344582K463521p66618k725589l016610k280168j364219p29271m71038n67401
$$ 4344582 6808103 6041485 3315896 299286 -1980882 -3345101 -4074372 -4545410 -5112811
7259e112811p96337o29530J95285R91400P45511m03686j162533q66120k16919
$$ -5112811 -5909148 -6538678 -6343393 -5351993 -4606482 -5010168 -6172701 -7038821 -7255740
7250g255740K81556J298267L015922L786679K105580q44701k348537j422861O15964
$$ -7255740 -6974184 -5675917 -2659995 1126684 3232264 2387563 39026 -1383835 -767871
7241g67871K300536K978353K160654K3050j622554j065126N31903L85643j648267
$$ -767871 1532665 4511018 6671672 6694722 5072168 4007042 4538945 4924588 3276321
7232C276321k665342j265880K68923j56480r81364K96970K740701L028223J22604
$$ 3276321 610979 -654901 -385978 -542458 -1523822 -1226852 1513849 4542072 4664676
7223D664676l541199n334027m827473k836004o7624K517680L433884J990038m99458
$$ 4664676 1123477 -4210550 -9038023 -11874027 -11941651 -9423971 -5990087 -4000049 -4499507
7214d499507j712423p00039J116410J604534L40780j163460j589075j190644o28826
$$ -4499507 -6211930 -6911969 -5795559 -4191025 -3850245 -5013705 -6602780 -7793424 -8422250
7205h422250L00269J569237J721884k75143k615990k399905L09987K583084K950407
$$ -8422250 -8121981 -6552744 -4830860 -5106003 -7721993 -10121898 -9811911 -7228827 -4278420
7196d278420K870337L152470K069009j139307l678410k860987l78880J91734j091652
$$ -4278420 -1408083 1744387 3813396 2674089 -1004321 -3865308 -4244188 -4052454 -5144106
7187e144106r36202J568136L178389J276339k239151l444559j195223K154928
$$ -5144106 -6080308 -4512172 -1333783 -57444 -2296595 -5741154 -6936377 -4781449
7179d781449L976925L793755K616216J116272p94934k861963l845468k669769
$$ -4781449 -804524 2989231 5605447 6721719 5926785 3064822 -780646 -3450415
7171c450415L7604K341011K954725K094294N44484r62230j426733k11672J534418
$$ -3450415 -3412811 -1071800 1882925 3977219 4521703 3559473 2132740 1921068 3455486
7162C455486J705320K28807n51601M54356J120823l74162k107891j270737R13483
$$ 3455486 5160806 5389613 4838012 5292368 6413191 6039029 3931138 2660401 3573884
7153C573884N91100k671612m798210k987168N29312K062149J200686j34815j272616
$$ 3573884 4164984 1493372 -3304838 -6292006 -5762694 -3700545 -2499859 -2634674 -3907290
7144c907290k608664l011371o85711L149391M436264J504930k114624k142203
$$ -3907290 -6515954 -9527325 -10213036 -7063645 -2627381 -1122451 -3237075 -5379278
7136e379278P65259K423202J374943L44379R66766P74157k329064n571913m797439
$$ -5379278 -4614019 -2190817 -815874 -471495 495271 1269428 -1059636 -6631549 -11428988
7127a1428988p24792K148901K118420J627331K068241J686624j49863q18382J223112
$$ -11428988 -12153780 -10004879 -7886459 -6259128 -4190887 -2504263 -2654126 -3472508 -2249396
7118b249396L443042L109955J188388k09837j327268k774378k920154q15540P54188
$$ -2249396 1193646 4303601 5491989 5282152 3954884 1180506 -1739648 -2555188 -1801000
7109a801000q74544l349121k564259P57074K388413J451730R60549J860397J756814
$$ -1801000 -2675544 -6024665 -8588924 -7831850 -5443437 -3991707 -3031158 -1170761 586053
7100E86053K32489L64004L275757N503893L938864m4795l340517m818091m435732
$$ 586053 818542 1182546 4458303 9962196 13901060 13856265 10515748 5697657 1261925
7091A261925j897245J504248K529479J233l031083l319870j474717P5547Q51612
$$ 1261925 -635320 868928 3398407 3399640 368557 -2951313 -4426030 -4350483 -3498871
7082c498871J560246J583347R1219j601001j424129M04804J782146J519633J45241
$$ -3498871 -1938625 -355278 -264059 -1865060 -3289189 -2884385 -1102239 417394 562635
7073E62635j299118j867633j032479L96357P17497l38942j120000p01542r2679
$$ 562635 -736483 -2604116 -3636595 -3240238 -2522741 -2861683 -3981683 -4683225 -4775904
7064d775904K08055J310698K966612K411882j209734l931512j972775K252834
$$ -4775904 -4567849 -3257151 -290539 2121343 911609 -3019903 -4992678 -2739844
7056b739844L076947n41162m080845m118359k041111o27169l75141m13473m51534
$$ -2739844 337103 -204059 -4284904 -8403263 -10444374 -11071543 -11446684 -11860157 -12311691
7047a2311691m76522k11995K17349L59328M93965J274159K275590K400771J674682
$$ -12311691 -12788213 -13000208 -12782859 -12423531 -11929566 -10655407 -8379817 -5979046 -4304364
7038d304364J096451R03833O56573O97664J542105K068338N84005k253317l830477
$$ -4304364 -3207913 -2304080 -1647507 -949843 592262 2660600 3244605 991288 -2839189
7029b839189l101711j528774l26022Q17034J846483J734284O02723J31670Q78234
$$ -2839189 -5940900 -7469674 -7795696 -6978662 -5132179 -3397895 -2795172 -2663502 -1785268
7020a785268J383600R08585P29357J519339J855257R02313K37334J011856J487962
$$ -1785268 -401668 506917 1236274 2755613 4610870 5513183 5750517 6762373 8250335
7011H250335j01706k010122j246651J637533L084561J580693o77444j502177j525550
$$ 8250335 8148629 6138507 4891856 6529389 9613950 11194643 10517199 9015022 7489472
7002G489472k301280l568208l847280k708944j131726Q362Q51449J929802L127631
$$ 7489472 5188192 1619984 -2227296 -4936240 -6067966 -6059604 -5208155 -3278353 -150722
6993a50722L510156K276783j28030k151886k576119j530171N2429J363859J702636
$$ -150722 3359434 5636217 5508187 3356301 780182 -749989 -697560 666299 2368935
6984B368935L73083k327178m409277l787933q13254J797317K022954P65446M03859
$$ 2368935 2742018 414840 -3994437 -7782370 -8595624 -6798307 -4775353 -4009907 -3606048
6975c606048J699612K988704K378727M3619j965011j901948o9165J557087J325330
$$ -3606048 -1906436 1082268 3460995 3504614 1539603 -362345 -431510 1125577 2450907
6966B450907m79656k077792k231504j496431j115748j133143n61186O23525J040404
$$ 2450907 1971251 -106541 -2338045 -3834476 -4950224 -6083367 -6644553 -6021028 -4980624
6957d980624J65595l31367J050507K959642K856559Q60582m06270J29221O79785
$$ -4980624 -4815029 -5146396 -4095889 -1136247 1720312 2580894 2174624 2303845 2983630
6948B983630J4128m99488L68816J474451J674639J968816K833197J905870k246350
$$ 2983630 2997758 2498270 2867086 4341537 6016176 7984992 10818189 12724059 10477709
6939A0477709o020332m776574k1211K154095q8447k034265k35270K347706J794774
$$ 10477709 4457377 -319197 -340408 1813687 1725240 -309025 -544295 1803411 3598185
6930C598185l73750k07266K064845K792426Q68266j163465j537323j217316j255633
$$ 3598185 3224435 3017169 5082014 7874440 8742706 7579241 6041918 4824602 3568969
6921C568969j289532j196153j613269k125017j265737Q43617K004665J097814
$$ 3568969 2279437 1083284 -529985 -2655002 -3920739 -3077122 -1072457 25357
6913B5357k35147l37339j92244j598755l893419m485886k321879Q30154K656360
$$ 25357 -209790 -547129 -739373 -2338128 -6231547 -10717433 -13039312 -12209158 -9552798
6904i552798K630794J805947J272529J336637J622705J477323N68238n77875r10095
$$ -9552798 -6922004 -5116057 -3843528 -2506891 -884186 593137 1161375 583500 -326595
6895c26595m0063J188745J660446J156128R7733j307169k649071k498762J81942
$$ -326595 -366658 822087 2482533 3638661 3736394 2429225 -219846 -2718608 -2536666
6886b536666L430356L251113j228090n342729m138417R56278L754465J518151
$$ -2536666 893690 4144803 2916713 -2426016 -6564433 -5608155 -1853690 -335539
6878c35539j848511j877259M80704J321604j60570j281339m72112Q74840J255951
$$ -335539 -2184050 -4061309 -3580605 -2259001 -2419571 -3700910 -4173022 -3298182 -2042231
6869b042231J208252J867843L024654L352701J676441k059019o027248p013868
$$ -2042231 -833979 1033864 4058518 7411219 9087660 7028641 1001393 -6012475
6861f012475l362127K355331N342933L895253J120308M98293J439727R42973j507842
$$ -6012475 -9374602 -7019271 -1676338 2218915 3339223 3837516 5277243 6220216 4712374
6852D712374l100985j880428L56323N58373j393313k645495j280407J298479K419621
$$ 4712374 1611389 -269039 87284 645657 -747656 -3393151 -4673558 -3375079 -955458
6843i55458J398032k54178j125068j176380j009138j058465j475058j735265n75735
$$ -955458 442574 188396 -936672 -2113052 -3122190 -4180655 -5655713 -7390978 -7966713
6834g966713K242260M241523K418036k251777m801700k322923J971125K975525
$$ -7966713 -5724453 -1482930 935106 -1316671 -6118371 -8441294 -6470169 -3494644
6826c494644M87003j138990N11263L011501L277151J742070P63523Q56243O04144
$$ -3494644 -3007641 -4146631 -3635368 -623867 2653284 4395354 5158877 6015120 6619264
6817F619264n47813j354517p11857P04065J253298L27218r62442j218082n59649
$$ 6619264 6071451 4716934 4005077 4709142 5962440 6289658 5327216 4109134 3549485
6808C549485l19220q75123r53965J23551Q08443l93633j971469j191435J341467
$$ 3549485 3230265 2355142 1401177 1524728 2333171 1939538 -31931 -1223366 118101
6799A18101J762568j510774m950195m392703l36742L366619M550398L942713K391684
$$ 118101 1880669 369895 -4580300 -8973003 -9309745 -5943126 -1392728 2549985 4941669
6790D941669j08448k575846l008614j136461P94530J060793O50243J191999K109763
$$ 4941669 4833221 2257375 -751239 -1887700 -1093170 -32377 617866 1809865 3919628
6781C919628J481886r62984l260331l497246j635333Q29232K166352J577334l0291
$$ 3919628 5401514 4438530 1178199 -2319047 -3954380 -3125148 -958796 618538 588247
6772E88247n76394R22041K670736J795468k016099n608356n673669k244671J700856
$$ 588247 11853 933894 3604630 5400098 3383999 -2224357 -7898026 -10142697 -8441841
6763h441841L449629K636766O87593p40963p00723P74312K707149L622881K475500
$$ -8441841 -4992212 -2355446 -1667853 -2408816 -3109539 -2335227 371922 3994803 6470303
6754F470303l51116k865523k934205o41555J214303P1218l069704m664610l200451
$$ 6470303 6119187 3253664 319459 -322096 892207 963425 -2106279 -6770889 -9971340
6745i971340r89533n19627r07508K16923K737331M364792M174481L247790K036665
$$ -9971340 -10960873 -11480500 -12388008 -12171085 -9433754 -5068962 -894481 2353309 4389974
6736D389974r3767k312533k288575K8773J292438n66821k758058j430252K339656
$$ 4389974 4296207 1983674 -304901 -276128 1016310 449489 -2308569 -3738821 -1399165
6727a399165L552310J33315m179906m706783j354701K190077L297590K492863
$$ -1399165 2153145 2286460 -1893446 -6600229 -7954930 -5764853 -2467263 25600
6719B5600J273709m5193j565503k391802j603826j57083J1788r22998l93554K640489
$$ 25600 1299309 1254116 -311387 -2703189 -4307015 -4464098 -4452310 -5375308 -5768862 -3128373
6709c128373N292384M278252O25111j668609j101059j2246m09149j357934j371491
$$ -3128373 2164011 6442263 7067374 5398765 4297706 4285460 3876311 2518377 1146886
6700A146886q23394o88156q62876r12877p91731q9524J456477K235150K19856
$$ 1146886 323492 -364664 -1227540 -2140417 -2932148 -3021672 -1565195 669955 889811
6691H89811l130175l748403j045315P22604o85498j536041J449916M755675L177018
$$ 889811 -2240364 -5988767 -7034082 -6311478 -6996976 -8533017 -7083101 -2327426 849592
6682H49592j637287l532010j118531J201113Q76571J5022K25509K46460j82929
$$ 849592 -787695 -4319705 -5438236 -4237123 -3360552 -3345530 -3120021 -2873561 -3056490
6673c056490Q26031L074668L521508J399388l37078l30727r29058k901516k985472
$$ -3056490 -2230459 844209 4365717 5765105 5428027 5097300 4168242 1266726 -1718746
6664a718746K29651K561467L59621l344685l212075O46969L648497L451331J625661
$$ -1718746 -1489095 1072372 1431993 -1912692 -5124767 -4477798 -829301 2622030 4247691
6655D247691J61213j8470J512427L384247K274072k464897n992523l896534R47404
$$ 4247691 4408904 4390434 5902861 9287108 11561180 9096283 3103760 -792774 154630
6646A54630K282817j66339j000291J483904K645403j85057k781403q39727K922842
$$ 154630 2437447 2271108 1270817 2754721 5400124 5215067 2433664 1593937 4516779
6637D516779K975817o18590k803521j338860N41177k70532k185083j741277J147809
$$ 4516779 7492596 6874006 4070485 2731625 3272802 3002270 817187 -924090 223719
6628B23719L052345J616954j593118l401072k924820j935133j862088k129417
$$ 223719 3276064 4893018 3299900 -101172 -3025992 -4961125 -6823213 -8952630
6620h952630j771424r90810q7902J647238M358960O007982M312934k7903l729957
$$ -8952630 -10724054 -11714864 -11802766 -10155528 -5796568 211414 4524348 4496445 766488
6611G66488m402490k322058P76751L018856K881185L65244k176996k124846K55899
$$ 766488 -3636002 -5958060 -5181309 -2162453 718732 1083976 -1093020 -3217866 -2961967
6602b961967K243183K226921J042154k92838j844535l074731k293430N89144K547234
$$ -2961967 -718784 1508137 2550291 2257453 412918 -2661813 -4955243 -4366099 -1818865
6593a818865P92641l200203n040757k691266J239763K820072J174597j180154
$$ -1818865 -1026224 -4226427 -9267184 -11958450 -10718687 -7898615 -6724018 -7904172
6585g904172j620360L3969K186424L489815L388046J531890j688845m119785l358541
$$ -7904172 -9524532 -9490563 -7304139 -3814324 -426278 1105612 -583233 -4703018 -8061559
6576h061559j16875J781186J49651k490530k459133L3409J936374K313317K979308
$$ -8061559 -8178434 -6397248 -6247597 -8738127 -11197260 -11163851 -9227477 -6914160 -3934852
6567c934852M377171M319593J842247o51450p83295M36277M60788j170655k838413
$$ -3934852 442319 4761912 6604159 5952709 5169414 5605691 6066479 4895824 2057411
6558B057411l297688k501263q61262Q53086J589016J215652R45070J477162J679756
$$ 2057411 -1240277 -3741540 -4602802 -3749716 -2160700 -945048 22 1477184 3156940
6549C156940M45774j102252j013219M72536J259086O79439M58190J806198L224474
$$ 3156940 3602714 2500462 1487243 1959779 3218865 3898304 4356494 6162692 9387166
6540I387166K397414o17250l300738l502641j480781P70248J426258L02k557663
$$ 9387166 11784580 11167330 7866592 4363951 2883170 3653418 5079676 5079978 2522315
6531B522315m412628l999370j340657J805915L498560L212703J695493j65634
$$ 2522315 -1890313 -5889683 -7230340 -5424425 -1925865 1286838 2982331 2816697
6523B816697j548760j378097P14500L062257L185926R06795j186662j136195J004
$$ 2816697 1267937 -110160 604340 3666597 6852523 7759318 6572656 5436461 5437465
6514E437465K49993k96446k41566M30308L73064p99632j852608j562442K8610
$$ 5437465 5687458 5391012 5149446 5579754 5952818 5153186 3300578 1738136 1766746
6505A766746J721576J835461l73743l148444l429965q57596J101897j65842k460577
$$ 1766746 3488322 5323783 4950040 1801596 -1628369 -2485965 -1384068 -1549910 -4010487
6496d010487k104605M10762J564422N65815l2973O66198N10183j274382k177323
$$ -4010487 -6115092 -5704330 -4139908 -3574093 -3607066 -2940868 -2430685 -3705067 -5882390
6487e882390n22986J783726K413815J671374O49440q49869k525358k381466K35767
$$ -5882390 -6405376 -4621650 -2207835 -536461 112979 -736890 -3262248 -5643714 -5407947
6478e407947K575000J949782m65247j614040o87155J003055K606255L673725K968082
$$ -5407947 -2832947 -883165 -1348412 -2962452 -3649607 -2646552 -40297 3633428 6601510
6469F601510J06690k560260k393766j92390R57952K9557j204889j442806j300042
$$ 6601510 6708200 4147940 1754174 1561784 2519736 2549293 1344404 -98402 -1398444
6460a398444j288846o65889R79976K654032L256628K869483K165063J354366K98804
$$ -1398444 -2687290 -3353179 -2373203 280829 3537457 6406940 8572003 9926369 10225173
6451A0225173p04671p40112P80630K794988K876821p9057l866905n229280l922959
$$ 10225173 9520502 8780390 9561020 12356008 15232829 15153772 11286867 6057587 2134628
6442B134628k547724k336777j771580k8973J181476O82467q6383N2708k14045
$$ 2134628 -413096 -2749873 -4521453 -4550426 -3368950 -2686483 -2772866 -2720158 -2934203
6433b934203j734049k418689o44948J307878O52038j074848m02507K265422L318234
$$ -2934203 -4668252 -7086941 -7731889 -6424011 -5771973 -6846821 -7249328 -4983906 -1665672
6424a665672J741083L12454J031304K758912L551282K430305r47785n394455p359444
$$ -1665672 75411 387865 1419169 4178081 7729363 10159668 9211883 3817428 -3542016
6415c542016m349138R77078L491224K205907N94285N19063K31229r68789p78955
$$ -3542016 -7891154 -6914076 -3422852 -1216945 -622660 -103597 127632 -841157 -1620112
6406a620112J566117K886274P04050k842450m235906l142825j380925L45830K185813
$$ -1620112 -53995 2832279 3536329 693879 -3542027 -6684852 -8065777 -7719947 -5534134
6397e534134L352473K902194J241543n58291j759437j558738M00731K421725K078635
$$ -5534134 -2181661 720533 1962076 1403785 -355652 -1914390 -1513659 908066 2986701
6388B986701J2298m65407J326752J993255k34401k112893o40747J743867J085896
$$ 2986701 2998999 2533592 3860344 5853599 5619198 3506305 2865558 4609425 5695321
6379E695321j638655k420000q41641k28630j895136l516657l242206j747141K7092
$$ 5695321 4056666 1636666 795025 566395 -1328741 -4845398 -8087604 -9834745 -9807653
6370i807653J887120K914289K127949R05791J621399L491604L053247m79564l626150
$$ -9807653 -7920533 -5006244 -2878295 -1972504 -351105 3140499 6193746 5714182 2088032
6361B088032l619048j861134p70333q7255J421321K884641K566758P68788q28206
$$ 2088032 -1531016 -3392150 -4162483 -4249738 -2828417 56224 2622982 3391770 2563564
6352B563564j724215k468518k843123k200626j013976k06459N56454K001767L104968
$$ 2563564 839349 -1629169 -4472292 -6672918 -7686894 -7893353 -7336899 -5335132 -2230164
6343b230164K022528p34883k303766j368300o9341p34292k286644j794971J145404
$$ -2230164 -207636 -942519 -3246285 -4614585 -4683926 -5418218 -7704862 -9499833 -8354429
6334h354429L651452L426920J684333J141351K089899K043072n40752l566509
$$ -8354429 -4702977 -1276057 408276 1549627 3639526 5682598 5141846 1575337
6326A575337l583601l68896K386114J700531p68807j136106J112968K468475Q08935
$$ 1575337 -2008264 -2377160 8954 1709485 940678 -195428 917540 3386015 4194950
6317D194950j331932q17888J068962P54466j725943k689068o50444J614093J865057
$$ 4194950 2863018 2045130 3114092 3868558 2142615 -546453 -1196897 417196 2282253
6308B282253J538579K107258J764485j167929m149804l510150j02108J887806
$$ 2282253 3820832 5928090 7692575 6524646 2374842 -1135308 -1237416 650390
6300F50390R50101o17413j224445j821193k810338k680038q38756R93261J398458
$$ 650390 1600491 983078 -241367 -2062560 -4872898 -7552936 -8391692 -7398431 -5999973
6291e999973R99769P29302N74397P47356J788165K810044K064545l4584j042030
$$ -5999973 -5000204 -4270902 -3696505 -2949149 -1160984 1649060 3713605 3679021 2636991
6282B636991m00946l37055j773011k507842j091656N99555P61962O88811J876861
$$ 2636991 2236045 1898990 125979 -2381863 -3473519 -2873964 -2112002 -1423191 453670
6273D53670K830372J752550J91217P35825K727924L478239K487991J332188L64108
$$ 453670 3284042 5036592 5227809 5963634 8691558 12169797 14657788 15989976 16354084
6264A6354084j297472l126075l580468k901210k803494l444553l125610j087543
$$ 16354084 15056612 11930537 8350069 5448859 2645365 -799188 -3924798 -5012341
6256e012341J449658L056613L210053J923254j00558j367482j164732o07953p66464
$$ -5012341 -3562683 -506070 2703983 4627237 4526679 3159197 1994465 1386512 620048
6247F20048q83858p2435P30735N84910P09040K255913L451618J989967r23760
$$ 620048 -263810 -336245 394490 979400 1688440 3944353 7395971 9385938 8462178
6238H462178k133284j118946K90040J691456L718684M637118J774255l533828
$$ 8462178 6328894 5209948 5499988 7191444 10910128 15547246 17321501 13787673
6230A3787673o686680o024420m198835k821453l82199L122286M236980J344768
$$ 13787673 7100993 1076573 -3122262 -5943715 -6325914 -3203628 1033352 2378120
6222B378120j913480j590729J069152K076601L68518j818959k519621j449322
$$ 2378120 464640 -1126089 -56937 2019664 2388182 569223 -1950398 -3399720
6214c399720P59419K628034K463665O62748j25369J280523K574465J522013m52139
$$ -3399720 -2640301 -12267 2451398 3114146 2988777 4269300 6843765 8365778 7913639
6205G913639o19524P31122J035076m49565j896087j915227j126536o88807q39783
$$ 7913639 7294115 8025237 9060313 8610748 6714661 4799434 3672898 2984091 2144308
6196B144308j031309n70305P72362K262780K749814J996195P35346o04939j989999
$$ 2144308 1112999 542694 1315056 3577836 6327650 8323845 9059191 8454252 6464253
6187F464253k609091j404667R05399K221709J897647J213250P65437j75397j336659
$$ 6464253 3855162 2450495 3355894 5577603 7475250 8688500 9453937 9278540 7941881
6178G941881j407388r97760k248474m395528l640218O32537L607345J892287j248870
$$ 7941881 6534493 5536733 3288259 -1107269 -4747487 -4114950 -507605 1384682 135812
6169A35812j211815Q69745Q54803j294985k137427q20913L66977O06237J129513
$$ 135812 -1076003 -206258 648545 -646440 -2783867 -3604780 -3237803 -2631566 -1502053
6160a502053J684855O49559j522435k745176k845302l062260k723932m06846K285608
$$ -1502053 182802 832361 -690074 -3435250 -6280552 -9342812 -12066744 -12473590 -10187982
6151a0187982K520644J341293K163695M313328L435937r39560l798177k289772
$$ -10187982 -7667338 -6326045 -4162350 150978 3586915 2647355 -1150822 -3440594
6143c440594K13385P1618j407028j643300j348739j918145j892131J57819K050745
$$ -3440594 -3227209 -3155591 -4562619 -6205919 -7554658 -9472803 -11364934 -11207115 -9156370
6134i156370J149075j055795j210965O25868J494753L22795r17119l78120J698689
$$ -9156370 -8007295 -9063090 -10274055 -9648187 -8153434 -7830639 -8747758 -9125878 -7427189
6125g427189L798790M288332K565150L11979K44011K364999L322414J004163k358871
$$ -7427189 -3628399 659933 3225083 3537062 3781073 6146072 9468486 10472649 8113778
6116H113778l539027k504713j089433J73626J240833Q20068j482286l156685k092697
$$ 8113778 4574751 2070038 980605 1154231 2395064 3215132 1732846 -1423839 -3516536
6107c516536j22272R671o69074M86297K579949K603784R40186O69514J793611
$$ -3516536 -3638808 -3629137 -4298211 -3811914 -1231965 1371819 2312005 2981519 4775130
6098D775130J112574j764035l205668j544121K46589m19557k049080k406485j888691
$$ 4775130 5887704 4123669 918001 -626120 -379531 -799088 -2848168 -5254653 -7143344
6089g143344j324646K64164L163899N031717M010291J468855n17559j948552k987692
$$ -7143344 -8467990 -8203826 -5039927 -8210 4002081 5470936 4953377 3004825 17133
6080A7133k073037J226364L881853L100736M88345n12504M19312J186897J183974
$$ 17133 -2055904 -829540 3052313 6153049 6641394 6128890 6548202 7735099 8919073
6071H919073J031176r7989l030670n456816m258804n33621J680888J512984J872568
$$ 8919073 9950249 9852260 6821590 1364774 -2894030 -3427651 -1746763 -233779 1638789
6062A638789L640590L788943P20658k613236l088893j549707k75479O58667J866882
$$ 1638789 5279379 9068322 9788980 7175744 4086851 2537144 2261665 2920332 4787214
6053D787214K135242M68708j230522n50482J664851K677644J874488P52584j23695
$$ 4787214 6922456 7391164 6160642 5610160 7275011 9952655 11827143 12579727 12456032
6044A2456032j322988k340789k079739j320311j914018l389654l118975m43149
$$ 12456032 11133044 8792255 6712516 5392205 3478187 88533 -3030442 -3473591
6036c473591J909334J538229o09916k139630k344139k017408j462098l27939J095499
$$ -3473591 -1564257 -26028 -635944 -2775574 -5119713 -7137121 -8599219 -8927158 -7831659
6027g831659J742431J024704l10987p03091P35480L055381M219691L452739K106210
$$ -7831659 -6089228 -5064524 -5375511 -6078602 -5343122 -2287741 1931950 5384689 7490899
6018G490899J426539O27785j252259k721746j556075J301788K466053J025721
$$ 7490899 8917438 9545223 8292964 5571218 4015143 5316931 7782984 8808705
6010H808705k69131L08927O51838j454890m371304m904174k875031q24277j91779
$$ 8808705 8539574 8848501 9500339 8045449 3674145 -1230029 -4105060 -4929337 -5121116
6001e121116j57597K82893J100045J779531J660987L31949j128339m89973K427749
$$ -5121116 -5278713 -4995820 -3895775 -2116244 -455257 -123308 -1251647 -1741620 686129
5992F86129M262715K047415k379589m430094k653400K5214P49739j69741q86168
$$ 686129 4948844 6996259 4616670 186576 -2466824 -2441610 -1691871 -1861612 -2747780
5983b747780n07373N84206J311030O41215r33517j216503O89178K220774P13586
$$ -2747780 -3255153 -2670947 -1359917 -718702 -1652219 -2868722 -2179544 41230 754816
5974G54816k092292k288384J5300Q74595q53280j680574L39140K282395J668749
$$ 754816 -1337476 -3625860 -3610560 -2735965 -3589245 -5269819 -4930679 -2648284 -979535
5965i79535O98548J659201K000769j329481n444001m842668J01369L389876K089470
$$ -979535 -280987 1378214 3378983 2049502 -3394499 -8237167 -8135798 -4745922 -2656452
5956b656452l18868k72077Q82388L89354j120297j278383j01977M79842K6791
$$ -2656452 -2975320 -3247397 -2365009 -1975655 -3095952 -4374335 -4476312 -3996470 -3969679
5947c969679n4233Q55299J662443J457507Q96634J160568K243907K850161J939762
$$ -3969679 -4023912 -3168613 -1506170 -48663 847971 2008539 4252446 7102607 9042369
5938I042369N3958j279572j417683j184677j302215j224700l81967L73090q7618
$$ 9042369 9096327 7816755 6399072 5214395 3912180 2687480 2305513 2678603 2590985
5929B590985j186561j336113k82939P66616J102314R59279K38257j297952k513268
$$ 2590985 1404424 68311 -214628 551988 1654302 2613581 2851838 1553886 -959382
5920i59382j751000L20876R31646p83409k161490q93162J377915J433479p72211
$$ -959382 -2710382 -2389506 -1457860 -2241269 -4402759 -5295921 -3918006 -2484527 -3256738
5911c256738k138886q55408J397599K107749J123234K52303N82379J292655J109664
$$ -3256738 -5395624 -6251032 -4853433 -2745684 -1622450 -1370147 -787768 504887 1614551
5902A614551K01263N615J182303K432879J989600r6158j981527k201817r59427
$$ 1614551 1815814 1821429 3003732 5436611 7426211 7330053 5348526 3146709 2187282
5893B187282O31606J558794J167377m17052j903527k026769j368594j694708l116139
$$ 2187282 2818888 4377682 5545059 5128007 3224480 1197711 -170883 -1865591 -4981730
5884d981730l467660j335247J733764L189429K498719J000646k16363q83639p55823
$$ -4981730 -8449390 -9784637 -8050873 -4861444 -2362725 -1362079 -1578442 -2462081 -3217904
5875c217904K42789J363328J701484J335294R39907O48461J59432m28159p36585
$$ -3217904 -2975115 -1611787 89697 1424991 2364898 3013359 3172791 2744632 2008047
5866B008047o95664l15767N88104J742013K138571J189508m99837k134315l538742
$$ 2008047 1312383 996616 1584720 3326733 5465304 6654812 6154975 4020660 481918
5857D81918m242693l134028k98705K071040K190317J013988M36308M06431j59072
$$ 481918 -3760775 -6894803 -7193508 -5122468 -2932151 -1918163 -1481855 -1075424 -1234496
5848a234496q12910m13877M15548M45067O78538K750529M821471K993840k415476
$$ -1234496 -2047406 -2461283 -2045735 -1600668 -922130 1828399 6649870 9643710 7228234
5839G228234n862177l614898J363591L765280K471819K07341j083610j494294
$$ 7228234 1366057 -2248841 -885250 2880030 5351849 5559190 4475580 2981286
5831B981286j169700p7088P21958K4289j410384j618142k06374J203488J201853
$$ 2981286 1811586 1734498 2456456 2480745 1070361 -547781 -754155 449333 1651186
5822A651186n7659j565080k383004k062030r82765L8014R24029K208644L303720
$$ 1651186 1593527 28447 -2354557 -4416587 -5399352 -5361338 -4437309 -2228665 1075055
5813A075055K561146Q6398j462518n81005N29271n68041k319223j456950J736750
$$ 1075055 3636201 3722599 2260081 1679076 2208347 1640306 -678917 -2135867 -399117
5804c99117L853133L428527K096359Q79320r36694k828349k754714r62265m84412
$$ -399117 3454016 6882543 8978902 9858222 8921528 6093179 3338465 2376200 1891788
5795A891788k262516l219790j315906P78959q8670k442332k735320r91944j04529
$$ 1891788 -370728 -3590518 -4906424 -4127465 -4216135 -6658467 -9393787 -10385731 -10490260
5786a0490260o91625n75529Q91944J727436J104619R92159K816273N026613N395143
$$ -10490260 -11181885 -11757414 -10865470 -9138034 -8033415 -7041256 -4224983 801630 6196773
5777F196773L809967J445472j165097l736177n204452m686065k771912p23678
$$ 6196773 10006740 11452212 10287115 6550938 1346486 -3339579 -6111491 -6835169
5769f835169R35933K063192K057381P54305m72376n7086J483144K060412Q86722
$$ -6835169 -5899236 -3836044 -1778663 -1024358 -1496734 -1553820 -70676 1989736 2876458
5760B876458n52816p74328k56359m02401j519268k672118k833229j404012J591305
$$ 2876458 2323642 1549314 1292955 890554 -628714 -3300832 -6134061 -7538073 -5946768
5751e946768M795982N778546L460747p1679j687098r15918J37819L90040R11811
$$ -5946768 -1150786 4627760 8088507 8016828 6329730 5413812 5551631 5941671 6853482
5742F853482J953539J598451r09150k852340j596639J176730J703256m08764k092068
$$ 6853482 8807021 10405472 9496322 6643982 5047343 6224073 7927329 7518565 5426497
5733E426497j743484q76715o10555O2313J398370J394474j033662l714953l998070
$$ 5426497 3683013 2806298 2195743 2258056 3656426 5050900 4017238 302285 -3695785
5724c695785k092226M6092J447913K035407J449439j25909j318158j464348j727481
$$ -3695785 -5788011 -5741919 -4294006 -2258599 -809160 -935069 -2253227 -3717575 -5445056
5715e445056k641442k347195M71918L598659M034161K477144J946165K762295
$$ -5445056 -8086498 -10433693 -9961775 -6363116 -2328955 148189 2094354 4856649
5707D856649K335520j77014k430257k672815j894764j277741l48162J024709J372747
$$ 4856649 7192169 7015155 4584898 1912083 17319 -1260422 -1608584 -583875 788872
5698G88872J09266q09833L59025K302048K535100R71394m23857q12466j213178
$$ 788872 898138 88305 447330 2749378 5284478 6255872 5832015 5019549 3806371
5689C806371k113548k233748l78222K534100M125292K939512l04678l675974n713439
$$ 3806371 1692823 -540925 -919147 1614953 5740245 8679757 8375079 4699105 -1014334
5680a014334n972386m528359j917972M17422Q89826k57444o94654J180857L901499
$$ -1014334 -6986720 -11515079 -13433051 -13015629 -12125803 -12383247 -13077901 -11897044 -7995545
5671g995545M677638K953954P48668k87240m93348o54257l73647J141767L401086
$$ -7995545 -3317907 -363953 384715 97475 -395873 -1050130 -1423777 -282010 3119076
5662C119076M548916L114132j33883k372459j617291N71122P08797j852054l778993
$$ 3119076 7667992 10782124 10648241 8275782 6658491 7229613 7938410 6086356 2307363
5653B307363k567430k09644J49004q45943l00762J821521K823256J968383J268796
$$ 2307363 -260067 -469711 -320707 -1166650 -1467412 354109 3177365 5145748 6414544
5644F414544J404221N83380j674756l024200j892143K03343J230070J062371K64078
$$ 6414544 7818765 8402145 6727389 3703189 1811046 2014389 3244459 4306830 4570908
5635D570908j017078j901938j137399L47743J294k120680k722692l29710K188086
$$ 4570908 3553830 1651892 514493 862236 863530 -1257150 -3979842 -4309552 -2121466
5626b121466K043048L86268m98360q21863j450181j270907M75699J596539L8329
$$ -2121466 -78418 307850 -190510 -1012373 -2462554 -3733461 -3257762 -1661223 -1622894
5617a622894k219513j691406J495139M046543M016700K167654j13485j673962
$$ -1622894 -3842407 -5533813 -4038674 7869 4024569 6192223 6078738 4404776
5609D404776j368711O21088K129475J571294r4643j521114k969406m245961l418596
$$ 4404776 3036065 3657153 5786628 7357922 7263279 5742165 2772759 -1473202 -4891798
5600d891798k80857J823026R54146K94360K795182N225590K895839k096886l597199
$$ -4891798 -5172655 -3349629 -2395483 -2101123 694059 5919649 8815488 6718602 3121403
5591C121403j038772L22163j370446k003550O51551K969276J760486q49521j656761
$$ 3121403 2082631 2404794 1034348 -969202 -317651 2651625 4412111 3562590 1905829
5582A905829j023572m80248L73298J718713J735150j96595j489641k17362J671839
$$ 1905829 882257 402009 775307 2494020 4229170 4032575 2542934 2325572 3997411
5573C997411J439359o41202k773295m358196m971749l206675Q75963M204403M044031
$$ 3997411 5436770 4795568 2022273 -2335923 -7307672 -10514347 -9638384 -5433981 -1389950
5564a389950J298734j310796k504495k288036p35135J226880J802305Q01990K32837
$$ -1389950 -91216 -1402012 -3906507 -6194543 -6929678 -5702798 -3900493 -3098503 -2865666
5555b865666J089431J819296J273821N75130O08216M82161K3078O67794K134070
$$ -2865666 -1776235 43061 1316882 1892012 2500228 2982389 3005467 3673261 5807331
5546E807331J674581j222918l107147k086403j090876k407430l125711k58820
$$ 5807331 7481912 6258994 3151847 1065444 -25432 -2432862 -5558573 -5817393
5538e817393L415305L712618K069117K517872M075844K420575k121645m594134
$$ -5817393 -2402088 1310530 3379647 5897519 9973363 12393938 10272293 5678159
5530E678159l234408j403167j222418p99452J094950K560134K340723J818204
$$ 5678159 2443751 1040584 -181834 -981286 113664 2673798 5014521 6832725
5522F832725J700240O11095j495097k235952p96210L86965l85354j634671j932237
$$ 6832725 8532965 9144060 7648963 5413011 4616801 5003766 4618412 2983741 1051504
5513A051504k285274l315464l215994r71452J093259O97073o43448r2940J915665
$$ 1051504 -1233770 -4549234 -7765228 -8736680 -7643421 -6946348 -7589796 -7682736 -5767071
5504e767071K589488J423040R81861K819884M864357L912350k68298m407633n329619
$$ -5767071 -3177583 -1754543 -772682 2047202 6911559 10823909 10555611 6147978 818359
5495H18359l301727r98862L30537J774096L484512L228263J57205k474822j563099
$$ 818359 -2483368 -3482230 -3151693 -1377597 2106915 5335178 5492383 3017561 1454462
5486A454462P06845j0550l005585l196678P87838M152476L083796p2665j253320
$$ 1454462 2161307 2150757 -854828 -4051506 -3263668 888808 3972604 3899939 2646619
5477B646619o21689r01085k332077k674900r82973J351058K758290K879225K242824
$$ 2646619 2024930 1123845 -1208232 -3883132 -4866105 -3515047 -756757 2122468 4365292
5468D365292J671978J479052R09707n77055j685130q82363N59869r0760k406476
$$ 4365292 6037270 7516322 8426029 7848974 6163844 5281481 5841350 5750590 3344114
5459C344114k905684o52095J006913p1996j482118q17065K60678k43730l84194
$$ 3344114 438430 -213665 793248 721252 -760866 -1577931 -1317253 -1560983 -1945177
5450a945177K112258M765309L655063K5137j327850O54658K400136J853417Q30018
$$ -1945177 167081 4932390 8587453 8612590 7284740 7939398 10339534 12192951 13022969
5441A3022969P17757K02377j470762k668019k364068j899109k173966j841671
$$ 13022969 13740726 13943103 12472341 9804322 7440254 5541145 3367179 1525508
5433A525508j2298J625971J230951n55675k060414k897067l159606k031630P44205
$$ 1525508 1513210 3139181 4370132 3814457 1754043 -1143024 -4302630 -6334260 -5590055
5424e590055L230233L248225J305590k75543o22079p84645j173803o73372J060971
$$ -5590055 -2359822 888403 2193993 1918450 1296371 511726 -662077 -1335449 -274478
5415b74478K226670J171788r60980j580239l88968N5254j808608l784829k660452
$$ -274478 1952192 3123980 2163000 582761 193793 249047 -1559561 -5344390 -8004842
5406h004842J149630L779980K772044k25413k164126k104143r71268M60955J763086
$$ -8004842 -6855212 -3075232 -303188 -528601 -2692727 -4796870 -5768138 -5307183 -3544097
5397c544097K203279J564640Q60212Q29922N37107j043636k846978k865424r63604
$$ -3544097 -1340818 223822 1084034 1913956 2451063 1407427 -1439551 -4304975 -5268579
5388e268579J132490K205175K198379J023073j194066k809875j870883R85729
$$ -5268579 -4136089 -1930914 267465 1290538 96472 -2713403 -4584286 -3598557
5380c598557K867932K454760J486712J564731J572968m7213k063250j808575P61226
$$ -3598557 -730625 1724135 3210847 4775578 6348546 6301333 4238083 2429508 3190734
5371C190734K631148J719644n71565j831847k152736l284516m941882m507106
$$ 3190734 5821882 7541526 6969961 5138114 2985378 -299138 -5241020 -9748126
5363i748126j225238J677220J154515r86412m64053L120492N635025M390279J338781
$$ -9748126 -10973364 -9296144 -8141629 -9128041 -9592094 -6471602 -836577 3553702 4892483
5354D892483p41420j787014k329594j270326J415258K703843P17365j543646n50895
$$ 4892483 4151063 2364049 34455 -1235871 179387 2883230 3600595 2056949 1506054
5345A506054J793316J142842j902629k777874q10956k25631k435801l223585N6219
$$ 1506054 3299370 4442212 2539583 -238291 -1049247 -1274878 -3710679 -6934264 -6878045
5336f878045L704243L548221J252857N83348P94277j297907m682891m847746p82503
$$ -6878045 -3173802 374419 1627276 2210624 3004901 1706994 -2975897 -7823643 -8606146
5327h606146L236438L630709J734219P64843J354540J815252J107819k28818j392387
$$ -8606146 -5369708 -1738999 -4780 760063 2114603 3929855 5037674 4808856 3416469
5318C416469k227619k837042k940339j953914J39774K110605K253637J83794k543502
$$ 3416469 1188850 -1648192 -4588531 -6542445 -6402671 -4292066 -2038429 -1854635 -4398137
5309d398137l840964k715840L88200L900830N680928M577235J974091N87503J145926
$$ -4398137 -8239101 -10954941 -10566741 -6665911 -984983 3592252 5566343 6153846 7299772
5300G299772J583250K04838j941158k966306k839165k610771k207414q39793J144198
$$ 7299772 8883022 9087860 7146702 4180396 1341231 -1269540 -3476954 -4316747 -3172549
5291c172549K520525K821832K331589J080721p16552j844110j232460M43047J531671
$$ -3172549 -652024 2169808 4501397 5582118 4865566 3021456 1788996 2232043 3763714
5282C763714J248008k38181k436480l897019k444562J747318M588078K485374
$$ 3763714 5011722 4773541 2337061 -1559958 -4004520 -2257202 2330876 4816250
5274D816250k309375m049302j251269J436747J79517k700153k654339L50934K231430
$$ 4816250 2506875 -1542427 -2793696 -1356949 -1177432 -3877585 -6531924 -6180990 -3949560
5265c949560R17504j079090p23242J263179J692714n18727k833813k488846r0387
$$ -3949560 -3032056 -4111146 -4834388 -3571209 -1878495 -2397222 -5231035 -7719881 -7810268
5256g810268J471141J104082N87341J217555J573159J02798j844296j834044j64668
$$ -7810268 -6339127 -5235045 -4647704 -3430149 -1856990 -1754192 -3598488 -5432532 -5597200
5247e597200N75506o60410k302969k779453k027411m69109J362691K214714J326862
$$ -5597200 -5021694 -5682104 -7985073 -10764526 -12791937 -13261046 -11898355 -9683641 -8356779
5238h356779J54503N31384J416680M24087j553472r99844K285125L986923J646756
$$ -8356779 -8202276 -7670892 -6254212 -5830125 -7383597 -8383441 -6098316 -2111393 -464637
5229d64637j681802k438504j463505r49496p0587K494622M570514L428413P10203
$$ -464637 -2146439 -4584943 -6048448 -6997944 -7068531 -4573909 -3395 3425018 4135221
5220D135221l9549P62415n4289k415765l118928j628986q73001j846930k057784
$$ 4135221 4095672 4858087 4803798 2388033 -730895 -2359881 -3232882 -5079812 -7137596
5211g137596k08378J897213L156848M533567N369213L026599j746637l784109
$$ -7137596 -7345974 -5448761 -2291913 2241654 7610867 10637466 8890829 5106720
5203E106720q29908K323526P75422l054250l442153r3353K153742Q96811j461738
$$ 5106720 4276812 6600338 7375760 4321510 879357 786004 2939746 3836557 2374819
5194B374819k537247k711817k632420j722206j27982P41461N13830L76431P53078
$$ 2374819 -162428 -2874245 -5506665 -7228871 -7356853 -6615392 -6101562 -5725131 -4972053
5185d972053P23419K60062P26505K363733L312968K059277p03606l233464m289944
$$ -4972053 -4248634 -3988572 -3262067 -898334 2414634 4473911 3770305 536841 -3753103
5176c753103l252971m35921K325721L127292K407721K169379K645906K023756
$$ -3753103 -7006074 -7441995 -5116274 -1988982 418739 2588118 5234024 7257780
5168G257780l8540j300266n80619M9428j398797l461562l517769j796322m58881
$$ 7257780 7219240 5918974 5338355 5387783 3988986 527424 -2990345 -4786667 -5245548
5159e245548J62562J439012K974921K445601l96329k290564o44188K716083L922145
$$ -5245548 -5082986 -3643974 -669053 1776548 1380219 -910345 -1554533 1161550 5083695
5150E083695K139213J52307J60356J123132R46051m21622j416222j371160j018072
$$ 5083695 7222908 7375215 7535571 8658703 9604754 9183132 7766910 6395750 5377678
5141E377678q49596n04255J29690M75585J82473n30730j479940k388111k392944
$$ 5377678 4528082 4023827 4153517 4629102 4811575 4280845 2800905 412794 -1980150
5132a980150j170705j95242p59341j042740J753934N992976O296817J339045l233986
$$ -1980150 -3150855 -3346097 -4105438 -5148178 -3394244 2598732 8895549 10234594 7000608
5123G000608k642721K80002M06649j279774l43419K537217K481840r16514k808040
$$ 7000608 4357887 4637889 5044538 3764764 3421345 5958562 8440402 7523888 4715848
5114D715848j488506o76980j822352j121027K756526M516679L28336n272642n767854
$$ 4715848 3227342 2550362 728010 -393017 2363509 6880188 7208524 1935882 -3831972
5105c831972j802579J393998K255153K764439K693309J81048l075031l061370
$$ -3831972 -5634551 -4240553 -1985400 779039 3472348 3653396 578365 -2483005
5097b483005J38023K140511Q94919p96601q5083K269173L882362L457095R82224
$$ -2483005 -2344982 -204471 690448 -106153 -191236 2077937 5960299 9417394 10399618
5088A0399618k237902l635561j904674P26448J172719k11982q25387l97017q13763
$$ 10399618 8161716 4526155 2621481 3347929 4520648 4308666 3483279 3086262 2272499
5079B272499j864124j221748R80806J508234j004367l790574l905342j650014
$$ 2272499 408375 -813373 167433 1675667 671300 -3119274 -7024616 -8674630
5071h674630R86901K711855K829636J243533n71451p91044Q8244O6851q22275
$$ -8674630 -7687729 -4975874 -2146238 -902705 -1474156 -2265200 -2176956 -2110105 -2932380
5062b932380n88782R92490J934017J685597J792882K258082R35476k291065m370621
$$ -2932380 -3521162 -2528672 -594655 1090942 2883824 5141906 6077382 3786317 -584304
5053e84304l635938k023322j162783O3315K025523K234066l90389k418040m94944
$$ -584304 -4220242 -6243564 -7406347 -7343032 -5317509 -3083443 -3473832 -5891872 -6386816
5044f386816L444578M960290L202299R27974j13200n76694j148007j566796j632909
$$ -6386816 -2942238 2018052 5220351 6148325 6035125 5458431 4310424 2743628 1110719
5035A110719j227534K1905J613229J884441L81317r59363o38606R0021l86839
$$ 1110719 -116815 -94910 1518319 3402760 3784077 2824714 2186108 2276129 1889290
5026A889290j185812p52408J84823J16910k35701O99534J987519J233947j376182
$$ 1889290 703478 -48930 135893 252803 17102 716636 2704155 3938102 2561920
5017B561920k830548j259856J852871L605728K482925m83734k305949o54526K998228
$$ 2561920 -268628 -1528484 324387 3930115 6413040 5929306 3623357 2968831 5967059
5008E967059M234656J169130k676081l078191q94086k06543j995879l233832k056309
$$ 5967059 10201715 11370845 8694764 5616573 4722487 4515944 2520065 -713767 -2770076
4999b770076l45033l57708j532259j928027j025765J44517O26775M57095M84567
$$ -2770076 -3115109 -3472817 -5005076 -6933103 -7958868 -7814351 -7187576 -6730481 -6245914
4990f245914J488542L090647L921975L412662K612056K367920J755423l13302
$$ -6245914 -4757372 -1666725 2255250 5667912 8279968 10647888 12403311 12090009
4982A2090009k830970l705233k455211l67553J458068K637590K685171J495316
$$ 12090009 9259039 5553806 3098595 2731042 4189110 6826700 9511871 11007187
4974A1007187L30944N27239J310795O50199j645539l384715k914034j083733K90933
$$ 11007187 11338131 11865370 13176165 13826364 12180825 8796110 5882076 4798343 5089276
4965E089276O46462M64822k18699j787714l567157l626702j040668K166665K784121
$$ 5089276 5735738 6200560 5981861 4194147 626990 -2999712 -4040380 -1873715 910406
4956I10406L79652k039044k044283o47667J84432P59113K116305L199043K636758
$$ 910406 1290058 -748986 -2793269 -3440936 -3256504 -2497391 -381086 2817957 5454715
4947E454715J803627K531979L132093Q94803k510043l068507j282965j399045
$$ 5454715 7258342 9790321 12922414 13817217 11307174 8238667 6955702 5556657
4939E556657l675807l660325k70475J911905N22678q84965P6521L03174k186820
$$ 5556657 1880850 -1779475 -2049950 -138045 384633 -500332 -423811 -120637 -2307457
4930b307457l428874o2287M519890N443593L135954L37417k737324n517136m554036
$$ -2307457 -5736331 -5798618 -1278728 4164865 7300819 7638236 4900912 -616224 -5170260
4921e170260O91559M387110K234447j840407k371728n85086o7730K10191J850789
$$ -5170260 -4478701 -91591 2142856 302449 -2069279 -2654365 -2722095 -2511904 -661115
4912f61115J629877k420026n031640j768532K513367J809580m01002J633062M193406
$$ -661115 968762 -1451264 -6482904 -8251436 -5738069 -3928489 -4329491 -2696429 1496977
4903A496977Q88160m228819k934558K207808K578083n40248Q51329N068877L006919
$$ 1496977 2385137 -1843682 -4778240 -2570432 7651 -532597 318732 5387609 8394528
4894H394528m366355o480779j319396K223795P98583J62105J593256L53590j744220
$$ 8394528 4028173 -2452606 -3772002 -1548207 -749624 -587519 1005737 1359327 -384893
4885c84893J383482N248596L66352p677320m675954N698501O453409o57194K705615
$$ -384893 998589 6247185 6613537 -1063783 -5739737 -41236 6412173 5754979 8460594
4876H460594J3790231J0418926P66956K5864583Q5682644J08363057L9909516
$$ 8460594 22250825 32669751 33436707 59301290 144983934 253346991 293256507
4869B93256507o7046304j10245297o7588545j2073951j543062j5017748j1982918
$$ 293256507 226210203 115964906 48376361 36302410 34759348 19741600 7758682
4862G758682K353847K483033p590674p362461J524209L047518k027628j353764
$$ 7758682 10112529 12595562 5004888 -2357573 -833364 2214154 186526 -1167238
4854a167238L335742J018163n663306m732998K902448N522278J370608n59333
$$ -1167238 2168504 3186667 -2476639 -7209637 -4307189 1215089 2585697 2026364
4846B026364J803913J550772k571261m070504j327846K56670r65308r29558J086160
$$ 2026364 3830277 5381049 2809788 -1260716 -2588562 -2331892 -3297200 -4226758 -3140598
4837c140598J219098r31350j594651j03862O91145N82254J524993K318557O34573
$$ -3140598 -1921500 -2852850 -4447501 -4551363 -3860218 -3277964 -1752971 565586 1200159
4828A200159j433194o96973N71532j356871l743296j462114L273426L845444L14479
$$ 1200159 -233035 -930008 -358476 -1715347 -5458643 -6920757 -3647331 198113 512592
4819E12592j219631N23488O76603k169498l598307j543967Q88627J894776L105650
$$ 512592 -707039 -183551 493052 -1676446 -5274753 -6818720 -5930093 -4035317 -929667
4810i29667M227524K581675p89468j434577P00037O08554k895899m455471p81651
$$ -929667 3297857 5879532 5090064 3655487 4355524 4964078 2068179 -2387292 -3168943
4801c168943M231410N843688M391995K094494q04263l663896m014239j676579
$$ -3168943 1062467 6906155 11298150 13392644 12588381 8924485 4910246 3233667
4793C233667j72477j162566j617581N10443K041748k79481l918058m043984n48824
$$ 3233667 3061190 1898624 281043 791486 2833234 2553753 -1364305 -5408289 -5957113
4784e957113K430761K602106J581676J466442K220791K585048J764817j6707j763357
$$ -5957113 -3526352 -924246 657430 2123872 4344663 6929711 8694528 8677821 6914464
4775F914464k493937k039958q61956N18938J285263M80498j301153j551670Q65426
$$ 6914464 4420527 2380569 1518613 2037551 3322814 3803312 2502159 950489 1815915
4766A815915L226599K350655m30420r23362J606813L264413J206914k642254m608806
$$ 1815915 5042514 7393169 6962749 6039387 7646200 10910613 12117527 9475273 4866467
4757D866467l525806r88737O80482R0119j874527k246336O16355M132294M338895
$$ 4866467 1340661 351924 1032406 1122525 -752002 -2998338 -2381983 1750311 6089206
4748F089206J232691j543684k101012k085656k798050l013909j679535K15254
$$ 6089206 7321897 5778213 3677201 1591545 -1206505 -4220414 -5899949 -5684695
4740e684695J587124K461795K334703J32027l022986l710414m46905M013763N852709
$$ -5684695 -4097571 -1635776 698927 830954 -2192032 -5902446 -6349351 -2335588 3517121
4731C517121L948256j29942l773950m459879j665082J560534J310070k171768
$$ 3517121 7465377 7335435 3561485 -898394 -2563476 -1002942 307128 -1864640
4723a864640m624905l488268o48572J303183K359105L247048L391665K616339
$$ -1864640 -6489545 -9977813 -10626385 -9323202 -6964097 -3717049 -325384 2290955
4715B290955K240855K561993J714143j000156l123746k615822j093991j004665
$$ 2290955 4531810 7093803 8807946 7807790 4684044 2068222 974231 -30434
4707c0434j625308p64915J081884J391730k56474j522985q00026Q13237J384431
$$ -30434 -1655742 -2420657 -1338773 52957 -203517 -1726502 -2526528 -1713291 -328860
4698c28860M91243p73522j303103j083275r28315j174891j154461n75895n62178
$$ -328860 162383 -611139 -1914242 -2997517 -3925832 -5100723 -6255184 -6831079 -7393257
4689g393257j833340k657893r04668K208786L224841J531716K50506J212528K337019
$$ -7393257 -9226597 -11884490 -12789158 -10580372 -7355531 -5823815 -5573309 -4360781 -2023762
4680b023762J638576O65249J417130K377900P72470k634370m020222j393939L110675
$$ -2023762 -385186 280063 1697193 4075093 4847563 2213193 -1807029 -3200968 -90293
4671i0293N598991L780760j260115n429352m846560j59281L430709J982906k412527
$$ -90293 5508698 9289458 8029343 2599991 -2246569 -2405850 1024859 3007765 595238
4662E95238m389862j874953K097334L674448K314175L73051n8307P51118R38757
$$ 595238 -3794624 -5669577 -3572243 102205 2416380 2789431 2731124 3482242 4420999
4653D420999l54677j655799j141799N83620J227148J87045p63986n35892l25887
$$ 4420999 4066322 2410523 1268724 1852344 3079492 3266537 2502551 1966659 1640772
4644A640772j270325k460708k547955j748955j056238p73433p72102q86679m33536
$$ 1640772 370447 -2090261 -4638216 -6387171 -7443409 -8216842 -8988944 -9875623 -10309159
4635a0309159J085051K405034J717159r7428j25272J852241K462166J50854j796407
$$ -10309159 -9224108 -6819074 -5101915 -5199343 -5324615 -3472374 -1010208 -859354 -2655761
4626b655761r9373L496103M942138L314620N60483k038073l960655l899844j559973
$$ -2655761 -2755134 740969 5683107 8997727 9558210 7520137 3559482 -340362 -1900335
4617a900335M39696j58076j393418n0949K724027K795245m71434l146480k460336
$$ -1900335 -1460639 -1618715 -3012133 -3063082 -339055 2456190 1984756 -1161724 -3622060
4608c622060n681J424216J098738k72132j686213j700849L65936K553096K035387
$$ -3622060 -3627741 -2203525 -1104787 -1376919 -3063132 -4763981 -4398045 -1844949 190438
4599A90438p65462k406187j251685O44821J194622R04050O75583j57439j799287
$$ 190438 -575024 -2981211 -4232896 -3588075 -2393453 -1489403 -813820 -971259 -2770546
4590b770546k433682r41319O34518j86547k202819j647483K678634P328047P809352
$$ -2770546 -5204228 -6145547 -5511029 -5697576 -7900395 -9547878 -6869244 458803 8268155
4581H268155L341789k386542m856309l000981Q6526Q05700r82714k407150j733770
$$ 8268155 11609944 9223402 4367093 1366112 1452638 2258338 1275624 -1131526 -2865296
4572b865296n33794r57024k202113j517649J450830L329222J297528k537318l305608
$$ -2865296 -3399090 -4356114 -6558227 -8075876 -6625046 -3295824 -1998296 -4535614 -7841222
4563g841222O7230L126631K147517m79881j60595K423012K219749j935059m971692
$$ -7841222 -7773992 -4647361 -2499844 -2979725 -3140320 -717308 1502441 -432618 -5404310
4554e404310l212173K12216O42913j135665j198008R19362K319168J863329R54580
$$ -5404310 -8616483 -8404267 -7761354 -8897019 -10095027 -9175665 -6856497 -4993168 -4038588
4545d038588J44713j050721j576262M7905K398324K669994J207360P13396J270353
$$ -4038588 -3893875 -4944596 -6520858 -6472953 -4074629 -1404635 -197275 516121 1786474
4536A786474M01628j847948k516290j097162n91395j896183j932271O09071K392364
$$ 1786474 2188102 340154 -2176136 -3273298 -3864693 -5760876 -7693147 -7084076 -4691712
4527d691712J194013Q4849K024251M064816J728478l368761n383030k572533J032546
$$ -4691712 -3497699 -3412850 -1388599 2676217 4404695 1035934 -4347096 -6919629 -5887083
4518e887083K089039J643216J632595J501271J7698k018718k686764j297191J213075
$$ -5887083 -3798044 -2154828 -522233 979038 996736 -1021982 -3708746 -5005937 -3792862
4509c792862L270302L483142J539717j115935k333797j455237J50615R08316O47652
$$ -3792862 -522560 2960582 4500299 3384364 1050567 -404670 -254055 654261 1301913
4500A301913K20603K89016Q22904J243247Q01015p19112k456221l051306k016821
$$ 1301913 1522516 1811532 2634436 3877683 4678698 3959586 1503365 -1547941 -3564762
4491c564762k52079R76442J273357J077917O74965j53537j300806j813181r97701
$$ -3564762 -3816841 -2840399 -1567042 -489125 185840 32303 -1268503 -3081684 -4079385
4482d079385K35361K97133o70127p07811J005786K683313K648331J945803K247992
$$ -4079385 -3844024 -3546891 -4217018 -4924829 -3919043 -1235730 1412601 3358404 5606396
4473E606396K471997L33721l179432m149605j253394J945848J695405j227768
$$ 5606396 8078393 8412114 5232682 1083077 -170317 1775531 3470936 2243168
4465B243168l287181k923435j470959m30242J13946O46378J287442J735037J411250
$$ 2243168 -1044013 -3967448 -5438407 -5868649 -5754703 -5108325 -3820883 -2085846 -674596
4456f74596L736j639398j897606l55017J399932J745795R77130L47717J2781p56335
$$ -674596 -670860 -2310258 -4207864 -4562881 -3162949 -1417154 -440024 -92307 -79526 -835861
4446h35861j736196j588946K06445K259934K694290J274992m14433r30452n88858
$$ -835861 -2572057 -4161003 -3954558 -1694624 999666 2274658 1860225 929773 340915
4437C40915o46419j249936j271830k85218O99734J072382J564461K220401J303189
$$ 340915 -305504 -1555440 -2827270 -3112488 -2412754 -1340372 224089 2444490 3747679
4428C747679j762968m041902k495071J334037L197783K052321O11747K83659m33239
$$ 3747679 1984711 -2057191 -4552262 -3218225 -20442 2031879 2643626 2927285 2494046
4419B494046j940033k068025p5440J607391J435783J043506J470013P60215j997741
$$ 2494046 554013 -1514012 -1589452 17939 1453722 2497228 3967241 4727456 2729715
4410B729715l730580j861388J172289J579159k0396l81732Q16319J312910O44027
$$ 2729715 -1000865 -2862253 -1689964 -110805 -131201 -512933 303386 1616296 2260323
4401B260323N5531p81099k760967l955694j664163K543698M275048K772703J428121
$$ 2260323 2315854 1534755 -1226212 -5181906 -6846069 -4302371 -27323 2745380 4173501
4392D173501J611614R25066j348010k157592k08674J154142l42559j478330J158587
$$ 4173501 5785115 6710181 5362171 3204579 2995905 4150047 3807488 2329158 3487745
4383C487745M712192L774145j186750m109775j857001K000994K828169O65324
$$ 3487745 8199937 11974082 10787332 6677557 4820556 6821550 9649719 10315043
4375A0315043j461194k256125k720479l331331l086287j379627P54080J828919
$$ 10315043 8853849 6597724 3877245 545914 -2540373 -3920000 -3165920 -1337001
4367a337001J607705J122153J311443K036646K391413J734732L58342p85851j073769
$$ -1337001 270704 1392857 2704300 4740946 7132359 8867091 9225433 8439582 7365813
4358G365813j002475j734070l487332m668582l375905J68634L539892M753517
$$ 7365813 6363338 4629268 1141936 -3526646 -6902551 -6733917 -3194025 1559492
4350A559492M078512K729697Q97879j764067m416660n270520l573080m19587K374739
$$ 1559492 5638004 8367701 9265580 7501513 3084853 -2185667 -5758747 -6178334 -3803595
4341c803595L472628K424093k9567k079967k256641q45927P17404J592984J781142
$$ -3803595 -330967 2093126 2063559 -16408 -2273049 -3118976 -2401572 -808588 972554
4332I72554J096232o02731k163455j878406j10764M41430j673050m057225l164663
$$ 972554 2068786 1466055 -697400 -2575806 -2686570 -2245140 -3918190 -7975415 -11140078
4323a1140078R41816M379179M166436J457551o93198j243361j289919j212774
$$ -11140078 -10198262 -5819083 -1652647 -195096 -888294 -2131655 -3421574 -4634348
4315d634348R7464K811187M831729M091454J195134j315060j715711l34116J214283
$$ -4634348 -4536884 -1725697 3106032 7197486 8392620 7077560 5361849 5027733 6242016
4306F242016J221421p66167k904100k475429N66048K886389K053486j56069p70783
$$ 6242016 7463437 6697270 3793170 1317741 1883789 4770178 6823664 6667595 5896812
4297E896812p5564j23540m68283P60276K515420J971717k94498r41491J47562
$$ 5896812 5821248 5697708 5229425 5989701 8505121 10476838 10182340 9240849 9388411
4288I388411l48455k639973k802734o2520J009578j449235k590202P11090L417100
$$ 9388411 9039956 6399983 3597249 3534729 4544307 3095072 504870 1215960 4633060
4279D633060L23619m558680l916060J149151L273443O83710j243519K27258J674361
$$ 4633060 4956679 397999 -3518061 -2368910 904533 1588243 344724 571982 2246343
4270B246343O53783o29159m18836k02508o82083l27655N08945o49113k979170
$$ 2246343 2900126 2270967 1852131 1649623 967540 639885 1148830 499717 -2479453
4261b479453k217930K048130M493941K078177j317340j381126M49121R16563N47966
$$ -2479453 -4697383 -2649253 1844688 3922865 2605525 1224399 1673520 2590083 3138049
4252C138049J174924J548582k36708k679272l147942k015993j212128q48249k67449
$$ 3138049 4312973 5861555 5624847 2945575 -202367 -2218360 -3430488 -4278737 -4546186
4243d546186j04178m56458M25600K731569L233978J54753k957148k037414J287545
$$ -4546186 -4650364 -5106822 -4681222 -1949653 1284325 1439078 -1518070 -3555484 -2267939
4234b267939K431180P46214o14937k35491N14738J081400K249354L337849K433767
$$ -2267939 163241 909455 294518 59027 573765 1655165 3904519 7242368 9676135
4225I676135m98681l423020m847860m434709k001867J548942L410977J730732
$$ 9676135 9177454 5754434 906574 -3528135 -5530002 -3981060 -570083 1160649
4217A160649j538495l009328j952549J87969K582054M564224M315021J303727
$$ 1160649 -377846 -3387174 -5339723 -5151754 -2569700 1994524 6309545 7613272
4209G613272j548259j508231k08909o58902j916967r30215J805456K988210J915167
$$ 7613272 6065013 4556782 4347873 3688971 1772004 841789 2647245 5635455 7550622
4200G550622O02616n88917k641129l935980j907357J585502K033289l36474p43778
$$ 7550622 8153238 7564321 4923192 987212 -920145 665357 2698646 2362172 1618394
4191A618394J720770K069585k080491n891985m527309j32928K218954J721743
$$ 1618394 3339164 5408749 3328258 -2563727 -7091036 -7223964 -5005010 -3283267
4183c283267J027998J239263J602125K130800L054757L061296R14025k230469
$$ -3283267 -2255269 -1016006 586119 2716919 5771676 8832972 9746997 7516528
4175G516528m122656l841479j627769J804973M457864L853868L35235k608890
$$ 7516528 3393872 -447607 -2075376 -270403 4187461 8041329 8376564 5767674
4167E767674k796722j738830j231901o37221N40504O61732q68517j521146K85638
$$ 5767674 2970952 1232122 221 -637000 -96496 565236 -303281 -1824427 -1538789
4158a538789J964018R23335q41743j11520K098801K595916J404412O66910K5025
$$ -1538789 425229 1348564 506821 395301 2494102 5090018 6494430 7161340 7186365
4149G186365j907416k813402Q54602O737029P625502R88842p306914j0500211
$$ 7186365 5278949 2465547 3320149 10057178 17682680 18671522 11364608 864397
4141H64397q007968l257730J293503M302692M283864J587775o16324k70554N09194
$$ 864397 -7143571 -10401301 -9107798 -4805106 -521242 1066533 450209 179655 688849
4132F88849r93498l315629k832762N54075L094938K367408j30637j842955k026279
$$ 688849 -304649 -3620278 -6453040 -5898965 -2804027 -436619 -567256 -2410211 -4436490
4123d436490j083309O41048K163082J764560p69969k905133k044734J013667K933627
$$ -4436490 -5519799 -4878751 -2715669 -951109 -1721078 -4626211 -6670945 -5657278 -2723651
4114b723651K100333L82883R9505P93349M34979j080562j621822j83241J270718
$$ -2723651 -623318 -240435 -140930 652419 1087398 6836 -1614986 -1798227 -527509
4105e27509M27765k037990l225485j720550Q33100K029192J457210O61384J025646
$$ -527509 -99744 -2137734 -5363219 -7083769 -6250669 -4221477 -2764267 -2102883 -1077237
4096a077237K290153K954391J871973m05045j866334j043866J128085K046826
$$ -1077237 1212916 4167307 6039280 5634235 3767901 2724035 3852120 5898946
4088E898946M27241k010262k554379q44237Q22086N56918r20262j728478j367287
$$ 5898946 6326187 4315925 1761546 917309 1739395 2296313 1376051 -352427 -1719714
4079a719714p20456l14657l9693k29519j370600k679283k594995r85408P09532
$$ -1719714 -2440170 -2754827 -2794520 -3024039 -4394639 -7073922 -9668917 -10654325 -9944793
4070i944793J802302K966962M115214L972661K641197J949151J853798m11997
$$ -9944793 -8142491 -5175529 -1060315 2912346 5553543 7502694 9356492 8944495
4062H944495n202821p706592m159120J653756K884900p85937l269241j319880
$$ 8944495 3741674 -3964918 -8124038 -6470282 -3585382 -4371319 -7640560 -8960440
4054h960440J888858L113743L328782L710121K488379j134289m010535l351288
$$ -8960440 -7071582 -3957839 -629057 3081064 5569443 4435154 424619 -2926669
4046b926669q40042N88379J055045J756487J719207N6934j142990R9466J866142
$$ -2926669 -3766711 -3178332 -2123287 -366800 1352407 1409341 266351 365817 2231959
4037B231959J282694p59896j530626j168744j544088k190407j583766r32846k155770
$$ 2231959 3514653 2754757 1224131 55387 -1488701 -3679108 -5262874 -6195720 -8351490
4028h351490l301584r62137L337326M372647J110039j656982n02596K433694L839802
$$ -8351490 -11653074 -12615211 -9277885 -4905238 -3795199 -5452181 -5954777 -3521083 318719
4019C18719L557238K693690J156636q09223j615822p79232P9497q617j53125q9146
$$ 318719 3875957 6569647 7726283 6917060 5301238 4522006 4601503 4592886 4439761 4350615
4009D350615q76557k094952j673850J74347M37174j555023k210159P25417M194343
$$ 4350615 3474058 1379106 -294744 -120397 316777 -1238246 -3448405 -2722988 1471355
4000A471355M388408K157155O13226R2215r14752k030827j955154j551422k394311
$$ 1471355 5859763 8016918 8630144 8722359 7807607 5776780 3821626 2270204 -124107
3991a24107l462329k643178m55345R91419J694511L038934M301831L499971J217532
$$ -124107 -3586436 -6229614 -6684959 -5693540 -3999029 -960095 3341736 6841707 8059239
3982H059239p0122l06432j716482m102375m201127q85639K472671K626864P26517
$$ 8059239 7989117 7682685 5966203 1863828 -2337299 -3222938 -750267 1876597 2603114
3973B603114q417J186800K484359K503905J623204R07120R77424J540185J460850
$$ 2603114 2594697 3781497 6265856 8769761 10392965 11300085 12277509 13817694 15278544
3964A5278544m9492k085942k874683k136409j385400j630941k256549k575132
$$ 15278544 15229052 13143110 10268427 8132018 6746618 5115677 2859128 283996
3956B83996k776241k602245r65504J808139L045065R21468k477283l376938j160237
$$ 283996 -2492245 -5094490 -6059994 -4251855 -1206790 -285322 -2762605 -6139543 -7299780
3947g299780J015517N42061j538289k383213q54592J804648L799567M100811K474507
$$ -7299780 -6284263 -5742202 -7280491 -9663704 -10518296 -8713648 -4914081 -813270 1661237
3938A661237m32505k883825l053641r00371J486362J957897L98404j580722k469213
$$ 1661237 1228732 -1655093 -4708734 -5609105 -4122743 -2164846 -1766442 -3347164 -5816377
3929e816377j852247k39300J224766J354345K16039n64704J84374J407326J379818
$$ -5816377 -7668624 -7907924 -6683158 -5328813 -5112774 -5677478 -5493104 -4085778 -2705960
3920b705960L75430j18090k90307j486962k831165j658667J721538L221870R69973
$$ -2705960 -2330530 -2448620 -2738927 -4225889 -7057054 -8715721 -6994183 -3772313 -2802340
3911b802340j253844L12106L185527K318212j787387l544844n96290L062283L213688
$$ -2802340 -4056184 -3744078 -558551 1759661 -27726 -3572570 -4168860 -1106577 2107111
3902B107111O15200j597709k316349k090644r31771J089049K622531K460908J192199
$$ 2107111 2722311 1124602 -1191747 -3282391 -4214162 -3125113 -502582 1958326 3150525
3893C150525J00019m98216p72258n66161j53768m36005j260407r83621J007270
$$ 3150525 3250544 2752328 1980070 1413909 1260141 824136 -436271 -1419892 -412622
3884d12622K742565K148650l0383j255472k64130K076688M006249L838098Q84501
$$ -412622 2329943 4478593 4448210 3192738 2928608 5005296 9011545 12849643 13734144
3875A3734144l248818n404635m284060k005396r37556m78541J093687K981093
$$ 13734144 10485326 5080691 796631 -1208765 -2146321 -2624862 -1531175 1449918
3867A449918K772801M56594j192992n27335Q74949O80813j226381k963006k835930
$$ 1449918 4222719 4679313 3486321 2958986 3833935 4514748 3288367 325361 -2510569
3858b510569r58618O55787j12843k703360l584080l36068M502431N827831K328651
$$ -2510569 -3469187 -2813400 -2926243 -5629603 -9213683 -9549751 -5047320 780511 3109162
3849C109162j791142k220508L77989K123746J228873m51103p20243O5478J53886
$$ 3109162 1318020 -902488 -524499 1599247 2828120 2377017 1656774 1722252 1876138
3840A876138o53880o60718Q90121K000659M40790k477661k936153p754K461916
$$ 1876138 1222258 561540 1451661 3452320 3893110 1415449 -1520704 -1528458 933458
3831I33458J129435j878499k052023R24577L174996K699972J603775J634680J226182
$$ 933458 2062893 184394 -1867629 -943052 2231944 4931916 6535691 8170371 9396553
3822I396553j245704m198018n124388m060298k553497r09163J218306K862157
$$ 9396553 8150849 3952831 -1171557 -5231855 -7785352 -8694515 -7476209 -4614052
3814d614052K829604J892361J618904J685051O40631j078394j378318R5842J091989
$$ -4614052 -1784448 107913 1726817 3411868 4052499 2974105 1595787 1691629 2783618
3805B783618K3522j676632j566281N15155K232394J483758j234792l216711k362895
$$ 2783618 2807140 1130508 -435773 79382 2311776 3795534 2560742 -655969 -3018864
3796c018864L81116K026436J233735j26651O0763J039384P57917n26420p05404
$$ -3018864 -2637748 -611312 622423 495772 556535 1595919 2353836 1827416 1122012
3787A122012M32127P10272n84103j104908P68300K796913J839326j387240l094528
$$ 1122012 1554139 2264411 1680308 575400 1343700 4140613 5979939 4592699 1498171
3778A498171j624510O14072R14498j70664l94219M87584N63687r57257k290611
$$ 1498171 -126339 487733 1402231 1231567 837348 1324932 1888619 931362 -1359249
3769a359249j711859k32425j17364j389410j711642K1792J851577J540905k53178
$$ -1359249 -3071108 -3303533 -3420897 -4810307 -6521949 -6500157 -4648580 -3107675 -3360853
3760c360853j123497l48505M99009L8489j349246k400513k188236n62074J486643
$$ -3360853 -4484350 -4832855 -4333846 -4295357 -5644603 -8045116 -10233352 -10795426 -9308783
3751i308783K151938P93459p02324k4552K378644L945872L580321K444618J204515
$$ -9308783 -7156845 -6363386 -7065710 -7090262 -4711618 -765746 2814575 5259193 6463708
3742F463708q36205l127927l229287m47335K117909J249322k220797m813817m600851
$$ 6463708 5627503 2499576 -729711 -1177046 940863 2190185 -30612 -4844429 -9445280
3733i445280k227762P60512K635455J983257l14054j017696J149486K756077L60191
$$ -9445280 -11673042 -10912530 -8277075 -6293818 -6607872 -7625568 -6476082 -3720005 -3359814
3724c359814l518480l300324J247595M223215K106815j506584j851096K76590
$$ -3359814 -6878294 -10178618 -8931023 -4707808 -2600993 -4107577 -5958673 -5682083
3716e682083R24454o93402j940811j276688L62457J950552L200859L349766J717117
$$ -5682083 -4757629 -5451031 -7391842 -8668530 -8306073 -6355521 -3154662 195104 1912221
3707A912221n54044j528801j243330j397613k314454k361706p28437J223326J992266
$$ 1912221 1358177 -170624 -1413954 -2811567 -5126021 -7487727 -8216164 -6992838 -5000572
3698e000572J666569R91625K05240m70186m37995L89853J226398J442058J160178
$$ -5000572 -3334003 -2342378 -2137138 -2607324 -3045319 -2655466 -1429068 12990 1173168
3689A173168O26082k2390k64904L08185R38210N73787j45951L11532J267174j3420
$$ 1173168 1799250 1776860 1511956 1820141 2758351 3332138 3186187 3497719 4764893 4751473
3679D751473l866800o421211m417260L2049K218533J203792L44643J770580L487911
$$ 4751473 884673 -5536538 -9953798 -9921749 -7703216 -6499424 -6154781 -4384201 -896290
3670h96290K783686K604k467572l317915k967112k091068q53514O97982K212407
$$ -896290 1887396 1890000 -577572 -3895487 -6862599 -8953667 -9807181 -9109199 -6896792
3661f896792K947054K140961L0562j732211j666335l52118M43496L78868O69557
$$ -6896792 -3949738 -1808777 -1778215 -3510426 -5176761 -5528879 -5085383 -4706515 -4036958
3652d036958J526538J503334J28667q25650J932J329866J213249q9792q52185
$$ -4036958 -2510420 -1007086 -878419 -1704069 -1702137 -372271 840978 751186 -100999
3643a00999l81948P35550J823480K073256O00396j796604k423177l10131J559601
$$ -100999 -482947 252603 2076083 4149339 4749735 2953131 529954 219823 1779424
3634A779424L28640k017196j590003Q51785Q38718k270211l670300o11466L076360
$$ 1779424 2108064 90868 -1499135 -647350 191368 -2078843 -5749143 -6360609 -3284249
3625c284249K735765n58335k586816k231910j371049o60400N74819J526165Q85248
$$ -3284249 -548484 -1106819 -3693635 -5925545 -7296594 -7956994 -7382175 -5856010 -4970762
3616d970762m0008J053836K995151K093382k009210n018172l647675L26916L019454
$$ -4970762 -5010770 -3956934 -961783 1131599 -877611 -5895783 -9543458 -9216542 -6197088
3607f197088K982973J366919l68092j240546p49051M19176O71670m73603j576797
$$ -6197088 -3214115 -1847196 -2215288 -3455834 -4204885 -3785709 -3114039 -3587642 -5164439
3598e164439j180774M57187K027266K481366J410224n66536j590629l70808J579329
$$ -5164439 -6345213 -5888026 -3860760 -1379394 30830 -535706 -2126335 -2497143 -917814
3589i17814J507858l66566p01536J877505M202358L013656k52595j695165m83355
$$ -917814 590044 223478 -478058 1399447 5601805 8615461 8362866 6667701 6184346
3580F184346O20301l56144k238809k836861j587035K17480P74558n33017k089324
$$ 6184346 6804647 6448503 4209694 1372833 -214202 3278 777836 244819 -1844505
3571a844505j442948J404475L367469K267026m2339n48455L29990j17342j928006
$$ -1844505 -3287453 -1882978 1484491 3751517 3709178 3160723 3490713 3373371 1445365
3562A445365k088381M69741K762634K041415m16085j683685j352753j035032j012416
$$ 1445365 -643016 -173275 2589359 4630774 4214689 2531004 1178251 143219 -869197
3553h69197l2741J774938K249436K92052k068207k034013L94247K639149L018682
$$ -869197 -901938 873000 3122436 3414488 1346281 -687732 -293485 2345664 5364346
3544E364346K355736J717414L61856k476561m960840m264234p69212J801267J199707
$$ 5364346 7720082 9437496 9799352 7322791 2361951 -1902283 -2671495 -870228 329479
3535C29479o55244j039338k42898p4437m31227N922Q03648L69281r32376j071786
$$ 329479 -325765 -1365103 -1608001 -1682438 -2113665 -2107743 -1304095 -934814 -1867190 -2938976
3525b938976J33879M82568j039442k557855k184723n64326O94613J467544K501632
$$ -2938976 -2805097 -2322529 -3361971 -5919826 -8104549 -8668875 -7974262 -6506718 -4005086
3516d005086L446820L040743R59951j477435k481229j413288N79556J631523J107948
$$ -4005086 -558266 2482477 3442428 1964993 -516236 -1929524 -1349968 281555 1389503
3507A389503J6479q62541k017483l282594k568862J061982M290701L007581j286172
$$ 1389503 1405982 543441 -1474042 -4756636 -7325498 -6263516 -1972815 1034766 -251406
3498b51406k571785J109541M314759K025669k727493l114686J630560N285524
$$ -251406 -2823191 -1713650 2601109 4626778 1899285 -1215401 415159 5700683
3490E700683L487799p84376k145928q9168J321575l71253k999318l326016j569072
$$ 5700683 9188482 8404106 6258178 6169010 7490585 7119332 4120014 793998 -775074
3481g75074p10749j946827k899489j183341J928062L236996K115145R26288J088590
$$ -775074 -1485823 -3432650 -6332139 -7515480 -5587418 -2350422 -235277 691011 1779601
3472A779601J281148K90908p79755n89819Q9403j10460p08306l46331P44222J098404
$$ 1779601 3060749 3351657 2571902 1982083 2071486 1961026 1252720 906389 1650611 2749015
3462B749015K91165p41051j282554j362043r80784n4739R89595J470304J197883
$$ 2749015 3040180 2299129 1016575 -345468 -1326252 -1380991 -391396 1078908 2276791
3453B276791N02577o7227J33956J147236J661134L54779j679695j768683L23101
$$ 2276791 2779368 2712141 2846097 3993333 5654467 6009246 4329551 2560868 2883969
3444B883969J496825j37411k238334j925047k55364j14918j346100j398070R7106
$$ 2883969 4380794 4243383 2005049 80002 -175362 -290280 -1636380 -3034450 -2937344
3435b937344Q91496K5545j050648j365569j463650j302477j2998J773111K148572
$$ -2937344 -2045848 -2020303 -3070951 -4436520 -5900170 -7202647 -7215645 -5442534 -3293962
3426c293962J113743Q31290J947067K392471R00706r41348j530905j708966k716977
$$ -3293962 -2180219 -1348929 598138 2990609 3891315 2949967 1419062 -289904 -3006881
3417c006881l717221l128077r47244J677650L809996M552441L140525L96051j510472
$$ -3006881 -6724102 -9852179 -10799423 -9121773 -5311777 -759336 2381189 2777240 1266768
3408A266768j815498j882700k192749j080966J792982L316553J035497k498310
$$ 1266768 -548730 -2431430 -4624179 -5705145 -3912163 -595610 439887 -2058423
3400b058423k771219K91014K328534Q56951j548051j188155J944855M536075L876668
$$ -2058423 -4829642 -4538628 -2210094 -1353143 -2901194 -4089349 -2144494 2391581 6268249
3391F268249M77426k673077l060306j093971O22000O35691K11341Q00227J439916
$$ 6268249 6745675 4072598 1012292 -81679 540321 1176012 1387353 2187580 3627496
3382C627496M51121j328055j402493M93624J741121N74752j456366j658684M93290
$$ 3627496 4078617 2750562 1348069 1841693 3582814 4157566 2701200 1042516 1535806
3373A535806L044256L696974J780581j147898k457618j054227J116233J189344
$$ 1535806 4580062 8277036 10057617 8909719 6452101 5397874 6514107 7703451
3365G703451j062036l145636l360673k635634k328283k066072r73376M86623J456271
$$ 7703451 6641415 3495779 135106 -2500528 -4828811 -6894883 -7868259 -7381636 -5925365
3356e925365K295339L443721L549376R96147k821507m127784j487624K000230
$$ -5925365 -3630026 -186305 3363071 4359218 1537711 -2590073 -4077697 -2077467
3348b077467K569849M19993j255947r01579n87O4597J17854J095677J792228O15372
$$ -2077467 492382 912375 -343572 -1245151 -1245738 -1181141 -1063287 32390 1824618 2439990
3338B439990j380023j373280J300460L909687L580561N65029k366625k878595
$$ 2439990 1059967 -313313 987147 4896834 8477395 9042424 6675799 3797204
3330C797204q24882K153263M049456L867503K068462l16784k662032m346216m164772
$$ 3797204 2972322 5125585 9175041 13042544 15111006 14794222 12132190 7785974 3621202
3321C621202j658979J186609J511885o87219k289552j378876J19996l81254k092866
$$ 3621202 1962223 3148832 4660717 3973498 1683946 305070 425066 43812 -2049054
3312b049054k179412j02986J778093J731698O23949O5628L09942N96353L95017
$$ -2049054 -4228466 -4331452 -2553359 -821661 -197712 -132084 177858 774211 1169228
3303A169228k69854r75550j071830l11036O30248Q97703O62773Q61918J772107
$$ 1169228 899374 -76176 -1148006 -1459042 -828794 68909 731682 1593600 3365707
3294C365707K522900K028149j7336k734767m204023k767854Q65574L506655K723693
$$ 3365707 5888607 7916756 7899420 5164653 960630 -1807224 -941650 2565005 5288698
3285E288698k34805k026655j291738L39754R93432N04327n08451j696804k457503
$$ 5288698 5053893 3027238 1735500 2075254 3068686 3573013 3064562 1367758 -1089745
3276a089745j827802J48083J879743J879569M11774r38984q32061Q12691K613409
$$ -1089745 -2917547 -2769464 -889721 989848 1401622 462638 -369423 443268 3056677
3267C056677K462259n46618m569590o249793l999474M35513L855035M507610L106437
$$ 3056677 5518936 4972318 402728 -5847065 -9846539 -9411026 -5555991 -1048381 2058056
3258B058056J628853J263171J246194L9692k097297k817480r84678J030513L00717
$$ 2058056 3686909 4950080 6196274 6235966 4138669 1321189 336511 1367024 1667741
3249A667741k257220k931782m99081K200545K458099R91185R5699O00957J757248
$$ 1667741 -589479 -3521261 -4020342 -1819797 638302 1629487 1725186 2326143 4083391
3240D083391K441476J621281o90070k406900j405507R28057R62904j462916k064122
$$ 4083391 6524867 8146148 7456078 5049178 3643671 4571728 5534632 4071716 2007594
3231B007594J209870M157329K252066k447433m494044k989127j575384j737882
$$ 2007594 3217464 7374793 9626859 7179426 2685382 -303745 -1879129 -3617011
3223c617011j304403L77783Q82438n76617j452205n99956m55027k176285k647937
$$ -3617011 -4921414 -4543631 -3661193 -4237810 -5690015 -6289971 -6744998 -8921283 -11569220
3214a1569220M88630M208934M389574K156524J621358K978882K607371n04792
$$ -11569220 -11080590 -6871656 -2482082 -325558 1295800 4274682 6882053 6377261
3206F377261l165083l298497k477425j956651m61899J981695K096480j471232
$$ 6377261 3212178 -86319 -2563744 -4520395 -4982294 -3000599 -904119 -2375351
3198b375351m316289j910684L073896M009919J8424k878571r44170K208562J992317
$$ -2375351 -6691640 -8602324 -5528428 -1518509 -1500085 -4378656 -5322826 -3114264 -1121947
3189a121947l42774r22788K01510K58398o46385r7108J321630L35036k990091
$$ -1121947 -1464721 -2387509 -2185999 -1927601 -2573986 -2671094 -1349464 -1014428 -4004519
3180d004519m301295j547757J705151J809120K17984K05910J420619J299674r3400
$$ -4004519 -8305814 -9853571 -8148420 -6339300 -6121316 -5915406 -4494787 -3195113 -3288513
3171c288513m25336P34334J544989J228907P12469K72308m72753m80901J554616
$$ -3288513 -3713849 -2979515 -1434526 -205619 506850 779158 306405 -174496 1380120
3162A380120L863890K959854q55842k949493r74358J367115j92663m015600n092240
$$ 1380120 5244010 8203864 7348022 4398529 3424171 4791286 4598623 583023 -4509217
3153d509217k412788J40390o257q40260K63002K412875L105626K229502J672801
$$ -4509217 -6922005 -6781615 -6787872 -7628132 -7365130 -4952255 -1846629 382873 2055674
3144B055674J853915J188764q71662k493850k038326l39700Q21656J264159J886446
$$ 2055674 3909589 5098353 4226691 1732841 -305485 -645185 176471 1440630 3327076
3135C327076K558963K440777J881705J838752J552071o01047l490835l536129
$$ 3327076 5886039 8326816 10208521 12047273 13599344 12998297 9507462 5971333
3127E971333j56283K136810j18059l617621k690803J987543L883079J00427m406563
$$ 5971333 5815050 7951860 7833801 4216180 1525377 3512920 7395999 7496426 3089863
3118C089863m136219n66290R36167q72799k188149l90658K462463K925622L42692
$$ 3089863 -1046356 -1612646 -676479 -1549278 -3737427 -4128085 -1665622 1260000 1602692
3109A602692l235597n508681n227478k353592J759384M856901N506103M308812
$$ 1602692 -1632905 -7141586 -12369064 -14722656 -12963272 -8106371 -2600268 1708544
3101A708544K869090J765393L00977j668074k681984j400297J086142K040207
$$ 1708544 4577634 6343027 6644004 4975930 2293946 893649 1979791 4019998
3093D019998M48799j732200k419956k073318k172421k327759j047967J201569
$$ 4019998 4468797 2736597 316641 -1756677 -3929098 -6256857 -7304824 -6103255
3085f103255K132694R53209p04150j574194k155917k553233j409561J482711L630819
$$ -6103255 -3970561 -3017352 -3721502 -5295696 -7451613 -10004846 -11414407 -9931696 -6300877
3076f300877K929131Q14076K69315J761971L196840L130367K052901R87533O00975
$$ -6300877 -3371746 -2557670 -2288355 -526384 2670456 5800823 7853724 8841257 9442232
3067I442232J257621K304471J867929q72812l817072m347862l070451k791353
$$ 9442232 10699853 13004324 14872253 13999441 10182369 5834507 2764056 -27297
3059b7297l998151m095216j616520J490052K915901K981158K987226K560914P76251
$$ -27297 -4025448 -8120664 -9737184 -8247132 -5331231 -2350073 637153 3198067 3974318
3050C974318j264710j290048Q83265K743965K108035l41634j994059j264823P55910
$$ 3974318 2709608 1419560 2302825 5046790 7154825 6813191 4819132 3554309 4310219
3041D310219J602656L34081j259488r24426R54954J734934J03858k172476k806389
$$ 4310219 5912875 6246956 4987468 4063042 5017996 6752930 6856788 4684312 1877923
3032A877923j923730j232362j279551j096764j23693J043710J820420K250791
$$ 1877923 -45807 -1278169 -2557720 -3654484 -3778177 -2734467 -914047 1336744
3024A336744K235560J254088o47426k332512k614019j542638l53176j82676q06049
$$ 1336744 3572304 4826392 4178966 1846454 -767565 -2310203 -2663379 -2846055 -3652104
3015c652104o45474J487234M397881N080691K179502j760407k864191n61529J864041
$$ -3652104 -4297578 -2810344 1587537 6668228 8847730 7087323 4223132 3661603 5525644
3006E525644J546468p85343k584755k796266k043771p83454Q50039J896570J219065
$$ 5525644 7072112 6286769 3702014 905748 -1138023 -1921477 -1071438 825132 2044197
2997B044197o14056j792647j933519k566912m220691m740536k020056K648973
$$ 2044197 1430141 -362506 -2296025 -4862937 -9083628 -13824164 -15844220 -13195247
2989a3195247N684192N294042K952651R74325J85645K25977O12011P42684k6062
$$ -13195247 -7511055 -2217013 735638 1709963 1895608 2121585 2733596 3476280 3450218
2980C450218j362386j765560l40675J752499K567748J719468M61212l33551r91475
$$ 3450218 2087832 322272 -18403 1734096 4301844 6021312 6482524 6148973 5157498
2971E157498j594064j078585J114547L212218K465623j364369n070785n426744
$$ 5157498 3563434 2484849 3599396 6811614 9277237 7912868 2842083 -2584661
2963b584661k880604p42130r72634k121839j760512L15997K207046K404303J137675
$$ -2584661 -5465265 -6207395 -7180029 -9301868 -11062380 -10746383 -8539337 -6135034 -4997359
2954d997359l14454p27190K96726J763060J858556L711k088080k427156j277676
$$ -4997359 -5311813 -6039003 -5742277 -3979217 -2120661 -2116950 -4205030 -6632186 -7909862
2945g909862l35937L7498Q66833K052364K136874J040819O51394J604348J762127
$$ -7909862 -8245799 -8208301 -7341468 -5289104 -3152230 -2111411 -1460017 144331 1906458
2936A906458l80356k732145k353719J54830J585961P90468k25327Q9623O09765
$$ 1906458 1526102 -1206043 -3559762 -3404932 -1818971 -1028503 -1253830 -1164207 -554442
2927e54442k63964k019566k832917j948914k94991P90280Q30778M47800N63730
$$ -554442 -818406 -2837972 -5670889 -7619803 -7914794 -7124514 -6293736 -5845936 -5282206
2918e282206J288116J834197J745018J550228J644497J364076J77255j031010
$$ -5282206 -3994090 -2159893 -414875 1135353 2779850 4143926 4321181 3290171
2910C290171j228476j066152j695187k279717r39302J750044K685009N92030j750275
$$ 3290171 2061695 995543 -699644 -2979361 -3918663 -2168619 516390 1108420 -641855
2901f41855j247864J167296J932379k73480l099167l834490k364135l79678R63456
$$ -641855 -1889719 -722423 1209956 936476 -2162691 -5997181 -8361316 -8740994 -7777538
2892g777538J686010K018549J876231J350004J025101J404754K243896K758707
$$ -7777538 -6091528 -4072979 -2196748 -846744 178357 1583111 3827007 6585714
2884F585714K365986J017626q18164k026240j252293J406923L319121J608994
$$ 6585714 8951700 9969326 9151162 7124922 5872629 7279552 10598673 12207667
2876A2207667k855385n418320k901711K271619M820492K687694j328826l548711
$$ 12207667 9352282 3933962 1032251 3303870 8124362 10812056 9483230 5934519
2868E934519l123967j656186p51444o68934o44901q2446N17473J69302r75906
$$ 5934519 2810552 1154366 402922 -266012 -910913 -993359 -475886 -306584 -1282490
2859a282490j690932j786293k541684l978254l666460k05076L856590N110240
$$ -1282490 -2973422 -4759715 -7301399 -11279653 -14946113 -15151189 -11294599 -6184359
2851f184359L859628K689834J836619l01989k766446k465189O07385K656131J617078
$$ -6184359 -2324731 365103 2201722 1899733 -866713 -3331902 -2724517 -68386 1548692
2842A548692k80177o74080j11296N65083K077141L905874L291304l07451l028290
$$ 1548692 1268515 594435 483139 1048222 3125363 7031237 10322541 10015090 6986800
2833F986800j894283O39464P35678q89757r22410O64359Q70939j119609k800225
$$ 6986800 5092517 5731981 6467659 5577902 4655492 5319851 6190790 5071181 2270956
2824B270956k197715J09237K594732L899547K824426l58146l093652l276673k055301
$$ 2270956 73241 182478 2777210 6676757 9501183 9143037 6049385 2772712 717411
2815G17411j721535j965372r57388Q81711J408378N49874L31474J171530J273697
$$ 717411 -1004124 -2969496 -3926884 -3045173 -1636795 -1086921 -755447 416083 1689780
2806A689780O1894o66101K36195J457316J344837R9202q68031o23313M90703J026727
$$ 1689780 1751674 1085573 1321768 2779084 4123921 4223123 3355092 2731779 3222482 4249209
2796D249209j08036j786015j693690j49873n16168l940033o503295m603088m76752
$$ 4249209 4141173 2355158 661468 511595 -4573 -3944606 -10447901 -15050989 -15527741
2787a5527741J513511J603977K816825M469967L332234K92898l66612J574571
$$ -15527741 -14014230 -12410253 -9593428 -5123461 -1791227 -1498329 -1864941 -290370
2779b90370J833609n61549j427925R12575K528918J101570R3423K053386L422486
$$ -290370 1543239 981690 -446235 466340 2995258 4096828 4190251 6243637 9666123
2770I666123O96414k946248k514217P92090J902180j59656j841665j208405J27646
$$ 9666123 10362537 7416289 4902072 5694162 7596342 7436686 5595021 4386616 4514262
2761D514262N57312K08175m15616o95806L64197K373059L010059J483555L64520
$$ 4514262 5071574 5279749 4864133 4168327 4532524 6905583 9915642 11399197 11763717
2752A1763717J309837J583387j617823n776323o225202k965252K9457R63306J183691
$$ 11763717 13073554 14656941 13039118 7262795 1037593 -1927659 -1898202 -934896 248795
2743B48795R87464p37238k835789k382482O54712L046764L033008J960505R98006
$$ 248795 1236259 499021 -2336768 -4719250 -4064538 -1017774 2015234 3975739 4973745
2734D973745k14631j298743j076552k84259r26130k425466j936087Q50677K833011
$$ 4973745 4759114 3460371 2383819 2099560 1173430 -1252036 -3188123 -2337446 495565
2725D95565K405556J628268K111825K219401L29424k006454k386353r88368J79268
$$ 495565 2901121 4529389 6641214 8860615 9190039 7183585 4797232 3808864 3988132
2716C988132p7477j461147k661205j897185J164930L761370K745369p09174k163740
$$ 3988132 3910655 2449508 -211697 -2108882 -943952 2817418 5562787 4853613 2689873
2707B689873m05350O91330j617375m484386l854762l57116K332708K851606K572970
$$ 2689873 2284523 2975853 1358478 -3125908 -6980670 -7337786 -5005078 -2153472 419498
2698D19498K160163J076778r7035R8975J431395K039382J292015O05542J036501
$$ 419498 2579661 3656439 3559404 3658379 5089774 7129156 8421171 9026713 10063214
2689A0063214J675443J046607r24198k890919l497248k479908o32422J050609
$$ 10063214 11738657 12785264 11861066 8970147 5472899 2992991 2360569 3411178
2681C411178J961982J615636m06700l401998n105635l707827j38329K917405L964208
$$ 3411178 5373160 6988796 6582096 3180098 -1925537 -5633364 -5771693 -2854288 1109920
2672A109920L276204J237794j681097l609466k647894Q9479J441420P48331N79596
$$ 1109920 4386124 5623918 3942821 333355 -2314539 -2225060 -783640 -35309 544287
2663E44287K072865K833858J213935m95423K27339J765547Q61614k184610m022569
$$ 544287 2617152 5451010 6664945 6169522 6396861 8162408 9024022 6839412 2816843
2654B816843l057697q49091Q12328J562021J334347j1214j652679k219761j524338
$$ 2816843 -240854 -1089945 -277617 1284404 2618751 2607537 954858 -1264903 -2789241
2645b789241n44361K11095R21714J252619N63923n52612m96592J065481K320872
$$ -2789241 -3333602 -3122507 -2200793 -948174 -384251 -936863 -1433455 -367974 1952898
2636A952898J469508q72893k260826j420699J6788m44127k542587l130420n67374
$$ 1952898 3422406 2549513 288687 -1132012 -1115224 -1559351 -4101938 -7232358 -7799732
2627g799732K316606J703701j791898l939235k795533o68812J87385N23942J575284
$$ -7799732 -5483126 -3779425 -5571323 -9510558 -12306091 -12974903 -12787518 -12263576 -10688292
2618a0688292K649252K885201K790116K412888O47146j968109k668279p35187
$$ -10688292 -8039040 -5153839 -2363723 49165 696311 -1271798 -3940077 -4675264
2610d675264O78093n21894j739669j17781K382405K146035k91648j740074j623843
$$ -4675264 -3997171 -4519065 -6258734 -6376515 -3994110 -1848075 -2139723 -3879797 -5503640
2601e503640j401867n14491K211646M347322K389819j823395k620100J053514
$$ -5503640 -6905507 -7419998 -5208352 -861030 1528789 -294606 -2914706 -1861192
2593a861192L884800K207637j128294k038335j087007j190114k544801k953056
$$ -1861192 2023608 4231245 3102951 1064616 -22391 -1212505 -3757306 -6710362
2585f710362j490094M86874J054222o54125l361006l885765l53461M654374O522575
$$ -6710362 -8200456 -7713582 -6659360 -7313485 -10674491 -14560256 -14913717 -10259343 -3736768
2576c736768M349690J437777j32181j655168l525318l079203P76331M314889L664949
$$ -3736768 612922 2050699 1918518 263350 -3261968 -6341171 -5564840 -1249951 2414998
2567B414998K80243j523308o20195O31569Q25624Q59597J294828J281593L69384
$$ 2414998 2695241 1171933 551738 1183307 2008931 2868528 4163356 5444949 5814333
2558E814333o04778p31084K1826Q85050O02216j441447l600326l010478L50995
$$ 5814333 5209555 4478471 4500297 5385347 5987563 4546116 945790 -2064688 -1713693
2549a713693K379132j76073m749214n725416j612442L379745N069677L851121
$$ -1713693 665439 489366 -4259848 -9985264 -11597706 -8217961 -3148284 702837
2541G02837K551986K127896J377262l02319j958967k735947k766059j982185L67887
$$ 702837 3254823 5382719 6759981 6457662 4498695 1762748 -1003311 -2985496 -2617609
2532b617609L717401M919050J422605m241388n977260j593787L703397L768387
$$ -2617609 1099792 6018842 7441447 3200059 -2777201 -4370988 -667591 3100796
2524C100796m90275k975798j126025J427184J170686n57080q26799K98942R01863
$$ 3100796 2610521 -365277 -1491302 -64118 1106568 549488 -277311 21631 923494
2515I23494O37743N22698O51997K44404p77736j675031j800742r88379R9139m4147
$$ 923494 1561237 2083935 2735932 2980336 2202600 527569 -1273173 -2261552 -2162413 -2206560
2505b206560j885660l104324j080304K751093M054087J768827k82809O99836K582091
$$ -2206560 -4092220 -7196544 -8276848 -5525755 -1471668 297159 14350 714186 3296277
2496C296277K354737O21489o78340j803455l247337l162157m67715J895433Q69125
$$ 3296277 5651014 6272503 5594163 3790708 543371 -2618786 -3086501 -1191068 -321943
2487c21943j470101q02419K653160M572210K971207M2995k114756l589624m374959
$$ -321943 -1792044 -2594463 58697 4630907 7602114 7645109 5530353 1940729 -2434230
2478b434230l698514k100243j143042q27403m8526O25870k78092j861263j688528
$$ -2434230 -6132744 -8232987 -9376029 -10203432 -10251958 -9626088 -9904180 -11765443 -13453971
2469a3453971J70915J347409J332648J720209K195719M85201k906799m125507
$$ -13453971 -13283056 -11935647 -10602999 -8882790 -6687071 -6201870 -9108669 -13234176
2461a3234176j601819J571053K605572K638095L277978L175547R02712j620195
$$ -13234176 -14835995 -13264942 -10659370 -8021275 -4743297 -1567750 -665038 -2285233
2453b285233j731050p6492P88858L03877j84040j38290o9334J1872L65954O08191
$$ -2285233 -4016283 -4092775 -3303917 -3000040 -3184080 -3322370 -3391704 -3379832 -3013878 -2405687
2443b405687O34519J316529K634636K525184k90682l426265l205307M90470L915724
$$ -2405687 -1771168 -454639 2179997 4705181 4414499 988234 -2217073 -1726603 2189121
2434B189121L969160J127910k280889m821833o027506n110985j440070L456231
$$ 2189121 6158281 7286191 5005302 183469 -5844037 -10955022 -12395092 -8938861
2426h938861N876055L582892q73183k532366k58950J809268M72227j708592p33987
$$ -8938861 -3062806 520086 -353097 -2885463 -3144413 -1335145 -862918 -2571510 -3305497
2417c305497K166289K571606K13377q89919M64938R18296r55103j836902L08216
$$ -3305497 -1139208 1432398 1645775 755856 1220794 2139090 1183987 -652915 -344699
2408c44699K340658J270468q32149r52802l51099j416328k477610m98033L224726
$$ -344699 1995959 3266427 2434278 1481476 1130377 -285951 -2763561 -3261594 -36868
2399c6868M704439L178133J141323k94116j948067l448148l557709k910696k770608
$$ -36868 4667571 7845704 8987027 8692911 6744844 3296696 -261013 -3171709 -5942317
2390e942317k050112O18291L058644K248774r1246L86425L325322L927812J052912
$$ -5942317 -7992429 -7374138 -4315494 -2066720 -2157966 -1771541 1553781 5481593 6534505
2381F534505o68779J490629L940417K773315l80102j862827j700863k143074l239290
$$ 6534505 5865726 7356355 11296772 14070087 13689985 11827158 10126295 7983221 4743931
2372D743931l550993l389872l954619m488876l282517p02509J242564J764518
$$ 4743931 1192938 -2196934 -6151553 -10640429 -13922946 -14625455 -13382891 -11618373
2364a1618373J789431K247342L377650M829846N192193K779399j662616m604392
$$ -11618373 -9828942 -7581600 -4203950 625896 5818089 8597488 6934872 2330480
2356B330480l808859j228911l6169m88538r21521j027640j324828q06475J583261
$$ 2330480 -1478379 -2707290 -2743459 -3231997 -4153518 -5181158 -6505986 -7312461 -5729200
2347e729200L956466L412413P19467l88149J126175K109003L28440k206456k689693
$$ -5729200 -1772734 1639679 2359146 1970997 3097172 5206175 5534615 3328159 638466
2338F38466j501115o24269l27885N6182l23996k595829n134497m699179r45539
$$ 638466 -862649 -1486918 -1814803 -1758621 -2082617 -4678446 -9812943 -14512122 -15457661
2329a5457661K606766L097604J917684K222650M108577M436905J456736k452327
$$ -15457661 -12850895 -9753291 -7835607 -5612957 -1504380 2932525 4389261 1936934
2321A936934l777227k278345o83793n85147q04595k02486J78134p43517j570130
$$ 1936934 -1840293 -4118638 -4802431 -5387578 -6192173 -6394659 -6216525 -6960042 -8530172
2312h530172l26865K077703K894653J824718J478721K972351L864160J992721
$$ -8530172 -8857037 -6779334 -3884681 -2059963 -581242 2391109 6255269 8247990
2304H247990j038190k407884k240891k494586k982073j813677N53681J294452
$$ 8247990 7209800 4801916 2561025 66439 -2915634 -4729311 -4175630 -2881178
2296b881178k3756j26296K714974N177935L539132l37147j366727J252224K874520
$$ -2881178 -2904934 -3031230 -316256 4861679 8400811 8063664 6696937 7949161 10823681
2287A0823681L36591l538222m209744j569549P29488O14889m52460n19229K40595
$$ 10823681 11160272 7622050 3412306 1842757 2572245 3187134 2734674 2215445 2456040
2278B456040M94939k10436j200868j684151j427080q04723m72851p71535j400010
$$ 2456040 2950979 2740543 1539675 -144476 -1571556 -2376279 -2849130 -3620665 -5020675
2269e020675j828363j814432j295951k29821R90276J456097Q02777k5657J33431
$$ -5020675 -6849038 -8663470 -9959421 -10189242 -9198966 -7742869 -6940092 -6965749 -6832318
2260f832318J128258J947398K357646K850576L048635J739615r36166k789810
$$ -6832318 -5704060 -3756662 -1399016 1451560 4500195 6239810 5303644 2513834
2252B513834k236638o28311m00853j422722j140344J267255K912716J003839k632658
$$ 2513834 277196 -351115 -751968 -2174690 -3315034 -2047779 864937 1868776 -763882
2243g63882l337293J6053L123117K102735j097389j783239M81163J597165l80194
$$ -763882 -4101175 -4085122 -962005 1140730 43341 -1739898 -1258735 338430 -41764
$$ [...]
##END NTUPLES=NMR SPECTRUM
##END=
