##TITLE=31Pdec_DE-125
D2O, 24 sc
 29.1.2026
##JCAMPDX= 6.0         $$ Bruker NMR JCAMP-DX V2.0
##DATA TYPE= NMR SPECTRUM
##DATA CLASS= NTUPLES
##ORIGIN= UXNMR, Bruker Analytische Messtechnik GmbH
##OWNER= root
$$ XWIN-NMR		Version 3.5
$$ Thu Jan 29 15:50:21 2026 Russian Standard Time (UT+4h)  she@DPX200
##.OBSERVE FREQUENCY= 81.013821
##.OBSERVE NUCLEUS= ^31P
##.ACQUISITION MODE= SIMULTANEOUS
##.ACQUISITION SCHEME= undefined
##.AVERAGES= 24
##.DIGITISER RES= 17
##SPECTROMETER/DATA SYSTEM= spect
##.PULSE SEQUENCE= zgpg30
##.SOLVENT NAME= D2O
##.SHIFT REFERENCE= (INTERNAL, D2O, 0, 198.062)
##AUDIT TRAIL= $$ (NUMBER, WHEN, WHO, WHERE, WHAT)
$$ ##TITLE= Audit trail, XWIN-NMR		Version 3.5
$$ ##JCAMPDX= 5.01
$$ ##ORIGIN= Bruker BioSpin GmbH
$$ ##OWNER= she
$$ F:/spectra/data/she/nmr/P31/2/pdata/1/auditp.txt
$$ ##AUDIT TRAIL=  $$ (NUMBER, WHEN, WHO, WHERE, WHAT)
(   1,<2026-01-29 15:48:56.26 +0400>,<she>,<DPX200>,
      <created by zg, POWCHK disabled, PULCHK disabled
       configuration hash MD5:
       00 E9 B6 7A A2 85 ED C7 34 08 36 98 17 FE 4E 26
       data hash MD5: 32K
       43 FE 81 F8 D0 B5 88 D3 CA 43 13 2C EF 5D CB D7>)
(   2,<2026-01-29 15:48:58.62 +0400>,<she>,<DPX200>,
      <Start of raw data processing
       efp BC_mod = 2 LB = 1.5 FT_mod = 6 PKNL = 1 PHC0 = 1367.571 PHC1 = 179.9009 SI = 64K 
       data hash MD5: 64K
       84 00 98 2D AF 07 A8 11 34 93 90 70 30 BE 59 AC>)
(   3,<2026-01-29 15:49:48.53 +0400>,<she>,<DPX200>,
      <pk PHC0 = -25.2648 PHC1 = 0 
       data hash MD5: 64K
       18 9A 86 07 B8 14 94 05 AB E5 F1 7F 49 9C 39 8A>)
(   4,<2026-01-29 15:49:52.29 +0400>,<she>,<DPX200>,
      <abs ABSG = 5 
       data hash MD5: 64K
       21 A8 2D 57 99 89 E8 AF 49 98 28 49 9E DB AF 36>)
$$ ##END=
$$ 
$$ hash MD5
$$ AC BC 46 63 17 E7 0E EF 1F B0 74 30 BD 8B 32 C1
##$RELAX= 
##$RELAX= 
##$RELAX= 
##$RELAX= 
##$RELAX= 
##$RELAX= 
##$RELAX= 
##$RELAX= 
$$ Bruker specific parameters
$$ --------------------------
##$DU= <F:/spectra>
##$EXPNO= 2
##$NAME= <P31>
##$PROCNO= 1
##$TYPE= <nmr>
##$USER= <she>
##$AMP= (0..31)
100 100 100 100 100 100 100 100 100 100 100 100 100 100 100 100 100 100 
100 100 100 100 100 100 100 100 100 100 100 100 100 100 
##$AQSEQ= 0
##$AQ_mod= 1
##$AUNM= <au_zg>
##$AUTOPOS= <>
##$BF1= 81.014009
##$BF2= 200.13
##$BF3= 200.13
##$BF4= 200.13
##$BF5= 200.13
##$BF6= 200.13
##$BF7= 200.13
##$BF8= 200.13
##$BYTORDA= 1
##$CFDGTYP= 0
##$CFRGTYP= 5
##$CHEMSTR= <none>
##$CNST= (0..31)
1 1 145 1 1 1 1 1 1 1 1 1 1 1 1 1 1 1 1 1 1 1 1 1 1 1 1 1 1 1 1 1 
##$CPDPRG= <waltz16>
##$CPDPRG1= <>
##$CPDPRG2= <waltz16>
##$CPDPRG3= <>
##$CPDPRG4= <mlev>
##$CPDPRG5= <mlev>
##$CPDPRG6= <mlev>
##$CPDPRG7= <mlev>
##$CPDPRG8= <mlev>
##$CPDPRGB= <>
##$CPDPRGT= <>
##$D= (0..31)
0 1 0 0 0 0 0 0 0 0.06 0 0.03 2e-05 3e-06 0 0 0.0002 0 0 0 0 0 0 0 0 0 
0 0 0 0 0 0 
##$DATE= 1769687335
##$DBL= (0..7)
120 120 120 11 120 120 24 19 
##$DBP= (0..7)
150 150 150 150 150 150 150 150 
##$DBP07= 0
##$DBPNAM0= <>
##$DBPNAM1= <>
##$DBPNAM2= <>
$$ [...]
##$SUBNAM3= <"">
##$SUBNAM4= <"">
##$SUBNAM5= <"">
##$SUBNAM6= <"">
##$SUBNAM7= <"">
##$SUBNAM8= <"">
##$SUBNAM9= <"">
##$SW= 400.765351723535
##$SWIBOX= (0..15)
0 1 3 0 0 0 0 0 0 0 0 0 0 0 0 0 
##$SW_h= 32467.5324675325
##$TD= 32768
##$TD0= 1
##$TE= 0
##$TE2= 300
##$TE3= 300
##$TEG= 300
##$TL= (0..7)
0 120 53 12 22 120 120 120 
##$TP= (0..7)
150 150 150 150 150 150 150 150 
##$TP07= 0
##$TPNAME0= <>
##$TPNAME1= <>
##$TPNAME2= <>
##$TPNAME3= <>
##$TPNAME4= <>
##$TPNAME5= <>
##$TPNAME6= <>
##$TPNAME7= <>
##$TPOAL= (0..7)
0.5 0.5 0.5 0.5 0.5 0.5 0.5 0.5 
##$TPOFFS= (0..7)
0 0 0 0 0 0 0 0 
##$TUNHIN= 0
##$TUNHOUT= 0
##$TUNXOUT= 0
##$USERA1= <user>
##$USERA2= <user>
##$USERA3= <user>
##$USERA4= <user>
##$USERA5= <user>
##$V9= 5
##$VALIST= <valist>
##$VCLIST= <CCCCCCCCCCCCCCC>
##$VD= 0
##$VDLIST= <DDDDDDDDDDDDDDD>
##$VPLIST= <PPPPPPPPPPPPPPP>
##$VTLIST= <TTTTTTTTTTTTTTT>
##$WBST= 1024
##$WBSW= 4
##$XGAIN= (0..3)
0 0 0 0 
##$XL= 0
##$YL= 0
##$YMAX_a= 2832
##$YMIN_a= -3539
##$ZGOPTNS= <>
##$ZL1= 120
##$ZL2= 120
##$ZL3= 120
##$ZL4= 120
##$ABSF1= 198.0616
##$ABSF2= -202.7028
##$ABSG= 5
##$ABSL= 3
##$ALPHA= 0
##$AQORDER= 0
##$ASSFAC= 0
##$ASSFACI= 0
##$ASSFACX= 0
##$ASSWID= 0
##$AUNMP= <proc_1d>
##$AZFE= 0.1
##$AZFW= 0.5
##$BCFW= 0
##$BC_mod= 2
##$BYTORDP= 0
##$COROFFS= 0
##$CY= -3
##$DATMOD= 1
##$DC= 0
##$DFILT= <>
##$DTYPP= 0
##$F1P= 0
##$F2P= 0
##$FCOR= 1
##$FTSIZE= 65536
##$FT_mod= 6
##$GAMMA= 0
##$GB= 0
##$INTBC= 1
##$INTSCL= 9.790993e-09
##$ISEN= 30
##$LB= 1.5
##$LEV0= 0
##$LPBIN= 0
##$MAXI= 10000
##$MC2= 0
##$MEAN= 0
##$ME_mod= 0
##$MI= 50
##$NCOEF= 0
##$NC_proc= -7
##$NLEV= 6
##$NOISF1= 182.463
##$NOISF2= 159.3651
##$NSP= 0
##$NTH_PI= 0
##$NZP= 0
##$OFFSET= 198.0616
##$PC= 4
##$PHC0= 1342.306
##$PHC1= 179.9009
##$PH_mod= 1
##$PKNL= yes
##$PPARMOD= 0
##$PSCAL= 0
##$PSIGN= 0
##$REVERSE= no
##$SF= 81.0140089999434
##$SI= 65536
##$SIGF1= 159.3651
##$SIGF2= -187.1042
##$SINO= 113.3802
##$SIOLD= 16384
##$SREGLST= <1H.CDCl3>
##$SSB= 0
##$STSI= 65536
##$STSR= 0
##$SW_p= 32467.5324675325
##$SYMM= 0
##$S_DEV= 0
##$TDeff= 32768
##$TDoff= 0
##$TI= <>
##$TILT= no
##$TM1= 0
##$TM2= 0
##$TOPLEV= 0
##$USERP1= <user>
##$USERP2= <user>
##$USERP3= <user>
##$USERP4= <user>
##$USERP5= <user>
##$WDW= 1
##$XDIM= 65536
##$YMAX_p= 311466639
##$YMIN_p= -30617245
$$ End of Bruker specific parameters
$$ ---------------------------------
##NTUPLES= NMR SPECTRUM
##VAR_NAME=  FREQUENCY,     SPECTRUM/REAL,   SPECTRUM/IMAG
##SYMBOL=    X,             R,               I
##VAR_TYPE=  INDEPENDENT,   DEPENDENT,       DEPENDENT
##VAR_FORM=  AFFN,          ASDF,            ASDF
##VAR_DIM=   65536,         65536,           65536
##UNITS=     HZ,            ARBITRARY UNITS, ARBITRARY UNITS
##FACTOR=    0.49542278885378, 1,            1
##FIRST=     16045.7642231865, 0,            0
##LAST=      -16421.768244346, 0,            0
##MIN=       -16421.768244346, -30617245,    0
##MAX=       16045.7642231865, 311466639,    0
$$ Real data points
##PAGE= N=1
##DATA TABLE= (X++(R..R)), XYDATA
$$ [...]
43158 -513411 64327 316079 87955 -444605 -793444 -595448 58990 763867 1133538 1018418
43148 1018418 594499 283752 396737 788917 1029373 949178 831133 993029 1415869 1944806
43138 1944806 2645361 3658429 4743791 5276961 4830704 3581513 2021450 484665 -812322
43129 -812322 -1501641 -1328817 -692250 -362471 -419530 2434 1453781 3089862 3515893
43120 3515893 2496472 1119807 323594 -16390 -468485 -1276754 -2433603 -3790120 -4715430
43111 -4715430 -4302477 -2454326 -325299 806963 761618 204365 -292038 -418049 105887
43102 105887 1158815 1874951 1417069 28045 -1260651 -1845300 -1892140 -1618216 -958566
43093 -958566 -6920 856721 1437314 1814620 1857168 1199684 -75085 -1203148 -1490204
43084 -1490204 -1021665 -451463 -348259 -849648 -1633749 -2078595 -1740037 -839142 -62130
43075 -62130 199982 160845 157349 209344 177002 10067 -348338 -1007921 -1853382 -2452066 -2478605
43064 -2478605 -2089906 -1706659 -1567020 -1652508 -1892793 -2211502 -2409763 -2205955 -1490993 -514809
43054 -514809 266757 605093 654866 609782 260871 -684200 -1813310 -2162213 -1552152 -1202592
43044 -1202592 -2281462 -4163170 -4990920 -3919709 -1960811 -509223 81568 150175 -161880
43035 -161880 -793993 -1309978 -1264021 -781514 -260496 273280 1017564 1805495 2223577 2272776
43025 2272776 2405920 2806419 3015515 2483800 1310202 250083 1213 536142 1169888
43016 1169888 1302555 1024022 890594 1199128 1676071 1827698 1356227 262351 -1155347
43007 -1155347 -2337411 -2770893 -2386405 -1527933 -566876 278890 898507 1398153 2130327
42998 2130327 3198670 4057712 4124616 3691586 3580807 3902391 3921441 3305262 2690272 2689627
42988 2689627 3103129 3521625 3954877 4337742 4167232 3324074 2626505 2797738 3384098
42979 3384098 3459884 2931861 2326186 1726258 869980 6025 -340683 -333517 -619302 -1196949
42969 -1196949 -1389902 -992691 -581393 -540151 -555599 -270409 233085 766810 1242671 1446078
42959 1446078 1236574 1049596 1517246 2483624 3086777 2917060 2345013 1595890 410059
42950 410059 -1059248 -1904856 -1551689 -503211 475939 1253712 1895099 2034158 1404078
42941 1404078 532372 205887 520281 1008385 1424175 1870509 2383888 2862588 3216290
42932 3216290 3247318 2673526 1605185 647361 174510 -92150 -410604 -444496 77038 589795
42922 589795 287580 -790824 -1912839 -2661547 -3172953 -3576328 -3838283 -4016457 -4066704
42913 -4066704 -3548146 -2136111 -316255 1014995 1518921 1446747 974840 233675 -221937
42904 -221937 135344 913450 1225515 1018938 1045494 1411438 1245720 201241 -749330 -671587
42894 -671587 -880 227786 -181255 -714148 -1181466 -1747538 -2269008 -2457097 -2495454 -2702979
42884 -2702979 -2756968 -2114912 -1152187 -936972 -1697182 -2413357 -2320752 -1986820 -2263952 -2820191
42874 -2820191 -2579086 -1328791 1091 691609 1044794 1547254 1910425 1539620 619527
42865 619527 69250 417671 1253172 1947270 2482830 3230535 4153500 4646326 4177538 2837148
42855 2837148 1194906 -200794 -1108273 -1524830 -1491306 -1018120 -225583 475001 511609
42846 511609 -332403 -1517841 -2060508 -1437714 -208252 413226 -240993 -1528218 -2130744
42837 -2130744 -1532309 -606345 -506745 -1256902 -1900348 -1871714 -1533518 -1280435 -896115 -185350
42827 -185350 476755 851124 1467849 2685678 3547536 2677993 293902 -1726386 -2016619
42818 -2016619 -1065904 -71421 614439 1266085 1754415 1597044 730468 -460496 -1710573
42809 -1710573 -2903292 -3690279 -3667556 -2940517 -2093268 -1585850 -1464873 -1536842 -1458537 -787139
42799 -787139 593450 2081204 2779023 2389050 1441625 661716 371991 447333 513504 191627
42789 191627 -544950 -1251752 -1511328 -1466979 -1516462 -1579557 -1167132 -212693 695564 1087893
42779 1087893 1130500 1105933 843571 90098 -873118 -1469518 -1538404 -1375325 -1145810 -712021
42769 -712021 -95244 303412 152030 -383227 -856170 -1032735 -991247 -866558 -721001 -629694
42759 -629694 -666774 -747628 -654507 -317499 56764 236272 189240 -106718 -891839 -2296597
42749 -2296597 -3800345 -4441000 -3777628 -2368685 -1089187 -268414 231005 456648 424728
42740 424728 540274 1285057 2390130 2913859 2405030 1508124 1088329 1204735 1399801
42731 1399801 1604545 2074472 2556009 2279639 1043214 -220557 -370549 688847 2009949
42722 2009949 2695044 2665814 2442195 2520840 3024891 3666179 3912099 3420953 2506781 1994308
42712 1994308 2346081 3016010 2973735 1901560 575013 -68600 47553 290184 251823
42703 251823 135399 231762 420510 379251 42839 -388550 -783132 -1175002 -1525960 -1599801
42693 -1599801 -1217420 -587611 -223350 -409643 -809196 -786909 -182107 457979 572289 269781
42683 269781 888 -244217 -855629 -1695526 -1926956 -1134303 -134304 -99688 -1111496 -2156096
42673 -2156096 -2443449 -2108111 -1573867 -900978 -58169 700132 1175889 1589637 2125189
42664 2125189 2362031 1708165 331775 -859879 -1260960 -1164834 -1170563 -1365755 -1361561 -907444
42654 -907444 -198824 321988 285635 -373432 -1310188 -1948198 -1931861 -1413010 -866413 -729457
42644 -729457 -1227274 -2259596 -3251942 -3406759 -2525660 -1487542 -1447952 -2496950 -3541606
42635 -3541606 -3682444 -3255068 -3147691 -3444474 -3318852 -2209905 -551689 830130 1610576
42626 1610576 1958005 1961427 1525255 786946 230979 214332 557901 742672 428506 -257280
42616 -257280 -816408 -741517 12319 825888 915280 203786 -528847 -593678 -218211 -44189
42606 -44189 -50675 401360 1466598 2444789 2723976 2455544 1962297 1164168 151654 -341475
42596 -341475 87769 531967 -135973 -1377129 -1440879 103485 1543020 1307804 -20654
42587 -20654 -867816 -930663 -1101780 -1674112 -1980233 -1763475 -1650085 -1954525 -2051246 -1442032
42577 -1442032 -639895 -385915 -622426 -930694 -1484799 -2713567 -4218127 -4912345 -4375964
42568 -4375964 -3350061 -2595313 -1907295 -816016 200961 53055 -1384337 -2780113 -2815417
42559 -2815417 -1642603 -417359 200321 421412 465340 183855 -353435 -688613 -691861 -756676
42549 -756676 -909997 -486347 689835 1493130 776079 -965174 -2183181 -2298191 -2081392
42540 -2081392 -2082079 -1827676 -891797 244741 914416 1081358 932268 349839 -622519 -1399937
42530 -1399937 -1598074 -1681384 -2220320 -2921360 -3092845 -2733468 -2402780 -2236761 -1886380 -1364328
42520 -1364328 -1182246 -1552964 -2094095 -2439052 -2553971 -2324380 -1466502 -136186 918341
42511 918341 1205125 1102157 1237902 1588132 1645542 1288885 977761 1066544 1329716 1319457
42501 1319457 939302 478408 224836 240279 451964 754961 984594 963923 676146 252460
42491 252460 -307787 -1203635 -2414631 -3426403 -3729437 -3466942 -3131543 -2662557 -1458858
42482 -1458858 503865 2174782 2516386 1709799 783682 325464 96233 -251008 -663167
42473 -663167 -939307 -1058751 -1162655 -1460404 -2116942 -2972473 -3482071 -3259601 -2583367 -2018110
42463 -2018110 -1655949 -1145215 -389169 239624 367007 -113300 -1180660 -2619791 -3837255
42454 -3837255 -4267558 -3990130 -3437430 -2551616 -963618 898039 1783400 1162652 43609
42445 43609 -364333 -181486 -321190 -945331 -1383688 -1328527 -1111612 -793976 4482 1055289
42435 1055289 1217933 -155460 -2077380 -2924829 -2299203 -1184263 -404596 231610 1056984
42426 1056984 1622504 1286465 305984 -403197 -505874 -549351 -936153 -1307215 -1291739 -1233377
42416 -1233377 -1571123 -1919276 -1478833 -172576 1317386 2529459 3479860 3932662 3306817
42407 3306817 1671396 114171 -407843 -102730 220161 244039 130152 -108918 -485059
42398 -485059 -559281 115566 1124901 1484720 886623 21270 -471373 -742149 -1160266 -1575633
42388 -1575633 -1589526 -1224230 -941832 -1204713 -2227431 -3801745 -5055613 -4818573 -2796720
42379 -2796720 -179297 1477553 1840026 1719854 1609399 1164470 272533 -359905 -300341
42370 -300341 -317483 -1336498 -2909906 -3705966 -3331725 -2640727 -2185083 -1457997 -61494
42361 -61494 1354790 1983021 1960998 1875875 1769518 1426140 1140540 1280288 1408810 817326
42351 817326 -213058 -657773 -284588 -622 -470616 -1242030 -1569084 -1374957 -986331
42342 -986331 -493690 187225 1005698 1832673 2498383 2629628 1884660 516143 -717304
42333 -717304 -1319802 -1343187 -962322 -367797 -35667 -319088 -701726 -319271 648241 1088932
42323 1088932 682429 372659 716119 1023892 828613 889864 1707625 2241382 1457981 202135
42313 202135 13331 797084 1285971 1295013 1758768 2736860 3171543 2747675 2328517 2232820
42303 2232820 1673361 440495 -335311 115143 930136 897947 61881 -771222 -1326798
42294 -1326798 -1835104 -2298193 -2540180 -2615354 -2655929 -2664482 -2733287 -2971844 -3040801 -2451178
42284 -2451178 -1540506 -1308651 -1952860 -2479305 -2216004 -1740160 -1696615 -1678147 -1102660 -354340
42274 -354340 -105009 -159059 87798 574961 841562 869830 829915 494844 -239059 -783209
42264 -783209 -727257 -746241 -1613815 -2789315 -3136026 -2695798 -2516478 -2887557 -3003475 -2424849
42254 -2424849 -1719483 -1453546 -1504326 -1554180 -1424463 -837089 290592 1270132 1293980 729580
42244 729580 758515 1584139 2064098 1400291 140897 -861616 -1416756 -1429868 -468516 1341834
42234 1341834 2859564 3204764 2854787 2731776 2845938 2647563 2133781 1682662 1207744
42225 1207744 425234 -299393 -324172 127442 92551 -758029 -1637878 -1757314 -1276592 -819551
42215 -819551 -542491 -165879 305081 423965 -1476 -410179 -86687 779502 1135152 438103
42205 438103 -517161 -753149 -668370 -1439633 -2924451 -3394798 -1875722 298024 1118692
42196 1118692 355316 -624948 -981022 -1208401 -1935652 -2925245 -3462386 -3064882 -1698082
42187 -1698082 118032 1340244 1142295 -217683 -1707523 -2687783 -3226707 -3324138 -2659697
42178 -2659697 -1397583 -483529 -582682 -1181986 -1281942 -644397 176967 765891 1144565 1203745
42168 1203745 536105 -853842 -2133490 -2414870 -1784907 -1114057 -860973 -600563 25372
42159 25372 433821 -208993 -1678386 -2824778 -3033587 -2780831 -2533898 -1960477 -768060
42150 -768060 420797 833292 671623 598544 500577 -197474 -1177143 -1365520 -593753 -28200
42140 -28200 -534658 -1548437 -2133502 -2340150 -2746137 -3238265 -3143501 -2351608 -1553320 -1350728
42130 -1350728 -1621432 -1779685 -1349409 -355532 580166 676508 -186223 -1222896 -1559954
42121 -1559954 -1082251 -223193 728843 1636828 2082179 1580171 316551 -785584 -924025
42112 -924025 -136461 876435 1442221 1420311 1196505 1187880 1281335 903927 -226598 -1642177
42102 -1642177 -2620226 -2903854 -2673688 -2087483 -1251738 -477028 -135596 -314240 -867668
42093 -867668 -1608021 -2132076 -1828164 -643835 383314 68981 -1481678 -3028791 -3759160
42084 -3759160 -3958406 -4055191 -3862253 -3180263 -2495276 -2501740 -3236264 -4050699 -4214810 -3393604
42074 -3393604 -1905867 -667212 -441876 -991643 -1426868 -1458800 -1612193 -2049761 -2116881
42065 -2116881 -1507501 -939775 -973887 -1065817 -728798 -759451 -2001167 -3478450 -3331723 -1491733
42055 -1491733 96758 131850 -549368 -556017 254023 1222024 2057496 2708299 2842776 2327681
42045 2327681 1726314 1640548 1997685 2500510 3170607 3829335 3735891 2611033 1486603
42036 1486603 1551159 2484555 2920132 2333038 1450249 907393 627008 653331 1444243 2839309
42026 2839309 3658276 3031601 1563003 520260 281243 234797 -25581 -95386 595443
42017 595443 1973430 3315244 3872548 3468814 2612131 2034173 2039877 2312462 2356920 2043029
42007 2043029 1689750 1719370 2237555 2823128 2742900 1595370 -154380 -1440832 -1546715
41998 -1546715 -745213 49469 194712 -160375 -378711 -57765 594436 1101754 1316836
41989 1316836 1471593 1644565 1494634 696053 -617619 -2045519 -3279960 -4033872 -3973762
41980 -3973762 -3166959 -2326931 -2079583 -2147003 -1809470 -1040357 -526870 -570680 -657711 -280111
41970 -280111 403586 922437 989018 494013 -431694 -1166342 -995444 2355 1019920 1627998
41960 1627998 2086278 2309204 1505738 -471221 -2256603 -2430288 -1333110 -443627 -304771
41951 -304771 -152270 520790 1165477 1166767 698003 183194 -381014 -1075091 -1522139 -1227621
41941 -1227621 -239490 876295 1574196 1617648 1007575 -81612 -1276131 -2083627 -2173087
41932 -2173087 -1695517 -1253345 -1297883 -1552797 -1406289 -947337 -1037543 -2021850 -2994983 -2981494
41922 -2981494 -2329015 -2074678 -2276294 -2035997 -1151088 -642306 -1310731 -2636249 -3548124
41913 -3548124 -3612069 -3035201 -2131016 -1280345 -911588 -997138 -927829 -309485 436600 593258
41903 593258 -94367 -1436778 -3061506 -4273601 -4204086 -2668859 -515395 1358433 2875290
41894 2875290 4121285 4417223 3028400 591078 -1210471 -1578676 -1420527 -1950066 -3157483
41885 -3157483 -4099697 -4201574 -3697152 -2985583 -2101574 -962016 142172 579226 -14046
41876 -14046 -1250413 -2281621 -2573829 -2234976 -1620372 -972735 -563062 -740331 -1492906
41867 -1492906 -2282719 -2698113 -2965008 -3371338 -3541829 -2940810 -1873338 -1192881 -1036300
41858 -1036300 -689749 118545 654523 312757 -464983 -1003417 -1438541 -2120185 -2482103
41849 -2482103 -1611963 138442 1231469 933149 245743 278645 561087 -53501 -1324619
41840 -1324619 -1703977 -501182 1185157 2092084 2312110 2485573 2385944 1430616 94720
41831 94720 -485386 -247637 -285690 -1006675 -1487877 -1182043 -992861 -1698149 -2339529 -1518288
41821 -1518288 285562 1142466 289832 -1039336 -1566851 -1470384 -1462437 -1483291 -1108807 -528154
41811 -528154 -232955 -93808 475225 1543840 2455312 2599922 1986932 1025806 63919
41802 63919 -777508 -1488897 -1979822 -2007597 -1381630 -251821 932615 1764113 2066791 1860675
41792 1860675 1413803 1265010 1824361 2902416 3936522 4653638 5133139 5302380 4954096
41783 4954096 4315114 3929136 3775579 3198070 2024902 1015546 690192 458804 -341344
41774 -341344 -1175328 -1068105 -271659 -63260 -864505 -1562674 -1001814 591784 2029163
41765 2029163 2445642 1817961 649285 -445059 -1054048 -1182082 -1108558 -1003758 -808202
41756 -808202 -412092 264976 1228624 2127882 2230312 1200586 -189344 -736732 -246180
41747 -246180 287292 16710 -863583 -1721281 -2274114 -2417572 -1925104 -885217 4900
41738 4900 181715 15232 375004 1549089 2961751 3787185 3538431 2318138 872589
41729 872589 155220 395359 745678 236431 -1060781 -2171263 -2357689 -1768046 -1095777
41720 -1095777 -927357 -1265458 -1407817 -558400 1092057 2223519 1790660 263296 -1035463
41711 -1035463 -1425374 -1017231 170608 2132124 3989424 4405883 3259873 1973364 1735710
41702 1735710 2228208 2564739 2593979 2559539 2239157 1344557 314144 -168261 -145070 -94110
41692 -94110 40125 676527 1628766 2168282 2040320 1652474 1245214 640628 -126428 -717241
41682 -717241 -1177469 -1924184 -2786173 -2836949 -1610709 147827 1393824 1887566 1962009
41673 1962009 1788646 1462261 1329600 1553064 1652883 1110946 190552 -434958 -622459 -675015
41663 -675015 -520001 264167 1604080 2814169 3412736 3441805 2932855 1811099 559211
41654 559211 186603 1018765 2080210 2260476 1667846 1209717 1194946 1146125 884335 928997
41644 928997 1561592 2189323 2141361 1655585 1445524 1464999 822384 -872522 -2667679 -3289643
41634 -3289643 -2712324 -2082212 -2126962 -2353182 -2092662 -1636478 -1671547 -2036006 -1900341 -1070784
41624 -1070784 -236678 179704 527833 973541 964362 301099 -25085 981374 2709132
41615 2709132 3508824 2750751 1418250 656997 623218 898574 1141112 992665 169657
41606 169657 -848694 -919992 342707 1763216 1862247 546745 -1068163 -2131379 -2593013
41597 -2593013 -2526714 -1830847 -736957 87817 235794 -64232 -439010 -849418 -1387984
41588 -1387984 -1905113 -2029748 -1427267 -70050 1520412 2440250 2224373 1458504 1153037
41579 1153037 1565140 2123873 2417609 2556524 2519682 2002546 1223457 1025311 1603169 1867174
41569 1867174 841444 -850636 -1770181 -1567480 -1176946 -1299267 -1674028 -1923568 -2175359
41560 -2175359 -2513607 -2545694 -1974476 -1132206 -539206 -248472 60974 587759 1222177 1618451
41550 1618451 1320682 123949 -1524001 -2769231 -3162815 -2982698 -2692616 -2463706 -2360694
41541 -2360694 -2540150 -2947566 -3140314 -2751653 -1949411 -1210376 -826842 -790235 -912049 -885032
41531 -885032 -471421 205819 784822 1144472 1433328 1573399 1212498 326352 -641788 -1446973
41521 -1446973 -2277946 -3071719 -3290783 -2830070 -2429362 -2542816 -2473685 -1465517 -79019
41512 -79019 530431 320058 254639 726583 1236850 1575496 2067764 2478429 1961117 586374
41502 586374 -248987 300916 1169313 800873 -722255 -1948854 -2057978 -1627498 -1525931
41493 -1525931 -1895167 -2373306 -2712222 -2911364 -3060601 -3261903 -3593019 -4049718 -4490482
41484 -4490482 -4580013 -3917431 -2522468 -1157213 -742439 -1365378 -2279513 -2955647 -3579155
41475 -3579155 -4333607 -4878013 -4973895 -5043189 -5513640 -6039076 -5989659 -5398921 -4800620 -4345365
41465 -4345365 -3679530 -2577202 -1188956 211840 1301025 1727622 1527869 1294178 1457039
41456 1457039 1661693 1378636 804521 481089 295688 -319809 -1304797 -1913024 -1762631
41447 -1762631 -1191335 -535503 164804 662004 528400 -108138 -617200 -874086 -1431164
41438 -1431164 -2406706 -3050546 -2875201 -2449512 -2487028 -2796113 -2767708 -2342732 -1804400 -1068430
41428 -1068430 69044 1260209 1888102 1891235 1761111 1850871 2144165 2530203 2864737 2956315
41418 2956315 2901067 3140176 3698515 3712263 2398527 322328 -1006260 -786278 406328
41409 406328 1560289 2197289 2325283 2040677 1447284 666914 -168102 -746499 -617358
41400 -617358 174930 741305 276790 -790227 -1311944 -1031269 -798327 -1051852 -1084974 -295360
41390 -295360 718082 1041875 799472 780236 1104451 1120384 501092 -329598 -910736 -1233491
41380 -1233491 -1352518 -1038716 -137827 983680 1643068 1492020 885256 540753 754901
41371 754901 1041073 783208 151875 -99869 217718 470485 374892 638824 1760343 2881488
41361 2881488 2845124 1967299 1571454 1915793 1918068 1139148 650707 1274392 2153647 2073614
41351 2073614 1322517 1056243 1359626 1232200 355009 -350968 -148666 476161 562794 -192628
41341 -192628 -1357852 -2282964 -2449433 -1801282 -986957 -846534 -1446012 -2014394 -1955054 -1414248
41331 -1414248 -720367 62203 688755 560355 -393524 -1194152 -922437 -7100 410575
41322 410575 233312 606893 2190971 4071875 4919251 4682753 4439812 4736568 4822769
41313 4822769 3795032 1978058 610735 317047 516131 486165 354072 541131 769352
41304 769352 444252 -196910 -262298 384257 789895 249314 -901778 -2200771 -3781725
41295 -3781725 -5501753 -6276696 -5355759 -3697405 -2961104 -3429901 -3964344 -3760787 -3021830
41286 -3021830 -1975138 -456289 1286001 2389597 2355930 1507171 342213 -730337 -973963
41277 -973963 221820 2113039 2937002 2052262 772613 450160 739890 608381 136090
41268 136090 205439 991746 1856706 2371312 2481529 2005072 949021 70249 122482 684490
41258 684490 690634 43189 -275761 270778 1096517 1513206 1565245 1560194 1492912 1275890 996022
41247 996022 680945 270422 -36497 90995 513037 661496 314588 -175488 -513971 -756498
41237 -756498 -873206 -657462 -248023 -88941 -113903 366084 1586943 2735231 2877251
41228 2877251 2011266 770949 -450097 -1567460 -2358162 -2506395 -1983338 -1041691 45633
41219 45633 1044367 1766882 2163132 2137133 1258705 -789419 -3274507 -4589006 -3879617
41210 -3879617 -2069101 -761723 -520558 -740951 -828916 -823474 -1021426 -1587911 -2491487 -3383736
41200 -3383736 -3644430 -2959462 -1750098 -686494 29107 548153 883578 1063305 1473741
41191 1473741 2351531 3064937 2642152 1073253 -547917 -1279909 -1157273 -678691 -125979
41182 -125979 350431 510240 235560 -361014 -1209518 -2268240 -3102918 -3015328 -1910354
41173 -1910354 -594009 152198 406411 644991 867675 730867 291968 -7868 -80552
41164 -80552 -366649 -1128320 -1934611 -2052615 -1185627 261803 1519954 2037066 1874398
41155 1874398 1532609 1297162 886956 -20606 -1055229 -1358536 -580913 729811 1910363
41146 1910363 2938693 4051485 4951070 4997136 4158176 3178382 2584113 2014462 922947
41137 922947 -421544 -1187856 -1120121 -859022 -1015161 -1380790 -1313878 -593285 393205 1108768
41127 1108768 1244478 799965 102025 -308697 -105048 438640 655631 177576 -629002
41118 -629002 -946666 -257334 1106088 2178798 2313962 1935920 2067561 2980001 3678902
41109 3678902 3095378 1517750 301725 220807 699362 838007 604536 555147 767147
41100 767147 706056 128858 -477419 -612591 -514681 -800985 -1551051 -2189008 -2289688 -2083713
41090 -2083713 -1967451 -1848492 -1356526 -592902 -270033 -967583 -2433273 -3746425 -4122037
41081 -4122037 -3552637 -2755261 -2493939 -2880999 -3359499 -3385357 -2966974 -2440843 -1984256 -1626894
41071 -1626894 -1494336 -1584236 -1420657 -489856 892957 1650398 1093837 -321961 -1523252
41062 -1523252 -1753320 -910602 565914 1889073 2357073 1878484 912013 -90266 -825624
41053 -825624 -890766 -142687 596673 97553 -1615778 -2999878 -2941317 -2140496 -1818186 -1873883
41043 -1873883 -1377712 -285587 581661 998298 1535684 2292640 2529586 1786613 511972
41034 511972 -618687 -1296300 -1408644 -1016984 -588828 -537415 -487045 250012 1452874 2095270
41024 2095270 1736419 933711 198669 -471261 -877681 -570323 123071 132808 -734307 -1248107
41014 -1248107 -510808 691921 1117421 833894 834314 1469450 2167083 2328045 1766856 625767
41004 625767 -507659 -779167 37367 1176774 1851281 2050480 1945356 1289085 147716
40995 147716 -512770 72872 1284872 1920750 1700259 1101461 268025 -840096 -1633950
40986 -1633950 -1419801 -556404 -45394 -123297 -238925 -206923 -290048 -266839 427872 1593321
40976 1593321 2342962 2373961 2211033 2176891 2090534 1963360 1958973 1698770 751160 -202405
40966 -202405 -418 1067561 1375608 335034 -804368 -1053779 -1059151 -1486017 -1438320 193698
40956 193698 2709658 4260752 4082452 3015398 2143057 1807400 1724594 1339306 261204
40947 261204 -1134820 -1845546 -1366512 -229009 922024 2103559 3378977 4264531 4436841
40938 4436841 4319826 4231307 3662953 2234434 649619 -240762 -662923 -1175858 -1362754
40929 -1362754 -507536 878360 1520224 1142778 551337 144466 -393254 -997922 -1130107
40920 -1130107 -875453 -929873 -1307791 -1241795 -634841 -448986 -1221434 -2221973 -2580689 -2363227
40910 -2363227 -2040003 -1704374 -1316071 -1004474 -693658 -117344 425681 103314 -1232554
40901 -1232554 -2629136 -3301488 -3531889 -3763431 -3623151 -2611295 -1145270 -122552 157684
40892 157684 24487 -171333 -123129 463126 1322579 1543351 727075 -221951 -253923 268270
40882 268270 66230 -1182426 -2349612 -2273366 -984790 567491 1491987 1574023 1303460
40873 1303460 1320685 1659605 1766894 1443812 1233943 1435976 1363844 364797 -917667 -1289326
40863 -1289326 -779831 -649818 -1628701 -3058624 -3878380 -3649357 -2549422 -1176056 -417697
40854 -417697 -646408 -955644 -152955 1382511 1967696 1017475 -114578 -290355 -229180
40845 -229180 -957918 -1805961 -1434416 -148738 462240 -43091 -480402 -100182 397591
40836 397591 398227 564980 1597148 2735639 2623235 1276160 231585 731584 2400886
40827 2400886 3811026 3914565 2801895 1338019 253268 -409687 -997074 -1596280 -1988336
40818 -1988336 -2174337 -2453812 -2808593 -2705305 -1873774 -879464 -451218 -538803 -571865 -435230
40808 -435230 -544927 -984531 -1212260 -817700 -89257 419239 547353 537309 652359 954487
40798 954487 1224045 993935 -49011 -1575962 -2820883 -3361130 -3333175 -2820126 -1641183
40789 -1641183 -85096 800753 359300 -601606 -676777 319393 1183953 1000927 186006
40780 186006 -369173 -424355 -204835 263799 961788 1411340 1163747 632888 748612 1715547
40770 1715547 2718764 3017876 2743870 2314290 1666990 693648 53188 670846 2315803
40761 2315803 3442418 2896469 1286828 123480 -28839 178222 245637 489939 1040581
40752 1040581 1067621 -198250 -2102930 -3112846 -2706347 -1975704 -2135269 -3040836 -3595590
40743 -3595590 -3223850 -2394766 -1753452 -1233505 -312149 1047179 2121662 2286900 1850310
40734 1850310 1577018 1497881 871901 -454226 -1433234 -1199830 -439359 -434691 -1128752 -1298109
40724 -1298109 -588309 -72827 -436714 -849283 -367079 569637 985239 911387 993727 1131105
40714 1131105 705605 -130671 -589369 -554367 -580133 -564213 302402 1946996 3040207 2871770
40704 2871770 2523666 3237173 4436187 4551719 3368586 2269356 2135690 2211503 1502844
40695 1502844 372807 -59610 349680 522132 -332138 -1643125 -2252516 -1848840 -1168658
40686 -1168658 -912328 -977143 -914168 -715461 -745370 -1052698 -1184862 -767357 3380 556718
40676 556718 463134 -308716 -1442096 -2439984 -2886049 -2733291 -2358970 -2274715 -2734011 -3533707
40666 -3533707 -4116336 -3948771 -2983007 -1775883 -1020177 -891432 -923029 -560488 206585
40657 206585 794756 630957 -153549 -710117 -347551 582466 963343 191408 -1139758
40648 -1139758 -2038788 -2236429 -2128744 -1924839 -1440168 -664041 37909 392836 469614 373880
40638 373880 111587 -116408 99933 854584 1652440 1882380 1418853 657250 104284 -34685
40628 -34685 -19337 -285241 -814199 -962123 -246394 869498 1448701 1227818 737475 338982
40618 338982 -173386 -900599 -1476553 -1669848 -1770851 -2063017 -2412416 -2666251 -2942302 -3229554
40608 -3229554 -3231670 -2902346 -2561664 -2179647 -1241872 242595 1367036 1581092 1571161 2073752
40598 2073752 2490366 1747396 96583 -1130567 -1436140 -1670949 -2492565 -3324370 -3254224
40589 -3254224 -2286145 -1278964 -1004497 -1467983 -1906695 -1493415 -330710 484367 214094
40580 214094 -483009 -560013 -232399 -584733 -1670629 -2237203 -1597076 -620269 -329926 -506457
40570 -506457 -427639 -215209 -533057 -1352642 -1846714 -1409196 -261564 843140 1175992
40561 1175992 518529 -546366 -1025759 -502559 439749 940282 705810 -5055 -763454
40552 -763454 -1041102 -400066 923297 1982413 2125707 1745762 1621877 1873943 2084848
40543 2084848 2156672 2408556 2932154 3445169 3829858 4329941 5052687 5584383 5306288 4051619
40533 4051619 2428442 1439816 1592428 2348909 2690063 2226153 1432973 822829 420976
40524 420976 174072 213532 383258 147765 -555735 -975200 -635019 -188339 -440839 -1017481
40514 -1017481 -897652 29088 882752 1120750 1012093 813874 427769 19007 68169 494796
40504 494796 510411 -254880 -1126938 -1310766 -879989 -398172 -51864 305278 587184 516708
40494 516708 123337 -195563 -90540 451375 1117836 1428093 1062149 218851 -467964 -465466
40484 -465466 314634 1623748 2975685 3645010 3104966 1740702 698277 652218 1045584
40475 1045584 927847 197288 -517483 -938979 -1358414 -1742492 -1416280 -84468 1356868
40466 1356868 1675546 774703 -320067 -908081 -1318725 -1907428 -2094449 -1133679 526701
40457 526701 1511252 1152991 143798 -548415 -689528 -486745 -42155 458338 625191
40448 625191 448217 489283 991737 1324421 887565 56307 -430970 -523359 -565188 -460450
40438 -460450 -1975 398410 270754 -9574 65257 -73305 -1237246 -2668743 -2634386 -974987
40428 -974987 532224 808043 903318 2026739 3575767 4229414 3884898 3296095 2629154
40419 2629154 1612273 515737 -190716 -704420 -1347259 -1614108 -892652 232832 615338
40410 615338 328065 626860 2073856 3738617 4445097 3967409 2845177 1790059 1415931
40401 1415931 1837383 2382349 2300716 1765507 1520146 1636621 1492792 979921 691120 659292
40391 659292 -10403 -1651672 -3048626 -2758460 -945296 836915 1418535 970900 404252
40382 404252 412451 1088538 1996963 2479150 2133375 1159280 230262 -7415 549451 1270248
40372 1270248 1232682 161354 -1101720 -1400992 -575679 375306 503417 -87604 -619286
40363 -619286 -690387 -658597 -1087240 -2037569 -2979250 -3401913 -3424623 -3563385 -3882452 -3824517
40353 -3824517 -3143229 -2478694 -2437224 -2512966 -1721132 -116459 1187243 1524843 1345928
40344 1345928 1203208 912595 92405 -1121102 -2305503 -3195633 -3585197 -3294843 -2536172
40335 -2536172 -1815206 -1234882 -465000 356900 430630 -545349 -1683737 -1945687 -1312438
40326 -1312438 -376175 619288 1618612 2186174 1982581 1493389 1418396 1523304 965231 -280067
40316 -280067 -1155788 -840113 329941 1428256 1894077 1746410 1331607 1094768 1288325
40307 1288325 1745740 2134355 2385120 2563352 2408447 1475588 -189792 -1919599 -3079717
40298 -3079717 -3541541 -3452928 -2948637 -2264246 -1783426 -1665636 -1565908 -970186 171426 1228236
40288 1228236 1364977 328987 -1199471 -2165139 -2107310 -1431221 -722220 -147855 297728
40279 297728 408751 72887 -309246 -220211 262142 601708 616237 742103 1449069 2670731
40269 2670731 3809964 4134394 3351530 2064017 1418880 1938696 2917070 3342472 3105880
40260 3105880 2788993 2620302 2391505 2196982 2366895 2648202 2322976 1316925 387753
40251 387753 -39408 -441409 -1262203 -2162220 -2649947 -2779201 -2693506 -2107610 -881591 380929
40241 380929 974837 973992 866301 670535 84374 -761989 -1396837 -1691172 -1813992 -1661175
40231 -1661175 -1019318 -222838 79060 -140396 -281097 -176766 -433504 -1389923 -2366318
40222 -2366318 -2432843 -1523824 -336545 563553 1072356 1227549 1100856 972351 1161725
40213 1161725 1608040 1928339 1935874 1779870 1498970 813640 -389156 -1625566 -2198257
40204 -2198257 -1915760 -1180444 -477609 -94127 -256374 -1075851 -2198008 -2883734 -2718487
40195 -2718487 -2015454 -1318412 -808914 -473354 -461122 -758953 -782434 10224 1129690 1407605
40185 1407605 521572 -511805 -727423 -472180 -702387 -1480142 -1936664 -1606739 -1052709
40176 -1052709 -984347 -1311673 -1401036 -949069 -262444 172083 89252 -524447 -1488091 -2403434
40166 -2403434 -2801986 -2568024 -2166108 -2176222 -2521951 -2439782 -1447583 -113883 525891 242938
40156 242938 -147005 82391 635006 698861 130885 -235921 534920 2493105 4697292
40147 4697292 6016777 6047769 5278600 4417769 3759620 3313381 3194983 3409161 3411746 2551889
40137 2551889 1071551 58726 141644 770203 1123973 1173875 1347446 1622951 1618456 1320903
40127 1320903 1087110 1046113 1072503 1267876 1885150 2738352 3184958 2806908 1787481 619640
40117 619640 -249016 -585200 -571004 -720365 -1173478 -1259859 -347559 1007426 1514914 807342
40107 807342 -157861 -580630 -861233 -1658009 -2633781 -2925927 -2472060 -2048847 -2077261 -2079163
40097 -2079163 -1424671 -124002 1269632 2192126 2386998 2000394 1506718 1330404 1431605
40088 1431605 1427240 1159619 913322 970368 1192365 1242690 1055570 827821 612286 199870
40078 199870 -531296 -1358357 -1907602 -1953185 -1461183 -580135 253166 494533 112954 -209926
40068 -209926 31542 267610 -479654 -2013093 -2852098 -2031393 -270932 1138654 1879959
40059 1879959 2314117 2348035 1701925 950468 1036676 1690566 1495181 -147100 -2100001
40050 -2100001 -2969431 -2615688 -1708254 -652402 337900 795506 450299 -278469 -867075
40041 -867075 -1336860 -1766780 -1763408 -1189565 -837327 -1360314 -1959446 -1355897 64103 414864
40031 414864 -1112169 -3056503 -3656486 -3015646 -2498356 -2672062 -2817450 -2212491 -1065474
40022 -1065474 -138463 32076 -490878 -1080899 -984750 -48691 1021876 1398208 1050875
40013 1050875 664006 726107 1042121 1126919 759937 110191 -419089 -426804 140201 786877
40003 786877 818961 -17419 -1368584 -2701942 -3646062 -3924687 -3378664 -2294713 -1400282
39994 -1400282 -1170718 -1284666 -1091984 -502490 -17218 92610 167305 553855 1033795 1200059
39984 1200059 1157527 1417001 2103387 2612630 2209902 863409 -584672 -1078705 -275330
39975 -275330 1122316 2080358 2348775 2626920 3476114 4447221 4713834 4283733 3932501
39966 3932501 3985024 3887280 3199517 2344852 1925870 1778213 1242804 102907 -1241752
39957 -1241752 -2345129 -2999470 -3096792 -2678707 -2075446 -1589491 -1078244 -236325 752004
39948 752004 1280795 1095384 607803 345398 422176 647288 801841 646706 -27259 -1113636
39938 -1113636 -2131370 -2639903 -2615910 -2346650 -2111550 -2041861 -2098742 -2061341 -1674320 -916121
39928 -916121 -32863 710455 1167127 1223596 840222 240966 -212055 -459187 -790970 -1288078
39918 -1288078 -1508819 -1030390 -88246 688713 1063899 1305579 1528499 1399491 712830
39909 712830 -121650 -537591 -539753 -535855 -545964 -140651 691457 1187626 751621 -155556
39899 -155556 -643899 -659508 -913792 -1619513 -2125462 -2029005 -1844895 -2068942 -2234231 -1600545
39889 -1600545 -387644 385351 88801 -1059579 -2476658 -3541804 -3705603 -3027564 -2492552
39880 -2492552 -3021054 -4171491 -4581304 -3740173 -2541207 -1968820 -2093533 -2595583 -3354972
39871 -3354972 -4029233 -3856954 -2570620 -966685 41038 454673 715371 761811 350721
39862 350721 -78224 222464 1134120 1648161 1121417 -11376 -889398 -1135288 -1000965
39853 -1000965 -959141 -1258493 -1675093 -1722384 -1284922 -888062 -1067866 -1645584 -1960512 -1674961
39843 -1674961 -998386 -259386 355433 741875 945072 1215843 1665197 1983272 1857363
39834 1857363 1501782 1332521 1271169 918127 357354 168394 508328 735406 237902 -720346
39824 -720346 -1282496 -938360 37862 984578 1503614 1666424 1620581 1205779 272586 -699964
39814 -699964 -875463 -179900 403238 68827 -782739 -1259313 -1189647 -939290 -493084 390734
39804 390734 1384856 1868456 1867971 1860543 1768768 1081457 -79635 -965753 -1257786 -1161137 -545166
39793 -545166 812619 2088684 1938356 524477 -358549 259186 1305136 1596307 1531460
39784 1531460 1815895 1891280 1090101 297985 795146 2080298 2500453 1711534 948873
39775 948873 976863 1254429 1220081 1064697 987618 815228 635681 881558 1579505 2305547
39765 2305547 2877238 3227034 2761167 1013340 -1060465 -1717699 -590230 961684 1868645
39756 1868645 2435500 3055832 3247833 2664757 1875696 1378977 902789 409858 640241
39747 640241 1750841 2546951 2171243 1537647 1835215 2531484 2316023 1291836 605837
39738 605837 387541 -192789 -990190 -838564 319422 960140 250647 -632007 -282552
39729 -282552 958099 1756748 1688991 1403524 1413014 1642269 1918197 2142455 2078018 1563962
39719 1563962 937652 811150 1373519 2140282 2397715 1824711 792093 61918 -8112
39710 -8112 86364 -347877 -1200469 -1738273 -1792013 -2076096 -3079325 -4287015 -4912803 -4862557
39700 -4862557 -4522232 -4082712 -3574052 -3125752 -2668394 -1800213 -501258 473984 575032
39691 575032 387611 797504 1610846 1973135 1900210 2215970 2933633 2962779 1851888 701562
39681 701562 643748 1298532 1562216 1198569 690710 87261 -836200 -1512042 -930640 758260
39671 758260 2075884 2111558 1727005 2209813 3365899 3807351 2865835 1344799 273202
39662 273202 -341244 -1092330 -1975725 -2261619 -1581078 -604680 -277752 -610358 -689203 67144
39652 67144 1099788 1403556 706233 -404442 -1298739 -1779779 -1838719 -1490594 -994474 -798320
39642 -798320 -1022658 -1273482 -1127641 -533794 357643 1362830 2076067 1969703 1043644
39633 1043644 34082 -405071 -433930 -576084 -896466 -1123344 -1275493 -1550638 -1767701
39624 -1767701 -1538325 -878659 -49880 1038620 2497396 3616070 3328400 1743997 292618
39615 292618 -88826 -72334 -669998 -1653429 -2076418 -1806162 -1549855 -1594633 -1447677 -741340
39605 -741340 251533 1096789 1586885 1577935 1031832 365716 232089 744996 1338226 1558614
39595 1558614 1596312 1840583 2304841 2756667 3103789 3334573 3266785 2689961 1750770 962660
39585 962660 686335 632963 87685 -1150558 -2189890 -1893011 -419842 668373 244789
39576 244789 -1010177 -1702428 -1661165 -1816078 -2404668 -2508963 -1603383 -494071 -184644
39567 -184644 -602701 -1048678 -1264446 -1389337 -1325120 -835622 -43632 668559 1033282 844578
39557 844578 -56583 -1322500 -2100754 -2057240 -1948239 -2498156 -3127485 -2660621 -1057971
39548 -1057971 515394 1334008 1873437 2721467 3589248 3825016 3284336 2260610 1050445
39539 1050445 14041 -350580 140395 1061284 1825136 2153892 1912206 977549 -287777
39530 -287777 -906676 -305360 774231 1085619 492237 -27666 -59700 -458518 -1804601
39521 -1804601 -2957841 -2206554 355987 2662296 3088712 2143006 1297612 1001906 694114
39512 694114 210288 42088 268721 300073 -80345 -332730 -197905 -253584 -865345 -1343756
39502 -1343756 -907667 89450 745593 997031 1494879 2361462 3060615 3452544 3997261
39493 3997261 4750673 5023473 4320053 2920812 1312522 -234924 -1284730 -1273239 -430974
39484 -430974 43004 -636886 -1772186 -2080380 -1271775 -181150 308624 -81343 -1112152
39475 -1112152 -2157164 -2471457 -1894384 -1120482 -812285 -710458 -157393 798080 1500614
39466 1500614 1690345 1658039 1496117 993662 317876 -4865 43022 -98477 -504286 -437112
39456 -437112 462970 1397526 1463811 918041 627362 673348 391085 -350101 -834682 -656617
39446 -656617 -429391 -931197 -2023700 -2870769 -2971595 -2586076 -2268491 -2310559 -2609438 -2826256
39436 -2826256 -2627494 -1910339 -864731 153529 748000 582292 -333595 -1353923 -1541851
39427 -1541851 -631113 548459 967581 593133 271122 488557 812835 723447 445075
39418 445075 532843 993240 1346598 1413560 1519224 1893459 2310814 2462105 2363360 2237010
39408 2237010 2210266 2251772 2210345 1824909 925100 -222518 -940942 -701007 392407 1717842
39398 1717842 2626911 2796994 2305969 1517273 829878 459233 446376 741765 1100082 1045980
39388 1045980 323404 -614997 -970309 -555662 -1737 134017 -1998 -82288 -225913 -575932
39378 -575932 -622063 329267 2036030 3293866 3202566 2061086 874554 352410 564653
39369 564653 1203406 1822637 1956075 1333021 92976 -1271487 -2246803 -2656160 -2762224
39360 -2762224 -2974060 -3388605 -3692865 -3582446 -3139004 -2664536 -2290472 -1934939 -1515238
39351 -1515238 -994103 -342485 320279 698845 704601 711628 1107602 1744909 2231340 2610750
39341 2610750 3227120 3961607 4216836 3779151 3115362 2595610 1990130 1078947 251388
39332 251388 31343 356899 785137 1137459 1500774 1813263 1885190 1677216 1225868 554354
39322 554354 45110 532476 2372672 4578425 5556907 4738468 2961284 1345217 456101
39313 456101 529256 1610990 3162395 4277371 4727116 5145014 5740408 5588061 3937826
39304 3937826 1634916 273064 209797 366300 -97679 -852668 -1210642 -936177 10400
39295 10400 1657781 3473381 4341861 3707239 2278403 1087153 301153 -476115 -1188004
39286 -1188004 -1347144 -852512 -100442 615788 1213646 1431161 991162 205644 -157906
39277 -157906 253459 1046661 1637972 1735272 1337098 742237 486091 723117 783563 -1181
39267 -1181 -1180024 -1758282 -1802967 -2303103 -3248122 -3266928 -1879026 -730337 -1379173 -2909144
39257 -2909144 -3255241 -2202847 -1364097 -1501620 -1728641 -1514858 -1629604 -2399879 -2631516
39248 -2631516 -1373579 406477 1168929 1018924 1241906 2089534 2429266 1592887 350536
39239 350536 -283955 -299427 -282050 -443293 -611346 -786685 -1126233 -1480506 -1398886 -703182
39229 -703182 173807 595246 444168 304376 777987 1645570 1935533 988436 -694870
39220 -694870 -1889765 -1887547 -1106167 -476232 -432651 -629697 -551029 -205967 -66234 -320648
39210 -320648 -450838 164593 1319303 2068346 1865408 1198057 785912 506777 -336097
39201 -336097 -1775135 -2824694 -2630819 -1584668 -873807 -1058306 -1533172 -1514641 -1168145
39192 -1168145 -1357467 -2389126 -3487786 -3700307 -2961092 -1962947 -1266987 -959515 -974952
39183 -974952 -1193438 -1242865 -790147 -166274 -158606 -942015 -1724179 -1787908 -1416927 -1342221
39173 -1342221 -1662547 -1868013 -1687780 -1322862 -918127 -347309 410806 1066016 1258469
39164 1258469 789449 -267962 -1381539 -1685795 -800273 538603 1191269 977770 770915
39155 770915 1142930 1581234 1390725 793704 547110 768345 769492 49723 -1013743 -1582196
39145 -1582196 -1197878 -146552 810600 1018996 431503 -394448 -882813 -991784 -1064032
39136 -1064032 -1234471 -1272823 -1043646 -815808 -935788 -1388267 -1868316 -2128073 -2040532 -1484770
39126 -1484770 -505046 428424 651213 -53002 -1193377 -2019469 -2096188 -1473605 -570379
39117 -570379 46709 74026 -183455 -133796 303807 543494 163538 -487835 -829571 -828650
39107 -828650 -835972 -964524 -1109300 -1294220 -1447773 -1103593 20303 1348977 2081980 2322611
39097 2322611 2725293 3137438 2691437 1428094 658250 1159637 2012440 1977958 1226408
39088 1226408 824327 1118710 1564373 1749128 1663269 1165387 43592 -1399197 -2444662
39079 -2444662 -2648503 -2069592 -1065759 -260647 -275152 -889705 -890146 529539 2569427 3804813
39069 3804813 3991493 3938945 3856872 3016709 1192926 -603286 -1226123 -564985 618023
39060 618023 1415490 1216623 101097 -1002316 -1126230 -386303 224550 171975 -126319
39051 -126319 -146688 141705 607528 1138713 1387005 1090216 735969 1072311 1882965 2241079
39041 2241079 2132604 2615378 3921726 4682619 3875123 2466855 2052932 2645413 2961034
39032 2961034 2364747 1373574 537679 -77277 -386953 -235967 97121 110196 -146531 -156397
39022 -156397 168844 314166 -10598 -410071 -341108 266664 1048690 1585108 1676891 1442076
39012 1442076 1154973 921305 671613 528264 802562 1396661 1617801 985515 -65457
39003 -65457 -683720 -577572 -161602 17532 -323830 -1111967 -1885589 -2112905 -1785926 -1362128
38993 -1362128 -947682 -139993 962853 1337029 302075 -1368114 -2403264 -2627807 -2707721
38984 -2707721 -2734641 -2191624 -1234874 -860044 -1497213 -2304207 -2288462 -1556303 -1023641 -1220939
38974 -1220939 -1740969 -1789653 -1133829 -395921 -195596 -90799 991365 3005758 4255136
38965 4255136 3317893 953111 -782183 -951958 -385458 -168338 -459838 -781270 -658275
38956 -658275 57308 877723 824909 -475550 -2107345 -2968044 -3126347 -3164143 -2734482 -1168294
38946 -1168294 770963 1407909 587645 -29741 478490 1052304 664174 53876 375824
38937 375824 1324899 1846808 1831204 1844965 1821619 1282293 510531 352748 955003 1610966
38927 1610966 1816819 1727929 1601263 1425594 1129275 712097 218065 -129472 20167 670155
38917 670155 1371364 1891246 2552126 3503889 4144137 3821941 2755524 1677395 833208
38908 833208 -139349 -1517746 -3071871 -4148156 -4011202 -2565463 -939678 -643464 -1721450
38899 -1721450 -2521789 -1881635 -663417 -243463 -340152 368474 1983964 3185336 3179238
38890 3179238 2531266 1933768 1352090 702944 326817 330959 281067 -23622 -170758 63765
38880 63765 182011 -307922 -1129863 -1633164 -1576901 -1200472 -847842 -760218 -907740 -865540
38870 -865540 -256689 527178 528463 -591618 -1997710 -2609170 -2223077 -1434413 -823396 -598200
38860 -598200 -758127 -1176801 -1604754 -1873356 -2046461 -2202429 -2180661 -1743684 -941502 -157759
38850 -157759 225186 155618 -108368 -353320 -657984 -1091154 -1209387 -324421 1437350 2779915
38840 2779915 2515150 1005880 -244276 -339364 292891 896663 1319758 1670529 1717357
38831 1717357 1185326 342495 -193366 -137208 274830 694019 1006358 1288564 1576689 1728797
38821 1728797 1545306 1070336 660919 586981 661864 509987 126516 -124905 -48626 160960
38811 160960 262804 242387 177189 75938 -74821 -273371 -508107 -650743 -467455 21823
38801 21823 359730 177497 -235093 -310053 -36958 102534 6270 164708 872897 1757011
38791 1757011 2269996 2169646 1316000 -421636 -2635500 -4196659 -4173221 -2823045 -1282015
38782 -1282015 -304820 388109 1493301 3079007 4305054 4240347 2942420 1537870 1064070
38773 1064070 1402547 1613791 1130298 206720 -692918 -1415092 -1943617 -2175582 -2047421
38764 -2047421 -1559541 -596966 882432 2355126 2851796 1866712 -26118 -1608139 -1967164
38755 -1967164 -1104487 126366 759007 707871 905677 2084895 3655929 4382016 3991785
38746 3991785 3365482 3178655 3254618 3377942 3744700 4189813 3885157 2460985 765106
38737 765106 -138573 -190472 21550 255534 541189 573294 -31755 -1087475 -2043469 -2613912
38727 -2613912 -2710364 -2116951 -865393 351720 806583 600241 342970 221502 -309
38718 -309 -310110 -494471 -681678 -1066661 -1171021 -209370 1669608 3216846 3390443 2303161
38708 2303161 747135 -611656 -1350931 -1255627 -628297 -247528 -561217 -1118549 -1142199
38699 -1142199 -493977 264971 672258 855234 1160045 1586224 1820195 1710445 1428236
38690 1428236 1149673 926955 1031999 1965973 3631406 4842544 4442917 2851550 1644096
38681 1644096 1465401 1316537 316620 -831369 -914834 38834 1065119 1753048 2330862
38672 2330862 2580697 1869583 345489 -874692 -961543 -137189 934819 1852000 2438316
38663 2438316 2647832 2678730 2694190 2422201 1596764 715806 601920 1173278 1474252 1070675
38653 1070675 551053 391535 254796 -117062 -197134 447516 1262003 1478852 1306615 1561016
38643 1561016 2446325 3456273 4225522 4692910 4577801 3571003 2150992 1423245 1829155
38634 1829155 2590162 2776368 2409765 2053136 1756168 1103916 170083 -322039 16078
38625 16078 683927 1067510 1258648 1584851 1753434 1229316 283663 -212096 -109172 -186437
38615 -186437 -740038 -919426 -88872 964328 1042437 179229 -664635 -1113067 -1532311 -1898626
38605 -1898626 -1620296 -585215 535475 1223638 1606586 1860606 1825546 1390293 675928
38596 675928 -226260 -1117469 -1393917 -652412 503742 1174130 1581721 2627840 3975929
38587 3975929 4023111 2285585 419018 1092 490598 459681 -173449 -453308 -200338
38578 -200338 -80624 -212327 -78400 219000 -127756 -1231933 -2023403 -1547235 -92970
38569 -92970 1280135 1853746 1651165 1117289 631719 194942 -399403 -1012208 -1106964 -542741
38559 -542741 -12465 -173257 -668163 -661881 -143767 39763 -539543 -1247204 -1206965 -349863
38549 -349863 517815 483829 -614870 -1951399 -2515499 -2326703 -2456037 -3554903 -4912986
38540 -4912986 -5505332 -5399388 -5331282 -5340539 -4814170 -3670145 -2504043 -1638866 -995946 -862853
38530 -862853 -1701326 -3028022 -3550250 -2778715 -1612703 -973380 -753399 -544057 -483324
38521 -483324 -758606 -1006601 -860864 -518579 -224423 188897 698223 715099 -7114 -716256
38511 -716256 -659838 -164954 80323 230999 785450 1376033 1246043 687996 731490 1362075
38501 1362075 1322922 24071 -1495339 -2061262 -1843812 -1638524 -1483335 -865821 241246
38492 241246 1467619 2836633 4543008 6059975 6393494 5399393 4111916 3460185 3224656
38483 3224656 2626444 1494699 378578 -273759 -613496 -1087343 -1869850 -2600763 -2640501
38474 -2640501 -1754264 -614246 -328643 -1233986 -2387292 -2564245 -1611474 -506351 -211438
38465 -211438 -820961 -1766114 -2463861 -2674680 -2479736 -2018424 -1207853 108670 1583254
38456 1583254 2288657 1681564 406811 -430017 -621426 -794954 -1111534 -980892 -289248
38447 -289248 53569 -679166 -2034288 -3152154 -3801308 -3982088 -3293948 -1682583 -246688
38438 -246688 -145331 -972301 -1338254 -926660 -778545 -1460761 -2170249 -2036597 -1280971 -577349
38428 -577349 -132800 71684 -55230 -215385 329181 1580299 2270072 1368367 -395783
38419 -395783 -1435947 -1340218 -1013733 -1043584 -1052844 -764415 -624501 -959913 -1358276 -1422821
38409 -1422821 -1487910 -1958971 -2426184 -2146348 -1147384 -165018 399754 760858 972991 657544
38399 657544 -175902 -708299 -317006 397055 308275 -626019 -1172730 -374102 1300717 2623860
38389 2623860 2952365 2560720 2017472 1668330 1548997 1453377 1180049 888878 986789 1489126
38379 1489126 1865528 1811813 1735595 2008565 2159272 1482152 198901 -724225 -828447 -524470
38369 -524470 -227231 129422 602788 957794 1071174 1019246 595203 -607653 -2363009
38360 -2363009 -3681223 -3869819 -3231739 -2431678 -1732559 -1197647 -1029931 -1183686 -1106077
38351 -1106077 -425392 429848 790020 632916 457878 546590 807569 1137622 1512357 1872593
38341 1872593 2219185 2595173 2751648 2230143 1104730 185302 40494 272837 288390
38332 288390 300186 861595 1785088 2360691 2456991 2569144 2824219 2741514 2055712 1074999
38322 1074999 120531 -737094 -1289526 -1230725 -778358 -622965 -1017335 -1478849 -1602357 -1546324
38312 -1546324 -1427888 -900622 186428 1231252 1532692 1155832 669609 363400 237774
38303 237774 446538 1084567 1657289 1421360 340551 -801937 -1353427 -1393718 -1252669
38294 -1252669 -940021 -394465 101164 264218 406722 1143837 2432094 3349319 3080851
38285 3080851 1851289 628386 123878 361768 1004997 1669466 1964292 1684251 1117783
38276 1117783 872686 1259820 2052172 2858176 3401371 3398939 2634339 1373786 304660
38267 304660 -227201 -561792 -1030145 -1359692 -1212494 -907455 -988526 -1311490 -1237262 -673314
38257 -673314 -268913 -477745 -966180 -1091771 -511572 788718 2550479 4112115 4728634
38248 4728634 4398166 4036556 4436056 5253512 5398201 4318064 2592128 1313533 1173586
38239 1173586 2114043 3517425 4559639 4598327 3539774 1934472 633869 270893 1013136
38230 1013136 2672243 4889669 7300656 9812290 12753252 16386419 20163086 22982701
38222 22982701 24549918 25953059 28410798 32134219 37268242 45180678 57512464 74913500
38214 74913500 99094579 135314388 187803680 249288098 298070470 311466639 284335546
38207 284335546 232727119 179152595 136475632 105544745 83036797 66939135 55794290
38200 55794290 47307786 39675687 32833336 27387959 23231751 19879899 17403239 16215175
38192 16215175 16158295 16304734 15700389 14189664 12499011 11421724 10877549 10034846 8517843
38183 8517843 7082097 6654172 7000412 6956184 5906137 4445792 3483683 3230087 3329950
38174 3329950 3548954 3856296 3976631 3381287 1972917 526506 49555 665752 1499959
38165 1499959 1850605 2060909 2790784 3765496 3982684 3162664 2245540 2157879 2668583 2878930
38155 2878930 2425793 1743536 1386075 1502974 1875788 2185546 2292226 2372245 2697738 3310341
38145 3310341 4118044 5180043 6482050 7536226 7801796 7525325 7500640 7914934 8229609
38136 8229609 8416826 9359778 11493011 13934215 15804574 17831274 21737361 28211761
38128 28211761 35932764 42216128 44365140 41332030 34962589 29006064 25971943 25394599
38120 25394599 25821031 27404354 30996847 35347310 37258589 34876212 29410829 23322556
38112 23322556 18171228 14586211 12770592 12107756 11346121 10076287 9215920 9332932 9462090
38103 9462090 8526200 7067255 6395489 6603135 6679786 6311301 6290693 7065123 7958446 8160254
38093 8160254 7704350 7117132 6699571 6514126 6609972 6877416 6978529 6735348 6372997 6129154
38083 6129154 5824783 5114343 4071489 3241641 3049454 3315285 3480992 3274053 3016481
38074 3016481 3199879 3831380 4338266 4120826 3091198 1697463 592992 276522 782316
38065 782316 1563695 1866726 1421831 676175 204881 39648 -195930 -593869 -746726 -332718
38055 -332718 331499 573117 160282 -393279 -409107 197667 895123 1232880 1370828 1806614
38045 1806614 2680838 3513638 3665385 2979125 1884860 861930 -82938 -1240351 -2553773
38036 -2553773 -3461822 -3517165 -2831814 -1662778 858 1908073 3031095 2506475 1014951
38027 1014951 193316 472433 597582 -220128 -862989 1945 1711926 2422916 1701430
38018 1701430 964210 1384206 2530059 3244609 2904158 1594377 -109952 -1280527 -1273341
38009 -1273341 -482696 101425 139308 95412 191677 77363 -337977 -629243 -703628 -1064360
37999 -1064360 -1884931 -2572781 -2601150 -2093869 -1329130 -421791 250194 174622 -378559 -434413
37989 -434413 296584 995971 1114161 1156366 1551288 1836482 1731354 1925353 2797591 3341055
37979 3341055 2569453 1213452 733642 1271260 1910794 2436535 3304148 4111399 3678585
37970 3678585 1837147 -121707 -1051516 -998344 -490974 204385 888566 1382404 1899830
37961 1899830 2705228 3341495 3077704 2189044 1803692 2300729 2867871 2918586 2899081 3232753
37951 3232753 3433277 2896784 1833849 810872 -13664 -634704 -752625 -181343 670388
37942 670388 1184489 1122564 620164 15304 -185744 246345 688446 211751 -1094928 -2111724
37932 -2111724 -2219237 -1920157 -1609114 -883497 231995 553466 -647870 -2181581 -2381712
37923 -2381712 -1398887 -688646 -662419 -405416 354431 624099 -110960 -899089 -767043 -109533
37913 -109533 130358 -145659 -427708 -590924 -783479 -758136 -212579 425693 429936 -38616
37903 -38616 1456 942064 1992278 2324077 2165130 2237480 2584820 2614419 2070185 1293176
37893 1293176 574952 -81717 -483383 -219655 621314 1342692 1612865 1913030 2491970
37884 2491970 2549801 1311400 -558407 -1655193 -1735551 -1794566 -2250031 -2297930 -1428305 -386750
37874 -386750 41650 178054 503612 446205 -739538 -2405581 -3046630 -2256573 -1095905
37865 -1095905 -515524 -395529 -273643 -79727 191714 762867 1571859 2053603 1863232
37856 1863232 1385062 1103657 846012 135803 -923969 -1634532 -1570917 -1081302 -760458
37847 -760458 -639647 -172928 919091 2032332 2214052 1274828 -18396 -941664 -1506317
37838 -1506317 -1881526 -1742024 -864334 31571 -54984 -959935 -1456069 -955762 -272433 -335105
37828 -335105 -910764 -1167189 -932922 -721162 -827106 -1045783 -1139874 -1037236 -613572 250917
37818 250917 1353656 2222915 2509586 2145815 1269802 286151 -165071 275196 1199170
37809 1199170 1799770 1734109 1325431 953003 654138 409154 389951 668940 968347 1001347
37799 1001347 900195 1004807 1286081 1270582 613132 -441110 -1287423 -1569988 -1453935
37790 -1453935 -1338743 -1440267 -1689384 -1898178 -1884803 -1517084 -841475 -174326 157190 227029
37780 227029 417879 802227 937935 565763 194414 466838 1074608 978961 -117290 -1174239
37770 -1174239 -1145369 -404443 -173923 -786977 -1326579 -1075258 -545148 -643642 -1357423 -1858338
37760 -1858338 -1656494 -1044225 -432384 191781 954118 1627441 1794613 1380969 832800
37751 832800 724699 1162621 1545989 1068503 -354824 -1774922 -2107997 -1311808 -367580
37742 -367580 -126636 -563916 -1187869 -1642086 -1651953 -925483 352931 1236893 848895 -528908
37732 -528908 -1660733 -1675776 -810268 124549 546923 317564 -347404 -933274 -960840 -537750
37722 -537750 -311093 -630915 -1034224 -858729 -135105 500691 641905 451351 193240 -163565
37712 -163565 -738185 -1433888 -2047668 -2496225 -2709619 -2417004 -1337627 325951 1792586
37703 1792586 2343226 2083645 1896521 2507522 3684285 4504712 4349916 3425771 2334519
37694 2334519 1452897 877106 664510 779830 931016 818647 530552 364926 279127 -54645
37684 -54645 -525038 -413995 651795 1918859 2213460 1328157 211819 -202093 153661
37675 153661 840877 1488668 1708066 1052125 -322203 -1301074 -855187 616676 1646690
37666 1646690 1497921 970024 1142808 1924075 2395233 2254734 2240368 3076774 4492146
37657 4492146 5488769 5344934 4194284 2798646 1923513 1828256 2160003 2299518 1913069
37648 1913069 1251999 900460 1167876 1713722 1831470 1155268 55859 -709955 -727635
37639 -727635 -295181 -119590 -647123 -1617470 -2308898 -2354548 -2211899 -2493517 -2903520 -2483969
37629 -2483969 -1182648 -402684 -1234285 -2695001 -2822500 -1331664 36348 -25952 -846780
37620 -846780 -1229429 -1273050 -1779795 -2667326 -3108173 -2836606 -2298065 -1741898 -1081587 -467944
37610 -467944 -114588 290495 1103322 1814105 1639076 957122 964162 1685860 1584760 -253964
37600 -253964 -2599291 -3598179 -3092748 -2479846 -2711019 -3393339 -3742676 -3565122 -3110690
37591 -3110690 -2512327 -1675923 -550515 636160 1424790 1503912 1074206 682591 683163 1054088
37581 1054088 1649823 2239902 2357194 1705968 857249 897010 2076333 3412794 4019236
37572 4019236 4195810 4661360 5326410 5606627 5504692 5466152 5380052 4682866 3489824 2717098
37562 2717098 2792127 2946839 2198607 563397 -1079649 -1986850 -2075679 -1722116 -1383636
37553 -1383636 -1297670 -1271218 -785410 518696 2407841 4122550 4882935 4427619 3181788
37544 3181788 1885602 996984 498401 251075 272851 524702 709994 598017 393476
37535 393476 467181 784206 856242 232927 -1085424 -2551630 -3239753 -2432278 -386130
37526 -386130 1711607 2879846 3164274 2990787 2206025 524128 -1353322 -2075386 -1266159
37517 -1266159 22074 782754 1214148 1928569 2677521 2614332 1549714 265786 -418451
37508 -418451 -427657 -205232 -49265 143651 567359 1069387 1136579 405294 -883192 -2064740
37498 -2064740 -2601772 -2318550 -1323631 -48446 814885 904421 662157 719187 875129 342253
37488 342253 -942398 -2024694 -2229040 -1999971 -2014611 -2155215 -1956855 -1476034 -1017824
37479 -1017824 -504828 110598 258983 -494635 -1408489 -1315031 -345429 155396 -427876 -1175847
37469 -1175847 -1128346 -583365 -306624 -314351 -279442 -520270 -1577162 -3071415 -3937383 -3768451
37459 -3768451 -3111047 -2365194 -1258379 285455 1541738 1836438 1519315 1468424 1895984
37450 1895984 2237179 2073908 1567029 980610 360891 -176231 -348059 -118547 217214
37441 217214 588966 1323583 2413724 3085849 2657509 1528784 695488 443476 209343
37432 209343 -298421 -607125 -317376 248578 607886 774242 907738 783390 173510 -553888
37422 -553888 -811798 -598896 -365880 -178662 379520 1399660 2286629 2445264 1981876
37413 1981876 1500186 1428373 1712232 1985076 1908089 1503035 1242362 1633819 2600310 3413313
37403 3413313 3361841 2422222 1241075 555043 600064 906380 648455 -608370 -2424372
37394 -2424372 -3859738 -4337647 -3992756 -3240296 -2333271 -1430352 -748455 -385281 -189218
37385 -189218 -48562 -145110 -652863 -1313082 -1639532 -1544070 -1468311 -1819597 -2499939 -3084680
37375 -3084680 -3265338 -2999609 -2438127 -1916654 -1858877 -2364581 -2907922 -2778837 -1937107 -1114097
37365 -1114097 -858370 -825974 -436738 43456 -219325 -1225679 -1819221 -1212830 -203205
37356 -203205 -150640 -1144673 -2040993 -2146832 -1867923 -1539811 -699076 849073 2056291
37347 2056291 1690605 58482 -1204788 -1027245 108557 1067827 1261828 790448 22519
37338 22519 -624150 -877596 -886299 -1052849 -1458861 -1770593 -1802388 -1733229 -1607034 -1149513
37328 -1149513 -379228 158554 229465 452241 1375562 2471293 2861626 2722003 2932336
37319 2932336 3389212 2848841 850991 -1241462 -1881681 -1312171 -1027307 -1690272 -2509031
37310 -2509031 -2556238 -1845990 -962066 -289922 107163 291252 401985 561202 704119 733289
37300 733289 848265 1373707 2173317 2590854 2160787 1141886 216371 -114323 247171
37291 247171 1058344 1818268 2012673 1521202 706983 20698 -338456 -337977 21708 574732
37281 574732 956483 958279 789619 748775 712497 230994 -796329 -1736534 -1737610 -689347
37271 -689347 470871 629095 -311713 -1338338 -1504037 -898576 -254321 44923 146474
37262 146474 187950 135102 101447 321398 765556 1167820 1393607 1406348 1052860 419278
37252 419278 177662 823525 1712099 1801203 1345762 1695213 3136878 4212236 3816863
37243 3816863 2782442 2422075 2536207 2074544 1015551 235974 -39650 -340403 -745127
37234 -745127 -811043 -579050 -508635 -526079 -274018 -160916 -876956 -1905576 -1937762 -932063
37224 -932063 -285827 -580501 -674263 298721 1472056 1714624 1265871 787480 -62263 -1704536
37214 -1704536 -3123060 -2845390 -1101438 378922 605871 170370 -93147 -97327 -15108
37205 -15108 134342 98768 -571318 -1751491 -2643847 -2717161 -2196258 -1448858 -529816 380231
37195 380231 705499 129964 -825926 -1313095 -1069684 -537306 -199840 -89478 36905 207633
37185 207633 99252 -501413 -1218696 -1400903 -965083 -524187 -488900 -514159 -180807 262050
37175 262050 351222 177803 71835 -110385 -634426 -1111545 -955039 -488949 -670062 -1655805
37165 -1655805 -2554332 -2752143 -2580698 -2392207 -1899712 -914554 52649 500261 596597 583189
37155 583189 175873 -762153 -1521651 -1332299 -479700 155918 416600 880452 1635459 1891076
37145 1891076 1052761 -384866 -1327357 -1185291 -328372 382598 449287 199507 287429 670839
37135 670839 476482 -770076 -2176596 -2367797 -1170051 242819 855105 771485 567922
37126 567922 427248 320286 471755 1047647 1631323 1559615 762739 -95818 -347503 54980
37116 54980 647571 976449 956424 848645 954024 1291952 1565536 1434875 789123 -196719
37106 -196719 -1131596 -1556199 -1268490 -628123 -341248 -749364 -1440241 -1719388 -1344419 -630663
37096 -630663 -1253 304704 212866 -142018 -386878 -294695 -223108 -761877 -1840614 -2647699
37086 -2647699 -2666263 -2298832 -2056680 -1617520 -378338 1320630 2364457 2311422 1922775
37077 1922775 2042212 2633409 3233799 3678302 3898964 3608531 2793864 2065122 1882757
37068 1882757 1852097 1474565 1168276 1631126 2444525 2372112 1094133 -344599 -1010042
37059 -1010042 -1060273 -958040 -676364 -217131 -58372 -368845 -431464 387341 1579280 2137057
37049 2137057 1850952 1256469 692122 207858 88338 561030 1108457 938917 145622
37040 145622 -392034 -297713 -93275 -194402 -315500 -122765 245367 620330 1092659 1490828
37030 1490828 1210001 42297 -1324089 -2108410 -2301028 -2274990 -2022067 -1387166 -719041
37021 -719041 -605685 -1090767 -1706596 -2165844 -2472750 -2447289 -1771975 -595726 455100
37012 455100 1037983 1413022 1813918 1956677 1505966 705534 133755 -34479 -150982 -483393
37002 -483393 -795821 -676080 -108762 472277 693248 640613 640095 727721 566541 -40955
36992 -40955 -780663 -1177123 -1175266 -1085679 -1007222 -679325 -25096 529129 597810 479664 827386
36981 827386 1692864 2342934 2214887 1698668 1615115 2125795 2635488 2788320 3050144 3984016
36971 3984016 5248085 5771415 4942382 3325102 2096056 1918431 2417300 2637288 1977543
36962 1977543 765723 -81315 -16937 602093 1048463 1118459 1211701 1611755 2082639 2251038
36952 2251038 2012475 1387930 333453 -1014424 -2147891 -2568951 -2240201 -1425254 -268548
36943 -268548 1152278 2494812 3246642 3150206 2289731 860051 -824834 -2213956 -2902885
36934 -2902885 -3192036 -3769038 -4650181 -4930826 -3960566 -2393423 -1562350 -1965376 -2848332
36925 -2848332 -3248294 -2987580 -2551844 -2409301 -2676549 -3161817 -3444575 -3051040 -1831745
36916 -1831745 -194295 1149337 1681983 1356145 538857 -223154 -538324 -442769 -296850
36907 -296850 -351808 -550475 -816558 -1270465 -1914545 -2333677 -2094320 -1356409 -701716 -376781
36897 -376781 -113922 266836 542178 518284 334498 108861 -290143 -813161 -983983 -494440
36887 -494440 271194 713070 709879 431133 -129412 -837678 -1030140 -269969 706800 727377
36877 727377 -152118 -695561 -351260 -16272 -530532 -1426577 -1844432 -1803202 -1713309 -1378781
36867 -1378781 -532853 162002 -177774 -1186308 -1630258 -1226362 -964985 -1457290 -2018002
36858 -2018002 -1787470 -894406 -4509 596857 946092 963885 588709 -14550 -712633 -1465707
36848 -1465707 -1904029 -1451132 -270724 531878 234493 -488662 -539006 56621 355711
36839 355711 3310 -324365 10461 812188 1479372 1685195 1449961 941801 386926 -66369
36829 -66369 -448355 -742723 -690804 -156859 445271 555006 281796 362560 1224290 2455845
36819 2455845 3267454 3135384 1996908 247881 -1343033 -2107146 -2041230 -1677765 -1385376
36810 -1385376 -1106721 -759174 -473628 -367922 -450908 -774064 -1277162 -1508545 -1033837 -190726
36800 -190726 138408 -334508 -939674 -986853 -476507 305103 1198353 1865224 1822126 1266675
36790 1266675 1178500 2002785 2884837 2893651 2353559 2128970 2213938 2095723 2043809 2745086
36780 2745086 3803034 3929293 2805742 1544613 934190 372518 -848118 -2174285 -2545783
36771 -2545783 -1901402 -1138049 -936121 -1275612 -1837259 -2293735 -2355771 -1966544 -1342463 -605891
36761 -605891 327196 1282570 1710543 1411880 976427 1081999 1717632 2464069 3049735 3136048
36751 3136048 2127719 -10332 -2106361 -2833229 -2274175 -1629328 -1451268 -1092134 -50333
36742 -50333 1031843 1160087 184874 -1215433 -2297456 -2623468 -2104253 -1156264 -560886
36733 -560886 -694813 -993549 -568897 647144 1722360 1819848 1234037 1047093 1759678
36724 1759678 2598288 2463269 1324807 142591 -563790 -1313964 -2518752 -3521133 -3529584
36715 -3529584 -2956966 -2827166 -3067692 -2481855 -566069 1601259 2653410 2397891 1618955
36706 1618955 1046953 922415 1073909 1062588 649244 289353 610624 1263563 1087913 -225245
36696 -225245 -1480316 -1532442 -693079 90563 623475 1097978 1089971 179683 -802929 -477091
36686 -477091 1152309 2595600 2817197 2226265 1591545 1085080 770452 984249 1623974
36677 1623974 1887797 1393653 895854 1217395 2048471 2528655 2529846 2536671 2579020 2191182
36667 2191182 1391453 889744 1128117 1690668 1894598 1541776 863033 75194 -702863
36658 -702863 -1264316 -1331929 -835453 -144546 45566 -731330 -2113300 -3035754 -2735704 -1568263
36648 -1568263 -539996 -72213 387628 1397355 2536983 2752209 1566895 -382244 -2060457
36639 -2060457 -2992459 -3335436 -3249665 -2628323 -1555386 -663787 -639239 -1393630 -2036408 -1767856
36629 -1767856 -639625 598510 1193663 869243 -119150 -1186283 -1802576 -1890930 -1836653
36620 -1836653 -2037127 -2517485 -3018125 -3265010 -3027441 -2138521 -740759 589505 1265538
36611 1265538 1255115 1001259 794945 523610 117225 -123731 23189 115300 -610018 -2142540
36601 -2142540 -3286307 -2705914 -351620 2422998 4186435 4621260 4348306 3938946 3442501
36592 3442501 2725040 1844952 992667 327280 8318 191473 814378 1491948 1815677
36583 1815677 1771521 1733853 1958753 2145395 1689096 484092 -711542 -1016568 -459255
36574 -459255 145244 364692 589672 1036252 1039423 64864 -1079115 -1046525 165402 1175408
36564 1175408 1187156 964990 1435522 2264663 2529276 2135040 1781815 1927647 2476532 3153482
36554 3153482 3510738 2856953 935457 -1420952 -2944739 -3222492 -2874003 -2611261 -2649219
36545 -2649219 -2882016 -3031399 -2688872 -1773024 -876031 -618856 -791844 -736046 -405372 -293023
36535 -293023 -402941 -201574 318305 471717 59363 -192538 188503 623913 436672 -105500
36525 -105500 -349415 -262146 -180697 -70278 209599 325856 2849 -163233 643710 2058247
36515 2058247 2707773 1980515 840960 505528 879817 816958 -350736 -2017801 -3043096
36506 -3043096 -2977313 -2366756 -1887891 -1479270 -673275 341413 638260 -162542 -1100205
36497 -1100205 -953065 236562 1362025 1722816 1544320 1142515 438761 -517664 -1306307
36488 -1306307 -1747731 -2149283 -2590372 -2546339 -1680573 -525124 153532 311222 445058
36479 445058 778084 1175648 1621874 2167948 2533628 2368122 1881799 1639187 1693959 1528096
36469 1528096 968435 523175 507953 427749 -271782 -1248404 -1653559 -1277418 -723984 -495887
36459 -495887 -457174 -289856 14744 323056 612005 796192 650256 236253 126866 766223
36449 766223 1738987 2136950 1672068 992343 750279 766136 445395 -229621 -598603 -257767
36439 -257767 296538 242206 -512495 -1200446 -1178068 -689854 -375376 -267860 210730 1253350
36429 1253350 2236068 2550027 2364611 2111477 1650350 645357 -454447 -667143 162853
36420 162853 985288 795677 -342268 -1794986 -3164959 -4085480 -3877706 -2272611 -227607
36411 -227607 785230 355227 -543708 -813518 -311554 364062 665324 499340 164952
36402 164952 28010 106936 34015 -395567 -849941 -952154 -873438 -941588 -889949 -166880
36392 -166880 1076318 2029224 2327292 2395535 2512925 2278901 1387410 328818 -127984
36383 -127984 256862 1192691 2180936 2582575 1983084 879071 374705 742959 1001827
36374 1001827 533164 309181 1508011 3503771 4482122 3818713 2589178 1728130 998582
36365 998582 97023 -493014 -441507 -393660 -1010133 -1861773 -2127611 -1903657 -1953349 -2466447
36355 -2466447 -2929211 -3108722 -3348112 -3806798 -4097036 -3894374 -3421619 -3107188 -3110355 -3335633
36345 -3335633 -3592402 -3580901 -2995728 -1822032 -381295 953004 1904114 2246011 1992409
36336 1992409 1646463 1785599 2238210 2180732 1362636 684570 956354 1484357 786423 -1303953
36326 -1303953 -3182583 -3482257 -2709125 -2190103 -2040697 -1258175 334823 1445536 1024889
36317 1024889 -287924 -1118214 -1115956 -944349 -929655 -698399 -85978 527835 968685 1538432
36307 1538432 2230514 2435075 1901943 1350991 1519448 2105130 2319792 2074249 1838931
36298 1838931 1599823 832566 -491818 -1655843 -2072030 -1776611 -992143 83430 924778
36289 924778 946938 472437 636157 1787692 2702684 2117565 499024 -592308 -579434
36280 -579434 -375977 -878137 -1816289 -2275785 -1707938 -247622 1419859 2360238 2110019
36271 2110019 1282417 954400 1301335 1415008 693924 -233081 -378100 349036 1234385
36262 1234385 1679342 1546525 987794 459614 581212 1438024 2310789 2602382 2656707 3019174
36252 3019174 3305270 2737289 1603957 1079084 1440395 1540951 510075 -914283 -1400409
36243 -1400409 -712707 305626 941866 1071065 745618 101524 -435984 -506442 -359406
36234 -359406 -503498 -822021 -596123 467541 1682832 2057647 1251143 -255194 -1688095
36225 -1688095 -2534115 -2696744 -2240795 -1096260 750963 2739872 3853123 3636077 2805727
36216 2805727 2394933 2524249 2527805 2062124 1417518 821393 187487 -356207 -439711 -183333
36206 -183333 -253946 -841492 -1221568 -779685 98950 655309 724896 494999 -174359 -1389564
36196 -1389564 -2503170 -2638341 -1901245 -1325688 -1551517 -2210939 -2682835 -2739839 -2263687
36187 -2263687 -1080974 461602 1348751 955443 -44182 -435691 -30847 94284 -958578
36178 -958578 -2660003 -3526326 -2676214 -682053 1084704 1741228 1450719 893045 473972
36169 473972 119270 -404617 -1201674 -2193041 -3151536 -3803000 -4007285 -3796578 -3205736 -2276247
36159 -2276247 -1343613 -979515 -1310787 -1680221 -1453150 -942424 -943910 -1496139 -1847898 -1694692
36149 -1694692 -1599143 -1893148 -2002453 -1412585 -591497 -215480 -31276 631789 1572096 1915693
36139 1915693 1503350 1115251 1197647 1277413 979205 838851 1553184 2902530 3939815
36130 3939815 3989450 3126480 1958621 1238134 1386093 2077414 2537230 2458606 2252668 2140584
36120 2140584 1558926 42014 -1717543 -2461997 -1913476 -1024612 -647310 -592529 -180859
36111 -180859 822073 2080002 3087145 3458112 3166915 2714194 2722188 3138819 3176512 2302609
36101 2302609 978363 121453 132973 783916 1728574 2624165 2945196 2313823 1100463
36092 1100463 199716 21996 86197 -184664 -638454 -703094 -276304 120693 61270 -253278
36082 -253278 -286703 198914 904212 1270792 953645 165233 -382515 -59101 1008503 1980866
36072 1980866 2219431 2014333 2106624 2586104 2733454 2080510 1129617 648758 639088 544483
36062 544483 249555 183721 437693 505125 156590 -76827 257997 716093 544141 -239595
36052 -239595 -966089 -1313731 -1534250 -1743001 -1665820 -1232853 -827840 -671668 -429703 229625
36042 229625 1041274 1462466 1327193 863538 313709 -85339 42808 874921 1908484
36033 1908484 2278564 1719078 894651 565145 653480 432301 -457002 -1491192 -1854444
36024 -1854444 -1295326 -196423 1031773 2260203 3315937 3774547 3410189 2631425 2054635
36015 2054635 1694988 997537 -247336 -1412009 -1687809 -1008985 -115173 169399 -397124
36006 -397124 -1329359 -1781669 -1249963 -99669 734116 717717 252505 132882 688070 1630986
35996 1630986 2512479 3039276 3095633 2767916 2330629 2026878 1922335 2071676 2594929 3345751
35986 3345751 3737509 3282834 2218517 1252609 753644 526721 329299 202863 241285
35977 241285 386507 568116 781275 937411 865439 530572 73106 -359737 -631805 -593116
35967 -593116 -368921 -546754 -1564892 -2881222 -3305667 -2365553 -873562 94568 308740
35958 308740 175388 -39152 -242154 -150189 444408 1157328 1337679 905392 376965 59323
35948 59323 -237860 -572218 -541146 45916 598730 397301 -344476 -629584 16342 884621
35938 884621 1031792 509645 131573 170828 -22763 -892458 -1780851 -1701274 -642961 516291
35928 516291 1211777 1619747 1914722 1852077 1313868 641171 110723 -380957 -798033 -706707
35918 -706707 37249 882686 1368338 1780906 2416545 2733565 2106469 1070058 798290
35909 798290 1409107 1770078 1133469 60183 -582071 -725293 -759553 -750419 -548328 -248244
35899 -248244 -54546 35360 101534 166362 388077 928161 1389806 1006890 -172565 -932694
35889 -932694 -385831 704900 930918 181712 -419080 -368388 -418851 -1089590 -1598414 -959155
35879 -959155 529580 1669124 1870277 1531791 1093638 521886 -118334 -289262 329108
35870 329108 1131215 1140312 248760 -573756 -494984 127316 266091 -417209 -1246841 -1602859
35860 -1602859 -1755856 -2257862 -2888969 -2837479 -1908467 -953096 -808672 -1204507 -1149909 -252626
35850 -252626 803030 1165075 831632 514829 696707 1153428 1393112 1228617 769792
35841 769792 118733 -641802 -1281398 -1554310 -1503215 -1404506 -1432248 -1612217 -2028167 -2680930
35831 -2680930 -3129016 -2785231 -1794694 -1121153 -1359117 -1874312 -1660882 -738653 -18919
35822 -18919 83827 134952 658043 1357770 1708741 1736145 1715224 1500887 752617 -333565
35812 -333565 -1072917 -1114990 -818680 -696802 -777643 -679815 -164480 547117 1007706 1058922
35802 1058922 1050101 1415638 2041322 2305979 1898227 1320492 1278237 1753041 2063431 1743890
35792 1743890 925367 -116981 -1224156 -1997992 -1800118 -582828 688412 1051637 783604
35783 783604 966683 1875901 2556531 2262156 1619565 1788629 2853919 3704935 3411668
35774 3411668 2161178 793161 -114223 -534930 -706499 -756539 -515691 268191 1382026
35765 1382026 2037400 1728982 1063841 1150248 2142711 3036692 3028258 2329270 1358047 32605
35755 32605 -1464047 -2048314 -952507 844657 1560820 869010 102918 172354 493263
35746 493263 363600 213978 695995 1382205 1344713 552002 -213227 -549196 -699287 -754452
35736 -754452 -417251 350524 1093424 1438806 1439035 1241992 867856 419473 88417 -188416
35726 -188416 -702904 -1473347 -2138231 -2505533 -2813242 -3178890 -3132261 -2115214 -355540
35717 -355540 1103131 1329672 332089 -1064939 -2050976 -2468270 -2675516 -2914699 -2944845
35708 -2944845 -2302226 -815552 1131153 2714651 3110604 2117915 433177 -961355 -1730774
35699 -1730774 -2145222 -2117439 -1046506 947717 2430604 2211499 1041748 688691 1535700
35690 1535700 2315731 2263979 2122029 2472942 2438659 1124563 -561933 -879856 356447
35681 356447 1622159 1834384 1484640 1433030 1632776 1550399 1109207 639028 355630 384804
35671 384804 920257 1824193 2307341 1564465 -270986 -2187375 -3331072 -3656475 -3505625
35662 -3505625 -2957941 -1933266 -753650 -120792 -337423 -836048 -802796 -141402 531305
35653 531305 775159 754192 716286 584224 339441 316753 663275 879553 457660 -246779
35643 -246779 -345377 486836 1733491 2717708 3045993 2557372 1514611 804255 1220748
35634 1220748 2454590 3443667 3769724 3906971 3964748 3208734 1330413 -728157 -1954004
35625 -1954004 -2535095 -3131246 -3536613 -3108142 -2113762 -1529149 -1623932 -1792571 -1774126 -1979290
35615 -1979290 -2446481 -2526467 -1993089 -1537107 -1613141 -1590545 -724381 646802 1606545 1905644
35605 1905644 1937470 1784783 1123548 28671 -842472 -998949 -552184 171004 972976
35596 972976 1615980 1746100 1220966 270806 -777901 -1681742 -2123814 -1760420 -680032
35587 -680032 424766 842221 527837 34707 -140642 48843 387239 716428 961119
35578 961119 959763 474648 -495377 -1443752 -1608995 -695178 721359 1721593 1989364 2002130
35568 2002130 2228882 2438278 2031091 853554 -620572 -1801406 -2348626 -2116007 -1202382
35559 -1202382 -180469 186245 -222231 -659468 -499040 -140024 -413445 -1316241 -2045721
35550 -2045721 -2281661 -2612261 -3392328 -3961054 -3574888 -2518050 -1569754 -835516 33292
35541 33292 772987 697427 -39081 -362929 280117 1227865 1627623 1374950 730714 -112464
35531 -112464 -617389 -8628 1446783 2094211 823690 -1250813 -2126858 -1481301 -692404
35522 -692404 -544187 -293198 773116 2062838 2467027 1592529 -173990 -2066848 -3073895
35513 -3073895 -2501445 -884024 369749 663204 807829 1518701 2246861 2241327 1907341
35504 1907341 2068198 2463231 2154295 1161971 544433 833992 1427552 1753019 2165171
35495 2165171 3251805 4785719 5761803 5260701 3216971 623815 -1092312 -1319759 -852695
35486 -852695 -842940 -1314226 -1283316 -257916 1098108 1894516 1959410 1667479 1398473 1396195
35476 1396195 1688733 1950128 1837295 1517337 1389877 1353011 1045004 803113 1444993 2858246
35466 2858246 3793166 3519701 2746181 2307440 1954487 1310541 1050611 1887386 3052186
35457 3052186 3198876 2474732 2227331 2727015 2715895 1529660 228696 -46236 344748
35448 344748 470737 389223 711720 1217985 1045952 79852 -815384 -999473 -758845 -666809
35438 -666809 -824502 -951655 -835023 -478965 -36592 311908 573722 996077 1676576 2217510
35428 2217510 2132269 1589161 1323019 1666789 2070718 1858273 1143158 610321 582526 789220
35418 789220 1047446 1612251 2548014 3173448 2707111 1407780 518153 846778 1779726
35409 1779726 2043675 1250103 298422 247194 1072965 1677755 1055523 -594880 -1952420
35400 -1952420 -1862484 -504424 936299 1712663 2205363 3036902 4046458 4591069 4463133
35391 4463133 3949855 3271963 2572849 2223486 2430972 2684783 2340765 1666223 1475532
35382 1475532 1765878 1699171 1056186 596420 629495 428805 -277586 -417856 791100 2281305
35372 2281305 2481201 1558524 918641 876549 371065 -1017464 -2262048 -2458792 -1955272
35363 -1955272 -1393803 -688011 388099 1423788 1914774 2029142 2212118 2444152 2392888
35354 2392888 1947132 1226671 453341 106114 685955 1942252 2851784 2813884 2382298
35345 2382298 2351210 2631838 2597240 2071849 1335180 523241 -300370 -787850 -721137 -545443
35335 -545443 -775906 -1049268 -537630 730472 1724993 1718315 1094764 655630 636467 660083
35325 660083 289472 -589468 -1681352 -2444917 -2522072 -2027792 -1296537 -531860 46724 19398
35315 19398 -787778 -1868928 -2579545 -2948700 -3371879 -3679294 -3287828 -2283240 -1520346
35306 -1520346 -1433388 -1487595 -1111611 -483872 -11091 334976 685136 820148 577341 283311
35296 283311 261670 263332 -95476 -619870 -794206 -577698 -470887 -858035 -1583100 -2061237
35286 -2061237 -1645577 -191660 1513989 2303850 1960689 1564901 2055175 2896279 2818273
35277 2818273 1536778 -24923 -1052490 -1558206 -1742182 -1431339 -499627 622704 1220900
35268 1220900 938542 85136 -550378 -320282 557538 1040883 395673 -849313 -1481596
35259 -1481596 -980149 145270 1180908 1747407 1624276 795154 -203606 -626173 -408582
35250 -408582 -198351 -387384 -696593 -839851 -932671 -1011371 -802766 -282927 133730 262357
35240 262357 382955 514258 197401 -554064 -882521 -327190 257195 -174358 -1372353
35231 -1372353 -2297680 -2623919 -2740315 -2588075 -1621391 70463 1572704 2218948 2108744
35222 2108744 1538749 741387 244536 576068 1368551 1579423 892681 123077 -75157
35213 -75157 -55474 -297424 -532846 -403552 -273597 -595752 -996397 -832208 -311830 -228902
35203 -228902 -758992 -1288719 -1368046 -1150254 -921903 -840275 -1120693 -1808308 -2288218 -1719138
35193 -1719138 -215173 968459 783518 -457176 -1575537 -1848609 -1507358 -1167865 -1153058
35184 -1153058 -1352003 -1501451 -1509578 -1512412 -1626735 -1753838 -1717223 -1449507 -903897 -33800
35174 -33800 833921 895564 -288996 -1938537 -2670340 -2068311 -1032088 -433452 -143552
35165 -143552 267959 618570 545288 317262 447877 804091 860297 640962 616419 742371
35155 742371 465756 -197944 -460502 14736 441738 11492 -911153 -1361599 -1193216 -1187617
35145 -1187617 -1822638 -2584076 -2676272 -1987422 -1087515 -464677 -5578 728248 1776314
35136 1776314 2499108 2251328 1299377 685553 1008873 1721682 1941855 1577806 1154581
35127 1154581 824122 249416 -561139 -1024816 -819285 -379340 -222971 -219205 73121 653140
35117 653140 1102320 1192665 1078087 954688 857529 752103 525528 -101855 -1332437 -2841588
35107 -2841588 -3815099 -3684546 -2811055 -2238152 -2603981 -3361808 -3328306 -2071604 -420728
35098 -420728 652788 1252428 2084742 3055292 3235958 2338431 1275846 818745 564378
35089 564378 -57047 -536871 -68600 931577 1276449 812468 568794 992418 1205028
35080 1205028 424884 -870640 -1781664 -2182689 -2435145 -2542027 -2271303 -1667068 -868098
35071 -868098 122876 969360 912081 -104363 -761703 199522 2161151 3237062 2599575
35062 2599575 1203097 149080 -587098 -1419235 -2091596 -2065582 -1443950 -846320 -610725
35053 -610725 -618527 -739769 -999350 -1342666 -1573241 -1566843 -1375725 -1109914 -821362 -532261
35043 -532261 -361815 -564802 -1261028 -2054284 -2213939 -1500815 -542478 -30894 131450 349228
35033 349228 339624 -520157 -1923662 -2696642 -2368930 -1788872 -1790302 -2129155 -2286719 -2450572
35023 -2450572 -2899086 -3127432 -2548452 -1573863 -1029591 -894952 -671573 -689934 -1783728
35014 -1783728 -3630649 -4656893 -3957416 -2319507 -926704 14854 801213 1229850 854504
35005 854504 -235293 -1515800 -2552602 -2989910 -2533461 -1497504 -873502 -1201880 -1798471
34996 -1798471 -1791957 -1471259 -1673831 -2125990 -1562505 335869 2180313 2558374 1729614
34987 1729614 1018683 1037732 1232620 977293 417723 110741 274480 641816 858421 777655
34977 777655 352234 -559718 -2012732 -3537003 -4201007 -3490254 -2050506 -1148025 -1313265
34968 -1313265 -1890602 -2067349 -1918438 -2075107 -2643229 -2949190 -2389238 -1205790 -285234
34959 -285234 -296503 -1076960 -1827583 -1932803 -1573177 -1407124 -1686867 -1994583 -1955981 -1815348
34949 -1815348 -1965432 -2222519 -2063377 -1429305 -764555 -304141 103422 402825 200529
34940 200529 -503835 -1035750 -947293 -761921 -1260867 -2291377 -2872016 -2395636 -1229735
34931 -1229735 -172571 209566 -259163 -1316076 -2248144 -2389188 -1809747 -1169176 -797932
34922 -797932 -356128 463380 1386913 1987970 2243228 2347205 2346943 2295355 2404935 2672287
34912 2672287 2692667 2261114 1822075 1853286 2124408 2097999 1753259 1381576 841849 -201225
34902 -201225 -1410729 -1956767 -1595825 -842760 -62832 774331 1366776 1108575 183245
34893 183245 -325327 78103 592854 522102 454209 1146595 2013712 1892938 870824 146648
34883 146648 249988 530091 431144 202373 137457 27086 -336795 -839318 -1427340 -2100939
34873 -2100939 -2389253 -1688414 -379623 291074 -124624 -603093 -217252 426514 96339
34864 96339 -1317663 -2792259 -3492405 -3304298 -2379597 -1015829 111331 361161 -168336
34855 -168336 -856142 -1381231 -1801332 -1989088 -1699295 -1196211 -1111087 -1521854 -1770473 -1407342
34845 -1407342 -812380 -637930 -1042704 -1676355 -2028662 -1612371 -253399 1485512 2528815
34836 2528815 2322493 1458171 961541 1114167 1287778 870354 53765 -380585 68760
34827 68760 1046808 1631306 1184433 -113830 -1535751 -2403781 -2335171 -1235042 513219
34818 513219 1938199 2076990 911870 -521469 -1116188 -648202 256049 834124 776092
34809 776092 364542 213122 721546 1647941 2308830 2275054 1772876 1341807 1183983 922967
34799 922967 34925 -1420282 -2568665 -2499180 -1339326 -200255 98212 -240694 -806351
34790 -806351 -1797277 -3283629 -4276837 -3704939 -2117013 -1179314 -1393291 -1586205 -993780
34781 -993780 -492015 -1010362 -1902201 -1970964 -1282738 -795099 -746190 -585552 -170815 92538
34771 92538 146601 296721 425594 172159 -140865 235918 1185239 1644132 1072668 172097
34761 172097 -183113 -8837 166747 155748 174070 415371 827731 1093624 855372 292283
34751 292283 253973 1223704 2355258 2361139 1296456 535867 892254 1708950 1993300 1453135
34741 1453135 169082 -1622341 -2970966 -2648730 -897642 333975 -180012 -1260549
34733 -1260549 -1151938 -126869 119489 -903728 -1978971 -2134146 -1696383 -1269900 -865972
34724 -865972 -374278 9600 157254 161816 -3217 -347084 -418987 201844 954531 737740
34714 737740 -498647 -1425763 -880918 935091 2972196 4296907 4374459 3242518 1761676
34705 1761676 986810 983143 926748 506637 296092 498996 496685 184040 521636 1844610
34695 1844610 2746043 1913008 261192 -192096 918252 2146974 2547062 2555263 2503980
34686 2503980 1833817 317835 -1198560 -1987827 -2391100 -2867545 -2976941 -2180765 -1002454
34677 -1002454 -434566 -558963 -642635 -407226 -350126 -796541 -1380033 -1656723 -1685922 -1734681
34667 -1734681 -1758376 -1438615 -580423 660373 1837897 2464386 2321581 1576745 578492
34658 578492 -367161 -999365 -1150182 -990540 -983443 -1312118 -1599644 -1549930 -1555886 -2077187
34648 -2077187 -2624650 -2222183 -1005298 -443932 -1459587 -3058560 -3593379 -2866085 -2055024
34639 -2055024 -1823572 -1581033 -751000 242339 747948 895324 1159065 1388440 1012549
34630 1012549 60953 -644332 -377135 782140 2142881 3045670 3339676 3430730 3780639
34621 3780639 4249137 4215947 3569748 3127528 3572587 4353585 4345854 3389445 2344456 1676606
34611 1676606 945428 -83767 -788095 -688947 -340231 -520175 -1092212 -1411871 -1436590 -1592939
34601 -1592939 -1780304 -1406273 -449184 314828 380386 177594 329074 722115 775838 397369
34591 397369 197565 673358 1449704 1609633 825459 -101279 -167217 460477 535664 -607551
34581 -607551 -2029591 -2278621 -1127165 334634 1079664 1017783 649174 485106 805023
34572 805023 1435242 1748281 1361957 770928 727203 1098347 1068204 472892 79371 328971
34562 328971 671995 546400 199570 -11336 -369503 -1103184 -1544337 -869469 652450
34553 652450 1967709 2554801 2644054 2342942 1495775 468483 143157 765541 1449092
34544 1449092 1244774 266918 -606196 -798894 -439077 68604 511864 955258 1515643
34535 1515643 2046477 2138339 1663545 1201941 1453178 2161344 2200861 1066228 -228824
34526 -228824 -312496 771752 1651534 1472401 924587 1093401 1882610 2241871 1709262 926392
34516 926392 474902 -14268 -1015232 -1913014 -1563154 26721 1483283 1815643 1582532
34507 1582532 1782270 2248981 1985042 773025 -418053 -642093 100174 1212510 2138232
34498 2138232 2500897 2203474 1617891 1205076 795602 -200179 -1670744 -2563682 -2192338
34489 -2192338 -1198844 -655347 -695057 -713146 -532277 -505748 -596373 -269585 510447 947604
34479 947604 447554 -589377 -1426700 -1949444 -2418263 -2617614 -1960794 -448290 1081867
34470 1081867 1901622 2209277 2700429 3559045 4232135 4166940 3464187 2696538 2278276 2182925
34460 2182925 2188870 2197754 2258031 2398117 2549463 2623280 2596060 2500975 2373614 2241192 2149928
34449 2149928 2149008 2218580 2251032 2147075 1895380 1501329 900177 79478 -713594 -1053454
34439 -1053454 -715961 91735 888696 1188290 661545 -646706 -2106296 -2786011 -2247662
34430 -2247662 -952102 299959 1131674 1594261 1752822 1728051 1928936 2644782 3430186
34421 3430186 3478531 2684978 1775984 1260649 871616 285403 -253269 -432945 -403456 -273248
34411 -273248 366074 1706707 2937243 3048133 2248790 1720967 1960119 2220066 1799107
34402 1799107 1057348 717069 769526 637010 62389 -670504 -1192045 -1296997 -884965 -40803
34392 -40803 865270 1429855 1546397 1346861 980695 663174 733756 1293541 1837342 1632168
34382 1632168 579930 -571817 -1078002 -1090660 -1427681 -2416682 -3242628 -2748767 -867184
34373 -867184 1089145 1760393 1125839 299672 188814 758466 1453096 1775561 1424188
34364 1424188 442131 -572304 -898942 -564348 -302730 -436015 -382862 363190 1407202
34355 1407202 2139652 2620718 3050010 2943423 1845399 495906 126345 699109 1050885
34346 1050885 847861 1041711 1987424 2529042 1823513 848076 856784 1256932 566162 -966521
34336 -966521 -1365754 313770 2654604 3737828 3198826 1892750 571188 -293319 -160347
34327 -160347 1048175 2346522 2487173 1397847 275302 205884 1056693 1738722 1316922
34318 1316922 -82413 -1281955 -1104255 426571 2137137 3062769 3332753 3430661 3136528
34309 3136528 1877551 -141710 -1904894 -2675272 -2530201 -1812917 -710486 455733 1132630
34300 1132630 1103263 797055 702576 694997 229938 -888544 -2099068 -2449890 -1472896 166038
34290 166038 1091367 624399 -405877 -692515 -99721 349061 23361 -637208 -1160106
34281 -1160106 -1798368 -2726161 -3290298 -2846354 -1798175 -988026 -460107 282201 1067482
34272 1067482 1128260 402840 -193587 -48837 416489 674980 1002052 1858507 2860904
34263 2860904 3085025 2257723 1073756 285804 -97845 -560861 -1308285 -2003577 -2232127
34254 -2232127 -2008290 -1658543 -1283882 -636492 336418 1124607 1174297 635739 208077 280416
34244 280416 628909 990676 1456461 2052205 2303186 1624006 74762 -1532244 -2319720
34235 -2319720 -2067717 -1291552 -672559 -440150 -377346 -398753 -803570 -1696931 -2465023 -2365259
34225 -2365259 -1571814 -1040655 -1226792 -1548878 -1417221 -1180893 -1479146 -2040684 -1862645
34216 -1862645 -559296 1071996 1990287 1974410 1516884 1014684 465896 -120999 -423350
34207 -423350 -122997 623426 1271105 1433614 1137984 536064 -306941 -1157030 -1487103 -996609
34197 -996609 -64479 733344 1386984 2187774 2795078 2338537 746064 -671255 -533315
34188 -533315 981543 2303476 2166890 800981 -509453 -765927 -120088 473821 383026
34179 383026 -75105 -230165 30019 380017 837090 1696338 2690936 3040200 2567741 1990537
34169 1990537 1779170 1572070 1158562 1076800 1518791 1609553 807222 172860 912366 2256491
34159 2256491 2355520 1023271 -63766 41048 459530 371055 286745 633958 613734 -311943
34149 -311943 -999296 -173463 1372833 1697915 471332 -686738 -577862 291208 1035867
34140 1035867 1636317 2197260 2039214 539124 -1601238 -2835975 -2440880 -1093522 154125
34131 154125 903390 1314280 1521057 1511537 1358527 1197488 1001804 687112 497161 963862
34121 963862 2256197 3797216 4842481 5284978 5492560 5449378 4643555 3003594 1427688
34112 1427688 942329 1570048 2379825 2460096 1519792 -208438 -2141027 -3479135 -3694904
34103 -3694904 -3035402 -2225152 -1596894 -878995 52993 693190 544782 -77788 -402047
34094 -402047 -258612 -242099 -695220 -1080930 -775686 -126401 -124862 -1107839 -2367047 -3154990
34084 -3154990 -3499460 -3725480 -3701697 -3090089 -2041632 -1084475 -455549 -39687 137777
34075 137777 -88731 -523403 -649036 -315271 30842 -34535 -385264 -566187 -274356 431658
34065 431658 1125803 1222183 514562 -499142 -1153587 -1396480 -1643147 -1995339 -2143225 -1952959
34055 -1952959 -1542131 -856787 103143 711123 293964 -626289 -718943 222280 803911 -28460
34045 -28460 -1651281 -2989506 -3933197 -4619620 -4426249 -2981983 -1376234 -918818 -1218668
34036 -1218668 -954524 -171370 -180340 -1221918 -1886380 -1228339 -45422 507315 393739
34027 393739 154373 -77405 -270194 -25125 791217 1500742 1390709 627480 -151010 -756164
34017 -756164 -1447384 -2349478 -3333816 -4194077 -4560114 -3957254 -2376605 -567585 611646
34008 611646 1020549 1208062 1735532 2687514 3655421 4055440 3607564 2567902 1414111
33999 1414111 462627 -40039 152212 797972 1020618 347456 -447401 -398640 92104 -102372
33989 -102372 -831027 -760772 324581 860460 -228580 -1935890 -2680920 -2241137 -1272034
33980 -1272034 -46752 1190886 1598260 771941 -283015 -484678 -373193 -1184092 -2747688
33971 -2747688 -3732895 -3681580 -3366252 -3217555 -2791532 -1918291 -1117506 -614914 -14558 808098
33961 808098 1460155 1862949 2331089 2609907 1896158 194459 -1327452 -1807751 -1636741
33952 -1636741 -1441033 -1005896 88956 1427255 2138795 1985110 1469622 1115814 1111642
33943 1111642 1470639 2119312 2858648 3419562 3522531 2983296 2028065 1340141 1313370 1372446
33933 1372446 667037 -569548 -1103142 -327150 882257 1230420 333865 -1283044 -2890533
33924 -2890533 -3856850 -3785474 -2851722 -1751107 -1032121 -686803 -435604 -25254 752447
33915 752447 1818520 2589015 2618468 2434322 2940734 3951929 4278460 3472100 2432505
33906 2432505 1919798 1612296 1231072 1388063 2351787 2995846 2212877 700482 82738
33897 82738 670721 1285953 1049639 204416 -738328 -1605285 -2253997 -2500822 -2411517 -2045140
33887 -2045140 -1113175 377801 1477582 1284917 404067 286352 1107301 1485675 589627
33878 589627 -609712 -754357 92184 732685 391364 -626941 -1531937 -1858346 -1813450
33869 -1813450 -1982264 -2548623 -2932660 -2581244 -1914200 -1823111 -2291506 -2313206 -1335322 -23351
33859 -23351 679399 576790 21167 -630906 -1004248 -770260 -135361 259626 257187 415996
33849 415996 980080 1304474 857618 206993 324642 1272382 2172993 2230834 1339444 20172
33839 20172 -797886 -348029 1083275 2196669 2161503 1679288 1936622 2875071 3337140 2789187
33829 2789187 2026008 1997281 2587621 2861694 2176629 862325 -45668 216841 1277690
33820 1277690 1945328 1615429 1004277 1085346 1728185 2050459 1798504 1530375 1527818 1418808
33810 1418808 993319 565544 292756 -87945 -511585 -321406 755909 1959949 2342445
33801 2342445 1794782 777078 -419944 -1507651 -1784277 -764336 906330 1944827
33793 1944827 1907191 1559661 1695022 2179069 2377626 2009550 1260851 429684 -196621 -368465
33783 -368465 -134741 42350 -266362 -915359 -1296309 -1018675 -378608 -138536 -845990 -2281956
33773 -2281956 -3556116 -3877833 -3298921 -2579987 -2303412 -2340940 -2296329 -2174934 -2317105 -2838538
33763 -2838538 -3479541 -3939994 -4041159 -3619508 -2663287 -1586421 -932175 -672950 -255398
33754 -255398 425527 602076 -345685 -1816559 -2573326 -2263708 -1714672 -1686275 -1968959 -1914056
33744 -1914056 -1289302 -273768 933055 2075389 2761519 2886671 2912247 3273150 3681656
33735 3681656 3512094 2780195 2180110 2072208 1971913 1317045 353654 -134337 177240
33726 177240 770003 904378 399366 -281089 -596172 -458651 -181240 2756 191670 541110
33716 541110 941178 1174733 1284804 1515928 1905773 2201559 2228881 2093198 1927890 1681574
33706 1681574 1281912 779163 147926 -834644 -2222712 -3489213 -3774823 -2680563 -767035
33697 -767035 783189 1095341 374250 -230179 253615 1555924 2492876 2464685 2193220
33688 2193220 2586579 3292402 3118799 1795507 460371 123530 419740 438021 158555
33679 158555 223032 598604 473708 -401184 -1154989 -998415 -341033 -149797 -613180 -1053289
33669 -1053289 -942915 -403638 247317 863546 1269372 1178248 575087 -91851 -336994 -114641
33659 -114641 267574 568851 797880 1040240 1215310 1059868 457598 -171276 -56673 1049628
33649 1049628 2329687 2632261 1756899 628235 160458 389994 850217 1288200 1672172
33640 1672172 1866746 1720612 1298027 757714 229158 993 406018 1138428 1155462 -94601
33630 -94601 -1647996 -2004026 -1024020 -29180 65420 -184317 89288 680851 787955 346853
33620 346853 53058 198903 248016 -302124 -1188603 -1780332 -1876976 -1820953 -1938814 -2095746
33610 -2095746 -1832967 -869003 589838 2041354 3090031 3538319 3217732 2111662 733420
33601 733420 -73120 -77055 -90271 -959654 -2309435 -2886938 -2164461 -954949 -226834 55311
33591 55311 446977 895635 808990 66198 -756342 -1227010 -1483918 -1625051 -1318575 -460541
33581 -460541 287637 253405 -231956 -261866 322993 830662 1034889 1694293 3238489 4677127
33571 4677127 4685657 3414347 2276580 2024779 2016789 1580692 1102162 1180489 1510055 1446029
33561 1446029 1177869 1388658 1983130 2142652 1650393 1172672 991655 451297 -797892
33552 -797892 -1865244 -1751942 -849263 -402697 -821547 -1452947 -1844533 -2192578 -2474790
33543 -2474790 -2218019 -1517593 -1335866 -2142371 -2978041 -2631731 -1246430 8699 475183
33534 475183 414343 190723 -41115 50321 732614 1488792 1408927 517035 -113467 121683
33524 121683 533590 274398 -489845 -1142408 -1609085 -1945558 -1503884 382239 2996867
33515 2996867 4534040 4010654 2225941 669862 111007 445990 1261170 2091984 2521402
33506 2521402 2451348 2121888 1689750 1063309 327741 -20970 427044 1493255 2646004
33497 2646004 3470916 3636940 2753228 810130 -1333550 -2490585 -2368919 -1871796 -1930600
33488 -1930600 -2358397 -2245259 -1313195 -351750 -176947 -608765 -849356 -597512 -267599
33479 -267599 -140601 147793 1043120 2375864 3509830 3932273 3500766 2464275 1564233
33470 1564233 1736589 3159890 4745126 5111919 4080376 2762151 2167545 2179886 2010677
33461 2010677 1246735 201720 -559865 -844679 -978674 -1297796 -1525386 -1004174 258205
33452 258205 1252010 1161525 484428 267606 558179 529021 12972 -170801 374740 903076
33442 903076 645200 -189586 -1023975 -1751865 -2407040 -2702882 -2549704 -2443806 -2714493 -2944149
33432 -2944149 -2757700 -2573149 -2832545 -3087447 -2721040 -2063814 -1820919 -1825206 -1458203 -1010747
33422 -1010747 -1371511 -2365686 -2645613 -1552943 -79205 471371 6249 -579271 -508871
33413 -508871 376215 1697039 2775358 3177516 3163351 3181906 3002124 2069630 759626
33404 759626 335593 1287513 2499630 2562669 1312167 -333654 -1423147 -1428637 -342769
33395 -342769 1097092 1801356 1466812 854946 573324 304606 -208450 -275634 707548 1971203
33385 1971203 2206502 1318178 270634 -530769 -1494850 -2526983 -2749085 -1905446 -999062
33376 -999062 -962084 -1461550 -1609030 -1250584 -931183 -991710 -1291490 -1589111 -1717979 -1529709
33366 -1529709 -1022157 -402854 207771 924562 1718082 2174068 1960410 1287168 535843
33357 535843 -326972 -1497607 -2664644 -3174028 -2898919 -2390057 -1996936 -1399554 -366319
33348 -366319 547676 696712 454399 812279 1800416 2141169 929483 -984595 -1978259
33339 -1978259 -1613624 -811558 -305577 78128 485810 444040 -222128 -678037 -108381 999939
33329 999939 1451082 995000 556462 824019 1394247 1536307 1196091 889583 962621 1280685
33319 1280685 1483580 1343537 927957 455359 -4010 -491008 -737038 -218728 953706
33310 953706 1632673 856557 -709468 -1398014 -623288 531631 976158 897216 936472 1008763
33300 1008763 721766 327260 355652 681114 828095 977817 1750761 2992688 3652138
33291 3652138 3113931 2001647 1340217 1394766 1641788 1526536 941816 174057 -400098
33282 -400098 -674569 -925311 -1408373 -1914546 -2014972 -1689939 -1322763 -1070480 -680179 19745
33272 19745 915425 1955195 3133100 3994167 3864568 2916579 2262969 2425445 2442788 1358471
33262 1358471 -28766 -112151 1085500 1809463 1111493 140064 270330 1127027 1477584
33253 1477584 1237254 1318767 1907763 2212851 1940793 1834549 2439754 3297770 3782868 3909521
33243 3909521 3792284 3069624 1588209 128239 -346577 113467 666861 835288 708909
$$ [...]
##END NTUPLES=NMR SPECTRUM
##END=
