##TITLE=31Pdec_DE-124_123sum
, 24 sc
 29.1.2026
##JCAMPDX= 6.0         $$ Bruker NMR JCAMP-DX V2.0
##DATA TYPE= NMR SPECTRUM
##DATA CLASS= NTUPLES
##ORIGIN= UXNMR, Bruker Analytische Messtechnik GmbH
##OWNER= root
$$ XWIN-NMR		Version 3.5
$$ Thu Jan 29 14:02:44 2026 Russian Standard Time (UT+4h)  she@DPX200
##.OBSERVE FREQUENCY= 81.013821
##.OBSERVE NUCLEUS= ^31P
##.ACQUISITION MODE= SIMULTANEOUS
##.ACQUISITION SCHEME= undefined
##.AVERAGES= 24
##.DIGITISER RES= 17
##SPECTROMETER/DATA SYSTEM= spect
##.PULSE SEQUENCE= zgpg30
##.SOLVENT NAME= CDCl3
##.SHIFT REFERENCE= (INTERNAL, CDCl3, 0, 198.062)
##AUDIT TRAIL= $$ (NUMBER, WHEN, WHO, WHERE, WHAT)
$$ ##TITLE= Audit trail, XWIN-NMR		Version 3.5
$$ ##JCAMPDX= 5.01
$$ ##ORIGIN= Bruker BioSpin GmbH
$$ ##OWNER= she
$$ F:/spectra/data/she/nmr/P31/2/pdata/1/auditp.txt
$$ ##AUDIT TRAIL=  $$ (NUMBER, WHEN, WHO, WHERE, WHAT)
(   1,<2026-01-29 14:00:36.93 +0400>,<she>,<DPX200>,
      <created by zg, POWCHK disabled, PULCHK disabled
       configuration hash MD5:
       00 E9 B6 7A A2 85 ED C7 34 08 36 98 17 FE 4E 26
       data hash MD5: 32K
       A4 A1 65 23 E3 E0 44 29 17 83 AA 5C 84 A2 99 F6>)
(   2,<2026-01-29 14:01:04.20 +0400>,<she>,<DPX200>,
      <Start of raw data processing
       efp BC_mod = 2 LB = 1.5 FT_mod = 6 PKNL = 1 PHC0 = 1388.452 PHC1 = 72.50077 SI = 64K 
       data hash MD5: 64K
       D3 AE 92 B7 7E 47 EE 78 6F 41 BD EF 24 98 0C FA>)
(   3,<2026-01-29 14:01:29.54 +0400>,<she>,<DPX200>,
      <pk PHC0 = -20.8811 PHC1 = 107.4001 
       data hash MD5: 64K
       16 9C 00 E1 36 98 BF D2 15 6B 3D 06 22 A7 BC EF>)
(   4,<2026-01-29 14:01:35.46 +0400>,<she>,<DPX200>,
      <abs ABSG = 5 
       data hash MD5: 64K
       19 04 D5 9D 3A 02 15 67 BA DD 97 26 83 16 CE 43>)
$$ ##END=
$$ 
$$ hash MD5
$$ CD 0D 70 DA 2C C1 0C 9B C3 AE 3E 84 F4 82 6C 5B
##$RELAX= 
##$RELAX= 
##$RELAX= 
##$RELAX= 
##$RELAX= 
##$RELAX= 
##$RELAX= 
##$RELAX= 
$$ Bruker specific parameters
$$ --------------------------
##$DU= <F:/spectra>
##$EXPNO= 2
##$NAME= <P31>
##$PROCNO= 1
##$TYPE= <nmr>
##$USER= <she>
##$AMP= (0..31)
100 100 100 100 100 100 100 100 100 100 100 100 100 100 100 100 100 100 
100 100 100 100 100 100 100 100 100 100 100 100 100 100 
##$AQSEQ= 0
##$AQ_mod= 1
##$AUNM= <au_zg>
##$AUTOPOS= <>
##$BF1= 81.014009
##$BF2= 200.13
##$BF3= 200.13
##$BF4= 200.13
##$BF5= 200.13
##$BF6= 200.13
##$BF7= 200.13
##$BF8= 200.13
##$BYTORDA= 1
##$CFDGTYP= 0
##$CFRGTYP= 5
##$CHEMSTR= <none>
##$CNST= (0..31)
1 1 145 1 1 1 1 1 1 1 1 1 1 1 1 1 1 1 1 1 1 1 1 1 1 1 1 1 1 1 1 1 
##$CPDPRG= <waltz16>
##$CPDPRG1= <>
##$CPDPRG2= <waltz16>
##$CPDPRG3= <>
##$CPDPRG4= <mlev>
##$CPDPRG5= <mlev>
##$CPDPRG6= <mlev>
##$CPDPRG7= <mlev>
##$CPDPRG8= <mlev>
##$CPDPRGB= <>
##$CPDPRGT= <>
##$D= (0..31)
0 1 0 0 0 0 0 0 0 0.06 0 0.03 2e-05 3e-06 0 0 0.0002 0 0 0 0 0 0 0 0 0 
0 0 0 0 0 0 
##$DATE= 1769680836
##$DBL= (0..7)
120 120 120 11 120 120 24 19 
##$DBP= (0..7)
150 150 150 150 150 150 150 150 
##$DBP07= 0
##$DBPNAM0= <>
##$DBPNAM1= <>
$$ [...]
##$SUBNAM3= <"">
##$SUBNAM4= <"">
##$SUBNAM5= <"">
##$SUBNAM6= <"">
##$SUBNAM7= <"">
##$SUBNAM8= <"">
##$SUBNAM9= <"">
##$SW= 400.765351723535
##$SWIBOX= (0..15)
0 1 3 0 0 0 0 0 0 0 0 0 0 0 0 0 
##$SW_h= 32467.5324675325
##$TD= 32768
##$TD0= 1
##$TE= 0
##$TE2= 300
##$TE3= 300
##$TEG= 300
##$TL= (0..7)
0 120 53 12 22 120 120 120 
##$TP= (0..7)
150 150 150 150 150 150 150 150 
##$TP07= 0
##$TPNAME0= <>
##$TPNAME1= <>
##$TPNAME2= <>
##$TPNAME3= <>
##$TPNAME4= <>
##$TPNAME5= <>
##$TPNAME6= <>
##$TPNAME7= <>
##$TPOAL= (0..7)
0.5 0.5 0.5 0.5 0.5 0.5 0.5 0.5 
##$TPOFFS= (0..7)
0 0 0 0 0 0 0 0 
##$TUNHIN= 0
##$TUNHOUT= 0
##$TUNXOUT= 0
##$USERA1= <user>
##$USERA2= <user>
##$USERA3= <user>
##$USERA4= <user>
##$USERA5= <user>
##$V9= 5
##$VALIST= <valist>
##$VCLIST= <CCCCCCCCCCCCCCC>
##$VD= 0
##$VDLIST= <DDDDDDDDDDDDDDD>
##$VPLIST= <PPPPPPPPPPPPPPP>
##$VTLIST= <TTTTTTTTTTTTTTT>
##$WBST= 1024
##$WBSW= 4
##$XGAIN= (0..3)
0 0 0 0 
##$XL= 0
##$YL= 0
##$YMAX_a= 20079
##$YMIN_a= -21381
##$ZGOPTNS= <>
##$ZL1= 120
##$ZL2= 120
##$ZL3= 120
##$ZL4= 120
##$ABSF1= 198.0616
##$ABSF2= -202.7028
##$ABSG= 5
##$ABSL= 3
##$ALPHA= 0
##$AQORDER= 0
##$ASSFAC= 0
##$ASSFACI= 0
##$ASSFACX= 0
##$ASSWID= 0
##$AUNMP= <proc_1d>
##$AZFE= 0.1
##$AZFW= 0.5
##$BCFW= 0
##$BC_mod= 2
##$BYTORDP= 0
##$COROFFS= 0
##$CY= -3
##$DATMOD= 1
##$DC= 0
##$DFILT= <>
##$DTYPP= 0
##$F1P= 0
##$F2P= 0
##$FCOR= 1
##$FTSIZE= 65536
##$FT_mod= 6
##$GAMMA= 0
##$GB= 0
##$INTBC= 1
##$INTSCL= 9.790993e-09
##$ISEN= 30
##$LB= 1.5
##$LEV0= 0
##$LPBIN= 0
##$MAXI= 10000
##$MC2= 0
##$MEAN= 0
##$ME_mod= 0
##$MI= 50
##$NCOEF= 0
##$NC_proc= -4
##$NLEV= 6
##$NOISF1= 182.463
##$NOISF2= 159.3651
##$NSP= 0
##$NTH_PI= 0
##$NZP= 0
##$OFFSET= 198.0616
##$PC= 4
##$PHC0= 1367.571
##$PHC1= 179.9009
##$PH_mod= 1
##$PKNL= yes
##$PPARMOD= 0
##$PSCAL= 0
##$PSIGN= 0
##$REVERSE= no
##$SF= 81.0140089999434
##$SI= 65536
##$SIGF1= 159.3651
##$SIGF2= -187.1042
##$SINO= 113.3802
##$SIOLD= 16384
##$SREGLST= <1H.CDCl3>
##$SSB= 0
##$STSI= 65536
##$STSR= 0
##$SW_p= 32467.5324675325
##$SYMM= 0
##$S_DEV= 0
##$TDeff= 32768
##$TDoff= 0
##$TI= <>
##$TILT= no
##$TM1= 0
##$TM2= 0
##$TOPLEV= 0
##$USERP1= <user>
##$USERP2= <user>
##$USERP3= <user>
##$USERP4= <user>
##$USERP5= <user>
##$WDW= 1
##$XDIM= 65536
##$YMAX_p= 476753024
##$YMIN_p= -3860962
$$ End of Bruker specific parameters
$$ ---------------------------------
##NTUPLES= NMR SPECTRUM
##VAR_NAME=  FREQUENCY,     SPECTRUM/REAL,   SPECTRUM/IMAG
##SYMBOL=    X,             R,               I
##VAR_TYPE=  INDEPENDENT,   DEPENDENT,       DEPENDENT
##VAR_FORM=  AFFN,          ASDF,            ASDF
##VAR_DIM=   65536,         65536,           65536
##UNITS=     HZ,            ARBITRARY UNITS, ARBITRARY UNITS
##FACTOR=    0.49542278885378, 1,            1
##FIRST=     16045.7642231865, 0,            0
##LAST=      -16421.768244346, 0,            0
##MIN=       -16421.768244346, -3860962,     0
##MAX=       16045.7642231865, 476753024,    0
$$ Real data points
##PAGE= N=1
##DATA TABLE= (X++(R..R)), XYDATA
$$ [...]
41819g1872k6305K0860J09360J05731k4157j29842r1313J0520L6670j0703l9221
41808a10272k2837M33J7626L4572L4824J3078n616k3565p2669j23301q8467L3697
41796c12497J24725J08709M8066K0643R733j8467l2758j827N0614J05259J59861
41785B62061J51287N041j89804k21695n3958Q9021M2077o4677l3990Q8784J12797
41774A86944k224j27414j68584j29024k9962Q5714J23189M1640n6479n3555K3424
41763a06331P0701N8956J4236o0351j30683j00719L6489J22225M8112o1185m2268
41752a50818M2971L1118n1432m4638N5884R6295L1825k0972m636O590k3911l3256
41740f4980L086K9039K9595N1456Q4700O1986j0422n1825m2157l1679k5920N457
$$ y = [-71872, -98177, -77317, 32043, 137774, 113617, -16225, -107538, -97018, -60348, -71051, -110272, -133109, -132676, -115050, -80478, -45654, -32576, -38192, -61757, -134426, -257727, -346194, -312497, -187772, -79063, -30997, -10354, -621, -19088, -51846, -53673, -3059, 102200, 262061, 413348, 418389, 228585, 6890, -47068, 41953, 84030, 19353, -14637, 74147, 186944, 184720, 57306, -111278, -240302, -270264, -184550, -61361, -19721, -76200, -129755, -106331, -35630, 23326, 37562, -22789, -153472, -254191, -217702, -95477, -47365, -108550, -150818, -107847, -76729, -128161, -172799, -116915, -20620, 11205, -9767, -14403, -7813, -31724, -64980, -61894, -32855, -3260, 48196, 132896, 194882, 184460, 132635, 90478, 58799, 32879, 38336]
41728C8336K5557j7468o0968j2895O1459K1754r8191j29062n2100k4013r1269
41717c38860j10696j2838P8338P0399L9561N0526L9194k0386k5222O1804J08906
41706e9274L5982l5137J0658Q9456Q5207M9792O8621P2240k9210j41792j16302
41695C0241L893N2758m379o4313q1352r7213j13027r2557o5292q0053q7399j2436
41683f11129R0950J12098P7766J05603J78006J46340j5750j39839j03022Q752
41673a50225N6536M2217M8134P4843N2779k4762p9336n7843K23K2197q884m8791
41661g2912o0396n5519n5986m5039q13L9673J5421n5053p8933k1944L9378L8004
41649c14119J3294K9842O5795N3674j2806p6461q5975k3035R1227J77266J50700
$$ y = [38336, 63893, 46425, -14543, -27438, 34021, 55775, -42416, -171478, -223578, -247591, -338860, -449556, -462394, -384056, -313657, -274096, -223570, -184376, -204762, -229984, -168180, -59274, -23292, -58429, -47771, 41685, 126892, 176684, 245305, 317545, 288335, 146543, 30241, 34134, 86892, 82513, 18200, -63152, -160365, -273392, -365949, -431241, -511294, -598693, -611129, -520179, -408081, -330315, -224712, -46706, 99634, 83884, -55955, -158977, -150225, -93689, -51472, -3338, 71505, 124284, 99522, 20186, -37657, -37434, -15237, -24121, -72912, -133308, -188827, -244813, -289852, -290665, -250992, -235571, -290624, -369557, -391501, -352123, -314119, -300825, -270983, -205188, -151514, -164320, -240781, -326756, -349791, -258564, -81298, 69402]
41638F9402M1596j9361J1374J6882q3332j75951j21936R682L7423n5856j11092
41627c81169m0918P2918J38876J61226J56202R8946M485m7416k3364J0409r397
41616A40798n6035o4738j7677M4439N3947l1124j52956j66474q640J81105K16895
41605A39540J10858L1125M1472M6984K366j4594J4486j5926j26658j62063l7910
41594B9680Q0565J8961j15758q9182R3538J95389J04089l2347o2440l3109n1721
41583A37665r6656q2314j9074J1873k714N68M6073Q0300N7708M897k0892l336
41571A14098K0344M502n2922j01523r4139n3210m8499r1991j03305k6596O4711
41560c68530O1606p232n800R2521J43839N3216o1480l8609P9957J17811L6074
$$ y = [69402, 110998, 91637, 103011, 119893, 36561, -139390, -261326, -251644, -214221, -270077, -381169, -422087, -349169, -210293, -49067, 107135, 206081, 210566, 163150, 139786, 150195, 140798, 84763, 20025, 2348, 46787, 100734, 69610, -83346, -249820, -258460, -77355, 139540, 250398, 281523, 322995, 369979, 372345, 357751, 372237, 356311, 229653, 67590, 29680, 110245, 129206, 13448, -75734, 17804, 213193, 317282, 284935, 222495, 189386, 137665, 41009, -41305, -60379, -48506, -51220, -50652, -4579, 75721, 133429, 138326, 117434, 114098, 134442, 138944, 86022, -15501, -109640, -162850, -211349, -303340, -406645, -433241, -368530, -306924, -314156, -319956, -227435, -83596, -30380, -91860, -130469, -50512, 67299, 103373]
41549A03373k9125k656K5033k2282p4524m6636K1315N3192O4314R3876R5898J4791
41537B96569r2297j22865p3228j3942K8709O0772M2653n3513j44887j24272k4541
41526b20842K7209L449m717M4795R2015R7573Q8036O1879j9720j20004j31712
41515h2039l5723O0855Q4054P4533P0464L6566l2551o3346l0968j8220o3960o8972
41503f9307M2402J67822J55789J6199j14688j60119j38293o4731N3324J49281
41493C7679J42553N0937l1995o2365o4754m5149J3929P3507N7513k6824p8878
41482F6153m7806l765j8173m4186R178J20408J58693N6920q4321j15456k9063
41471F8582L8261K872m9044j713R8524R8787l2551j54507j53500p9801k9275N317
$$ y = [103373, 74248, 71592, 96625, 74343, -181, -46817, -25502, 27690, 92004, 185880, 281778, 296569, 204272, 81407, 8179, -5763, 22946, 83718, 126371, 72858, -72029, -196301, -220842, -193633, -190184, -194901, -150106, -58091, 39482, 127518, 189397, 169677, 49673, -82039, -117762, -56907, 27147, 101680, 172144, 208710, 176159, 112813, 81845, 63625, -335, -69307, -26905, 140917, 296706, 312905, 198217, 38098, -100195, -164926, -111602, 37679, 180232, 231169, 199174, 136809, 72055, 26906, 40835, 114342, 171855, 145031, 66153, 18347, 14582, -3591, -47777, -38599, 81809, 240502, 297422, 213101, 97645, 68582, 106843, 109715, 60671, 58958, 157482, 256269, 223718, 69211, -84289, -164090, -193365, -188048]
41459a88048P5256J45390J33068M3786l0502l9882k3931l1206n8302p7851p7372
41448a29594n9629l5016j5334J346K4634L9026J3373l5237l6330L5432J05141
41437i2188R4687L2778N545L0526M7929J6893m4868j05144j41445j29555o1601
41426c46443K8137R4535J23974J13778M8312n2246j02358m5798M8871P0676K6052
41415G490K3507R8423J49681P9351q0198k13915k41434j58615j7779R8533J27458
41404a27498Q3473L9770L9170N9506P1898P7139O5584N417q7954j27704o0731
41393C8070M0398N6814k4690j05363j12786p4481m2700j9590O271J3670k990R309
41381b18068Q1603J37726Q5789k4274n2531J3171L1004n3210r2838J9609J40990
$$ y = [-188048, -112792, 32598, 165666, 209452, 178950, 139068, 115137, 83931, 25629, -52222, -129594, -189223, -224239, -239573, -238227, -213593, -174567, -161194, -196431, -232761, -197329, -92188, 2499, 35277, 40822, 71348, 119277, 136170, 91302, -13842, -155287, -284842, -346443, -318306, -223771, -99797, 13981, 62293, 10047, -92311, -138109, -89238, -18562, 7490, 30997, 129420, 279101, 358452, 278254, 64339, -177095, -335710, -353489, -254956, -127498, -44025, -4255, 34915, 94421, 166319, 243458, 309042, 314459, 226505, 98801, 38070, 78468, 135282, 110592, 5229, -107557, -182038, -224738, -244328, -238057, -224387, -227377, -218068, -136465, 1261, 87050, 62776, 10245, 23416, 54420, 1210, -91628, -72019, 68971]
41370F8971P8895r4126j40366k4728N2157l604m9652R278M6343m3782j27902m5300
41358b73816J08842J15967l5261j48281j07914O866Q7340J16627J15935R5013
41348H1318P7385Q4687Q7819M5094k1804n7338n4378m1664k4126j646r2j5344
41336A59911R363P1514N8604q2661k11390j65617l691P9669K7550m8880p4487
41325a80115p2506m2206M9944J51224J55898P1650R211L098j1179m6620n1010
41314C7389m0121p4600j06910m0144N8029J8605j22864j26668O8048K04422Q2240
41303d2574j42215j94696n0999J05390J58856J26262N0630j6146q225N0795L0188
41292F7266j09573k10573j33629L3877J24108J28217J33615J28869N1255m7215
$$ y = [68971, 147866, 53740, -86626, -111354, -59197, -62801, -112453, -103175, -56832, -100614, -228516, -273816, -164974, -49007, -84268, -232549, -340463, -333597, -246257, -129630, -13695, 81318, 158703, 243390, 331209, 376303, 354499, 297161, 242783, 201119, 176993, 175347, 175255, 159911, 169274, 240788, 299392, 216731, 5341, -160276, -163967, -84298, -56748, -105628, -180115, -252621, -294827, -244883, -93659, 62239, 133889, 143100, 146198, 135019, 88399, 37389, -2732, -77332, -184242, -224386, -166357, -147752, -270616, -397284, -329236, -124814, -42574, -184789, -379485, -430484, -325094, -166238, -39976, 10654, -5492, -13717, 37078, 67266, -42307, -252880, -386509, -352632, -228524, -100307, 33308, 162177, 213432, 166217]
41282A66217o2499j7110j0864l8442j7195M3635O3424M7158O0639P5770Q278j01309
41270B17702j13424p817P8535N5102k0095o8060q6410q5721n0342m410j0422n8414
41258a53776n0313N8704J79176J92622Q6399m3761q9401k4548O1208M5834p2089
41247A90055j51681r6004Q742K5789l4175o5337n3148o1997p6568j8432Q6922
41236b45834J19229N5925J0981N5004J25896J44288R8423k43j20985j66815o5443
41225A0426Q0540R0208k9062q7215k1934r61j26086k34901j44605O0993J58226
41214b44371R2427l432k6719R538O1685R4670P1662J0429K363P5069J03257j8835
41202B27743j78738j71796O652J55144J49631P2518K8032j4398j12657k06764
$$ y = [166217, 103718, 86608, 75744, 37302, 20107, 63742, 127166, 174324, 234963, 310733, 319011, 217702, 104278, 96461, 174996, 230098, 210003, 141943, 55533, -30188, -80530, -84940, -95362, -153776, -204089, -145385, 33791, 226413, 312812, 269051, 179650, 155102, 216310, 262144, 190055, 38374, -57630, -48888, -23099, -57274, -122611, -175759, -237756, -314324, -332756, -245834, -126605, -70680, -59699, -4695, 121201, 265489, 363912, 363669, 242684, 75869, 10426, 90966, 181174, 152112, 64897, 42963, 42002, -84084, -318985, -463590, -402597, -244371, -151944, -155376, -182095, -172557, -110872, -16202, 55460, 65889, 68252, 143321, 246578, 227743, 49005, -122791, -116139, 39005, 188636, 261154, 289186, 274788, 162131, -44633]
41192d4633j91859p8064K1967M4494L2215L9309N1744L5976J8187N1820J12205
41181I3361R6254k9828j39435q5109R0623J82510P8461j06062j93882j59171j03980
41170b76258q9309q0540l1159N8031J52970K04454J69666O6049j7316j1194N2487
41159A97881R3566Q3104L7573m3221j55497k33151j93767m5356J12790J92356
41149D6278J71285P2289m6629j01529n9913K736j532m1507k2957M3255N0922j7285
41137I5413n4066j7538j3419j03198j62269n9151J18090J68789O2966m0365m2582
41126d7330j1571j4433p18P4682J35577R2732j0930o4723m9234l5662n8879q3535
41114g4024q2379o6025m0028m966P994k2067l5581M7632J87935K41269J49119
$$ y = [-44633, -236492, -314556, -292589, -248095, -215880, -176571, -124827, -88851, -70664, -18844, 93361, 189615, 159787, 20352, -64757, 25866, 208376, 286837, 180775, -13107, -172278, -276258, -365567, -446107, -477266, -419235, -266265, -61811, 107855, 173904, 156588, 145394, 197881, 291447, 374551, 412124, 368903, 213406, -19745, -213512, -258868, -146078, 46278, 217563, 289852, 243223, 141694, 81781, 84517, 82985, 41478, 18521, 61776, 112698, 95413, 41347, 23809, 10390, -92808, -255077, -314228, -196138, -27349, 35617, -4748, -47330, -58901, -73334, -74052, 630, 136207, 228939, 218009, 153286, 104052, 68390, 9511, -74024, -156403, -222428, -262456, -267422, -259428, -281495, -317076, -269444, -81509, 159760, 308879]
41103C08879K3409j1519J8721P522o3606j14699r6115m3541j0626j4125m8120
41092d3820r6964j25646j00184k8784M2708P8564Q0358P6152R4847J30628J26051
41081B33910L3055r3178j25709l3427N2378R752r7805j13961j6482O3586L9221
41070d8660l0692n4572k4026J7395M3189M5395K4905L713k288k3622q6017j27879
41058b63159o3378O3053R5778j8374j40049j23964p297O4451L1162m0831o1062
41047d63670J0278J43884K37043J81533L875j17620n6359R2074J35894M0900n4422
41036A53410n7504k6011l2158m5505j5411K1382M881k9416N794J00437J34765
41025B14664M1195r3356j34764o4175K4764O0888N6871M3262J9014j2328k6579
$$ y = [308879, 332288, 320769, 339490, 347012, 283406, 168707, 72592, 29051, 18425, 4300, -43820, -140784, -266430, -366614, -395398, -352690, -274126, -193768, -117616, -22769, 107859, 233910, 266965, 173787, 48078, 14651, 67029, 76781, -21024, -134985, -151467, -87881, -48660, -79352, -133924, -157950, -140555, -97366, -51971, -27066, -23353, -25641, -49263, -135280, -263159, -326537, -263484, -167706, -186080, -326129, -450093, -457390, -392939, -361777, -402608, -463670, -453392, -309508, -72465, 109068, 112943, -4677, -61036, 31038, 166932, 207832, 153410, 95906, 69895, 37737, -7768, -23179, -1797, 3084, -26332, -20538, 79899, 214664, 255859, 162503, 27739, -36436, -11672, 49216, 106087, 149349, 168363, 156035, 129456]
41014A29456l2223p4473j43936j51003n3996N1768N5206j2282l5222Q300L6658
41003b21747J4495m38L3161Q3563J14372J23406J02354M1593j6894j6966J5123
40992B72022K14o4058r9717q0347o1173o3900m0993K1337O7667O3993K8845k9729
40980A4161r9113r6789L6448J82888J59930l091r5755o0581o4256j69011j91707
40969c86876k2872J57292J57633N3655n352n0510j29079r9813J26668L21977K33717
40958C56440Q488k3183J15680J07690j02408k17326r9061K0922l3703j00348l086
40947C0105J26623P7709j00131j99929j53886m3082O5625J30653R4254k1276p3486
40936f6821J1889J09263P5937l2702o5303n233M0893K2642j6177l6676l4332l578
$$ y = [129456, 97233, 22760, -121176, -272179, -326175, -274407, -219201, -231483, -266705, -258405, -221747, -207252, -207690, -174529, -90966, 23406, 146812, 249166, 290759, 273865, 256899, 272022, 272236, 208178, 108461, 28114, -33059, -96959, -137952, -116615, -48948, 15045, 43890, 14161, -84952, -181741, -145293, 37595, 197525, 194434, 98679, 38098, -26158, -195169, -386876, -409748, -252456, -94823, -41168, -46520, -97030, -226109, -325922, -199254, 122723, 356440, 364928, 341745, 457425, 565115, 462707, 245381, 146320, 167242, 133539, 33191, 30105, 156728, 234437, 134306, -65623, -219509, -262591, -196966, -66313, 27941, 6665, -66821, -54932, 54331, 130268, 97566, 32263, 27030, 67923, 90565, 74388, 37712, 3380, -198]
40924a98M4247O6102N0681M1935N2686L4803j6176l0240J366k0052j27365j95936
40912i8147j33519l5384j8539k5025M6045J17645M4738j18129j66632m7704Q0165
40901c54486R8202O2636N4242N3178K7530J9648O5576J12571Q7542j039p5368
40890A50232p2274O80O4100L1611q4623j59838j04405R888M9474J0181K564N9255
40878d3155Q2640J4658n5382k0746P9285J06095M691j23227j37026j9605J00342
40867a1430R7874J100n7869l3573j7455o1118o3834N9814J93006J54388j8344
40856B42559r9444k383R9599M4779q1276r4576J2713Q5722M2997l4971n1255j8444
40844A46020q197m4768q9927r8705n7196J7093Q4701J00244M6372l6636p3403
$$ y = [-198, 44049, 110151, 160832, 202767, 255453, 290256, 274080, 243840, 245206, 225154, 97789, -98147, -231666, -267050, -285589, -310614, -264569, -146924, -102186, -220315, -386947, -434651, -354486, -256284, -193648, -139406, -86228, -58698, -39050, 26526, 139097, 226639, 225600, 150232, 77958, 78638, 142738, 174349, 89726, -70112, -174517, -164629, -115155, -104974, -102410, -43155, 39485, 54143, -1239, -21985, 57300, 163395, 168086, 44859, -92167, -111772, -11430, 86444, 87544, 29675, -3898, -21353, -82471, -146305, -86491, 106515, 260903, 242559, 143115, 140732, 240331, 285110, 203834, 109258, 121971, 207693, 250690, 215719, 164464, 146020, 137823, 93055, 3128, -95577, -152773, -135680, -50979, 49265, 95637, 59001, -14402]
40833a4402k9183M4020O5358K4992j4891k2343l7969q5683j08881n8376J0102
40822b27256J2433k3661L649J00965J57584J14546N0321M6712N9517P1j14875
40811A80006j81252j47408o0420J3452M5828K7528l7839j04553j04429k5580O3619
40800c31048R4236P0221L9349K7188L7409Q3578J59474J91477R8180q0862j87295
40789B01907j23638K2695R4799N9033M097j8055m5271r5472j09961m8802L6282
40778b2386P6738P6756P9282R2182R5846Q2171M5023k4406r5478j04127m6088
40767B55513r212n8529j40940j62938j11093l1389N3849J28098J32808L6895p7784
40756A5278r9698l5952J8339L4898O2972R4828N3301n7976j16296n1610M3730
$$ y = [-14402, -43585, 435, 65793, 90785, 75894, 53551, 15582, -70101, -178982, -237358, -227256, -214823, -238484, -234835, -133870, 23714, 138260, 188581, 235293, 294810, 294881, 180006, -1246, -148654, -209074, -195622, -149794, -122266, -160105, -264658, -369087, -394667, -331048, -236812, -166591, -127242, -100054, -62645, 20933, 180407, 371884, 470064, 389202, 201907, 78269, 100964, 195763, 254796, 258893, 240838, 195567, 100095, -9866, -58668, -22386, 54352, 131108, 210390, 302572, 398418, 480589, 525612, 501206, 405728, 301601, 255513, 246301, 187772, 46832, -116106, -227199, -258588, -204739, -76641, 56167, 93062, 15278, -84420, -120372, -102033, -67135, -4163, 90665, 143966, 85990, -30306, -81916, -38186]
40745c8186N0665j0220l2497J1530N1834M0562M463k4482n7917j04367j23589
40734b32204p2646J7108N4738J748n9607j6198J18703J96111J13750m1387r5584
40723a5468q259Q7820P2116j3694m1994K5394R9173Q8858J1542m8554n5471m9611
40711A51852o1031n0771K0667J06058J19342N7128m08j1939k0162n8498r4004
40700A58234r3710o9867k6702N0959J17334P9562m4665r5599R472J32978J12627
40689C30623L372k4087M7639Q4669L2850k5802l7653l6926l4866m41L5737L777
40677C78892o5015o6936r439n708o1962n0851M9171P8376m4237j63456j24532
40666h5697j5792j0577q2333o5062O4718J53868J10786J8155j4247J8946P2210
$$ y = [-38186, 12479, 2259, -30238, -18708, 33126, 73688, 78151, 53669, -4248, -108615, -232204, -304850, -287742, -233004, -231256, -290863, -307061, -188358, 7753, 121503, 80116, -15468, -23727, 64093, 136209, 122515, 80521, 105915, 205088, 293946, 305488, 256934, 201463, 151852, 90821, 40050, 60717, 166775, 286117, 343245, 342837, 330898, 310736, 252238, 158234, 64524, -5343, -32045, 18914, 136248, 215810, 171145, 75546, 85018, 217996, 330623, 333995, 309908, 357547, 442216, 475066, 449264, 411611, 374685, 339819, 339378, 375115, 378892, 313877, 246941, 237502, 231794, 169832, 118981, 168152, 246528, 202291, 38835, -85697, -101489, -112066, -194399, -259461, -194743, -40875, 69911, 88066, 73819, 92765, 164975]
40655A64975J29357J73015J47225K3949j18917j52210m6636O8392M1110j13039
40645C17221k15901j47112L186O2649N28o9214o9455k9225J5880O7915R6326M2962
40633G5760o8803j33217j03997m1372L968M4786P1420L6538l5225m7979R302L5768
40621a53051n991l0436MN160l6562j7069R2950J45706O0826j4254M4028J05422
40609A96733K1427p6093J9019K02024J85755l7488j76631r6565Q831l2691j20536
40598I3785r8880k247N8557Q3700J14075J07455K3321o6705p4102k4142M518j105
40586B18230j1684k4524l2944p47O0138O3969k1493j00668q4839k3720j1360l4435
40574d077k1865J2854O53m2631k8696M8898Q3808J0754r3864j12104l4647L7350
$$ y = [164975, 294332, 467347, 614572, 638521, 519604, 367394, 320758, 389150, 430260, 317221, 101320, -45792, -42606, 20043, 20571, -48643, -118098, -147323, -131443, -63528, 32798, 75760, 6957, -126260, -230257, -271629, -267661, -222875, -151455, -114917, -150142, -198121, -188819, -153051, -159042, -189478, -189474, -184314, -220876, -237945, -144995, 711, 61537, 47283, 91311, 196733, 218160, 142067, 161086, 363110, 548865, 511377, 334746, 238181, 247012, 214321, 93785, -5095, -7342, 51215, 134915, 248990, 356445, 379766, 313061, 238959, 214817, 219335, 218230, 206546, 182022, 149078, 148331, 208469, 272438, 250945, 150277, 65438, 41718, 30358, -4077, -25942, -13088, -12435, -55066, -83762, -34864, 48944, 59698, -34166, -146270, -180917, -143567]
40562a43567K2354m5867o1556K3399J32343J48760O1038k0238o058N6772O0353
40551B27733n944m1144J3075P0781J3880j21074j54545K036J97193K10365L4456
40540D46812j28712j55236j35899j66166j53402K2035K53006L00070J16062r5094
40530C03476j57684j07697o1101m4320k3604Q351M6526R1428J04424L3860p3098
40519A20561r0083L354O9886J9082n4279l3811L0422K5943k3446j7661K1961j3056
40507E8873j03637r6233N5979J92629J57423M786q7296m6232L3914L2348o0486
40496A42068j45618j26074r437R7992J04617K6338n3844r1993j01645q4250j4822
40485b56668Q4224J21554L9893r1754j39820n4767P6622J30867P4572j8970o2987
$$ y = [-143567, -121213, -167080, -228636, -205237, -72894, 75866, 136904, 116666, 110608, 167380, 227733, 221789, 180645, 193720, 264501, 278381, 157307, 2762, 4798, 201991, 412356, 446812, 318100, 162864, 26965, -139201, -292603, -270568, -17562, 282508, 398570, 303476, 145792, 38095, -23006, -67326, -90930, -82579, -36053, 55375, 159799, 193659, 120561, 30478, 33832, 103718, 122800, 68521, 34710, 65132, 91075, 67629, 49968, 71929, 58873, -44764, -140997, -85018, 107611, 265034, 269820, 182524, 136292, 170206, 202554, 142068, -3550, -129624, -139061, -41069, 63548, 89886, 36042, -55951, -157596, -241846, -256668, -172444, -50890, -10997, -102751, -242571, -297338, -220716, -89849, -15277, -34247, -97234]
40474i7234m3460p492R520J2771J0229p876l2256k2594K6733M7991r670p5013
40462a88351k5687J25336K05964R9412q9248j59406o4499N7057Q4300M3371J3430
40451A01679L137j6503k7652L191M8568N5443L3824K9255K4162l8001j27825j36080
40439d6802l9795L8447P77p9870o7546M2965J33580J28811O3199K72l1286k5230
40427A17522L558P927l8404q1978n3052J9341L7672j4717m5304J264N7433M3012
40415E4274j1170j6213M2328R0712O7014j4720r1695j09971o4764r239j0252p1194
40403a44890j13449o2710N5889J40798J33844Q3435O6882P6989L7399o3827j23889
40392H6471o3981L5805L8761l4099k3702J08545J90110R0025p1778j02749k4093
$$ y = [-97234, -140694, -148186, -138666, -125895, -115666, -123542, -155798, -178392, -151659, -103668, -113338, -188351, -214038, -88702, 117262, 216674, 127426, -31980, -96479, -39422, 44878, 88249, 101679, 104816, 88313, 60661, 63852, 112420, 167863, 201687, 230942, 255104, 217103, 89278, -46802, -86597, -48150, -47373, -127243, -194789, -151824, -18244, 110567, 173766, 174038, 142752, 117522, 121080, 129007, 90603, 8625, -44427, -25086, 12586, -2131, -47435, -46171, 11262, 54274, 43104, 26891, 69219, 159931, 226945, 212225, 120530, 10559, -54205, -63444, -73696, -144890, -258339, -321049, -265160, -124362, 9482, 92917, 159799, 236788, 274187, 210360, 86471, 22490, 58295, 97056, 62957, 39255, 147800, 337910, 427935, 356157, 253408, 229315]
40381B29315q684r0307j25184m2216M7973L5703m3330j01821j16137q9513r149
40370c13350R5424J39531Q7612J32n8504q0712o2941Q811Q9555R6512L7467J1063
40358E0600M4390N4363J4133J1041O6998N8793p0568j67898q5161P8878J19112
40347A74681J8758p1038q4260q6846r5655l5952R6268J80126J26815j0630j18391
40336I3876j32819n4424O8600J51112J31768M0588l7206n6728l1103J3754M4247
40325B31665J8536n0252p3717q304N6125K1517o0168p0756j9166j0940n5245n8877
40313g9582o732J5864k050L0120J13119J11559k1663j34921j03439k4817m6759
40302a49301j11799n1373J21240J99067P5092j06903j49724m0803P7595J01646
$$ y = [229315, 220631, 130324, 5140, -37076, 10897, 46600, 3270, -98551, -214688, -304201, -313350, -217926, -78395, 9217, 9349, -49155, -129867, -192808, -183997, -94442, 2070, 39537, 50600, 94990, 149353, 163486, 174527, 241525, 300318, 229750, 61852, -23309, 55569, 174681, 193439, 122401, 38141, -48705, -144360, -180312, -84044, 96082, 222897, 212267, 93876, -38943, -93367, -24767, 126345, 258113, 298701, 261495, 204767, 173664, 187418, 231665, 250201, 199949, 126232, 117928, 174053, 195570, 135402, 64646, 45480, 34540, -20705, -79582, -86314, -70450, -72500, -42380, 70739, 182298, 160635, 25714, -77725, -102542, -149301, -261100, -312473, -191233, 7834, 82926, -23977, -173701, -214504, -136909, -35263]
40292c5263M8569j8055o5025q4866p1216l0567L635q92l3588m6418o167O8798
40280b71055J26595J28375P9425K6530K0245O2617R7687P4646R348m8148q9445
40269B16820j36247j61622j03181K1984R7202N2682l4703n1829k736K5261O957
40258f9412L81L4620O0012K6735m1099p2200k5794O4385J16194P9137j2269q8182
40246G2508j30165j54749j31128j4000J32447J65354O4487j9529J2588O5525K4203
40235H7541n7366p3162n6010r1511j32842p8942K7557O2885L4390M3968P7729
40224a55763L3124o1786o7692J9410N4046K938L099R9458J40055L0441r8380r6142
40212i7192p785M2155M1731M2728L7586P505n110K1247K8498o333j0524L3104
$$ y = [-35263, 13306, -4749, -69774, -154640, -225856, -256423, -252788, -253680, -287268, -333686, -339853, -271055, -144460, -16085, 63340, 89870, 110115, 172732, 270419, 345065, 354413, 306265, 216820, 80573, -81049, -184230, -162246, -65044, -12362, -47065, -98894, -101630, -76369, -69412, -69031, -34411, 25601, 52336, 11237, -60963, -86757, -22372, 93822, 172959, 160690, 72508, -57657, -212406, -343534, -357534, -225087, -59733, 4754, -14775, -2187, 63338, 87541, 30175, -42987, -98997, -190508, -323350, -402292, -374735, -311850, -277460, -233492, -155763, -122639, -184425, -252117, -232707, -178661, -175723, -172624, -73166, 66889, 97330, -1050, -97192, -104977, -62822, -21091, 21637, 59223, 66728, 61618, 82865, 111363, 105030, 94506, 127610]
40200A27610O243j44212k52714j49409O5256J44829M3568m5594J1033J22730J39002
40189F8342M7835m5275n6597M282O2836N6823p27m5091n0844n3971o6621l9775
40177a18783M4936J14743R8262K5216k2074p196N5296J31556J58788P4431r1642
40166D63533k21667k49912k17247j54451l3317J06602J29379O297r0009k7513
40156b88305P9734O6441q250K2338J34516J58972P3719K2469N1178N1196j2004
40145C52004k8327M0666O5485m5609j94709k36445j57757m4994K8706K9224k9283
40134b21039o0553R646J10076R2159m2505j24348p2365j1422m8833q6143J5962
40123d39365J96942K70258J79584M9299M587M4582Q4923N3473m8014j35850j24670
$$ y = [127610, 133853, -10359, -263073, -412482, -347226, -202397, -158829, -204423, -193390, -70660, 68342, 116177, 70902, 14305, 18587, 81423, 138246, 137519, 92428, 41584, -12387, -79008, -118783, -73847, 40896, 139158, 164374, 142300, 135104, 190400, 321956, 480744, 555175, 463533, 241866, -8046, -225293, -379744, -413061, -306459, -177080, -170783, -260792, -288305, -208571, -142130, -150380, -128042, 6474, 165446, 239165, 261634, 312812, 364008, 352004, 323677, 364343, 429828, 384219, 189510, -46935, -204692, -249686, -220980, -191756, -221039, -281592, -271946, -161870, -69711, -112216, -236564, -308929, -320351, -369184, -455327, -439365, -242423, 27835, 207419, 256718, 261305, 305887, 390810, 444283, 396269, 260419, 135749]
40112A35749m0325L522l0684m8411J5887P6887K6928r0300j42733r5717k5235
40101b14432K1011O3614J02327R0811J5125p6726j35102j42845r2835Q547J16182
40090b44323J77611J86522J60522Q6572m8083j82831k13821j09947M7299J42877
40080B398J16045n899j13447q7915O3780J77249J14375m9412j22147n9509l703
40069C1815m7730j03540o2179M0192J00647R4009M8383l4347j30816j47945m0954
40058b52465P9295Q0775M790o757N8774Q0314J7357l4482k2906j1814k6987J0591
40046b3515J17733J65527P3753l8870l0333M5665M7632r701O385J03889J38219
40035E96384L4416j12847j90078j91155j57165r7797j8356N2883R7531J09424
$$ y = [135749, 95424, 98946, 68262, 19851, 35738, 112625, 139553, 49253, -93480, -189197, -214432, -193421, -129807, -27480, 63331, 78456, 1730, -133372, -276217, -369052, -360505, -244323, -66712, 119810, 280332, 366904, 318821, 135990, -77831, -187778, -140479, 2398, 118443, 112544, -903, -88818, -25038, 152211, 266586, 217174, 95027, 35518, 31815, -15915, -119455, -181634, -141442, -40795, 53214, 101597, 67250, -63566, -211511, -252465, -173170, -92395, -87605, -94362, -35588, 44726, 62083, 27601, 4695, -7119, -34106, -23515, 94218, 259745, 333498, 294628, 264295, 309960, 357592, 347891, 354276, 458165, 596384, 630800, 517953, 327875, 136720, -20445, -118242, -136598, -83715, 13816, 123240]
40025A23240O4018l9824j18172p9506L5467R3687N3003m426k6617n0699q4210
40014c4039o5109J0940N1203J3220k7056j3668N296l660J1615O1045M8832o0389
40002a770j41144r0773P936L7303L7631R7756J63210J31102N0973M1571P0818
39991D04613J8434q3347q3241K3207P1862j800p2628n3490k4482n6857p5855k694
39979F3722R8712J24772P9928K3685l8160j09248j29735n7476L1982L3498l0420
39968I1260l9654M6312J31715J21827M7991J5580O0035J02389N7124m9873j13039
39957D71667r0009n3558p6697j28096j33600q7667l4102J8407P7279R8703L8412
39946A00739m8046n9965n155N679o7940j31220r4418J0326R2134J07745O7646
$$ y = [123240, 187258, 147434, 29262, -50244, -14777, 78910, 131913, 127487, 100870, 50171, -34039, -99148, -88208, -37005, -23785, -50841, -64509, -59213, -62873, -51258, 9787, 58619, -1770, -142914, -233687, -225751, -188448, -150817, -53061, 110149, 241251, 292224, 333795, 404613, 423047, 339700, 256459, 279666, 351528, 349728, 277100, 223610, 199128, 142271, 66416, 63722, 162434, 287206, 367134, 390819, 352659, 243411, 113676, 56200, 88182, 121680, 91260, 51606, 97918, 229633, 351460, 399451, 415031, 475066, 577455, 634579, 584706, 471667, 381658, 328100, 251403, 123307, -10293, -97960, -132062, -113655, -36376, 62327, 100739, 52693, -7272, -12427, -6748, -74688, -205908, -300326, -290000, -197866, -90121, -22475]
39935b2475M066k9238J1253Q6541R2256p052j09686r4104K6513J16756P7609m4188
39923A08251j17671q4159k0565k0532m7693J0188J40347J77298L6892j34441j48783
39912a00868k5681P2646Q0072N4519K2053m1841r8263p5455j1670j4225p3474
39901b12187p3921Q52M2158K0162L8024J29600J73216Q7822l2605p1058m5594
39890E6469k3462M333N9369Q2536J1228j10358j78484j42995k9814R1012J33470
39879d6696O5164l2837n5711k1799k3217m3578K3344J63342K25689J57469P6004
39868D87174N2318J1867p2883r2746j3881J8917o9906j23656n058J58360J69497
39857E20003N8728j2331j9823m2004n6649Q210R1027P3734n551j1849N1824N6843
$$ y = [-22475, -18409, -47647, -36394, 50147, 142403, 135351, 25665, -68439, -41926, 74830, 152439, 108251, -9420, -93579, -114144, -134676, -182369, -172181, -31834, 145464, 182356, 47915, -100868, -126549, -53903, 26169, 80688, 102741, 60900, -37363, -112818, -124488, -138713, -212187, -286108, -285256, -243098, -222936, -184912, -55312, 117904, 205726, 173121, 102063, 56469, 33007, 37340, 96709, 179245, 190473, 80115, -98369, -241364, -271178, -180166, -46696, 18468, -14369, -70080, -91879, -115096, -158674, -135330, 28012, 253701, 411170, 487174, 539492, 551359, 478476, 385730, 371849, 390766, 320860, 197204, 192146, 350506, 520003, 578731, 566400, 546577, 504573, 447924, 456134, 547161, 620895, 615344, 603495, 655319, 712162]
39845G12162k7100r6783r4004o4523m8501m5630o5975r3786m8776Q7535J76032
39834C90651J02969j7024j678J04587J07260j4564r3101o6593n0004r0367q7643
39823B84493j5098L827p5312j11299r394J08501R0120k3457q6925o5499m0161
39812E9796o0504r3047q6631k9039M0492N7636R160k7225J6220P7503M1168p7434
39800g1905j38843p8572J6036M9775L0810J0065R872M0292R5750J19610O2184
39789A45074k6334o1919o8810j23674j73122p9982J26074K31432J37739K604j3162
39778I5920K5232k0774j15899j15774k386R4119P9958o661p1150n6866K2336R2689
39766B0744Q4094J2045l9672l2893j3472k0585l3581l4560m0874m1903R065R7415
$$ y = [712162, 685062, 588279, 494275, 429752, 381251, 335621, 269646, 175860, 127084, 214619, 390651, 493620, 476596, 474918, 579505, 686765, 672201, 579100, 512507, 462503, 372136, 284493, 269395, 273222, 197910, 86611, 77217, 185718, 275838, 252381, 165456, 99957, 59796, -708, -93755, -180386, -209425, -168933, -111297, -102137, -129362, -113142, -35639, 5529, -71905, -210748, -289320, -273284, -223509, -192699, -182634, -172762, -132470, -36720, 82890, 145074, 118740, 56821, -11989, -135663, -308785, -388767, -262693, -31261, 106478, 109082, 95920, 121152, 100378, -15521, -131295, -133681, -39562, 40396, 33735, -37415, -94281, -71945, 20744, 104838, 116883, 77211, 44318, 30846, 10261, -23320, -57880, -98754, -140657, -131592, -34177]
39754c4177J28853N8652m0843q7682q1081m0347M7915J57574J92566J08956p552
39743D02834n9642o0652o6974o7198k6988J9997J9576r446j2210R019J2282p474
39731A53124k5278l6943m3803k0954M1092R1631O8641k6637j33311j80813j25005
39720b38256J2692J30138J35202O2582J8562P491o2530j74264j63722K3544J92111
39709e6450J52947J155l1508P9137J41231N3446o3640o5386L3706J19324J15093
39698D79055K2163r7884j52623j00261j4161K938l2469j1169Q5637J37366O0234
39687C78826o5849j15565q6102n9106m9389k258O9720O5762m1879j19325l4450
39676e9615J39160J94269O7861o9524n3710M8737N6588n4301j28966p0770L0080
$$ y = [-34177, 94676, 153328, 112485, 24803, -56278, -96625, -48710, 108864, 301430, 410386, 402834, 343192, 282540, 215566, 148368, 121380, 141377, 160953, 151507, 139297, 148316, 160598, 153124, 127846, 90903, 47100, 26146, 67238, 158869, 227510, 200873, 67562, -113251, -238256, -225564, -95426, 39776, 102358, 120920, 128411, 65881, -108383, -272105, -248561, -56450, 96497, 97652, 66144, 145281, 286512, 339958, 276318, 210932, 244638, 363962, 479055, 501218, 403334, 250711, 150450, 136289, 139227, 106758, 95589, 181226, 318592, 378826, 312977, 197412, 111310, 52204, 2815, 557, 70277, 136039, 94160, -25165, -59615, 79545, 273814, 341675, 272151, 218441, 267178, 323766, 269465, 140499, 69729, 99809]
39665I9809M1902l4361r4959p4963m140M6219L6547k898m33O5277J18198P9252
39653B75450j2003m3040J1656O1153L6852k5082o0388n5798k6443J3045L3485
39642B08887J6792O399N1700J00176N0242p3646j23121m3372L9991J7504m4556
39631B06996l2977L2619O2381N5692P3051J00583O7198k1986p7286n3858o666
39620D05747j660l2841n1273m2871m9232j05756j69056j43943j1934J10379J03679
39609A1239K604o1123m4558k0506l2614m0968k1669n969Q90L2870P4815O5672
39597c9317N283m6502p6671j04445p6954N9780J91476J36019n9567j39364j5613
39586a65875J03567O0171j7080K9710J11050O3792o8904j31838j00040m2389L4578
$$ y = [99809, 141711, 107350, 12391, -62572, -66712, -20493, 16054, 13156, 12723, 78000, 196198, 275450, 263447, 220407, 232063, 293216, 330068, 304986, 244598, 188800, 162357, 175402, 208887, 225679, 232078, 283778, 383954, 434196, 360550, 237429, 194057, 234048, 251552, 206996, 174019, 206638, 269019, 324711, 397762, 498345, 565543, 543557, 466271, 412413, 405747, 404087, 371246, 319973, 277102, 227870, 122114, -46942, -190885, -202819, -92440, 11239, 13843, -47280, -91838, -112344, -144958, -185926, -207595, -213564, -212674, -179804, -104989, -39317, -34034, -80536, -157207, -261652, -338606, -278826, -87350, 48669, -10898, -150262, -165875, -62308, -2137, -19217, 10493, 121543, 185335, 116431, -15407, -115447, -157836, -123258]
39575a23258J28289J45514M5133m0793n242M2598k3391r4372p344J38936J16393
39564C22463n4920j36615n3284K1763k3675q9089o9835j3987l755l3511o0949
39553a95394o4594k6010M5824Q0819L9171r8M3765J04846P8627J4800L3564J00300
39541B55620P2952n0909j23339p8019Q59M1037N0706K9067l3312p2412k0661O0495
39529A32084O7674L2716M2971M3006p3400k16994j90852j4000R1648N1070J8351
39518a5726P2699R4735K0221l2843N460K6563l7182p0477J2426R6220N0740o2781
39506A60055j10459q0774l3536K6180R8096J15899M6681k3877q591N5863Q5655
39495C31192P2037M7668Q630n1610r4597q8975n9342m3612n3249q8226j25153
$$ y = [-123258, 5031, 150545, 195678, 154885, 149643, 192241, 168850, 74478, 67134, 206070, 322463, 267543, 130928, 77644, 99407, 75732, -13357, -83192, -97179, -100934, -134445, -195394, -259988, -285998, -240174, -159355, -120184, -120282, -76517, 28329, 106956, 121756, 155320, 255620, 328572, 277663, 154324, 76305, 77164, 118201, 168907, 197974, 164662, 92250, 71589, 132084, 199758, 232474, 275445, 318451, 245051, 28057, -162795, -176795, -85147, -34077, -15726, 56973, 151708, 171929, 139086, 144546, 171109, 133927, 63450, 75876, 172096, 222836, 160055, 49596, -31178, -64714, -38534, 59562, 175461, 222142, 198265, 189674, 245537, 331192, 403229, 450897, 459527, 407917, 313320, 224345, 165003, 121391, 68142, -20084, -145237]
39484a45237r7250K4403J41758J29806J5478n9759l9831J2771N9426J07785J11411
39473B60761K0149p8027n0171N1022N1892m4857n7179N4110J07855J4020q1210
39462B48365o1374k3912p5877j46351j32945o3040N424P7991J21509M9992q6081
39451h6299r0383Q2011K11599J29706m2041j08619p3557l8879o490N1693P2691
39440A01432J3887m0748k1964Q601j06J3861O7041M5450q3573j54402n4467Q1464
39428b3524R2192L2620K3160K9920j7579n2634q962K1683m0069q9786l1716K2829
39416d1866l9888r8337M912J75380K18687J44741Q0769J7740j03071j80936j02795
39405G5336J2199j3936j04570o5540O4315R3710K6251K0177O2866L015j23699
$$ y = [-145237, -242487, -218084, -76326, 53480, 68958, 9199, -30632, -17861, 41565, 149350, 260761, 280910, 202883, 152712, 203734, 255626, 210769, 153590, 207700, 315555, 329575, 248365, 186991, 163079, 87202, -59149, -192094, -255134, -249710, -171719, -50210, -218, -86299, -176682, -94671, 116928, 246634, 204593, 95974, 22417, -16462, -22952, 28741, 101432, 115319, 74571, 52607, 61208, 61102, 74963, 142004, 187454, 103881, -50521, -104988, -23524, 68668, 101288, 124448, 154368, 136789, 84155, 75193, 96876, 56807, -32979, -64695, -41866, -81754, -180091, -175179, 201, 218888, 363629, 444398, 462138, 359067, 178131, 75336, 87535, 73599, -30971, -96511, -32196, 61514, 87765, 107942, 170808, 173823, 50124]
39394E0124j17144L9285J48669J28073Q2753M3683p5771k27603k24501n3369O7485
39383a38316J7760p5031q0822l1304K7581J20196K03550J62279J9982m9365M874
39372A81384L1626m8792j05677l2536P6335R8205N8085K1091l0790j01351j08232
39361C9348k6082K8307k9875j07262p4199M1036J10012Q8308M5830N3485J05122
39350B74030J29154N6852q8518j83212j38352j5288O4864P9815P9871O2510J783
39339C23509m5635j0778M7374K4886l9385k6972L8264J7731j00747j77947j46745
39328i6445p7271p990R9177K10949K18015J19111L9518K9347Q026o0178j04389
39317C77870r3624p9623o5534j73P3891M5225o6523j17150o9569k8876k4270L1000
$$ y = [50124, -67020, -27735, 120934, 249007, 331760, 375443, 299672, 72069, -152432, -205801, -138316, -120556, -195587, -276409, -307713, -280132, -159936, 43614, 205893, 225875, 176510, 181384, 213010, 164218, 58541, 26005, 102340, 200545, 258630, 279721, 248931, 147580, 39348, 13266, 41573, 11698, -95564, -169763, -128727, -18715, 69593, 115423, 168908, 274030, 403184, 460036, 371518, 188306, 49954, 34666, 99530, 179345, 259216, 321726, 323509, 277874, 267096, 314470, 339356, 299971, 272999, 311263, 328994, 228247, 50300, -96445, -173716, -181706, -82529, 128420, 346435, 465546, 505064, 534411, 542437, 482259, 377870, 284246, 204623, 139089, 138916, 212807, 258032, 191509, 74359, 4790, -24086, -48356, -17356]
39305a7356J24152J16421j926n6924K1941Q0408R456p6626n5653P245J7408K2770
39293A91316P9339J03685J6638r4553j07575n6202n7385j29651j92414j77143
39283d23945o6020J03214K24938K12407J23002Q2155P8603m876j46875j79002
39273C601p0557k135o8746j25369m5801O6400O7458j132k4327l70K2701N8989
39261a19288J04958Q2978j5971p1071k5072J2009l0343l8994P6593J92341J52555
39250C20695J7303m1356R557O8164O7347J1319p4581j26959p3530L4447M1895
39239B54301p0725j18746O374J50330J30077M587m8062K824N8579O9662M5396
39228D84597k0753j02373j10378k8288K7721j0657m9494r268K7683k4029r0282
$$ y = [-17356, 106796, 223217, 221291, 164367, 186308, 266716, 276172, 199546, 143893, 151138, 168546, 191316, 270655, 374340, 390978, 296425, 188850, 132648, 75263, -54388, -246802, -423945, -489965, -386751, -161813, 50594, 173596, 255751, 334354, 329478, 182603, 3601, -66956, -69091, -137837, -263206, -309007, -242607, -175149, -176281, -200608, -200978, -178277, -119288, -14330, 68648, 52677, -18394, -43466, -31457, -61800, -100794, -24201, 168140, 320695, 337998, 296642, 306199, 374363, 441710, 453029, 378448, 251489, 177959, 212406, 254301, 183576, 64830, 71204, 221534, 351611, 356198, 308136, 310960, 369539, 439201, 484597, 463844, 361471, 251093, 222805, 250526, 239869, 190375, 181107, 208790, 184761, 94479]
39217I4479p6121k9687k2660n024O9477J11551N0718j1783K9446R1609M9741m6438
39205C05308p4967m8231m6306m9974n494M4725M7971N1161Q6310P3451j9702o6166
39193B98086J6057J00185N7657l0133m2228k7815n2443k0832J20114J85232K1063
39182F24943j90204j81230j5184M7196k2164l7629L4604N1316q374j8226L6260
39171C21308M2397j0126k9158k5055p9271j41847r5415J7969O6050O7973J23056
39160B57881J63086M7652j42294j90046r1147l3815n9913l9048L5317L1238l2779
39149e3868P977J42424J68883M8754k2458L7695P1747j0780p6167k5375L8036
39138C26868J7688j3897K1933P1968P4443N5506L0476l1744r7378q4471j9994
$$ y = [94479, 18358, -11329, -33989, -39013, 30464, 142015, 192733, 180950, 210396, 302005, 351746, 305308, 230341, 182110, 135804, 85830, 80336, 125061, 173032, 224193, 310503, 383954, 364252, 298086, 314143, 414328, 471985, 441852, 399624, 371809, 319366, 298534, 418648, 603880, 624943, 434739, 253509, 238325, 285521, 263357, 225728, 260332, 311648, 303274, 285048, 321308, 363705, 353579, 324421, 299366, 220095, 78248, -17167, 802, 66852, 134825, 257881, 420967, 468619, 326325, 136279, 45132, 11317, -48596, -87644, -52327, -21089, -53868, -45891, 96533, 265416, 314170, 291712, 329407, 401154, 390374, 314207, 288832, 326868, 344556, 330659, 352592, 424560, 499003, 554509, 584985, 553241, 455863, 371392, 351398]
39127C51398r219l9804q661N8196L4664n2098m1824O4620Q8764r650o5585j2792
39115C58009J4700m1103n5360J6466L5407m8609p9420K0972R5789K4544p6142
39104B65253p1164j6459k826J0869O2947P6535K1583L452N7766N3746n7476j06598
39092B97628J3992J33672O2359j06872j63202j02274o5507o2614J9874J81890
39082B08946K75992K08767M6968p8920j00645n5241l9546r0519j19336m1465N9819
39071B74820L6733p6673j01949o436N1533M267k2110M2707Q6249L8106M828N6303
39059C88378Q4555J7510k6003M0435P8368n1271k22054k08688j8592J36248J32979
39048C51865L6383m9574q2299n5470J2822O9042O3478n195r2673j21528k2517
$$ y = [351398, 342179, 302375, 293714, 351910, 386574, 334476, 292652, 357272, 446036, 436386, 370801, 358009, 372709, 331606, 276246, 292712, 328119, 279510, 200090, 221062, 316851, 341395, 265253, 194089, 177630, 174804, 185673, 248620, 325155, 346738, 350190, 407956, 461702, 404226, 297628, 311620, 445292, 507651, 400779, 237577, 135303, 69796, 7182, 27056, 208946, 484938, 693705, 740673, 661753, 561108, 505867, 466321, 375802, 256466, 215001, 274820, 311553, 234880, 132931, 126495, 178028, 182295, 160185, 202892, 289141, 327247, 332075, 388378, 472933, 490443, 464440, 504875, 583243, 531972, 309918, 101230, 82638, 218886, 351865, 388248, 338674, 256375, 200905, 213727, 282769, 346247, 341052, 248379, 126851, 104334]
39037A04334J58663K46854J47001K373j4301J9256o9188j91870j14331J00051
39027C88842J24506r4510k14534m3619J59893J33244J1584K5557R4226K5376j07354
39016E03211j06610q584J216q5486j23004p0004M954Q4785J64131J51121J2169
39005E27899r2631k4045R6103P1948m8835p6308l364K2352o592M8509J88944K35921
38993I39901J28180O6325K48704N60006O35674K54871l64729p33945o04673k37590
38983H92724m8541r0506r8855K3444Q3270j0461p2306J4521Q4820K56j00230o2641
38971F15495J1641k3299r2085o7761j2688k6765l7913L2696P2946k3987j31466
38960C16814q8601K5853M6088j775K47K4501j2413n1590k440O9471O6482M3540
$$ y = [104334, 262997, 509851, 656852, 659225, 644924, 664180, 594992, 403122, 288791, 388842, 513348, 418838, 204304, 160685, 320578, 453822, 465406, 490963, 585189, 610565, 503211, 396601, 388017, 389233, 303747, 180743, 110739, 115693, 200478, 364609, 515730, 527899, 435268, 411223, 507326, 579274, 530439, 454131, 450767, 473119, 466527, 515036, 703980, 939901, 1068081, 1134406, 1383110, 1943116, 2578790, 2833661, 2468932, 1734987, 1130314, 892724, 844183, 753677, 654822, 678266, 761536, 751075, 678769, 693290, 778110, 778366, 678136, 615495, 627136, 603837, 511752, 443991, 431303, 404538, 366625, 399321, 472267, 448280, 316814, 228213, 254066, 300154, 298379, 298626, 323127, 310714, 259124, 256684, 326155, 392637, 436177]
38948D36177P8714R9038K5447n4609m4712j4728m1959n2495K393J1899o7432p8500
38936B99233L9059P5490q5461k03638o9909J15655Q3093m8682k2092Q5847M4679
38925C13274p5403n3553M3199Q04j03151l9389J10373P8368q7596r9637M6729
38914A34018P6273n6557j02906J7327J01771N7006K3789O2770O4368J4848K6354
38903D19061P4599K1888q9685q5696O635L104p0765j1572J59251J90050K7684
38892F44554j03504r6682r1603j53280j57117o6775j6686m5441l1356N0021P6821
38881H952K9083K0709O1012M7044l338K1551Q3129N2495j9957J1236Q2646K1695
38869D16257j04856q8029K9948K7986p4550o2129N0864N1965l4982J7310J75592
$$ y = [436177, 514891, 613929, 639376, 584767, 540055, 525327, 483368, 430873, 433266, 445165, 377733, 299233, 338292, 413782, 328321, 124683, 54774, 170429, 253522, 204840, 182748, 268595, 313274, 237871, 184318, 227517, 228321, 125170, 85781, 196154, 274522, 186926, 87289, 134018, 210291, 153734, 50828, 68155, 169926, 226932, 250721, 313491, 377859, 392707, 419061, 493660, 515548, 425863, 340167, 346802, 349906, 279141, 267569, 426820, 616870, 644554, 541050, 444368, 352765, 199485, 42368, -24407, -41093, -86534, -117890, -67869, 8952, 38035, 58744, 119756, 166800, 163462, 185013, 268142, 320637, 300680, 311916, 394562, 416257, 311401, 223372, 253320, 281306, 206756, 144627, 195491, 247456, 212474, 229784, 405376]
38858D05376J67167j2729p4080M3062Q0833l5198p4851L1027O9799o975J6039
38847F09470J55039J36909q7137k04336p7479L6687k4024p5148o126J157j20704
38836C44308j42417J9392J09654P041m5864P9515J29581n4396k16073j33091J2337
38825A09987J1601o275R5986J36613m4663k39886k00445l1864M1725M0288P3241
38814a3692Q4622K0929J690P9733Q8555m9290j37002m2742O6144M4297K0720J06992
38802B70956J61744P8308K985L7931L4719r0138j51792l8909O1975J1486m2196
38791C37069Q166R093j09084j30897M5196J69488O8642n4243j8637J2616r6071
38780B41338j44161K2157J82327J24390M631L974j2902j61348k27186n2090J21472
$$ y = [405376, 572543, 559814, 485734, 528796, 609629, 574431, 499580, 530607, 600406, 593431, 609470, 764509, 901418, 814281, 609945, 532466, 569153, 545129, 469981, 463855, 465012, 344308, 201891, 221283, 330937, 337978, 292114, 371629, 501210, 446814, 230741, 97650, 109987, 121588, 115313, 211299, 347912, 303249, 63363, -137082, -168946, -127221, -86933, -13692, 70930, 91859, 93549, 173282, 261837, 212547, 75545, 32803, 98947, 143244, 163964, 270956, 432700, 511008, 513993, 551924, 586643, 496505, 344713, 305804, 367779, 379265, 337069, 345235, 354328, 245244, 114347, 159543, 329031, 397673, 343430, 324793, 337409, 241338, 97177, 119334, 301661, 426051, 430682, 434656, 421754, 260406, 33220, -18870, 102602]
38769A02602N4555p7034l6248N2324M438l7126R5195K22412J33966k5704m8337
38758D41043l2545j10828j28668M3448J97900J41809L4464M0711J0850j50922
38748D87262j95853J7627J87859P7794o0226K3617J04852m5534j73147j9080J52552
38737E57723L4702j38395l9127J33132N6634q4309K3283J90228Q9160j03193n1485
38726F68353Q9460J596j54359o9992O3608q9411l12035j83895J38487J83617k5724
38715C09705r9854j294J9603n651J01807J82366J1294j78684o7023J29689L7800
38704D39758j62261p8404J37181Q6714j00159k8117J90149J67666L536O0596K24504
38693I41163J39253n5589J9112K29616J90290J9429O7920J79875K7084j23597
$$ y = [102602, 157157, 80123, 43875, 96199, 100637, 63511, 158706, 381118, 515084, 489380, 441043, 408498, 297670, 169002, 212450, 410350, 552159, 586623, 627334, 638184, 487262, 291409, 309036, 496895, 574689, 514463, 538080, 642932, 597398, 424251, 405171, 557723, 592425, 454030, 414903, 548035, 604669, 520360, 543643, 733871, 823031, 719838, 668353, 757813, 759409, 605050, 535058, 598666, 509255, 197220, 13325, 151812, 335429, 309705, 209851, 208557, 228160, 222509, 324316, 506682, 517976, 339292, 272269, 401958, 439758, 277497, 199093, 336274, 422988, 322829, 294712, 484861, 652527, 656063, 716659, 941163, 1080416, 1024827, 1043939, 1273555, 1463845, 1483274, 1551194, 1731069, 1758153, 1634556]
38683A634556J63555N88421N30143J01062j16021j07162k64629m62940k91909
38674A775076K5305m4010l20216k27406R8461O7413k24347k02103N0088j5425
38664I82836k72135j37966K40101K09333j31944j13138K13158J97282j13915q5244
38654I88368K19206J63418j52400n5692L27622K58474j52063j14283K82860K02601
38644A968111k94772l14677J62051K51093j18461j22040K65436K12020k41265
38635A767496j69610L90056M16784j17150j51659L91151M31098j37582k04716
38626B615868L68721M57833q9910j39845M27675M17341k45435k10818O59262Q92579
38616E153271K12509P4352P65840Q04994l4801j01946Q84325J132899K83734K36523
$$ y = [1634556, 1798111, 2386532, 2916675, 3017737, 2901716, 2794554, 2529925, 2066985, 1775076, 1800381, 1756371, 1436155, 1208749, 1307210, 1374623, 1150276, 948173, 998261, 982836, 710701, 572735, 812836, 1022169, 890225, 777087, 990245, 1187527, 1073612, 988368, 1207574, 1370992, 1218592, 1162900, 1490522, 1748996, 1596933, 1482650, 1765510, 1968111, 1673339, 1358662, 1520713, 1771806, 1653345, 1531305, 1796741, 2008761, 1767496, 1597886, 1987942, 2404726, 2287576, 2135917, 2527068, 2958166, 2820584, 2615868, 2984589, 3442422, 3352512, 3212667, 3640342, 4057683, 3812248, 3601430, 4260692, 5153271, 5365780, 5440132, 6205972, 7010966, 6976165, 6874219, 7758544, 8891443, 9175177, 9411700]
38606I411700J399822J736874P96927P95950K254888K798127J921753K274452
38598B3390493M285096M779896L300764L878126P579007J0048428J0229576J3681466
38590H1172852K2286975L0315364L8115853N7301299Q7708668R9421749O0430264
38583D76753024j7625768q2479993r6581070p2721540m7135484l5193009k7995064
38576I7021096j8807898j2311086j1038724r865201o158363l822048m783413n374412
38568B4859951l493501j974749k576697k906300j505541n39915j295343j759943
38560H807962p10172K0244p38789j310131n33247J26805m14961q73720k89471
38551D084520J43329m45457r01557l62827J18436k80002o08400j20809K90204
$$ y = [9411700, 10811522, 12548396, 13345323, 14141273, 16396161, 19194288, 21116041, 23390493, 27675589, 32455485, 35756249, 39634375, 47213382, 57261810, 67491386, 81172852, 103459827, 133775191, 171891044, 229192343, 316901011, 416322760, 476753024, 459127256, 376647263, 280066193, 207344653, 160209169, 125016160, 97021096, 78213198, 65902112, 54863388, 44998187, 38839824, 35017776, 30234363, 24859951, 21366450, 19391701, 16815004, 13908704, 12403163, 11863248, 10567905, 8807962, 8097790, 8118034, 7379245, 6069114, 5535867, 5662672, 5247711, 4373991, 4084520, 4227849, 3782392, 2880835, 2518008, 2636444, 2356442, 1748042, 1627233, 1917437]
38542A917437o0323l30477Q1977L22529j76028n18294p7956L00259l7098l27028
38532A094998N3467L77271L2123k92613Q779K92244l1271l56139j07433J58442
38522A229868r0052l11196n333K75983J7877k64417o5194J52112m8994j84689
38512G05965J33593L34904l4607l80526j39301J82263j1519l11475j45393J51171
38502D85075N3369j61495n4319R7092o6846k03448L9085K60789O0117j63290M5755
38491C91884L59330L57720L28725N69823O30879J15096m56638m60504k00116k49921
38481A386278m07877k14486P3810k8544k85264j93275O5963J9247j77097q1977
38471A56778J50665Q9446j28234r1294P3886j2192k02217j13410R9043L5647j59707
$$ y = [1917437, 1857114, 1526637, 1608614, 1931143, 1755115, 1236821, 1158865, 1459124, 1422026, 1094998, 1148465, 1525736, 1557859, 1265246, 1274025, 1566269, 1534998, 1178859, 1071426, 1229868, 1139816, 828620, 823287, 1099270, 1117147, 852730, 787536, 939648, 890654, 705965, 839558, 1174462, 1139855, 759329, 620028, 802291, 790772, 479297, 333904, 485075, 538444, 376949, 322630, 419722, 352876, 149428, 188513, 449302, 509419, 346129, 391884, 751214, 1108934, 1437659, 2007482, 2638361, 2753457, 2296819, 1836315, 1636199, 1386278, 978401, 763915, 837725, 809181, 523917, 330642, 396605, 415852, 238755, 156778, 307443, 396889, 268655, 177361, 251247, 239055, 36838, -76572, 22471, 58118, -101589]
38460a01589p5221J60339J11514j35831j31194J21615K12347O3004l1855J1615
38450B04744K9076K5367R9385J17067m7119j60408r574J46098J1310j71249m8047
38439A96650J66940O6073j90887j55229J07748J67522n291p9585k1849p5422j99105
38428b2435j33742O5110J21399N8466R4654J57563L7901j22885m8088J21024M5489
38417C74456j82568j98689j8582M1649k7170J7735J18687J3389j98523j73793
38407b33409M7018J06364k0646j7183J56770K01763M4734o3769l8164m7283j04539
38396C1656m4303R0766R3678K480K0315Q4331j6151j67082q5737J15456O6229
38385A91638j92618k42386j841J51372L2497j10488r2190k6547K0085J41305K71010
$$ y = [-101589, -176810, -16471, 95043, -40788, -171982, -50367, 161980, 224984, 193129, 204744, 233820, 259187, 358572, 475639, 428520, 268112, 258538, 404636, 415946, 244697, 196650, 363590, 429663, 238776, 83547, 191295, 358817, 353526, 273941, 252092, 176670, -22435, -156177, -91067, 30332, 88798, 183452, 341015, 378916, 256031, 207943, 328967, 374456, 191888, -6801, -25383, 16266, -10904, 6831, 125518, 138907, -59616, -233409, -186391, -80027, -100673, -117856, 38914, 240677, 285411, 221642, 183478, 136195, 31656, -12647, 78119, 171797, 174277, 194592, 278923, 262772, 95690, 9953, 125409, 191638, -980, -243366, -245207, -93835, -61338, -171826, -264016, -290563, -270478, -129173, 141837]
38374A41837J99991j5034r0778r111k3348j46901j19610O7705J19320j4683l9032
38363G0356J27045J93242M0897o6843J4528O8112l6835r8394P628Q3212n913p8324
38351C18711P881R4645L4938n1496l5052K225j7148l727Q5760J36668J07769J06342
38339G87516J29712K6046j84856k65461j50762o6985j34845j76657o4251N4920
38329d5623M3780R2L1057O6616M7494N0023R1964O1232m6875p5482N829K3991
38317B54098q1738j41208o3858M952m1256j01495r0388p4292p5797K517J54992
38306b53473K24379J67125J14367R8292k659j70917k01467m2518J04177J15159
38296A52465Q9353Q3505J3373r6918q8164K1774K7509p9558p2217P7017J12754
$$ y = [141837, 341828, 326794, 236016, 226905, 203557, 56656, -62954, 4751, 124071, 109388, 70356, 197401, 390643, 431540, 364697, 379225, 447337, 410502, 312108, 319736, 402948, 397035, 318711, 326592, 421237, 456175, 404679, 369627, 371852, 354704, 350977, 436737, 573405, 681174, 787516, 917228, 943274, 758418, 492957, 342195, 275210, 140365, -36292, -100543, -45623, -1843, -1751, 29306, 95922, 143416, 193439, 285403, 346635, 299760, 224278, 230107, 254098, 172360, 31152, -32706, -27754, -69010, -170505, -260893, -335185, -410982, -408465, -253473, -29094, 138031, 252398, 350690, 348031, 177114, -24353, -66871, 37306, 152465, 241818, 325323, 338696, 241778, 153614, 175388, 202897, 123339, 51122, 128139, 240893]
38285B40893k8113p2358R1134J88062M8581q5996l436J11643L7668r9611j03936
38274C24531n9730j02807j24272q175R5161L2450n7228O0R2914M9871l7179m822
38262B00774O8963K6076p7745r7544m3994J8986J23093K33551J72525p2288k19720
38251C32677j18599j8800j40107k67545j20957J42718J91464O3946L6848J12683
38241B14328O5772j03527j66637o8508K3646L5125L2692R502p7739j14581K8600
38230a21327K15410K01435K0818p9943m1937k1071n3731j5726Q4024P7166n6965
38219B08153j28493l8769Q1013Q8398K860p6293p5365L0724J65594J64042j6401
38208D05463j71236j08641N8486Q7779j5590m3714N1753J06940M1631l9012n1276
$$ y = [240893, 212780, 140422, 231556, 419618, 468199, 382203, 378767, 490410, 528078, 428467, 324531, 264801, 161994, 37722, 29547, 124708, 157158, 99930, 99990, 192904, 242775, 205596, 200774, 269737, 295813, 218068, 120524, 76530, 95516, 218609, 452160, 624685, 552397, 332677, 214078, 195278, 55171, -212374, -333331, -190613, 851, 64797, 101645, 214328, 280100, 176573, 9936, -58572, -34926, 199, 32891, 42393, -35346, -149927, -121327, 94083, 295518, 316336, 236393, 194456, 173385, 119654, 103928, 187952, 265118, 208153, 79660, 40891, 121904, 210302, 213162, 136869, 61504, 92228, 257822, 421864, 405463, 234227, 125586, 184072, 271851, 256261, 212547, 264300, 371240, 412871, 373859, 322583]
38197C22583k7923M749N3902O6736p822q2168l8291O0405O3381k195J4694R9354
38185E27405Q4120m5349j07826k8837N1801L6134J1033N1230P6342R132q1398
38174E83787r9725o4652m1156l2253j5105k372n739m697N675n147m7016q4750
38162A86850q4105m0753K9442Q8358Q9384L8653N864K9635O3349N9865M0212K6134
38150E32888q747n6762m3790M3246R9887O1374O650J1365J6637m6233j19698j26965
38138C69852r8102p6246k9402K9102p827j29799j30668P8039K57684J68701n9893
38127C71441j41833o8937m8660j15933j15112j2717O4471P6911R0432P3401n7567
38116A15897k06761j83771j8841O8633K4674J5849J03376J35604L3038o8218n1970
$$ y = [322583, 294660, 299409, 353311, 420047, 412225, 330057, 291766, 352171, 415552, 413357, 428051, 527405, 611525, 566176, 458350, 429513, 481314, 517448, 528481, 579711, 656053, 665185, 583787, 484062, 419410, 378254, 346001, 330896, 328524, 322785, 318088, 323763, 318616, 271600, 186850, 102745, 61992, 91434, 179792, 269176, 307829, 313693, 343328, 406677, 466542, 506754, 532888, 524141, 467379, 423589, 466835, 566722, 628096, 634746, 646111, 662748, 616515, 496817, 369852, 271750, 195504, 166102, 195204, 187377, 57578, -73090, 4949, 262633, 431334, 371441, 229608, 160671, 112011, -3922, -119034, -131751, -67280, 9631, 100063, 173464, 115897, -90864, -274635, -293476, -224843, -200169, -184320, -80944, 54660, 87698, 19480, -32490]
38105c2490Q653J5526K647L2439P7192Q7251O7958L5161j1461m6165l6523l127
38093A97061K1218N3227R0954O0710n2310j21317p0488l0078j18806k06099j22197
38082b98125K3172J2715r0989n1888J08232J35503o963p0966M9175J56260J02858
38071F8984L98k9159l7167p1041n9332J4301M1919q359k9764J4023L2992K0352
38059d1853P8515J73370J24308p3382j81110q1458M7288M2364j4263j7392l6475
38048A9912j24432j57065m5201Q8635J16933J06782J48250J65383P3150l9879
38038C52468n7208j9104q546J573M0411K8620p1730j40444q4055J441J219k6236
38026A8409J5906P3049N3715J4511N5246J23210R2383k6240j01510o7051K1806
$$ y = [-32490, -23837, -8311, -5664, 26775, 103967, 191218, 259176, 294337, 282876, 236711, 200188, 197061, 218279, 271506, 362460, 423170, 370860, 249543, 179055, 148977, 30171, -175928, -298125, -274953, -262238, -353227, -405115, -296883, -161380, -168343, -239309, -190134, -33874, 68984, 69382, 40223, 3056, -67985, -127317, -113016, -71097, -79456, -109220, -95197, -62205, -41853, 36662, 210032, 334340, 260958, 79848, -1610, 45678, 88042, 73779, 56387, 19912, -104520, -261585, -306786, -218151, -101218, 5564, 153814, 319197, 392347, 352468, 295260, 276156, 267610, 269183, 309594, 338214, 266484, 126040, 41985, 43426, 44645, 18409, 34315, 107364, 161079, 175590, 230836, 354046, 446429, 420189, 318679, 251628, 273434]
38015B73434P7728N3695k7114p4473l0896K7455m487p2723m2063N0356L4335q1165
38003A84082q5451P9699K02918J41863K1683k9307p9986j77907j92450o6523K0382
37992A9003m7541r4134M0453J86836J15614o8020r6255L2441R3589J5790n9172
37981A38604m5733m270R966k60l2062m9266K4600J46270J20225j08203k81694
37970h1823j58449J32050K82979K22760R6610k5958j54620k01935r2059L2033
37960E1588j0838j21862p0231J02247J34242k1641j32956p4285J6584K0500M059
37949a02593K9898L7308k396j2372L0448L9665j2685l7299R059N6653O2450O4530
37937A62666O3418N954p7911q0673P47M2685l345l7416J1195P6811Q4558N6593
$$ y = [273434, 351162, 404857, 377743, 303270, 272374, 299829, 295342, 222619, 180556, 230912, 265247, 184082, 98631, 178330, 381248, 523111, 544794, 515487, 435501, 257594, 65144, -1379, 19003, -28538, -122672, -82219, 104617, 220231, 152211, 55956, 88397, 181986, 197776, 138604, 92871, 88601, 98567, 98307, 66245, 16979, 41579, 187849, 308074, 199871, -81823, -240272, -108222, 174757, 397517, 494127, 468169, 313549, 111614, 19555, 51588, 40750, -81112, -151343, -49096, 85146, 63505, -69451, -143736, -127152, -106652, -102593, -72695, -35387, -37783, -50155, -19707, 19958, 7273, -30026, -20967, 35686, 98136, 162666, 226084, 232038, 154127, 73454, 74201, 116886, 113541, 76125, 87320, 164131, 248689, 305282]
37925C05282L3372J689m2626n5326j7402K4314K1187k9099j00637j50420j34324
37914a43990p0904m3293p3498p1386P913O1829J6355j4865Q5325K03479J52898
37903A09863j6051r1919l5930M47l4982l7311J8006K5409k7375j6234Q2800J23797
37891A00520K6268j03878j52858j30571p1993K4175J07876R4901K1192J7695R0439
37880B3766R8659k015p7216l7217L3531M3408K4871K2209L258l9994m6939j3157
37868C3164j7724o6316n7275L3426Q8440M0310k4341k3367N667J7799L9720O9471
37856A38974M9840O146M5672J49912J49641j277j16622o3146K6764j9623j35167
37845B31114j35903j2192P9990N2774l4881r0123p1139p33L4752l9405j63886
$$ y = [305282, 338654, 340343, 297717, 242391, 224989, 249303, 270490, 241391, 140754, -9666, -143990, -214894, -258187, -331685, -403071, -395158, -333329, -316974, -331839, -246514, -43035, 109863, 93812, 1893, -34037, -33590, -68572, -105883, -87877, -62468, -89843, -106077, -23277, 100520, 126788, 22910, -129948, -260519, -332512, -308337, -200461, -105560, -84368, -66673, 23766, 122425, 120410, 43194, 5977, 39508, 82916, 107787, 129996, 133254, 93260, 46321, 33164, 15440, -50876, -108151, -74725, 13715, 54025, 29684, 6317, 11984, 29783, 69503, 138974, 188814, 194960, 240632, 390544, 540185, 538908, 422286, 359140, 385904, 366281, 231114, 95211, 83019, 163009, 215783, 180902, 90779, 19640, 18907, 53659, 14254, -149632]
37834a49632j87822p7516L4617O0763P1806J25446J41474O1631j7158o382J2937
37823G0164n3816j19400n0063R5385J44745P4412J7177L6155N1541o033r9763
37812A60504j58682j51658q4491L973M9189K4971j4454m568M4783P8020O9704
37801A7291K9733k5100o5641o0333k1793L420P767K3569M4708L2009N637K9460
37789B0727Q7270Q9862K7420j3660j2035m1376r9000p2085N6415J37466Q3127
37778B64131Q88l241Q188m2816q8757n2155J373n259j2277L8813N5889m0728j31682
37765g633o6765Q3216J37490Q1671L8235L5843Q490l1418j7211J3182k9858j04846
37753A40396q7781J8601R3446R5835R1686J00727P4949J7009k5452o4397j32190
$$ y = [-149632, -337454, -414970, -380353, -319590, -247784, -122338, 19136, 80767, 63609, 57227, 70164, 16348, -103052, -153115, -57730, 87015, 161427, 178604, 214759, 266300, 260267, 160504, 1822, -149836, -234327, -230354, -181165, -156194, -170648, -175216, -130433, -52413, 17291, 47024, 21924, -43717, -104050, -125843, -122423, -114656, -91087, -46379, -14370, -8733, 20727, 107997, 197859, 225279, 211619, 199584, 158208, 59208, -12877, 43538, 181004, 264131, 265019, 261778, 269966, 227150, 138393, 86238, 87611, 82352, 70075, 108888, 164777, 124049, -7633, -74398, 8818, 146308, 227979, 266214, 302057, 310547, 279129, 261918, 275100, 245242, 140396, 52615, 71216, 164662, 260497, 352183, 452910, 527859, 544868, 519416, 455019, 322829]
37742C22829j71654j09740j590M7059M9367O7083L7445j26833l09273k89085o4143
37731e48535J41799K00369J89138J68032Q3716n0402j07234o1864n0205j22478
37721a57664j35422L98J47968J46677L5205n5563r5640j12649p8197K3691J06837
37710a74359Q7644Q788m0384m8802m0623K37O3438O3018l3592j11726o5048K9372
37698b62037K2865p3811j11063k6175Q2252J06777N1503j1776k5526K5131J00165
37687a21695J17479L4281q7178j44942j15296n2878O682P3995J39707J53930R4272
37676I8357O057m8975n4822l9093l4915n5917q8051r6701n7738J1595O5069P5543
37664b19591O0462N3749O0711N2873J0627m2186o4587n4439m7671n3831l1754
$$ y = [322829, 151175, 41435, 39845, 86904, 136271, 203354, 240799, 113966, -195307, -484392, -548535, -406736, -206367, -17229, 150803, 234519, 184117, 76883, 15019, -35186, -157664, -293086, -292688, -144720, 1957, 37162, -18401, -114041, -226690, -304887, -281196, -174359, -86715, -77927, -118311, -167113, -207736, -207499, -144061, -81043, -114635, -226361, -291409, -262037, -239172, -312983, -424046, -450221, -367969, -261192, -209689, -221465, -246991, -221860, -121695, -4216, 30065, -57113, -202055, -317351, -370229, -363547, -289552, -149845, 4085, 98357, 104414, 55439, 617, -38476, -73391, -129308, -217359, -314060, -371798, -360203, -295134, -219591, -159129, -105380, -44669, 8204, 18831, -23355, -87942, -142381, -190052, -243883, -275637]
37653b75637M1966J15995J21107O1470o42l5478o5474j00593j14037r0553m5709
37642c87585J4340R8472J77188J79707Q3747k9037n3034K0090R6298R2449K5262
37631C17897k3753j5370J648l6169j10348j37061q1695r022M295l7001p7397r3326
37619b97302r3454o7344J423P9778J03669N9639K643j6324l935K461j4421l7353
37607b80520l2985J5735Q2584J13536Q3861K5208j7796l4423l3730j4090K3539
37596f9081N4615N2232J5009m0124q8536r3662l2766N6891R9693O5988o067p3369
37584e9177j10097p1879O3373K00138J89001L5373p5847l5406L5838j3016j29224
37573B9077j53200n1827Q3105J84197K13048J03552j29613k93850k15688O053
$$ y = [-275637, -233671, -117676, 3431, 64901, 64259, 28781, -36693, -137286, -251323, -341876, -387585, -373245, -274773, -97585, 82122, 165869, 136832, 83798, 103888, 200186, 292635, 317897, 294144, 278774, 280422, 244253, 133905, -3156, -84851, -93873, -89578, -126579, -203976, -297302, -390756, -458100, -456677, -376899, -273230, -213591, -210948, -227272, -231207, -228746, -243167, -280520, -313505, -297770, -215186, -101650, -17789, 7419, -10377, -44800, -78530, -92620, -69081, -14466, 37766, 52775, 12651, -75885, -169547, -202313, -145422, -45729, 20259, 14192, -59177, -169274, -241153, -177780, 22358, 211359, 246732, 170885, 135479, 171317, 158301, 29077, -124123, -175950, -92845, 91352, 304400, 407952, 278339, -15511, -231199, -225146]
37563b25146J24473Q3300L4966M8897L1484m3809n9826J9774N5892l4127j23652
37552h7774p5560M5320Q4825K1403m4130m8614j4041J6940J8279j0291l0815q444
37540a32902K3012O488k6971P906R7331J29274P0345J0135o288m3272j12691j02973
37528h0606L1571J46939R8549m8300j20439o7838K5191R0060J15949R2531K1739
37517C05346m4912o7051p6422j04325j04383l6022K8580j2044j24899j64284n6155
37506d56571J17129K21198K01191J05584K2510PJ1085N54l9968p3758q3946q2389
37494e7374o1121p283L3753l34p0603n9076O0351J71642J77834J14448N5083N532
37482C62852m6631p1393n4582l5777k8353J3361R0077J16491N1256k7321m6980
$$ y = [-225146, -100673, -17373, 17593, 66490, 97974, 54165, -5661, 14113, 70005, 35878, -87774, -163334, -118014, -33189, -11786, -55916, -104530, -118571, -101631, -83352, -93643, -124458, -132902, -109890, -103402, -130373, -122467, -25136, 104138, 174483, 184618, 178330, 135058, 22367, -80606, -49035, 97904, 196453, 148153, 27714, -40124, -14933, 75127, 191076, 283607, 305346, 260434, 193383, 116961, 12636, -91747, -127769, -99189, -111233, -236132, -400416, -456571, -339442, -118244, 82947, 188531, 211041, 211048, 222133, 222687, 182719, 108961, 25015, -57374, -118495, -125778, -92025, -92359, -162962, -222038, -161687, 9955, 187789, 302237, 357320, 362852, 316221, 244828, 190246, 154469, 126116, 139477, 229554, 346045, 397301, 369980, 323000]
37471C23000m4952o8230p3875k2752K2697j904m6964l2304K8967Q0262J11690
37460B75635J11947L0834j05760j52690m7040N2191j9976j70651j79910l0445
37450b35865Q9474Q5682O3091J12833J70193J40825L9687n7329j13255j33551
37440A61785j28585j02416m8499L5693J04238Q1628k6148j04931q3542l4580l8943
37429a84300m1761L4112J15048P4713m7226r1752k1894M5426M2128K3555L0114
37418b1837K6833O991J7884N1025L2690m2323q4076m7546R807L8985N8656P3148
37406A20237M0330l8678r3095q2340m0175Q73M2533O8523N6721N0898J11630J86717
37394D24174J54426J6332q6140q2264n8055p7466o5882L5546J28450R2891k4164
$$ y = [323000, 278048, 209818, 135943, 113191, 135888, 133984, 87020, 54716, 83683, 163945, 275635, 387582, 418416, 312656, 159966, 112926, 165117, 145141, -25510, -205420, -235865, -146391, -60709, 2382, 115215, 285408, 426233, 465920, 408591, 295336, 161785, 33200, -69216, -117715, -82022, 22216, 103844, 77696, -27235, -110777, -145357, -184300, -226061, -191949, -76901, -2188, -49414, -141166, -163060, -117634, -75506, -51951, -21837, 4996, 11987, 29871, 80896, 113586, 71263, -12813, -60359, -50552, -11567, 47089, 120237, 160567, 121889, 28794, -53546, -93721, -92848, -50315, 18208, 74929, 125827, 237457, 424174, 578600, 594932, 508792, 426528, 368473, 291007, 225125, 260671, 389121, 482012, 457848]
37383D57848q2459n5106l9553q4881j18746o2636N1778J14114O0277n2062j01708
37372H6866m3686L4952K9930m4088r1136p7291n2482m3866k4655P433K1053L4791
37360a62179J03811J94226J82351L4296j11665j13726k145Q5185Q1057K9883m664
37349C16430l121J6354K1071k686j8416K3789J03456J32818O9674k1867n4427
37338E83075j9076K4207K2109k6971p3526n7798J6788O6583L6418l241M6281J37120
37326G51969J16990l8771j64710j28495n825M4890m116n1543k6978L5607O1370
37315E90388J6267o0147q1536n636R5565J09329K8296n0249p5754r5279j28300
37304C42944j09508j9531L8180j4035q7442m5649Q8774J55957O5160j11014k39981
$$ y = [457848, 375389, 320283, 280730, 195849, 77103, 14467, 66245, 180359, 240636, 188574, 86866, 43180, 78132, 108062, 63974, -27162, -104453, -156935, -200801, -225456, -218023, -196970, -162179, -58368, 135858, 318209, 352505, 240840, 127114, 124969, 210154, 291211, 321094, 316430, 313309, 329663, 350734, 348048, 329632, 353421, 456877, 589695, 659369, 637502, 583075, 563999, 588206, 610315, 583344, 509818, 452020, 468808, 535391, 571809, 568568, 614849, 751969, 868959, 830188, 665478, 536983, 531158, 576048, 571932, 520389, 493411, 529018, 590388, 606655, 546508, 464972, 459336, 554901, 664230, 692526, 642277, 566523, 471244, 342944, 233436, 213905, 252085, 238050, 150608, 104959, 193733, 349690, 414850, 303836, 63855]
37293F3855k52954j68038n1500L3225O9603Q4197R4647R0165P1440O3223O8461
37282A66324O0295L9646M0914N5622K2972o3927j19301q8760l7858m5562p9848
37271d9483p0757m7951q7785j50582j04180O5957J89861J30153j2626j8858J45141
37260a1110K57508J28221j33024k46519j25989K7644K3512p5153r6231k2188L5706
37249b37623M3304N4934O0379k450q6965o4563O1722J30733N6075n7134q0034
37238a21622j4661O8000J18076Q9889l3054j48651j10889N2314J40212N7578o2128
37227C5064q1100l7240p818L4828J09792J27391L9950m6169m3751k9034p3937
37216B7976q8361K825P5744q04j18385r1602L6641Q1981L0248K3477Q5872J02576
$$ y = [63855, -189099, -357137, -408637, -375412, -305809, -221612, -126965, -36800, 34640, 97863, 166324, 226619, 266265, 307179, 362801, 385773, 321846, 202545, 113785, 75927, 30365, -49483, -120240, -168191, -255976, -406558, -510738, -444781, -254920, -124767, -137393, -156251, -11110, 246398, 374619, 241595, -4924, -130913, -103269, -79757, -154910, -251141, -273329, -237623, -194319, -139385, -79006, -81456, -168421, -232984, -171262, -40529, 15546, -41588, -121622, -136283, -68283, 49793, 139682, 106628, -42023, -152912, -100598, 39614, 97192, 35064, -46036, -83276, -91094, -56266, 53526, 180917, 220867, 174698, 130947, 101913, 27976, -60385, -57560, 18184, 17380, -101005, -192607, -155966, -73985, -43737, -20260, 65612, 168188]
37204A68188N0389K4945M2412K2326l3919m7482l7810q7141j36410m4244J34728
37193E5982J70070L867j51534j37483n0088k3238k3768J2342K8732j9686l9248
37182a74052M7121J44293J31571N4277K2588J7081m8527j43388j57736q6019k7685
37171b20476k1869q249M7119R6990R9915P6236N4080K2404l5643r9776j24207
37160a13476q0979Q181P9007P9775K4858k6631m2876l6602j5567K9847P6616O3852
37148D6005k7132j23206j26271j8045J16881J65661R0634k8200p1178j5038M5015
37137E5126L4569J902K4702P7113P6429J7481l5485n6406n8571k4704N5079J10411
37125B77646P5762J2506J1988K0872o6652j76763j32358L0973O9698q1318j76102
$$ y = [168188, 218577, 243522, 285934, 308260, 274341, 226859, 189049, 101908, -34502, -78746, 55982, 226052, 229919, 78385, -59098, -109186, -132424, -156192, -143850, -115118, -134804, -174052, -126931, 17362, 148933, 203210, 225798, 242879, 194352, 50964, -106772, -192791, -220476, -242345, -250594, -203475, -106485, -6570, 69666, 123746, 146150, 110507, 10731, -113476, -194455, -186274, -107267, -27492, -2634, -29265, -72141, -108743, -124310, -94463, -17847, 46005, 18873, -104333, -230604, -248649, -131768, 33893, 124527, 96327, 25149, 10111, 55126, 89695, 91597, 116299, 193412, 269841, 287322, 251837, 195431, 136860, 112156, 167235, 277646, 353408, 365914, 377902, 398774, 332122, 155359, 23001, 53974, 123672, 42354, -133748]
37114a33748l9081J49851J36145k8578j07331m7297R073M574J9168O3040L8306
37103F4122o6968j28331p6507N318K8523K2580N0693R5689R5687L6307m0123q0493
37091F497n4442K0245P5161N2985k3755q1767q9293p7176p5158p3585m7995J4239
37079c54044J02868J69118J48006M2008m8959m2580Q503p869q7592j06979r671
37068a87191R9644R9062J4844k8862J2809N7217K3883n2988p5660j3966N8836
37057G628O1300Q93m2653j4009N7985R2730M1389n4293r0271j3976R3871J02838
37045B43432P237o1447l4939j8851j10882k06434j39569L7294J03323j761r6468
37034b79065n4056J5389j8869q2816l7149Q2354J29777P8662K9835L3157M2185
$$ y = [-133748, -172829, -22978, 113167, 84589, -22742, -70039, -60966, -56392, -37224, 25816, 64122, -2846, -131177, -207684, -202366, -173843, -151263, -100570, -4881, 90806, 127113, 86990, 6497, -47945, -27700, 47461, 100446, 76691, -5076, -94369, -171545, -246703, -320288, -368283, -354044, -251176, -82058, 65948, 107956, 58997, 16417, 24920, 17051, -70541, -177520, -187191, -87547, 11515, 26359, -2503, 10306, 67523, 91406, 38418, -37242, -51208, 7628, 68928, 69821, 27168, 13159, 71144, 163874, 205263, 150970, 60699, 46723, 140594, 243432, 250669, 189222, 154283, 135432, 24550, -181884, -321453, -284159, -180836, -182597, -279065, -333121, -317732, -336601, -419417, -456566, -374212, -244435, -165773, -135938, -102781, -60596]
37023f0596K3695o735l9719o1391j9674R2341J56329N7751j23132j80339m9365
37012b10835J13198J36941K1126j12414j55648p6623O9900J63564J19876p341
37002F1744q6447p3796m0566l1145J051Q0255J29985P6984l0722q1525m1412K1661
36990a3933L6157L057k1830O019P2406J16694R6864L4154k2999o1775r9934j34007
36978A0873j36895j03204n5505p210M2233P9873Q8468P8921P1370N1147o629p1650
36966D1792p4871k414P5269Q6234L3804k2909l6557j0184J1847p024m2930l2261
36954A9796L2509P0708K4373m5034m3022J2549K5218k2451n2686l4505k7646n9532
36942i9723p0525k9643j149l0061n5072j8628J7974k6410r7738p1096N4360J44922
$$ y = [-60596, -36901, -43636, -83355, -144746, -164420, -72079, 84250, 142001, 18869, -161470, -210835, -97637, 39304, 60430, -51984, -207632, -284255, -214355, -50791, 69085, 61744, -24703, -98499, -139065, -170210, -169159, -88904, 41081, 118065, 87343, 5818, -35594, -13933, 22224, 25281, 3451, 9470, 81876, 198570, 295434, 329588, 306589, 244814, 144880, 10873, -126022, -229226, -284731, -291941, -249708, -169835, -81367, -2446, 68924, 120071, 113442, 41792, -33079, -35493, 39776, 126010, 159814, 136905, 100348, 90164, 102011, 94987, 52057, 19796, 52305, 123013, 147386, 102352, 59330, 71879, 97097, 74646, 21960, -12545, -40191, -99723, -170248, -199891, -201040, -231101, -286173, -304801, -286827, -313237, -410975, -482071, -427711, -282789]
36930b82789J23352N8496L1280J4834m3898j00573o9347K8331P2159J3334n1211
36919b06032k0727O1663P9302K2166q21O3685J23754P7419l5904r6078p0599l3010
36907c5182k7020p282N9959J16754Q8905l153o7888n9948k1951r258k0441k3145
36895i650j5331k3186m8350n7282l2289K061K2433M0821O3412N2638j6832r1000
36883a12555r3514l7582m873j4255j053N5182Q1575L6977p086J8834O4579M4683
36871C0912j8540l2732J8614O1803M9527J1018r258J745L3733N4909K1729o2336
36859A61124j20844q9955l807N6340O2226L2773k3239q6837r9492l9224J7369
36848a33566J000k9629J6528Q9921O1245o0960j23197n5221L5729M1566j700p250
$$ y = [-282789, -159437, -100941, -69661, -54827, -98725, -199298, -268645, -240314, -168155, -154821, -206032, -226759, -165096, -85794, -63628, -64449, -764, 122990, 200409, 164505, 68427, -2172, -35182, -62202, -69484, -9525, 107229, 196134, 192981, 125093, 65145, 43194, 33936, 13495, -9650, -24981, -48167, -96517, -153799, -186088, -184027, -161594, -120773, -57361, -4723, -21555, -112555, -206069, -243651, -248524, -262779, -263832, -208650, -127075, -90098, -97184, -78350, -13771, 30912, 12372, -20360, -1746, 60057, 109584, 120602, 111344, 113089, 146822, 201731, 223460, 161124, 40280, -49675, -53482, 2858, 65084, 97857, 74618, -12219, -111711, -150935, -133566, -132566, -162195, -145667, -55746, 5499, -55461, -178658, -233879, -198150, -156584, -158284, -165534]
36836a65534K6755M5721L0640O37k5483l1683j4482n752l0406m3382J3228R3794
36824a05947R1442O779m1200j641L3440p599n9030m1290L136p740n5029n8569
36812b43248n615M4416M9635J7985j6245n522P5017J68468J71655O7286m4326
36801B79506q0784o6417m6472q941M6801O0524J0267k6165N941L9539L700m6702
36789A70797k9368J7308J0054k4617j2115R262n2031j48860j33058N936J01655
36778h5037N0532n1189p2047k3204J0004J4994K9910L7694j0379q3095p3559O2288
36766a93088K23855K58132J21549p1913j66929j15965r11P4208P3660J7616o1924
36755A58290j22959j18564m7386K6101L9698k62m8077p7283p4747k2726N7361
$$ y = [-165534, -138779, -93058, -62418, -61781, -87264, -118947, -133429, -139181, -169587, -212969, -199741, -105947, -14505, -7726, -48926, -50567, -17127, -24726, -83756, -125046, -121910, -129650, -184679, -243248, -248863, -204447, -154812, -136827, -153072, -158594, -83577, 84891, 256546, 323832, 279506, 198722, 132305, 85833, 76892, 123693, 184217, 194484, 168319, 174260, 213799, 217499, 170797, 141429, 158737, 168791, 144174, 132059, 141321, 89290, -59570, -192628, -186692, -85037, -34505, -85694, -157741, -180945, -170941, -155947, -126037, -88343, -98722, -181817, -255376, -193088, 30767, 288899, 410448, 338535, 171606, 55641, 54730, 128938, 202598, 220214, 158290, 35331, -83233, -130619, -104518, -64820, -65082, -113159, -190442, -265189, -287915, -230554]
36744b30554Q3273P747q4538n6414R9552K29971K00458N6486l9300j1583L6424
36733B91522l3693j87236k28776o2799J38719J38246m1810j48668o1158N5903
36723a39750K9569o5173o2614J9826M0406k2497o6214n1825k2281K9297J29704
36712a81552J88019Q3526j02715j45738m946J05947N0013k9606L9935J75469J68485
36701C46837m724j71866k07234j37232l5124N0648O6366k4379j57749j95330p3518
36690e43305J17080K24918J83038N3860m5451n0414J1157P8981J33630J78100
36680C41594J74034P3132p8171j49113q1648K9705O3311J4049m2964p0133p6865
36669A96931n8711q164L8265L4751o951m1244n6544o4739n4643k1534j1160n5729
$$ y = [-230554, -147281, -139534, -224072, -280486, -180934, 49037, 249495, 305981, 266681, 255098, 291522, 257829, 70593, -158183, -220982, -82263, 55983, 14173, -134495, -195653, -139750, -110181, -175354, -237968, -218142, -177736, -200233, -266447, -318272, -340553, -311256, -181552, 6467, 89993, -12722, -158460, -163406, -57459, -7446, -37052, 2883, 178352, 346837, 342113, 170247, -36987, -174219, -209343, -158695, -92329, -116708, -274457, -469787, -543305, -426225, -201307, -18269, 35591, -9860, -60274, -49117, 29864, 163494, 341594, 515628, 588760, 510589, 361476, 279828, 309533, 372844, 386893, 343929, 273796, 196931, 138220, 130056, 168321, 203072, 196121, 154877, 98333, 33594, -21049, -42583, -53743, -109472]
36657a09472r1376l2725P8819J03642j455j12546j01577Q604J01789J17653Q6724
36646D8080O0175O0770Q0600Q7998N5196J244k3636j6123l6304j13177j82647
36635B2176j68551q5448n613M1975P7591J03031R7635O8706M1457J0681l2951
36624A70689m7453N799O2853J7096j08374j63101q6204l664l0605q2317j744J89112
36612g7913K98594K10574R491j43635j71524j09302m6768n0683r2984p3015L5699
36601b11466J10771M5130o6629m4480R6993J52252L1826j07147j06029k0221J6643
36590a02357N820K1115L5328k9698j31215j39188l2370O8624P5825L6846L9544
36579a51726R3216J34866J06326Q397r2949j15553l7810Q4926J85028K23204J64130
$$ y = [-109472, -200848, -233573, -154754, -51112, -52567, -165113, -266690, -258086, -156297, -38644, 48080, 108255, 169025, 249625, 337623, 392819, 394063, 370427, 354304, 318000, 204823, 22176, -146375, -231823, -237436, -195461, -117870, -14839, 82796, 151502, 192959, 203640, 170689, 123236, 129035, 191888, 208984, 100610, -62491, -148695, -152359, -182964, -265281, -267025, -77913, 220681, 431255, 440746, 297111, 125587, 16285, -30483, -81166, -174150, -247165, -211466, -100695, -55565, -122194, -166674, -69681, 82571, 114397, 7250, -98779, -119000, -102357, -96537, -75422, -40094, -69792, -201007, -340195, -372565, -303941, -228116, -191270, -151726, -58510, 76356, 182682, 191079, 98130, -17423, -55233, 29693, 214721, 437925, 602055]
36568F02055m957j96099k55015j41285N297M7411R903k2646n6477j14461j15331
36557b41605R528J50669J52281O3559O5176J65072J78133L1825j16417j32173
36547C26048q6136q7552r7413l0856P1907J01955L4759o7549j41437j38437l5167
36536a49878J00365J34253L6778n3577j8393P1725P4028j5796q4867q2262n5652
36525d3276l4256Q101O7535Q1238R504j06170j80091j49760k2295J12754J42971
36514a13745M8172o5285q1380K932J06329J70937J88427J57033Q2419P090k2021
36503D80908j3001j1318k9965m0163k6111p202l098q857j1550j1805k0568l7398
36491B59872l5829J0207O8636N2089p0559j92097j75395l8841N9895M1128o58
$$ y = [602055, 597098, 400999, 145984, 4699, 9996, 57407, 67310, 44664, -11813, -126274, -241605, -232077, -81408, 70873, 134432, 199608, 364680, 542813, 574638, 458221, 326048, 239912, 152360, 54947, 24091, 95998, 197953, 232712, 165163, 23726, -114711, -149878, -49513, 84740, 121518, 67941, 49548, 121273, 195301, 179505, 94638, 12376, -43276, -77532, -69431, -1896, 79342, 88846, -17324, -197415, -347175, -369470, -256716, -113745, -65573, -130858, -212238, -209306, -102977, 67960, 256387, 413420, 495839, 502929, 480908, 467907, 456589, 426624, 386461, 360350, 353148, 350050, 341193, 329643, 317838, 297270, 259872, 224043, 234250, 302886, 354975, 284416, 92319, -83076, -121917, -62022, -20894, -21552]
36480b1552L7036J08933J14935O5442M7050P0130N9397j5656r3593j14356r2731
36469A65035q1680j04681j37082j32905p2120O733L9464J3739j5886m584L1171
36458b92796N9184Q2273J12474J36580J37962J12649M2804q7791k21129k38739
36448a56529j04281O4595J28412Q2740K2875k73j6355n6770j06277j22423o7315
36437c31601N1295J44981J07157m5732j58218j19156J532O8633O7643Q0026J21253
36426a2187J18067M0588m0189m6646J3505O5243M5264l3669q2801l0730P3236
36415A09681J05654L5960l5925m2699m2268q0490q2252P717Q2416K0122j02697
36404b4781j14150j6438K5926m5091j03648n6443K6002M7768K3379J0414J1532
$$ y = [-21552, 15484, 124417, 239352, 304794, 351844, 421974, 481371, 465715, 372122, 257766, 165035, 83355, -21326, -158408, -291313, -363433, -356700, -317236, -303497, -319383, -323967, -292796, -233612, -151339, -38865, 97715, 235677, 348326, 391130, 303339, 82210, -156529, -260810, -196215, -67803, 14937, 37812, 37539, 21184, -35586, -141863, -264286, -331601, -280306, -135325, -28168, -73900, -232118, -351274, -349742, -281109, -213466, -133440, -12187, 105880, 146468, 106279, 59633, 73138, 138381, 183645, 149976, 67175, 36445, 109681, 215335, 251295, 215370, 172671, 130403, 49913, -32339, -24622, 57794, 77916, -24781, -138931, -155369, -129443, -174534, -278182, -334625, -308623, -260855, -237476, -227062, -215530]
36393b15530P921J0443K5221L1613K5881K3376M408o1326j22853p7933P1952J89620
36381h7207J71203O6865j3238l4827k7059p678R181j8587j09316j95291j76639
36370d22593m5352Q2184Q1678l1589j00479r145J50291J75074K8990r2354l9105
36359b22400P4876N8427n8257r2066j5291J3780p1451j42147r3734J0531Q1088
36348d56644J23745J43032Q1959m2433q5972K1925J43133J20625M69o7570o0303
36337g8034o1008p1565j2296J00870J32247J8661j20859j25663J3335J51499J58330
36326A05517M9224n5020p5732m7163l3418l1925j1535L606k5601o0016l1975K8815
36314a85223L4816j055J8399R0053R5879J1022l6920J3779M5705k8898j00622
$$ y = [-215530, -207609, -197166, -171945, -140332, -114451, -91075, -86667, -147993, -270846, -348779, -276827, -87207, 83996, 150861, 137623, 102796, 75737, 68059, 77240, 58653, -50663, -245954, -422593, -467945, -385761, -304083, -335672, -436151, -445296, -295005, -119931, -90941, -183295, -222400, -147524, -89097, -147354, -239420, -254711, -240931, -312382, -454529, -548263, -537732, -456644, -332899, -189867, -107908, -150341, -236313, -214388, -71255, 49370, 49839, -17731, -78034, -139042, -210607, -222903, -122033, 10214, 28875, -91984, -217647, -204312, -52813, 105517, 154741, 99721, 23989, -23174, -56592, -88517, -100052, -96446, -122047, -182063, -214038, -185223, -150407, -151462, -133063, -43010, 52869, 63891, 26971, 40750, 86455, 57557, -43065]
36303d3065m1493P8093J07170M5956m178l6851j08068j66874j07762L0234R6698
36292a50140O2459M7314R5822R8832l519r5257n8203L7682L2205r3505j91603
36281b17913j45590j0072P6307O7949M3631O2905O7551p226p9821r002J65001
36270A3720K18663M8402j66701k10713j09662k4268J7340Q9098J46738O6094j06601
36259a7890j63684m0909P9066M1645p0050r5184j9156P3534J46457J85184J25358
36248B44371m8358j95818j63215o756O1731m5283j88785k05803j02740O724O7569
36237e76363J05862J32665J14703M2923l2400n6530k5416K8190P0533P3250K5333
36226i7250k9498r027J00002J83069J21521l8787j33099j00788n7761j02449j58224
$$ y = [-43065, -84558, -6465, 100705, 146661, 142483, 105632, -2436, -169310, -277072, -246838, -150140, -87681, -40367, 55455, 154287, 150768, 55511, -2692, 34990, 67195, -26310, -217913, -363503, -373575, -297268, -229319, -185688, -122783, -55232, -62458, -142279, -151281, 13720, 232383, 280785, 114084, -96629, -206291, -230559, -213219, -124121, 22617, 88711, -17890, -181574, -222483, -143417, -101772, -171822, -267006, -286162, -212628, -66171, 119013, 244371, 196013, 195, -163020, -169776, -108045, -153328, -342113, -547916, -650656, -643932, -576363, -470501, -337836, -223133, -180210, -212610, -269140, -294556, -266366, -195833, -122583, -97250, -126748, -135775, -35773, 147296, 268817, 230030, 96931, -3857, -61618, -164067, -322291]
36215c22291j02256K7040P5629j078p9652m7381N9068J29318J22807R0199Q9135
36204D0538J18072J25646P3337j0484n3002k4564K2963K7029j0932n2655q1700
36193A74248q8130m1051N4735J11323N2709o0566r3837k4927K7968j3795p7387
36182B1290n8037K6490P6832O3502N1173P4718P2296j4666j24073j31545k7989
36171B9991M2438k6052j37802j19112L1182J39526J10516M2397M2436O7942M3136
36160B66598R549L2535N5047q202j00875j06143m8777m9857j07531j00586j1378
36149a69620L7523K865j684Q4962J46631P4171n6384j03406n7250k858L5031Q5406
36137G5387J20082P3748l6241j08933q6745j5177K9702J8882l0049q4633j15462
$$ y = [-322291, -424547, -397507, -321878, -322956, -402608, -449989, -390921, -261603, -138796, -48597, 40538, 158610, 284256, 357593, 347109, 294107, 269543, 292506, 319535, 308603, 255948, 174248, 86118, 45067, 99802, 211125, 263834, 203268, 109431, 84504, 112472, 98677, 21290, -36747, -10257, 66575, 130077, 181250, 255968, 328264, 313598, 189525, 57980, 29991, 72429, 46377, -91425, -210537, -179355, -39829, 70687, 113084, 155520, 223462, 266598, 276147, 308682, 363729, 355527, 254652, 148509, 99732, 49875, -57656, -158242, -169620, -132097, -129232, -130916, -45954, 100677, 174848, 118464, 15058, -42192, -45050, -10019, 75387, 195469, 269217, 232976, 124043, 37298, 22121, 51823, 70705, 40656, -43977, -159439]
36126a59439j09973q0464m9327k7280j0247J1116M2553P7142R4583P8039K7043
36115a06254m7962j21079j36732m8461R9211J82705J43627O7677N5815P7523M5693
36104B11763j5659m421P9590J21727P0447K982j6464k9388q6671j52214j54410
36093B7282p2784M9675J24612O4126j03569j94090p3297J15885J05492j07433
36083f4101k29851r6210R6116J04618o360k2563O3891Q6327P493m2268q269J8584
36071i2593o858n983O3171J17703Q5356J2403k9074m9327q7262j16612p9349J7733
36059a70692R6443R5201L8273R783N4889J12799P9739n1945j64809j56142n8555
36048a15016K0543L0249n882n3845q4030o0709J1642O0874L4086j8021j3766L5727
$$ y = [-159439, -269412, -349876, -399203, -426483, -436730, -425614, -383061, -305919, -211336, -133297, -106254, -154216, -275295, -412027, -460488, -361277, -178572, -34945, 32732, 88547, 166070, 211763, 196104, 191683, 271273, 393000, 463447, 466429, 449965, 420577, 333906, 181692, 27282, -45502, 4173, 128785, 192911, 89342, -104748, -178045, -62160, 43332, -64101, -293952, -390162, -294046, -189428, -195788, -218351, -154460, -68133, -60640, -102908, -111177, -92593, -99451, -105434, -42263, 75440, 160796, 173199, 144125, 94798, 7536, -109076, -188425, -170692, -74249, 20952, 59225, 69008, 123897, 236696, 316435, 264490, 99681, -56461, -115016, -94473, -64224, -70106, -123951, -207981, -268690, -257048, -196174, -162088, -180109, -193875, -158148]
36036a58148N5489K9963O023o743l6538n4122J2599J44204K10049J31070j2937
36025C20909r1729q1650n7125o8692r5385j04311r7661q5426m9719K8828J16709
36014b65252J39912P5764K310O738N8381M1458p4633j74155j44780k3589O3119
36003b94727N6430J174l4031j1960O3704J33207J07976k1964j36793j14394R926
35992b41452Q4156L2513o2894p9921L079J02205J27056P0143R738J7660O4268
35981A26551N2163m4924j34735j29218n1958K4293Q2188J35282J55589J06749
35971C21980J5026o2617j08411j23793r0185j9459J2689l1833p2202k3398O0060
35960a22143O4348m080m2262k4940k2757n3502m5160L5961J27743J61354J22948
$$ y = [-158148, -102659, -72696, -66673, -73416, -109954, -164076, -151477, -7273, 202776, 333846, 320909, 229180, 147530, 90405, 21713, -73672, -177983, -275644, -361070, -410789, -381961, -265252, -125340, -49576, -47266, -40528, 17853, 59311, -15322, -189477, -334257, -357846, -294727, -238297, -237123, -271154, -283114, -219410, -86203, 21773, -191, -136984, -251378, -241452, -157296, -124783, -187677, -267598, -264519, -162314, -35258, 34885, 44623, 62283, 126551, 178714, 133790, -945, -130163, -182121, -157828, -75640, 59642, 215231, 321980, 337006, 274389, 165978, 42185, -48000, -67459, -54770, -86603, -158805, -182203, -122143, -57795, -61875, -104137, -129077, -151834, -205336, -250496, -214535, -86792, 74562, 197510]
35949A97510L0481o2475o2959N0058J34929M3640j44195k00909p3153M9826L1881
35938e366k8040L254P6252P2387J1168m289K6396J1978o5565j16969p4745K3152
35926g0387Q1144L5375q7300j72833j21897K5218J20515R4368L5586L8130N5157
35915C3076p103j15307j41956n3010L9966L0475n3683j01029n2137M6320J06141
35904b68247R2944N1712M4411P9047J09641Q8160L860j00450j36560m8442Q2171
35893a753Q1092r3247k45960j81044K3172J25417O7321J9631Q1490J45518J22590
35882A44227R3313J22145J03890m8983k10322k10572j01687o6608j28259j34741
35872d37597j1854J37101J89568J26417q376j45956j84223o7669J00227J38449
$$ y = [197510, 227991, 165516, 102557, 152615, 287544, 331184, 186989, -13920, -87073, -37247, -5366, -33406, -30152, 46100, 118487, 129655, 125366, 151762, 163740, 98175, -18794, -93539, -70387, 10757, 46132, -41168, -214001, -335898, -310680, -190165, -95797, -60211, -22081, 33076, 25973, -89334, -231290, -284300, -244334, -213859, -267542, -368571, -420708, -374388, -268247, -175303, -123591, -79180, -133, 109508, 197668, 201528, 101078, -35482, -83924, -1753, 79339, -13908, -259868, -440912, -417740, -292323, -225002, -205371, -123881, 21637, 144227, 237540, 359685, 463575, 414592, 204270, -6302, -107989, -174597, -302856, -437597, -449451, -312350, -122782, 3635, -4741, -150697, -334920, -402589, -302362, -163913]
35862a63913J8499q7656l5346J06847J63389Q1564k2124k6993M3734O4443k5199
35851A17245j36344j44482n7316N36k7296n0415J7894J19489J39029O8412p118
35840C9634m1932n5254n5325l4487k3025n6401r7595p9032j6363Q687j8577k1581
35828d51251L9923J02167R1533K1404m2295o4226n4776l6884k5301j7704N875
35817d31535N5655J04579J14449Q8212O8012P9330R9587Q4693J7166o4466q5494
35806A30188j4425P4589O8533l8166j24164j00160k0567J4387P73K071L0410M2027
35794F5496K3011L036j444R3k718k4891p7493j18157p3217M0313R7353M2788o956
35781c2786N6002J44806J12251p011n8891k5232k9014r8469j18536m1272L2345
$$ y = [-163913, -145414, -233070, -268416, -161569, 1820, 83384, 61260, 34267, 78001, 142444, 117245, -19099, -163581, -220897, -220361, -247657, -298072, -280178, -160689, -21660, 46752, 39634, -2298, -57552, -112877, -147364, -170389, -226790, -324385, -403417, -419780, -411093, -429670, -451251, -411328, -309161, -217628, -196224, -238519, -302745, -357521, -394405, -419706, -437410, -431535, -375880, -271301, -156852, -68640, -628, 78702, 178289, 262982, 280148, 215682, 130188, 115763, 190352, 258885, 220719, 96555, -3605, -24172, -9785, -9012, -6941, 23469, 65496, 88507, 91543, 90099, 90192, 87474, 62583, -14910, -133067, -206284, -165971, -68618, -25830, -32786, 23216, 168022, 280273, 273262, 214371, 189139, 160125, 61656, -56880, -98152, -65807]
35770f5807K6160j1995l3414o1360q8222m8201M5785Q3986M5229M6893J26598
35759F5652J38884n862j47763q7647J09962J98650Q2993q8412j43947p0707K5722
35748G7525M2935m1323j45849j51832m2226O2861O1731K5k5472j6894k9494m0984
35736b48997J0468R6981J32317J07911Q1258N5882K030k4902N9244J84007J61564
35725F17763m2619k25980k13256p2824K7480N7095Q3239R0507R047j12529j32576
35714H5347l3699L2344l1414j26318j23524o3208o8744j27207j00426M9998J84861
35703c21990J77801P7341J1713J2461J6569q540l3084l5578k6825j1710R974J6236
35691a15632l948q726L8756R0855P2017j347m5876m3920m6877m7782K3960J52038
$$ y = [-65807, -39647, -51642, -85056, -146416, -234638, -282839, -237054, -153068, -107839, -60946, 65652, 204536, 198674, 50911, -36736, 73226, 271876, 354869, 266457, 122510, 51803, 77525, 120460, 79137, -66712, -218544, -260770, -197909, -136178, -136153, -161625, -178519, -208013, -248997, -238529, -141548, -9231, 98680, 179938, 235820, 237850, 212948, 272192, 456199, 617763, 575144, 349164, 135908, 63084, 90564, 147659, 230898, 321405, 330452, 217923, 85347, 51648, 83992, 52578, -73740, -197264, -260472, -329216, -456423, -556849, -506851, -321990, -144189, -66848, -55135, -42674, -26105, -34645, -67729, -103307, -130132, -141842, -131868, -115632, -119580, -128306, -89550, 1305, 73322, 71975, 26099, -17821, -64698, -112480, -88520, 63518]
35679F3518K06210J25690J6249r307J7362J3120j3582j7277k5327p3899j04544
35668A98213n1089K7964L6958J2152N2069J12823M8874j33223k38442j53700k449
35657h9850M6193q561o6206q9639r0851m2682O6516J44340Q9450m4822r7022r375
35645a92509J05586J23164M3087n6002j17946j23094o3687L8214J18196J20812
35635d179N4547k4564o6581n1974O919O3915O5384Q307m9270o2096n2903n7270
35623a69765m9152J4750R4595R3718k296r3389j05726q6248r9981j08899m5389
35612e57782M4768N3002p644L847J40716K58936K01030J1690j25629j23102n6422
35601a56590j1230K6580Q9553J28021P3326l5620p8967j8600M3315R155p5314
$$ y = [63518, 269728, 395418, 411667, 402360, 419722, 432842, 419260, 401983, 376656, 302757, 198213, 147124, 175088, 212046, 224198, 276267, 389090, 437964, 304741, 66299, -87401, -89850, -43657, -52218, -118424, -208063, -298914, -341596, -275080, -130740, -41290, -86112, -183134, -192509, -86923, 36241, 79328, 23326, -94620, -217714, -281401, -243187, -124991, -4179, 50368, 25804, -40777, -92751, -85832, -21917, 43467, 51774, 2504, -59592, -112495, -169765, -218917, -204167, -109572, -15854, -18150, -111539, -217265, -303513, -403494, -512393, -557782, -513014, -460012, -467656, -463809, -323093, -64157, 136873, 148563, 22934, -100168, -156590, -167820, -141240, -51687, 76334, 149660, 114040, 35073, 16473, 59788, 68943, -6371]
35590f371r8951n7476m2511o6408k8318R6393J60723M5835j37861j86073p8870
35579c99888K6940N0779O2977J02236R9532L5499O627N3039P1091k932o6841l4144
35567D915k567q1087j67348r7435N8572P7277o0439j22563J9446J95950J95656
35556B0377N6539k5692K4637J05736J05733J9095q6548j45057j36098r4566o7473
35545b23317n0597j671P5942J18649R4464N1126L9085M2081K5186J010N55J9021
35533A91534L5954N2894O8575N4336L18m8672n2553m0101o0786r8307r1446k9492
35521a7746K9390L6224J975l4153m8325l6609r556N895j4190n3260n3876K3660
35509a70571J42463K04589J40680j4861j51593j88899j34737l7903O9771J49664
$$ y = [-6371, -105322, -162798, -205309, -271717, -300035, -203642, -42919, 2916, -134945, -321018, -399888, -372948, -322169, -259192, -156956, -57424, -21925, -15298, 37741, 108832, 105900, 39059, 4915, 2348, -78739, -246087, -343522, -284950, -207673, -268112, -390675, -371229, -175279, 20377, 76916, 51224, 75861, 181597, 287330, 306425, 219877, 74820, -61278, -155844, -223317, -273914, -275585, -199643, -80994, 13470, 64596, 103681, 145762, 170948, 171958, 172513, 191534, 227488, 280382, 348957, 403293, 403611, 354939, 302386, 262285, 201499, 103192, 11746, -17746, 11644, 47868, 49843, 15690, -32635, -69244, -78800, -72905, -87095, -140355, -194231, -170571, -28108, 176481, 317161, 302300, 150707, -38192, -172929, -210832, -141061, 8603]
35499H603J30940r394j62823j82076o7261L4011L5978J8522O6537J14180N4792
35488D2009o6534j01936j8014O4586O1478L5496O7611J11572O1656p7957j77315
35477B652j40354k3481L6970p748o5384k9391P7015J29978O7252m0794r6513q3301
35465a73099l2933M0867J09100R5521k2848j27356q6929M4640R0180J0621m1043
35454i3279L2535J22642J00654K2957K1099Q1249Q2947N075n8084o5484o8936
35443A83375q3519n9679o561p356p0611r4924l9075k222n5657j12519p0239J5788
35431d03199K5866l0492n0928k0337j0081k1263K0884J08777J34644O8324K0821
35420a56984O7749J21437O2627q1756j78753j52236l1461J11954J98447J57230
$$ y = [8603, 139543, 130149, -32674, -214750, -282011, -248000, -212022, -193500, -126963, -12783, 42009, -24525, -126461, -144475, -79889, -18411, 17085, 84696, 196268, 257924, 179967, 2652, -137702, -161183, -124213, -131961, -197345, -226736, -149721, -19743, 47509, 6715, -89798, -173099, -206032, -165165, -56065, 39456, 16608, -110748, -197677, -153037, -62857, -52236, -93279, -60744, 61898, 162552, 185509, 206608, 287857, 370804, 375879, 317795, 252311, 183375, 99856, 40177, 33616, 26260, -44351, -139275, -178350, -180572, -236229, -348748, -418987, -403199, -377333, -407825, -458753, -479090, -489171, -510434, -489550, -380773, -246129, -177805, -156984, -89235, 32202, 94829, 13073, -165680, -317916, -349377, -237423, -38976, 118254]
35410A18254J508j29843r5265P3183J86239J15375n7241j42719o8372M9868N9447
35399A10434m7101j41159j31091o0880j3258J1935N2808P5968J8864p9330j06549
35388c09359m4110J4180K8604O5540J36703J33354J2337q6732l7415O9872O8660
35377E1634k6717p4090m9952n0904p4081l123J58457K35574J38335P289J007O9686
35365C83115N9950m9675j44551j48781q8740j2043N4500P5811K4908o1356j03110
35354i972o6063Q452O2123P2814M9728J0956k2875l2347j1141K4447M0575J1656
35342A38353m9235r8662j14594j17503j18034p9442K0558J19547J27467M2754
35332a28791n1562r7277r7664n8148J9940Q2503N9369j5971k0348Q2763J72262
$$ y = [118254, 119762, -10081, -105346, -32163, 154076, 269451, 212210, 69491, 1119, 50987, 110434, 63333, -77826, -208917, -269797, -283055, -271120, -218312, -142344, -123480, -202810, -309359, -353469, -339289, -310685, -245145, -108442, 24912, 37249, -49483, -86898, -17026, 51634, 24917, -49173, -99125, -150029, -224110, -227233, -68776, 166798, 305133, 312422, 313429, 383115, 443065, 393390, 248839, 100058, 11318, -725, 53775, 129586, 154494, 93138, -9972, -76035, -67583, -5460, 67354, 117082, 128038, 105163, 72816, 61675, 86122, 126697, 138353, 89118, -9544, -124138, -241641, -359675, -439117, -418559, -299012, -171545, -128791, -180353, -277630, -375294, -433442, -413502, -330999, -271630, -287601, -307949, -225186, -52924]
$$ [...]
##END NTUPLES=NMR SPECTRUM
##END=
