##TITLE=31Pdec_DE-124W_EA2
, 24 sc
 30.1.2026
##JCAMPDX= 6.0         $$ Bruker NMR JCAMP-DX V2.0
##DATA TYPE= NMR SPECTRUM
##DATA CLASS= NTUPLES
##ORIGIN= UXNMR, Bruker Analytische Messtechnik GmbH
##OWNER= root
$$ XWIN-NMR		Version 3.5
$$ Fri Jan 30 15:20:11 2026 Russian Standard Time (UT+4h)  she@DPX200
##.OBSERVE FREQUENCY= 81.013821
##.OBSERVE NUCLEUS= ^31P
##.ACQUISITION MODE= SIMULTANEOUS
##.ACQUISITION SCHEME= undefined
##.AVERAGES= 24
##.DIGITISER RES= 17
##SPECTROMETER/DATA SYSTEM= spect
##.PULSE SEQUENCE= zgpg30
##.SOLVENT NAME= D2O
##.SHIFT REFERENCE= (INTERNAL, D2O, 0, 198.062)
##AUDIT TRAIL= $$ (NUMBER, WHEN, WHO, WHERE, WHAT)
$$ ##TITLE= Audit trail, XWIN-NMR		Version 3.5
$$ ##JCAMPDX= 5.01
$$ ##ORIGIN= Bruker BioSpin GmbH
$$ ##OWNER= she
$$ F:/spectra/data/she/nmr/P31/2/pdata/1/auditp.txt
$$ ##AUDIT TRAIL=  $$ (NUMBER, WHEN, WHO, WHERE, WHAT)
(   1,<2026-01-30 15:18:39.32 +0400>,<she>,<DPX200>,
      <created by zg, POWCHK disabled, PULCHK disabled
       configuration hash MD5:
       00 E9 B6 7A A2 85 ED C7 34 08 36 98 17 FE 4E 26
       data hash MD5: 32K
       99 9C 5E 95 90 AF 10 17 86 96 70 89 A5 70 45 16>)
(   2,<2026-01-30 15:19:00.96 +0400>,<she>,<DPX200>,
      <Start of raw data processing
       efp BC_mod = 2 LB = 1.5 FT_mod = 6 PKNL = 1 PHC0 = 1339.546 PHC1 = 179.9009 SI = 64K 
       data hash MD5: 64K
       31 61 4D DB 14 BB 2B 56 6E 12 53 77 E4 5D 23 BC>)
(   3,<2026-01-30 15:19:21.18 +0400>,<she>,<DPX200>,
      <pk PHC0 = 48.4187 PHC1 = -125.2 
       data hash MD5: 64K
       69 EB 70 D4 AD 27 FB EE 8D 89 2E 91 BE 18 8B 85>)
$$ ##END=
$$ 
$$ hash MD5
$$ B2 BC 5F 0F 1F 51 2F A0 92 0F 3E 10 E7 89 5B F2
##$RELAX= 
##$RELAX= 
##$RELAX= 
##$RELAX= 
##$RELAX= 
##$RELAX= 
##$RELAX= 
##$RELAX= 
$$ Bruker specific parameters
$$ --------------------------
##$DU= <F:/spectra>
##$EXPNO= 2
##$NAME= <P31>
##$PROCNO= 1
##$TYPE= <nmr>
##$USER= <she>
##$AMP= (0..31)
100 100 100 100 100 100 100 100 100 100 100 100 100 100 100 100 100 100 
100 100 100 100 100 100 100 100 100 100 100 100 100 100 
##$AQSEQ= 0
##$AQ_mod= 1
##$AUNM= <au_zg>
##$AUTOPOS= <>
##$BF1= 81.014009
##$BF2= 200.13
##$BF3= 200.13
##$BF4= 200.13
##$BF5= 200.13
##$BF6= 200.13
##$BF7= 200.13
##$BF8= 200.13
##$BYTORDA= 1
##$CFDGTYP= 0
##$CFRGTYP= 5
##$CHEMSTR= <none>
##$CNST= (0..31)
1 1 145 1 1 1 1 1 1 1 1 1 1 1 1 1 1 1 1 1 1 1 1 1 1 1 1 1 1 1 1 1 
##$CPDPRG= <waltz16>
##$CPDPRG1= <>
##$CPDPRG2= <waltz16>
##$CPDPRG3= <>
##$CPDPRG4= <mlev>
##$CPDPRG5= <mlev>
##$CPDPRG6= <mlev>
##$CPDPRG7= <mlev>
##$CPDPRG8= <mlev>
##$CPDPRGB= <>
##$CPDPRGT= <>
##$D= (0..31)
0 1 0 0 0 0 0 0 0 0.06 0 0.03 2e-05 3e-06 0 0 0.0002 0 0 0 0 0 0 0 0 0 
0 0 0 0 0 0 
##$DATE= 1769771918
##$DBL= (0..7)
120 120 120 11 120 120 24 19 
##$DBP= (0..7)
150 150 150 150 150 150 150 150 
##$DBP07= 0
##$DBPNAM0= <>
##$DBPNAM1= <>
##$DBPNAM2= <>
##$DBPNAM3= <>
##$DBPNAM4= <>
##$DBPNAM5= <>
##$DBPNAM6= <>
##$DBPNAM7= <>
##$DBPOAL= (0..7)
0.5 0.5 0.5 0.5 0.5 0.5 0.5 0.5 
##$DBPOFFS= (0..7)
$$ [...]
##$SUBNAM2= <"">
##$SUBNAM3= <"">
##$SUBNAM4= <"">
##$SUBNAM5= <"">
##$SUBNAM6= <"">
##$SUBNAM7= <"">
##$SUBNAM8= <"">
##$SUBNAM9= <"">
##$SW= 400.765351723535
##$SWIBOX= (0..15)
0 1 3 0 0 0 0 0 0 0 0 0 0 0 0 0 
##$SW_h= 32467.5324675325
##$TD= 32768
##$TD0= 1
##$TE= 0
##$TE2= 300
##$TE3= 300
##$TEG= 300
##$TL= (0..7)
0 120 53 12 22 120 120 120 
##$TP= (0..7)
150 150 150 150 150 150 150 150 
##$TP07= 0
##$TPNAME0= <>
##$TPNAME1= <>
##$TPNAME2= <>
##$TPNAME3= <>
##$TPNAME4= <>
##$TPNAME5= <>
##$TPNAME6= <>
##$TPNAME7= <>
##$TPOAL= (0..7)
0.5 0.5 0.5 0.5 0.5 0.5 0.5 0.5 
##$TPOFFS= (0..7)
0 0 0 0 0 0 0 0 
##$TUNHIN= 0
##$TUNHOUT= 0
##$TUNXOUT= 0
##$USERA1= <user>
##$USERA2= <user>
##$USERA3= <user>
##$USERA4= <user>
##$USERA5= <user>
##$V9= 5
##$VALIST= <valist>
##$VCLIST= <CCCCCCCCCCCCCCC>
##$VD= 0
##$VDLIST= <DDDDDDDDDDDDDDD>
##$VPLIST= <PPPPPPPPPPPPPPP>
##$VTLIST= <TTTTTTTTTTTTTTT>
##$WBST= 1024
##$WBSW= 4
##$XGAIN= (0..3)
0 0 0 0 
##$XL= 0
##$YL= 0
##$YMAX_a= 36667
##$YMIN_a= -31229
##$ZGOPTNS= <>
##$ZL1= 120
##$ZL2= 120
##$ZL3= 120
##$ZL4= 120
##$ABSF1= 0
##$ABSF2= 0
##$ABSG= 0
##$ABSL= 0
##$ALPHA= 0
##$AQORDER= 0
##$ASSFAC= 0
##$ASSFACI= 0
##$ASSFACX= 0
##$ASSWID= 0
##$AUNMP= <proc_1d>
##$AZFE= 0.1
##$AZFW= 0.5
##$BCFW= 0
##$BC_mod= 2
##$BYTORDP= 0
##$COROFFS= 0
##$CY= -3
##$DATMOD= 1
##$DC= 0
##$DFILT= <>
##$DTYPP= 0
##$F1P= 0
##$F2P= 0
##$FCOR= 1
##$FTSIZE= 65536
##$FT_mod= 6
##$GAMMA= 0
##$GB= 0
##$INTBC= 1
##$INTSCL= 9.790993e-09
##$ISEN= 30
##$LB= 1.5
##$LEV0= 0
##$LPBIN= 0
##$MAXI= 10000
##$MC2= 0
##$MEAN= 0
##$ME_mod= 0
##$MI= 50
##$NCOEF= 0
##$NC_proc= -5
##$NLEV= 6
##$NOISF1= 182.463
##$NOISF2= 159.3651
##$NSP= 0
##$NTH_PI= 0
##$NZP= 0
##$OFFSET= 198.0616
##$PC= 4
##$PHC0= 1387.965
##$PHC1= 54.7009
##$PH_mod= 1
##$PKNL= yes
##$PPARMOD= 0
##$PSCAL= 0
##$PSIGN= 0
##$REVERSE= no
##$SF= 81.0140089999434
##$SI= 65536
##$SIGF1= 159.3651
##$SIGF2= -187.1042
##$SINO= 113.3802
##$SIOLD= 16384
##$SREGLST= <1H.CDCl3>
##$SSB= 0
##$STSI= 65536
##$STSR= 0
##$SW_p= 32467.5324675325
##$SYMM= 0
##$S_DEV= 0
##$TDeff= 32768
##$TDoff= 0
##$TI= <>
##$TILT= no
##$TM1= 0
##$TM2= 0
##$TOPLEV= 0
##$USERP1= <user>
##$USERP2= <user>
##$USERP3= <user>
##$USERP4= <user>
##$USERP5= <user>
##$WDW= 1
##$XDIM= 65536
##$YMAX_p= 500835059
##$YMIN_p= -10751394
$$ End of Bruker specific parameters
$$ ---------------------------------
##NTUPLES= NMR SPECTRUM
##VAR_NAME=  FREQUENCY,     SPECTRUM/REAL,   SPECTRUM/IMAG
##SYMBOL=    X,             R,               I
##VAR_TYPE=  INDEPENDENT,   DEPENDENT,       DEPENDENT
##VAR_FORM=  AFFN,          ASDF,            ASDF
##VAR_DIM=   65536,         65536,           65536
##UNITS=     HZ,            ARBITRARY UNITS, ARBITRARY UNITS
##FACTOR=    0.49542278885378, 1,            1
##FIRST=     16045.7642231865, 0,            0
##LAST=      -16421.768244346, 0,            0
##MIN=       -16421.768244346, -10751394,    0
##MAX=       16045.7642231865, 500835059,    0
$$ Real data points
##PAGE= N=1
##DATA TABLE= (X++(R..R)), XYDATA
$$ [...]
$$ plain form
37650 -435579 -511270 -656623 -659404 -591303 -665244 -821812 -808509 -610797 -469135 -486588 -535450
37639 -535450 -563123 -681031 -888875 -981616 -827629 -533457 -252553 -13484 189909 311456
37629 311456 340822 340881 330629 258779 149279 138373 288649 469014 495672 325706 66230
37618 66230 -145755 -243851 -270992 -333526 -470999 -588652 -580146 -486753 -457138 -572996 -776928
37607 -776928 -925180 -857096 -516553 -103852 30942 -180699 -329191 -6618 597612 878598
37597 878598 588489 115385 -80832 -6876 48024 -13966 -37166 104829 356948 549748
37587 549748 498095 117658 -435700 -816182 -800692 -518238 -294941 -319940 -519453 -691136
37577 -691136 -693698 -550403 -406902 -347742 -270685 -37103 280771 458936 430652 348825 307052
$$ packed form
37650d35579p5691j45353k781O8101p3941j56568J3303J97712J41662j7453m8862
37639e35450k7673j17908k07844r2741J53987K94172K80904K39069K03393J21547
37629C11456K9366N9j0252p1850j09500j0906J50276J80365K6658j69966k59476
37618F6230k11985r8096k7141o2534j37473j17653Q506R3393K9615j15858k03932
37607g76928j48252O8084L40543M12701J34794k11641j48492L22573O04230K80986
37597H78598k90109m73104j96217P3956N4900o1990k3200J41995K52119J92800
37587E49748n1653l80437n53358l80482J5490K82454K23297k4999j99513j71683
37577f91136k562J43295J43501N9160P7057K33582L17874J78165k8284q1827m1773
$$ plain form
37566 307052 216726 42726 -69557 -40169 -14951 -108977 -187176 -103153 27857 36986 24106
37555 24106 188336 445154 521193 386855 294602 380715 506090 532803 509618 521924 572018
37544 572018 661072 787530 829076 651366 377547 293979 406191 360375 -52564 -568633
37534 -568633 -810434 -749391 -592442 -414819 -181788 4674 -14250 -175696 -253457 -170930
37524 -170930 -28077 149300 425996 710668 760935 516719 209759 47593 -6063 -21454
37514 -21454 112698 494959 929176 1057576 753257 229378 -228922 -509677 -649507 -695157
37504 -695157 -658343 -565099 -493613 -527342 -643299 -677941 -488967 -154041 104031 222912
37494 222912 384664 696181 932413 782723 283797 -189498 -356245 -278305 -166815 -118120
$$ packed form
37566C07052r0326j74000j12283K9388K5218r4026p8199Q4023J31010R129j2880
37555B4106J64230K56818P6039j34338r2253Q6113J25375K6713k3185J2306N0094
37544E72018Q9054J26458M1546j77710k73819q3568J12212m5816m12939n16069
37534e68633k41801O1043J56949J77623K33031J86462j8924j61446p7761Q2527
37524a70930J42853J77377K76696K84672N0267k44216l06960j62166n3656j5391
37514b1454J34152L82261M34217J28400l04319n23879m58300k80755j39830m5650
37504f95157L6814R3244P1486l3729j15957l4642J88974L34926K58072J18881
37494B22912J61752L11517K36232j49690m98926m73295j66747P7940J11490M8695
$$ plain form
37484 -118120 -99235 -51406 64987 221994 272934 69707 -315260 -611420 -658332 -559112
37474 -559112 -458062 -332179 -124590 82892 213050 376551 691307 1009073 1072821 909418
37464 909418 801152 849454 835954 594315 260992 13755 -214766 -561669 -931443 -1094761
37454 -1094761 -1003809 -803835 -584756 -323061 -50345 119126 155888 151662 158350 134303 81891
37443 81891 90303 188630 292409 355512 433801 518742 462271 203481 -52110 -58680 123700
37432 123700 186641 -34656 -386313 -624336 -666011 -572791 -423399 -280260 -180997 -87863
37422 -87863 74145 267117 323803 169249 -27756 -42668 116367 227398 135412 -102730
37412 -102730 -347409 -534072 -676447 -798816 -898737 -929492 -824124 -594913 -380112 -296718
$$ packed form
37484a18120J8885M7829J16393J57007N0940k03227l84967k96160m6912R9220
37474e59112J01050J25883K07589K07482J30158J63501L14756L17766O3748j63403
37464I09418j08266M8302j3500k41639l33323k47237k28521l46903l69774j63318
37454a094761R0952J99974K19079K61695K72716J69471L6762m226O688k4047n2412
37443H1891Q412R8327J03779O3103P8289Q4941n6471k58790k55591o570J82380
37432A23700O2941k21297l51657k38023m1675R3220J49392J43139R9263R3134
37422h7863J62008J92972N6686j54554j97005j4912J59035J11031r1986k38142
37412a02730k44679j86663j42375j22369r9921l0755J05368K29211K14801Q3394
$$ plain form
37402 -296718 -264397 -96813 223026 488589 526702 382862 196429 18489 -159732 -301193
37392 -301193 -349123 -296209 -159395 37917 200748 190574 12778 -126875 -65326 110553
37382 110553 216272 224554 214663 156599 -58055 -394250 -656452 -706372 -582751 -426817 -394097
37371 -394097 -569580 -819749 -806036 -344757 297572 686589 752485 780540 896591 899629
37361 899629 686038 497441 551356 691529 646456 445140 328187 378734 481111 557399
37351 557399 621334 648036 584220 460305 345454 239394 137541 115726 189132 178867 -76720
37340 -76720 -428200 -539026 -288591 128702 484266 700936 766244 677191 523555 449923
37330 449923 465193 423350 244633 28515 -100318 -132305 -105924 -22276 100453 178824 141795
$$ packed form
37402b96718L2321J67584L19839K65563L8113j43840j86433j77940j78221j41461
37392c01193m7930N2914J36814J97312J62831j0174j77796j39653O1549J75879
37382A10553J05719Q282r891n8064k14654l36195k62202m9920J23621J55934L2720
37371c94097j75483k50169J3713M61279O42329L89017O5896K8055J16051L038
37361H99629k13591j88597N3915J40173m5073k01316j16953N0547J02377P6288
37351E57399O3935K6702o3816j23915j14851j06060j01853k1815P3406j0265k55587
37340g6720l51480j10826K50435M17293L55564K16670O5308q9053j53636p3632
37330D49923J5270m1843j78717k16118j28833l1987K6381Q3648J22729P8371l7029
$$ plain form
37319 141795 603 -192659 -390062 -526092 -527832 -390853 -198326 -36721 80774 208356
37309 208356 405381 646114 776189 651530 376958 275590 494413 763244 725618 410083
37299 410083 153188 126069 198065 247101 319732 435692 492824 449779 389229 342575 281656
37288 281656 324605 647183 1083499 1154012 705526 225359 233875 604422 813126 668008
37278 668008 401091 151282 -196049 -614507 -787523 -527156 -71715 222756 299816 328221
37268 328221 355863 258276 -7704 -290786 -435266 -472588 -545896 -693169 -795445 -748199
37258 -748199 -593925 -424110 -232657 14256 217370 226996 92238 41310 162082 291502
37248 291502 303352 294005 345074 320302 114476 -74676 5531 260960 390284 359904 422460
$$ packed form
37319A41795j41192j93262j97403j36030j740J36979J92527J61605J17495J27582
37309B08356J97025K40733J30075j24659k74572j01368K18823K68831l7626l15535
37299D10083k56895k7119P1996M9036P2631J15960N7132m3045o0550m6654o0919
37288B81656M2949L22578M36316P0513m48486m80167Q516L70547K08704j45118
37278F68008k66917k49809l47331m18458j73016K60367M55441K94471P7060K8405
37268C28221K7642r7587k65980k83082j44480l7322p3308j47273j02276M7246
37258g48199J54274J69815J91453K46913K03114R626j34758n0928J20772J29420
37248B91502J1850r347N1069k4772k05826j89152Q0207K55429J29324l0380O2556
$$ plain form
37237 422460 654924 791103 606104 219921 -99095 -241146 -255518 -211481 -175197 -200803
37227 -200803 -252764 -240373 -176948 -173135 -235134 -242782 -193652 -270377 -542706 -784101 -754314
37216 -754314 -529772 -371044 -359625 -355142 -255649 -115144 -13028 44855 92470 184480 392752
37205 392752 698387 900631 778268 374962 4237 -85546 37906 132875 95451 37361
37195 37361 85305 206470 272660 236934 170101 126572 59067 -78961 -207007 -190209 -27542
37184 -27542 130398 175125 163987 202134 274195 268188 130539 -78582 -280829 -464434 -641418
37173 -641418 -758108 -717753 -525175 -353456 -371400 -507391 -504506 -258834 23734 101887
37163 101887 809 -107012 -202654 -384055 -590821 -623454 -456915 -297828 -271882 -275399
$$ packed form
37237D22460K32464J36179j84999l86183l19016j42051j4372M4037L6284k5606
37227b00803n1961J2391O3425L813o1999p648M9130p6725k72329k41395K9787
37216g54314K24542J58728J1419M483R9493J40505J02116N7883M7615R2010K08272
37205C92752L05635K02244j22363m03306l70725q9783J23452R4969l7424n8090
37195C7361M7944J21165O6190l5726o6833m3529o7505j38028j28046J6798J62667
37184b7542J57940M4727j1138L8147P2061o007j37649k09121k02247j83605j76984
37173f41418j16690M0355J92578J71719j7944j35991K885K45672K82568P8153
37163A01887j01078j07821r5642j81401k06766l2633J66539J59087K5946l517
$$ plain form
37153 -275399 -214674 -166811 -187473 -175697 -83319 -63935 -230839 -435158 -488285 -461385 -539277
37142 -539277 -692169 -741846 -685064 -692697 -798018 -821740 -641835 -349911 -97553 57814
37132 57814 117562 91750 28555 -5010 11412 77842 218221 384550 390392 120382 -235454
37121 -235454 -368324 -266262 -214057 -348800 -473268 -416118 -328772 -425900 -598636 -528615
37111 -528615 -133538 304943 473613 348439 148096 63710 93547 113544 58524 -5182
37101 -5182 5323 57032 45882 -60937 -210861 -367427 -519004 -598994 -531299 -380530 -327108
37090 -327108 -442605 -601877 -666775 -638699 -570327 -455340 -296505 -172753 -136642 -136636 -134140
37079 -134140 -193234 -341264 -450150 -410885 -343463 -448135 -684922 -798469 -679412 -514092
$$ packed form
37153b75399O0725M7863k0662J1776R2378J9384j66904k04319n3127K6900p7892
37142e39277j52892m9677N6782p633j05321k3722J79905K91924K52358J55367
37132E7814N9748k5812o3195l3565J6422O6430J40379J66329N842k70010l55836
37121b35454j32870J02062N2205j34743j24468N7150Q7346r7128j72736P0021
37111e28615L95077M38481J68670j25174k00343q4386K9837J9997n5020o3706
37101e182J0505N1709j1150j06819j49924j56566j51577p9990O7695J50769N3422
37090c27108j15497j59272o4898K8076O8372J14987J58835J23752L6111OK496
37079a34140n9094j48030j08886L9265O7422j04672k36787j13547J19057J65320
$$ plain form
37069 -514092 -504602 -597258 -607203 -509821 -462353 -561698 -706133 -728307 -587901 -385572 -230681
37058 -230681 -149032 -102498 -41621 67655 214327 313407 256858 36813 -221002 -395231
37048 -395231 -500511 -621415 -757700 -821192 -762237 -603321 -358538 -28646 311565 531151
37038 531151 586993 563235 533152 468113 322397 121886 -83790 -287633 -492567 -661921
37028 -661921 -734504 -654310 -402090 -67362 149319 126672 -8354 -46077 1809 -37497 -147264
37017 -147264 -108899 87206 125184 -162746 -477689 -460577 -202351 -61874 -149443 -314399
37007 -314399 -511333 -799156 -1022363 -886950 -414798 8517 134767 115426 162325 230945
36997 230945 189868 57598 -105433 -336906 -625490 -803178 -773578 -694248 -734411 -785255
$$ packed form
37069e14092R490r2656r945R7382M7468r9345j44435k2174J40406K02329J54891
37058b30681Q1649M6534O0877J09276J46672R9080n6549k20045k57815j74229
37048c95231j05280j20904j36285o3492N8955J58916K44783L29892L40211K19586
37038E31151N5842k3758l0083o5039j45716k00511k05676k03843k04934j69354
37028f61921p2583Q0194K52220L34728K16681k2647j35026l7723M7886l9306j09767
37017a47264L8365J96105L7978k87930l14943J7112K58226J40477q7569j64956
37007c14399j96934k87823k23207J35413M72152M23315J26250j9341M6899O8620
36997B30945m1077j32270j63031k31473k88584j77688K9600P9330m0163n0844
$$ plain form
36987 -785255 -633055 -328708 -146348 -197245 -297235 -245521 -65002 97944 198841 338136
36977 338136 612023 963348 1197750 1171491 949637 711584 503092 194340 -277933 -758139
36967 -758139 -1052561 -1153891 -1175610 -1162770 -1108163 -1078042 -1144556 -1210564 -1073240 -704588 -342250
36956 -342250 -229981 -338410 -413544 -278708 -30761 90040 1312 -129343 -150366 -194656
36946 -194656 -514283 -1057906 -1429417 -1357984 -1011732 -693671 -414966 -13102 421786 545607
36936 545607 214149 -295185 -593628 -558441 -346898 -181752 -194579 -368445 -563235 -662325
36926 -662325 -708164 -806816 -918170 -889891 -716932 -594660 -642996 -733030 -692759 -556915 -483976
36915 -483976 -516878 -564161 -568086 -560473 -561918 -530355 -429699 -289715 -173741 -103062 -21372
$$ packed form
36987g85255J52200L04347J82360n0897r9990N1714J80519J62946J00897J39295
36977C38136K73887L51325K34402k6259k21854k38053k08492l08752m72273m80206
36967g58139k94422j01330k1719J2840N4607L0121o6514o6008J37324L68652L62338
36956c42250J12269j08429p5134J34836K47947J20801q8728j30655k1023m4290
36946a94656l19627n43623l71511P1433L46252L18061K78705M01864M34888J23821
36936E45607l31458n09334k98443L5187K11543J65146j2827j73866j94790r9090
36926f62325m5839r8652j11354K8279J72959J22272m8336r0034M0271J35844P2939
36915d83976l2902m7283l925P613j445L1563J00656J39984J15974P0679Q1690
$$ plain form
36904 -21372 144752 364447 486025 416035 270165 221640 227371 84069 -223686 -454090
36894 -454090 -487560 -550594 -867679 -1266713 -1391657 -1209185 -1015396 -960362 -866216 -592748
36884 -592748 -320964 -314635 -566488 -840096 -955775 -898549 -731634 -544146 -434271 -424348
36874 -424348 -420007 -331962 -183371 -21173 183432 419363 513729 315851 -32559 -221291
36864 -221291 -184193 -174650 -364039 -588796 -637643 -589262 -646662 -776821 -787998 -707764 -786379
36853 -786379 -1086636 -1352039 -1396840 -1374433 -1472780 -1550783 -1336660 -872928 -483121 -317187
36843 -317187 -186547 108656 510302 837901 1004781 996232 794167 456950 158242 9286
36833 9286 -79954 -243677 -437563 -499800 -380712 -181256 9428 196066 410727 667145
$$ packed form
36904b1372J66124K19695J21578o9990j45870m8525N731j43302l07755k30404
36894d54090l3470o3034l17085l99034j24944J82472J93789N5034R4146K73468
36884e92748K71784O329k51853k73608j15679N7226J66915J87488J09875R923
36874d24348M341Q8045J48591J62198K04605K35931R4366j97878l48410j88732
36864b21291L7098R543j89389k24757m8847M8381n7400j30159j1177Q0234p8615
36853g86379l00257k65403m4801K2407r8347p8003K14123M63732L89807J65934
36843c17187J30640K95203M01646L27599J66880q549k02065l37217k98708j48956
36833I286q9240j63723j93886o2237J19088J99456J90684J86638K14661K56418
$$ plain form
36823 667145 963682 1226641 1268558 930513 291497 -356573 -762573 -872540 -752970 -488139
36813 -488139 -186574 29476 111729 97952 8783 -172936 -382921 -460114 -343355 -188337
36803 -188337 -174775 -265557 -283441 -181339 -92347 -114044 -181408 -190739 -136315 -65898 12589
36792 12589 112388 217222 311035 406814 486986 471585 326050 160082 121063 199825 240371
36781 240371 152558 11669 -93758 -207907 -407213 -613211 -622530 -332505 134147 536141
36771 536141 689459 554152 246334 -3954 198 238714 476659 510509 377746 259241
36761 259241 210263 85460 -251454 -713945 -1028974 -963480 -510609 106129 597493 819544
36751 819544 856496 887497 975168 1022194 938677 786981 708719 739630 760042 638671 391408
$$ packed form
36823F67145K96537K62959M1917l38045o39016o48070m06000j09967J19570K64831
36813d88139L01565K16050Q2253j3777q9169j81719k09985p7193J16759J55018
36803a88337J3562r0782j7884J02102Q8992k1697o7364r331N4424P0417P8487
36792A2589R9799J04834R3813R5779Q0172j5401j45535j65968l9019P8762M0546
36781B40371q7813j40889j05427j14149j99306k05998r319K90025M66652M01994
36771E36141J53318j35307l07818k50288M152K38516K37945L3850j32763j18505
36761B59241m8978j24803l36914m62491l15029O5494M52871O16738M91364K22051
36751H19544L6952L1001Q7671M7026q3517j51696p8262L0911K0412j21371k47263
$$ plain form
36740 391408 181630 170489 362555 590324 666370 571288 479114 571474 835240 1073014
36730 1073014 1108973 953935 773726 737459 896772 1152127 1308847 1228627 985890 830540
36720 830540 920408 1121019 1163525 984447 787269 750945 825276 890660 970749 1135369 1295392
36709 1295392 1291939 1154192 1068449 1085107 1062753 949194 899470 1005347 1104794 1017621 806532
36698 806532 620513 429562 150345 -75924 -21860 235408 354195 210542 78050 221065
36688 221065 531110 709702 638230 414966 166129 -19265 -70445 -6623 36843 -30366
36678 -30366 -137565 -189297 -209273 -234467 -187885 -6921 208117 334015 402862 459725 372206
36667 372206 36774 -314158 -324982 -30664 159782 53140 -64060 126599 547801 918813
$$ packed form
36740C91408k09778j1141J92066K27769P6046r5082r2174R2360K63766K37774
36730A073014L5959j55038j80209l6267J59313K55355J56720q0220k42737j55350
36720H30540Q9868K00611M2506j79078j97178l6324P4331O5384Q0089J64620J60023
36709A295392l453j37747q5743J6658k2354j13559m9724J05877R9447q7173k11089
36698H06532j86019j90951k79217k26269N4064K57268J18787j43653j32492J43015
36688B21065L10045J78592p1472k23264k48837j85394n1180O3822M3466o7209
36678c0366j07199n1732j9976k5194M6582J80964K15038J25898O8847N6863q7519
36667C72206l35432l50932j0824K94318J90446j06642j17200J90659M21202L71012
$$ plain form
36657 918813 1120535 1149227 926428 436764 -76175 -329038 -344769 -339347 -336905 -174112 133817
36646 133817 324758 249850 62122 -43595 -75666 -131478 -225805 -354752 -567650 -835424
36636 -835424 -986645 -931236 -832678 -881255 -981855 -871092 -515319 -183239 -84212 -112490
36626 -112490 -40239 166669 350088 408266 408061 440785 467412 372430 141529 -82531 -152415
36615 -152415 -92470 -65973 -159093 -260775 -211765 -36991 54251 -80709 -331030 -451550
36605 -451550 -348567 -188566 -200007 -402122 -580112 -533543 -297597 -77255 -1594 -24153
36595 -24153 -72083 -196891 -496571 -922605 -1253731 -1290469 -1041545 -700665 -462558 -375463
36585 -375463 -349359 -272060 -106184 99102 247553 246579 84435 -96079 -63159 265728 671607
$$ packed form
36657I18813K01722K8692k22799m89664n12939k52863j5731N422K442J62793L07929
36646A33817J90941p4908j87728j05717l2071n5812r4327j28947k12898k67774
36636h35424j51221N5409R8558m8577j00600J10763L55773L32080R9027k8278
36626a12490P2251K06908J83419N8178k05L2724K6627r4982k30901k24060o9884
36615a52415N9945K6497r3120j01682M9010J74774R1242j34960k50321j20520
36605d51550J02983J60001j1441k02115j77990M6569K35946K20342P5661k2559
36595b4153m7930j24808k99680m26034l31126l6738K48924L40880K38107Q7095
36585c75463K6104P7299J65876K05286J48451r74j62144j80514L2920L28887M05879
$$ plain form
36574 671607 834044 694002 496918 449338 490230 486689 482117 569770 636080 466502 82899
36563 82899 -245567 -350902 -323823 -285082 -220718 -138094 -167080 -341281 -447250 -288919 16575
36552 16575 209488 253996 303284 370114 316572 184541 237866 555750 829888 753436 439631
36541 439631 240645 265796 318851 267895 223071 294995 389072 364979 266274 243458 311768
36530 311768 327914 203638 25191 -78885 -109855 -173973 -316668 -447931 -451870 -336020
36520 -336020 -231502 -239513 -309563 -299783 -143142 87521 278987 386954 421674 385893 292624
36509 292624 210229 206085 250041 256468 226387 245167 307164 263829 29800 -269394 -480738
36498 -480738 -659158 -940642 -1235467 -1282225 -1039052 -781783 -697678 -595377 -213132 332659
$$ packed form
36574F71607J62437j40042j97084m7580M0892l541m572Q7653O6310j69578l83603
36563H2899l28466j05335K7079L8741O4364Q2624k8986j74201j05969J58331L05494
36552A6575J92913M4508M9288O6830n3542j32031N3325L17884K74138p6452l13805
36541D39631j98986K5151N3055n0956m4824P1924R4077k4093r8705k2816O8310
36530C11768J6146j24276j78447j04076l0970o4118j42695j31263l939J15850
36520c36020J04518q011p0050R780J56641K30663J91466J07967L4720l5781r3269
36509B92624q2395m144M3956O427l0081J8780O1997m3335k34029k99194k11344
36498d80738j78420k81484k94825m6758K43173K57269Q4105J02301L82245N45791
$$ plain form
36488 332659 647230 550922 256303 60172 47174 111283 100713 -77235 -332792 -367023
36478 -367023 35110 648134 965565 809646 562768 644358 964540 1111879 925053 612808
36468 612808 388300 264383 213021 274539 441541 618773 760727 892270 947163 765619
36458 765619 341649 -76201 -232385 -97605 214293 604271 943685 1029961 785689 437794
36448 437794 318842 504689 782786 948146 977333 917774 778369 588952 440182 377577
36438 377577 324757 182129 -33510 -190988 -166223 47218 317719 474272 474152 456808 563870
36427 563870 725918 731136 513322 252494 146533 201269 320073 478155 671505 769722
36417 769722 602568 215648 -103106 -130307 32866 80659 -153584 -535215 -790698 -768586
$$ packed form
36488C32659L14571r6308k94619j96131j2998O4109j0570j77948k55557l4231
36478c67023M02133O13024L17431j55919k46878Q1590L20182J47339j86826l12245
36468F12808k24508j23917n1362O1518J67002J77232J41954J31543N4893j81544
36458G65619m23970m17850j56184J34780L11898L89978L39414Q6276k44272l47895
36448D37794j18952J85847K78097J65360K9187n9559j39405j89417j48770o2605
36438C77577n2820j42628k15639j57478K4765K13441K70501J56553j20j7344J07062
36427E63870J62048N218k17814k60828j05961N4736J18804J58082J93350R8217
36417G69722j67154l86920l18754k7201J63173M7793k34243l81631k55483K2112
$$ plain form
36407 -768586 -528644 -232124 -3134 113059 129093 105349 127258 228492 341324 378018
36397 378018 352300 346353 359226 297054 157800 109054 277680 538633 641233 510390 295100
36386 295100 131700 -1576 -168351 -342267 -454601 -482739 -432132 -311247 -184706 -167939
36376 -167939 -288911 -423524 -455245 -431654 -450407 -447959 -267908 46578 202650 6776
36366 6776 -345945 -480994 -306974 -105808 -117699 -191040 3752 472866 805537 647642
36356 647642 132923 -277574 -307458 -80638 126178 171943 68121 -122079 -300344 -356672
36346 -356672 -289212 -236135 -289354 -342404 -249314 -95285 -153834 -542551 -1041523 -1317942 -1253112
36335 -1253112 -983013 -683434 -415620 -177470 -11887 6268 -114683 -230480 -167698 103476
$$ packed form
36407g68586K39942K96520K28990J16193J6034k3744K1909J01234J12832L6694
36397C78018k5718n947J2873o2172j39254m8746J68626K60953J02600j30843k15290
36386B95100j63400j33276j66775j73916j12334k8138N0607J20885J26541J6767
36376a67939j20972j34613l1721K3591j8753K448J80051L14486J56072j95874
36366F776l52721j35049J74020K01166j1891p3341J94792M69114L32671j57895
36356F47642n14719m10497k9884K26820K06816M5765j03822j90200j78265n6328
36346c56672O7460N3077n3219n3050R3090J54029n8549l88717m98972k76419O4830
36335a253112K70099K99579K67814K38150J65583J8155j20951j15797O2782K71174
$$ plain form
36325 103476 417662 552136 422656 150261 -55773 -84762 -6027 37171 7032 3812 104235
36314 104235 237799 290530 266245 234477 169228 1180 -175807 -148635 95119 272986
36304 272986 155164 -136938 -316498 -291740 -190770 -137400 -170639 -297799 -452278 -472653
36294 -472653 -297724 -106333 -82609 -136854 -79866 22897 -46495 -262852 -391122 -404419
36284 -404419 -503757 -664595 -564817 -136344 178578 -10076 -497541 -793316 -758546 -639480
36274 -639480 -634710 -733682 -869948 -949939 -820956 -478080 -210395 -265041 -456643 -418015 -169916
36263 -169916 -91766 -334464 -627289 -733154 -745747 -800534 -803792 -649459 -469774 -446827 -527456
36252 -527456 -525071 -401463 -277766 -238730 -267144 -321621 -372404 -400464 -428106 -498829 -593093
$$ packed form
36325A03476L14186J34474j29480k72395k06034k8989P8735M3198l0139l220J00423
36314A04235J33564N2731k4285l1768o5249j68048j76987K7172K43754J77867
36304B72986j17822k92102j79560K4758J00970N3370l3239j27160j54479k0375
36294d72653J74929J91391K3724n4245N6988J02763o9392k16357j28270j3297
36284d04419r9338j60838R9778M28473L14922j88654m87465k95775L4770J19066
36274f39480M770r8972j36266p9991J28983L42876K67685n4646j91602L8628K48099
36263a69916P8150k42698k92825j05865j2593n4787l258J54333J79685K2947q0629
36252e27456K385J23608J23697L9036k8414n4477n0783k8060k7642p0723r4264
$$ plain form
36241 -593093 -646889 -672776 -735498 -774138 -617348 -262388 25596 20829 -194216 -406332 -581188
36230 -581188 -809777 -1038096 -1066066 -808344 -391359 17606 340338 538217 577713 502816
36220 502816 441917 464675 474276 307410 -55815 -420186 -552262 -435163 -294702 -321973
36210 -321973 -426495 -370174 -115356 113697 145132 76526 91735 191486 229548 137597 -6146
36199 -6146 -93311 -83511 -19382 -2215 -108286 -290355 -427519 -496355 -582885 -684790 -656073
36188 -656073 -448315 -257265 -279538 -437201 -507541 -433111 -325928 -238142 -126050 -8057
36178 -8057 34217 14964 41762 143768 237659 259472 199252 32485 -221341 -390127 -290474
36167 -290474 -554 191628 156902 62907 80340 137524 82259 -64242 -164738 -184016 -205301
$$ packed form
36241e93093n3796k5887o2722l8640J56790L54960K87984m767k15045k12116j74856
36230e81188k28589k28319k7970K57722M16985M08965L22732J97879L9496p4897
36220E02816o0899K2758R601j66866l63225l64371j32076J17099J40461k7271
36210c21973j04522N6321K54818K29053L1435o8606J5209R9751L8062r1951j43743
36199f146q7165R800O4129J7167j06071j82069j37164o8836q6530j01905K8717
36188f56073K07758J91050k2273j57663p0340P4430J07183Q7786J12092J17993
36178h057M2274j9253K6798J02006R3891K1813o0220j66767k53826j68786R9653
36167b90474K89920J92182l4726r3995J7433N7184n5265j46501j00496j9278k1285
$$ plain form
36156 -205301 -274112 -343064 -353018 -285133 -152109 -8903 46588 -47270 -236716 -398326 -459049
36145 -459049 -436376 -376643 -307403 -257239 -263203 -303997 -248792 37314 483223 772281 620002
36134 620002 90145 -453850 -711195 -663612 -458007 -237613 -127415 -200828 -357117 -386489
36124 -386489 -264392 -211822 -336027 -421772 -285914 -134164 -266445 -565909 -627585 -338087
36114 -338087 20446 239296 403626 587891 665180 539490 302666 56342 -177388 -298015
36104 -298015 -173196 53340 22136 -306476 -487810 -190622 310291 501132 269386 -88357
36094 -88357 -305407 -312428 -125762 143581 279866 214176 175347 356905 578303 549353 327704
36083 327704 192705 177979 94590 -37293 26288 306634 510213 479682 419689 541585
$$ packed form
36156b05301o8811o8952r954O7885J33024J43206N5491r3858j89446j61610o0723
36145d59049K2673N9733O9240N0164n964m0794N5205K86106M45909K89058j52279
36134F20002n29857n43995k57345M7583K05605K20394J10198p3413j56289k9372
36124c86489J22097N2570j24205q5745J35858J51750j32281k99464o1676K89498
36114c38087L58533K18850J64330J84265P7289j25690k36824k46324k33730j20627
36104b98015J24819K26536l1204l28612j81334K97188N00913J90841k31746l57743
36094h8357k17050p021J86666K69343J36285o5690l8829J81558K21398k8950k21649
36083C27704j34999j4726q3389j31883O3581K80346K03579l0531n9993J21896
$$ plain form
36073 541585 751631 844290 789514 677788 551637 422342 308584 157820 -120385 -453489
36063 -453489 -607783 -503099 -361285 -399953 -517245 -448237 -149186 136602 172759 -17064
36053 -17064 -182793 -85973 264659 592459 620689 367549 95362 -27084 -82027 -197284
36043 -197284 -339836 -406656 -404144 -414840 -438602 -367389 -114537 267617 592114 677388 530129
36032 530129 356182 321127 357637 314357 209110 152356 85274 -147349 -454440 -515261 -234964
36021 -234964 72600 98807 -89330 -257453 -363995 -493393 -597643 -551188 -369224 -161042
36011 -161042 51609 270463 357674 158629 -245025 -593884 -738483 -711653 -570446 -354618
36001 -354618 -166571 -95939 -73897 17855 108216 3808 -294856 -539759 -538890 -349542 -140087
$$ packed form
36073E41585K10046R2659n4776j11726j26151j29295j13758j50764k78205l33104
36063d53489j54294J04684J41814l8668j17292O9008K99051K85788L6157j89823
36053a7064j65729R6820L50632L27800K8230k53140k72187j22446n4943j15257
36043a97284j42552o6820K512j0696k3762P1213K52852L82154L24497Q5274j47259
36032E30129j73947l5055L6510m3280j05247n6754o7082k32623l07091o0821K80297
36021b34964L07564K6207j88137j68123j06542j29398j04250M6455J81964K08182
36011a61042K12651K18854Q7211j99045m03654l48859j44599K6830J41207K15828
36001c54618J88047P0632K2042R1752R0361j04408k98664k44903Q69J89348K09455
$$ plain form
35990 -140087 -29792 -99802 -372494 -701736 -848054 -756905 -628286 -632177 -702630 -711205 -688819
35979 -688819 -728025 -781662 -731445 -594776 -497983 -466769 -395664 -238859 -101249 -95165 -198964
35968 -198964 -312323 -391112 -470095 -581605 -700627 -766960 -737332 -621365 -486731 -423978
35958 -423978 -479515 -611727 -727756 -771901 -760174 -723230 -659389 -581975 -568359 -685575 -881006
35947 -881006 -1025833 -1060377 -1007978 -861096 -597098 -335000 -295174 -488863 -602474 -368485
35937 -368485 41688 188759 -111928 -619877 -996768 -1109785 -999149 -756916 -529682 -485825
35927 -485825 -651645 -846270 -858426 -644205 -318890 -23791 160439 231841 237762 198989
35917 198989 88118 -53513 -47128 220388 549873 589335 291712 26000 134929 539720
$$ packed form
35990a40087J10295p0010k72692l29242j46318R1149J28619l891p0453q575K2386
35979f88819l9206n3637N0217J36669R6793L1214P1105J56805J37610O084j03799
35968a98964j13359p8789p8983j11510j19022o6333K9628J15967J34634O2753
35958d23978n5537j32212j16029m4145J1727L6944O3841P7414J3616j17216j95431
35947h81006j44827l4544N2399J46882K63998K62098L9826j93689j13611K33989
35937c68485M10173J47071l00687n07949l76891j13017J10636K42233K27234M3857
35927d85825j65820j94625j2156K14221L25315K95099J84230P1402N921l8773
35917A98989j10871j41631O385K67516L29485L9462k97623k65712J08929M04791
$$ plain form
35907 539720 899452 1020987 972537 908421 941811 1121677 1391814 1612446 1723998 1826048
35897 1826048 1997158 2132358 2096370 1951621 1866411 1860129 1832154 1812211 1958892 2266542
35887 2266542 2475279 2380825 2098904 1901016 1874155 1872649 1777527 1680606 1764533 2055830 2372151
35876 2372151 2538270 2597241 2720328 2917920 2972687 2738769 2401651 2299744 2516523 2775261
35866 2775261 2751739 2407430 2002252 1838009 1986821 2225319 2253781 2010638 1717020 1582018
35856 1582018 1578311 1584681 1589564 1584247 1407168 969117 562790 619386 1111716 1499267 1373813
35845 1373813 892006 431975 101503 -186452 -380440 -345057 -151813 -35558 -78869 -152801
35835 -152801 -161343 -158156 -218972 -352849 -529813 -657477 -572993 -232535 124959 209385 75138
$$ packed form
35907E39720L59732J21535m8450o4116L3390J79866K70137K20632J11552J02050
35897A826048J71110J35200l5988j44749q5210o282k7975j9943J46681L07650
35887B266542K08737r4454k81921j97888k6861j506r5122r6921Q3927K91297L16321
35876B372151J66119N8971J23087J97592N4767k33918l37118j01907K16779K58738
35866B775261k3522l44309m05178j64243J48812K38498K8462k43143k93618j35002
35856A582018l707O370M883n317j77079m38051m06327N6596M92330L87551j25454
35845A373813m81807m60031l30472k87955j93988L5383J93244J16255m3311p3932
35835a52801q542L187o0816j33877j76964j27664Q4484L40458L57494Q4426j34247
$$ plain form
35824 75138 65319 321552 581439 567645 367805 258269 299100 312564 203240 96751 129622
35813 129622 242564 264256 142140 5124 -16840 24523 -34723 -229943 -401605 -415127
35803 -415127 -331801 -261865 -163593 51045 303841 455976 569687 809139 1094064 1157385
35793 1157385 1006409 983292 1196202 1223680 685475 -131036 -578839 -457055 -140136 44906
35783 44906 181669 439152 723245 822023 691539 448711 219933 98715 119369 180023
35773 180023 113094 -88373 -232918 -185609 -28962 106531 231183 408844 597679 694001
35763 694001 653060 481752 210366 -39895 -78958 131745 362832 357388 143072 -10370
35753 -10370 87217 365604 610903 679916 607972 551977 613842 720677 737370 673343 651375
$$ packed form
35824G5138r819K56233K59887j3794j99840j09536M0831J3464j09324j06489L2871
35813A29622J12942K1692j22116j37016k1964M1363n9246j95220j71662j3522
35803d15127Q3326O9936R8272K14638K52796J52135J13711K39452K84925O3321
35793A157385j50976k3117K12910K7478n38205q16511m47803J21784L16919J85042
35783D4906J36763K57483K84093R8778j30484k42828k28778j21218K0654O0654
35773A80023o6929k01467j44545M7309J56647J35493J24652J77661J88835R6322
35763F94001m0941j71308k71386k50261l9063K10703K31087n444k14316j53442
35753a0370R7587K78387K45299O9013p1944n5995O1865J06835J6693o4027k1968
$$ plain form
35742 651375 675369 613402 459725 400271 507524 583517 468258 304289 293363 378472 406778
35731 406778 424935 514548 493543 156243 -268109 -303513 112181 538303 662415 640527
35721 640527 700423 795909 848844 978869 1222136 1307411 1026346 628200 534460 786563
35711 786563 1046414 1037898 743856 285114 -128193 -225090 58404 398818 445210 300431
35701 300431 344945 623878 769483 584898 342525 340660 459771 392200 117212 -101806
35691 -101806 -97187 40112 145105 163980 151049 185069 299947 448276 542342 547534 493952
35680 493952 394275 233369 56883 -38094 -48275 -89664 -206755 -262842 -119972 153219
35670 153219 357694 383663 255923 32114 -216351 -368194 -343912 -236552 -228789 -360275
$$ packed form
35742F51375K3994o1967j53677n9454J07253P5993j15259j63969j0926Q5109K8306
35731D06778J8157Q9613k1005l37300m24352l5404M15694M26122J24112k1888
35721F40527N9896R5486N2935J30025K43267Q5275k81065l98146r3740K52103
35711G86563K59851q516k94042m58742m13307r6897K83494L40414M6392j44779
35701C00431M4514K78933J45605j84585k42373j865J19111o7571k74988k19018
35691a01806M619J37299J04993J8875j2931L4020J14878J48329R4066N192n3582
35680D93952r9677j60906j76486r4977j0181m1389j17091n6087J42870K73191
35670A53219K04475K5969j27740k23809k48465j51843K4282J07360P763j31486
$$ plain form
35660 -360275 -483495 -475626 -385030 -317485 -281700 -240119 -242642 -379918 -600187 -689503 -504563
35649 -504563 -167860 50617 26983 -120595 -221365 -225553 -145856 48521 353541 620212
35639 620212 688589 623035 651267 841984 1010442 1007692 921919 864259 727387 375661 -21072
35628 -21072 -112671 153766 421253 379763 139428 4126 26236 -6639 -201827 -397700
35618 -397700 -412280 -288541 -189835 -151061 -60412 141128 356213 448062 383250 223341 35272
35607 35272 -139681 -270300 -352494 -427556 -529461 -622129 -641218 -588564 -518470 -429372 -254733
35596 -254733 6083 234034 333415 361067 425229 503045 469759 300966 133550 96287 172777
35585 172777 277539 380745 481595 519887 415128 182351 -73306 -284026 -467732 -626912
$$ packed form
35660c60275j23220P869R0596O7545L5785M1581k523j37276k20269q9316J84940
35649e04563L36703K18477k3634j47578j00770m188P9697J94377L05020K66671
35639F20212O8377o5554K8232J90717J68458k750q5773n7660j36872l51726l96733
35628b1072r1599K66437K67487m1490k40335j35302K2110l2875j95188j95873
35618c97700j4580J23739R8706L8774R0649K01540K15085R1849o4812j59909j88069
35607C5272j74953j30619q2194p5062j01905r2668j9089N2654P0094Q9098J74639
35596b54733K60816K27951R9381K7652O4162P7816l3286j68793j67416l7263P6490
35585A72777J04762J03206J00850L8292j04759k32777k55657k10720j83706j59180
$$ plain form
35575 -626912 -672745 -516842 -218447 18948 22705 -182159 -382969 -363368 -98445 229083
35565 229083 424490 479630 525932 594768 530788 221150 -173577 -358434 -256592 -75929
35555 -75929 -311 23810 108972 193281 152990 60138 123820 372390 571541 513613 254010
35544 254010 -10681 -188111 -320339 -443059 -519333 -499105 -383599 -231050 -115850 -64882
35534 -64882 -43002 -42654 -150540 -417923 -673217 -623318 -214727 238699 395791 254113 64260
35523 64260 -17743 -39157 -77849 -133687 -185813 -224074 -223531 -192287 -212611 -309507 -323288 -83600
35511 -83600 301481 513572 395356 70176 -318729 -745574 -1106219 -1160511 -853613 -476357
35501 -476357 -278646 -113095 250880 613711 534249 13273 -411220 -370201 -121610 -100774
$$ packed form
35575f26912m5833J55903K98395K37395L757k04864k00810J9601K64923L27528
35565B29083J95407N5140M6302O8836o3980l09638l94727j84857J01842J80663
35555g5929P5618K4121Q5162Q4309m0291r2852O3682K48570J99151n7928k59603
35544B54010k64691j77430j32228j22720p6274K0228J15506J52549J15200N0968
35534f4882K1880L48j07886k67383k55294M9899M08591M53426J57092j41678j89853
35523F4260q2003k1414l8692n5838n2126l8261N43L1244k0324r6896j3781K39688
35511h3600L85081K12091j18216l25180l88905m26845l60645n4292L06898L77256
35501d76357J97711J65551L63975L62831p9462n20976m24493M1019K48591K0836
$$ plain form
35491 -100774 -305794 -424555 -371256 -332347 -348503 -222882 93716 346754 353464 278581 331334
35480 331334 386465 177100 -238817 -502444 -446479 -288795 -256482 -266826 -140809 60603
35470 60603 130690 30970 -119693 -304074 -597875 -900607 -949732 -702713 -470067 -506527
35460 -506527 -660381 -638044 -467852 -432030 -606681 -766709 -773124 -766643 -863667 -911297 -736444
35449 -736444 -464343 -367166 -497079 -683197 -820281 -924722 -929605 -687368 -244531 104382
35439 104382 153055 14798 -88109 -105298 -92087 -20667 140004 250137 131212 -149286
35429 -149286 -328174 -292719 -187476 -146180 -121974 -72923 -126663 -398320 -753285 -919546
35419 -919546 -798449 -540197 -340505 -275101 -316118 -395669 -433052 -376965 -249085 -116942
$$ packed form
35491a00774k05020j18761N3299L8909j6156J25621L16598K53038O710p4883N2753
35480C31334N5131k09365m15917k63627N5965J57684L2313j0344J26017K01412
35470F0603P0087r9720j50663j84381k93801l02732m9125K47019K32646l6460
35460e06527j53854K2337J70192L5822j74651j60028o415O481r7024m7630J74853
35449g36444K72101R7177j29913j86118j37084j04441m883K42237M42837L48913
35439A04382M8673j38257j02907j7189J3211P1420J60671J10133j18925k80498
35429a49286j78888L5455J05243M1296K4206M9051n3740k71657l54965j66261
35419i19546J21097K58252J99692O5404m1017p9551l7383N6087J27880J32143
$$ plain form
35409 -116942 -36005 -41777 -144142 -271771 -286717 -150863 -31383 -119134 -359053 -492915
35399 -492915 -387295 -191236 -117511 -178290 -222129 -164809 -88293 -118272 -255044 -339195 -193294
35388 -193294 178464 549906 681844 559868 365612 232488 121557 -56590 -297218 -506190
35378 -506190 -562340 -356702 118588 669975 994917 949980 660115 322398 6018 -289756
35368 -289756 -502903 -555955 -468081 -320933 -177083 -114286 -240425 -546842 -827698 -890135
35358 -890135 -781018 -654784 -490906 -153842 282320 506523 351543 33266 -106545 -4267
35348 -4267 74566 -150509 -656769 -1100661 -1139628 -804985 -472216 -375719 -292750 86456 594180
35337 594180 723578 334812 -143671 -336736 -381206 -535300 -666389 -494129 -135334 10261
$$ packed form
35409a16942Q0937n772j02365j27629j4946J35854J19480q7751k39919j33862
35399d92915J05620J96059P3725o0779m3839N7320P6516k9979j36772q4151J45901
35388a93294L71758L71442J31938j21976j94256j33124j10931j78147k40628k08972
35378e06190n6150K05638M75290N51387L24942m4937k89865l37717l16380k95774
35368b89756k13147n3052Q7874J47148J43850O2797j26139l06417k80856o2437
35358h90135J09117J26234J63878L37064M36162K24203j54980l18277j39811J02278
35348d267P8833k25075n06260m43892l8967L34643L32769R6497Q2969L79206N07724
35337E94180J29398l88766m78483j93065m4470j54094j31089J72260L58795J45595
$$ plain form
35327 10261 -153825 -332904 -338972 -313501 -385860 -443794 -381377 -302287 -306022 -287469 -130008
35316 -130008 71238 157815 142451 122313 79368 -45016 -163480 -123941 63134 244100
35306 244100 341696 403140 444954 399044 228049 -15786 -247646 -370796 -273504 54125
35296 54125 399660 473874 223819 -107161 -267140 -235965 -144899 -84905 -72048 -99820 -124734
35285 -124734 -63038 105357 269083 293884 159798 -66925 -328146 -545852 -572189 -330150
35275 -330150 -14085 7205 -422737 -1036186 -1394766 -1310383 -962341 -661826 -585013 -693219
35265 -693219 -802617 -724181 -426527 -89881 65267 16816 -68123 -93173 -163390 -381563
35255 -381563 -624423 -659447 -437323 -130512 102006 247825 333795 337910 254255 106928
$$ packed form
35327A0261j64086j79079o068K5471p2359n7934O2417P9090l735J8553J57461
35316a30008K01246Q6577j5364k0138m2945j24384j18464L9539J87075J80966
35306B44100R7596O1444M1814m5910j70995k43835k31860j23150R7292L27629
35296E4125L45535P4214k50055l30980j59979L1175R1066N9994J2857k7772k4914
35285a24734O1696J68395J63726K4801j34086k26723k61221k17706k6337K42039
35275c30150L16065K1290m29942o13449l58580Q4383L48042L00515P6813j08206
35265f93219j09398P8436K97654L36646J55148m8451q4939k5050p0217k18173
35255c81563k42860l5024K22124L06811K32518J45819Q5970M115q3655j47327
$$ plain form
35245 106928 -161266 -657732 -1285887 -1674994 -1557791 -1144712 -912416 -1026364 -1174989 -1024207
35235 -1024207 -643364 -356505 -301100 -300449 -137540 188303 507211 689975 754220 788035
35225 788035 819732 787750 632750 392351 186482 122658 227351 440437 649827 767834
35215 767834 817283 904471 1050750 1104257 921778 608594 436765 497453 570253 413275
35205 413275 76911 -174407 -189319 -73913 -35648 -169175 -396795 -568863 -617607 -617930 -664095
35194 -664095 -699825 -570711 -279225 -62615 -118027 -348758 -514239 -556793 -616600 -756417
35184 -756417 -854242 -800911 -656131 -553949 -567552 -710861 -949634 -1144145 -1100488 -782218
35174 -782218 -395644 -170396 -113016 -62540 70026 217006 267101 163924 -82616 -390464
$$ packed form
35245A06928k68194m96466o28155l89107J17203M13079K32296j13948j48625J50782
35235a024207L80843K86859N5405O51J62909L25843L18908J82764O4245L3815
35225G88035L1697l1982j55000k40399k05869o3824J04693K13086K09390J18007
35215G67834M9449Q7188J46279N3507j82479l13184j71829O0688P2800j56978
35205D13275l36364k51318j4912J15406L8265j33527k27620j72068m8744l23m6165
35194f64095l5730J29114K91486K16610n5412k30731j65481m2554n9807j39817
35184g56417r7825N3331J44780J02182j3603j43309k38773j94511M3657L18270
35174g82218L86574K25248N7380N0476J32566J46980N0095j03177k46540l07848
$$ plain form
35164 -390464 -631733 -758320 -882181 -1123978 -1390991 -1438956 -1192273 -877187 -757318 -832494
35154 -832494 -900990 -849940 -754253 -706902 -683082 -611009 -483690 -342509 -213203 -121594 -124449
35143 -124449 -240208 -359583 -313297 -68627 192899 249890 79359 -125477 -174941 -69305
35133 -69305 60397 149019 261460 455274 653267 711639 584769 359158 131765 -75771
35123 -75771 -262212 -370954 -321724 -94915 246425 592264 819843 842226 685029 497632
35113 497632 430688 498653 590578 594128 471906 254516 27078 -100373 -90438 -42980 -87666
35102 -87666 -218826 -323441 -366047 -429448 -549933 -642445 -648731 -632466 -635685 -567003 -375679
35091 -375679 -239905 -383326 -719867 -878893 -645172 -223708 25481 139 -119055 -178081
$$ packed form
35164c90464k41269j26587j23861k41797k67013m7965K46683L15086J19869p5176
35154h32494o8496N1050R5687M7351K3820P2073J27319J41181J29306R1609k855
35143a24449j15759j19375M6286K44670K61526N6991j70531k04836m9464J05636
35133f9305J29702Q8622J12441J93814J97993N8372j26870k25611k27393k07536
35123g5771j86441j08742M9230K26809L41340L45839K27579K2383j57197j87397
35113D97632o6944O7965R1925L550j22222k17390k27438j27451R935M7458m4686
35102h7666j31160j04615m2606o3401j20485r2512o286J6265l219O8682J91324
35091c75679J35774j43421l36541j59026K33721M21464K49189k5342j19194n9026
$$ plain form
35081 -178081 -216570 -305125 -359977 -232345 61806 311610 330172 128841 -151185 -390595
35071 -390595 -510727 -436164 -173862 107614 229926 245311 379491 708203 1053380 1258940
35061 1258940 1382624 1490908 1443866 1089311 565826 191880 95997 155064 268219 470845
35051 470845 753910 980485 1062726 1073650 1108710 1156580 1170765 1161557 1157919 1167819 1210181 1287606
35039 1287606 1310935 1179437 964006 861814 918354 956058 860151 766273 832010 965560
35029 965560 959201 812219 741445 890294 1171535 1407463 1517281 1543060 1562769 1603338 1609873
35018 1609873 1501903 1276959 1039862 914646 940706 1037420 1036745 803016 407761 132482
35008 132482 163422 326938 311919 132004 115660 388335 649893 618447 443247 454479
$$ packed form
35081a78081l8489q8555n4852J27632K94151K49804J8562k01331k80026k39410
35071c90595j20132P4563K62302K81476J22312J5385J34180L28712L45177K05560
35061A258940J23684J08284m7042l54555n23485l73946r5883N9067J13155K02626
35051D70845K83065K26575Q2241J0924L5060M7870J4185r208l638R900M2362P7425
35039A287606K3329j31498k15431j02192N6540L7704r5907r3878O5737J33550
35029I65560o359j46982p0774J48849K81241K35928J09818K5779J9709M0569O535
35018A609873j07970k24944k37097j25216K6060R6714o75k33729l95255k75279
35008A32482L0940J63516j5019j79915j6344K72675K61558l1446j75200J1232
$$ plain form
34998 454479 696183 964251 1173133 1409088 1679784 1855842 1846279 1652054 1290582 842983
34988 842983 512838 441365 510268 508366 425154 384153 378451 321142 284737 401414 561835
34977 561835 527843 352277 354784 614829 814261 705444 442182 292717 290926 352557 496516
34966 496516 732616 908595 881785 720094 572068 469176 396390 398970 460188 436905 296262
34955 296262 256633 489981 829843 998614 994231 998580 1002550 811432 402611 17133 -140178
34944 -140178 -100108 -9027 18914 -83872 -306435 -514146 -567527 -496618 -443767 -459446 -489289
34933 -489289 -521618 -572647 -542202 -278756 183106 615237 858650 949215 968653 934787 865534
34922 865534 781753 612662 283330 -50838 -67198 308715 726796 804769 570755 360591
$$ packed form
34998D54479K41704K68068K08882K35955K70696J76058r563j94225l61472m47599
34988H42983l30145p1473O8903j902q3212m1001n702n7309l6405J16677J60421
34977E61835l3992j75566K507K60045J99432j08817k63262j49465j791O1631J43959
34966D96516K36100J75979k6810j61691j48026j02892p2786K580O1218k3283j40643
34955B96262l9629K33348L39862J68771m383M349L970j91118m08821l85478j57311
34944a40178M0070R1081K7941j02786k22563k07711n3381P0909N2851j5679k9843
34933d89289l2329n1029L0445K63446M61862M32131K43413R0565J9438l3866o9253
34922H65534q3781j69091l29332l34168j6360L75913M18081P7973k34014k10164
$$ plain form
34912 360591 378051 532433 657150 708283 731307 762466 810155 867683 916011 946656 978135
34901 978135 1012100 983750 804454 469065 103249 -109113 -62632 179232 429591 535003
34891 535003 487522 383108 321475 379272 596594 889075 1038561 916966 689892 629634
34881 629634 730624 715625 470281 240386 269967 455147 552907 561964 641768 762601 736015
34870 736015 575524 526072 666548 756746 621285 457773 554133 846634 996928 851328
34860 851328 602534 490258 535548 621577 667610 624577 427628 97002 -168464 -146456
34850 -146456 133721 366345 278747 -67795 -327380 -208731 256232 765263 1029193 997987
34840 997987 849298 803950 951436 1200241 1357373 1285010 1033095 816767 821074 1024631
$$ packed form
34912C60591J7460J54382J24717N1133K3024L1159M7689N7528M8328L0645L1479
34901I78135L3965k8350j79296l35389l65816k12362M6481K41864K50359J05412
34891E35003m7481j04414o1633N7797K17322K92481J49486j21595k27074o0258
34881F29634J00990j4999k45344k29895K9581J85180R7760R057P9804J20833k6586
34870G36015j60491m9452J40476R0198j35461j63512R6360K92501J50294j45600
34860H51328k48794j12276M5290Q6029M6033m3033j96949l30626k65466K2008
34850a46456K80177K32624q7598l46542k59585J18649M64963N09031K63930l1206
34840I97987j48689m5348J47486K48805J57132p2363k51915k16328M307K03557
$$ plain form
34830 1024631 1246683 1350450 1344211 1299033 1259380 1253744 1291978 1295603 1122587 749923 369169
34819 369169 205150 279308 438314 572913 704527 876606 1060715 1171270 1110597 832492
34809 832492 430987 107149 -45425 -148580 -319646 -453498 -412194 -330211 -452855 -700266
34799 -700266 -714547 -396184 -64040 46608 113820 342950 556654 482480 233479 151115
34789 151115 297918 456312 557982 747651 1011269 1092455 880086 605774 523207 591513
34779 591513 608191 512822 440927 557254 892689 1280560 1464139 1368447 1224908 1282958
34769 1282958 1457606 1475417 1336067 1345977 1634527 1917783 1890408 1633133 1447066 1439098
34759 1439098 1466788 1405614 1291002 1215584 1206989 1224888 1243957 1336007 1618206 2043922 2326110
$$ packed form
34830A024631K22052J03767o239m5178l9653n636L8234L625j73016l72664l80754
34819C69169j64019P4158J59006J34599J31614J72079J84109J10555o0673k78105
34809H32492m01505l23838j52574j03155j71066j33852M1304Q1983j22644k47411
34799g00266j4281L18363L32144J10648O7212K29130K13704p4174k49001q2364
34789A51115J46803J58394J01670J89669K63618Q1186k12369k74312q2567O8306
34779E91513J6678r5369p1895J16327L35435L87871J83579r5692j43539N8050
34769A282958J74648J7811j39350R910K88550K83256k7375k57275j86067p968
34759A439098K7690o1174j14612p5418q595J7899J9069R2050K82199M25716K82188
$$ plain form
34748 2326110 2242596 1978071 1935340 2191595 2396536 2286125 2037369 1967355 2104160 2245427
34738 2245427 2271924 2203036 2063256 1884925 1767738 1784092 1884107 1993591 2119591 2280841
34728 2280841 2452331 2649446 2908083 3099554 2971764 2509510 2047662 1862941 1865735 1882431
34718 1882431 1986454 2259491 2443077 2213706 1710517 1416192 1526017 1764925 1851397 1828853
34708 1828853 1861237 1968932 2091779 2233934 2430638 2666027 2873742 2963401 2886344 2757835
34698 2757835 2818601 3141894 3490275 3630359 3658860 3802049 4030138 4148103 4160904 4232002
34688 4232002 4351365 4384677 4412578 4659327 5082699 5398270 5536394 5702579 5945846 6081919
34678 6081919 6138303 6433480 7031850 7533570 7647710 7602471 7715869 7919030 8038199 8232617
$$ packed form
34748B326110q3514k64525m2731K56255K04941j10411k48756p0014J36805J41267
34738B245427K6497o8888j39780j78331j17187J6354J00015J09484J26000J61250
34728B280841J71490J97115K58637J91471j27790m62254m61848j84721K794J6696
34718A882431J04023K73037J83586k29371n03189k94325J09825K38908Q6472k2544
34708A828853L2384J07695J22847J42155J96704K35389K07715Q9659p7057j28509
34698B757835O0766L23293L48381J40084K8501J43189K28089J17965J2801P1098
34688D232002J19363L3312K7901K46749M23372L15571J38124J66185K43267J36073
34678F081919N6384K95177N98370N01720J14140m5239J13398K03161J19169J94418
$$ plain form
34668 8232617 8753250 9484965 10124771 10670092 11361902 12246114 13137897 13953870 14761095
34659 14761095 15544454 16226444 16896647 17757509 18862596 20139567 21618646 23386055 25362830
34650 25362830 27403963 29591500 32157746 35132448 38348046 41803345 45733775 50283665
34642 50283665 55404416 61166516 67902621 75916222 85283823 96100856 108746930 123774828
34634 123774828 141712019 163125871 188730543 219232015 255104703 296518765 343042542
34627 343042542 392664828 440622552 479402040 500835059 499554328 475652130 434640951
34620 434640951 384760985 333609314 286158555 244644486 209425550 179904654 155210945
34613 155210945 134572193 117345851 102922273 90774943 80553440 71954642 64536443
$$ packed form
34668H232617N20633P31715O39806N45321O91810Q84212Q91783Q15973Q07225
34659A4761095P83359O81990O70203Q60862J105087J276971J479079J767409J976775
34650B5362830K041133K187537K566246K974702L215598L455299L930430M549890
34642E0283665N120751N762100O736105Q013601R367601J0817033J2646074J5027898
34634A23774828J7937191K1413852K5604672L0501472L5872688M1414062M6523777
34627C43042542M9622286M7957724L8779488K1433019j280731k3902198m1011179
34620D34640951m9879966n1151671m7450759m1514069l5218936k9520896k4693709
34613A55210945k0638752j7226342j4423578j2147330j0221503q598798p418199
$$ plain form
34606 64536443 57862500 51840669 46702453 42570421 39201902 36220755 33441934 30881852
34598 30881852 28587630 26565959 24800496 23259041 21918266 20773465 19741793 18607929
34590 18607929 17241222 15861900 14876014 14381572 14033272 13483750 12764044 12105907 11577882
34581 11577882 11077889 10557467 10064036 9628463 9261662 9004724 8848254 8656990 8308783
34572 8308783 7875544 7551796 7424375 7394564 7291246 6995105 6517484 6037221 5782796 5778254
34562 5778254 5777283 5556265 5197433 4953023 4897574 4878421 4785036 4694540 4712835 4797920 4801403
34551 4801403 4620620 4280733 3912801 3649075 3485772 3265750 2870139 2418482 2192040
34542 2192040 2334134 2683337 2926296 2880939 2624504 2383022 2312935 2380174 2447218 2449959
$$ packed form
34606F4536443o673943o021831n138216m132032l368519k981147k778821k560082
34598C0881852k294222k021671j765463j541455j340775j144801j031672j133864
34590A8607929j366707j379322r85886m94442l48300n49522p19706o58137n28025
34581A1577882m99993n20422m93431m35573l66801k56938j56470j91264l48207
34572H308783m33239l23748j27421k9811j03318k96141m77621m80263k54425m542
34562E778254r71k21018l58832k44410n5449j9153r3385r0496J8295Q5085L483
34551D801403j80783l39887l67932k63726j63303k20022l95611m51657k26442
34542B192040J42094L49203K42959m5357k56435k41482p0087O7239O7044K741
$$ plain form
34532 2449959 2428714 2391568 2260480 2021236 1831709 1862840 2072759 2253045 2286654 2253029
34522 2253029 2268667 2324644 2325437 2225413 2076102 1959129 1902437 1867134 1816223 1777920 1798957
34511 1798957 1837157 1772028 1557323 1298625 1133986 1106821 1214754 1493452 1933120 2358173
34501 2358173 2533976 2420751 2225964 2165060 2234474 2261052 2126853 1885816 1660397 1479346
34491 1479346 1283217 1090508 1048096 1211595 1354003 1182786 757490 482786 596249 853529
34481 853529 868885 606296 341901 263732 334314 476349 653244 780686 782694 756832 888410
34470 888410 1172752 1406858 1481648 1480853 1444791 1264749 926138 656775 663849 850511 956850
34459 956850 895584 794667 765849 783977 784750 763387 758724 803875 895526 977365 976923 888310
$$ packed form
34532B449959k1245l7146j31088k39244j89527L1131K09919J80286L3609l3625
34522B253029J5638N5977P93j00024j49311j16973n6692l5303n0911l8303K1037
34511A798957L8200o5129k14705k58698j64639k7165J07933K78698M39668M25053
34501B358173J75803j13225j94787o0904O9414K6578j34199k41037k25419j81051
34491A479346j96129j92709m2412J63499J42408j71217m25296k74704J13463K57280
34481H53529J5356k62589k64395p8169P0582J42035J76895J27442K008k5862J31578
34470H88410K84342K34106P4790p95l6062j80042l38611k69363P074J86662J06339
34459I56850o1266j00917k8818J8128P73k1363m663M5151R1651Q1839m42q8613
$$ plain form
34447 888310 779406 689292 578542 428935 331570 401993 633532 893309 1053087 1087677
34437 1087677 1055317 1007614 925067 761829 571649 527941 730519 1025796 1138874 988997
34427 988997 759169 643365 657502 731312 839039 964554 1057924 1109325 1168793 1230452 1207792
34416 1207792 1084092 957346 866958 733016 566285 557228 794064 1050336 1058009 872447
34406 872447 741539 705613 586345 339141 155677 186042 373014 599178 799937 886067
34396 886067 753147 446281 156792 -8841 -105034 -147685 -29214 272703 571582 677908
34386 677908 597772 428967 211282 4884 -36749 152836 403382 511852 519520 617406
34376 617406 841783 1045953 1134299 1134113 1046872 830663 572227 492093 679674 938506 989006
$$ packed form
34447H88310j08904r0114j10750j49607r7365P0423K31539K59777J59778L4590
34437A087677l2360m7703q2547j63238j90180m3708K02578K95277J13078j49877
34427I88997k29828j15804J4137P3810J07727J25515R3370N1401N9468O1659k2660
34416A207792j23700j26746r0388j33942j66731r057K36836K56272P673j85562
34406H72447j30908l5926j19268k47204j83464L0365J86972K26164K00759Q6130
34396H86067j32920l06866k89489j65633r6193m2651J18471L01917K98879J06326
34386F77908q0136j68805k17685k06398m1633J89585K50546J08470P668R7886
34376F17406K24377K04170Q8346j86q7241k16209k58436q0134J87581K58832N0500
$$ plain form
34365 989006 758976 419451 205627 246736 484730 694228 654927 375683 92503 -9277
34355 -9277 9787 3375 -2370 139627 423331 640811 653030 573541 600020 761447 928703
34344 928703 996090 931817 708552 351105 59747 102268 478334 812998 731610 292408
34334 292408 -90257 -134066 44654 169786 150167 88473 63058 57399 77476 184970 367497
34323 367497 488319 452076 355900 370985 496735 551922 439035 296829 296487 374718 316639
34312 316639 75729 -154627 -213303 -140707 -1999 266471 668352 961893 912998 665497
34302 665497 585022 730901 777595 549533 336555 475549 850795 1086728 1093400 1104808
34292 1104808 1221939 1244794 1027914 730507 568470 508213 377091 161057 23721 76650
$$ packed form
34365I89006k30030l39525k13824M1109K37994K09498l9301k79244k83180j01780
34355i277J9064o412n745J41997K83704K17480J2219p9489K6479J61427J67256
34344I28703O7387o4273k23265l57447k91358M2521L76066L34664q1388m39202
34334B92408l82665m3809J78720J25132j9619o1694k5415n659K0077J07494J82527
34323C67497J20822l6243r6176J5085J25750N5187j12887j42206l42P8231n8079
34312C16639k40910k30356n8676P2596J38708K68470M01881K93541m8895k47501
34302F65497q0475J45879M6694k28062k12978J38994L75246K35933O672J1408
34292A104808J17131K2855k16880k97407j62037o0257j31122k16034j37336N2929
$$ plain form
34282 76650 254019 388689 330829 40767 -342728 -570135 -519708 -344438 -288018 -383866
34272 -383866 -452468 -387832 -303620 -341690 -454580 -480280 -371103 -237112 -171936 -132469 -23905
34261 -23905 159114 328603 416449 445568 487809 582898 708110 804667 820248 744218 620725
34250 620725 516258 456616 408061 340235 285935 297054 352634 371777 334262 325863 419440
34239 419440 562247 652236 703138 849675 1168682 1554351 1804347 1797090 1567868 1255850
34229 1255850 1008045 893708 865358 825983 773013 842178 1147209 1598657 1967940 2140762
34219 2140762 2210979 2273404 2222421 1880209 1297658 787733 605183 684951 776320 769328 774363
34208 774363 892301 1033170 1025240 828472 559436 345069 239114 265912 437349 685021
$$ packed form
34282G6650J77369J34670n7860k90062l83495k27407N0427J75270N6420r5848
34272c83866o8602O4636Q4212l8070j12890k5700J09177J33991O5176L9467J08564
34261b3905J83019J69489Q7846K9119M2241R5089J25212R6557J5581p6030j23493
34250F20725j04467n9642m8555o7826n4300J1119N5580J9143l7515q399R3577
34239D19440J42807Q9989N0902J46537L19007L85669K49996p257k29222l12018
34229A255850k47805j14337k8350l9375n2970O9165L05031M51448L69283J72822
34219B140762P0217O2425n0983l42212n82551n09925j82550P9768R1369o992N035
34208G74363J17938J40869p930j96768k69036k14367j05955K6798J71437K47672
$$ plain form
34198 685021 858757 865168 764955 670749 596708 496318 409171 437340 559843 610916 518105
34187 518105 442504 559164 780450 858912 740042 637351 713251 838063 764947 446665
34177 446665 69336 -171884 -228617 -166904 -81698 -41075 -41499 -16774 64107 142205 174981
34166 174981 240292 415110 580874 516323 224355 -786 57026 228772 180531 -136662
34156 -136662 -445468 -537025 -506235 -526118 -562747 -460531 -217414 -12813 20482 -77343 -201268
34145 -201268 -301722 -368526 -392690 -390209 -390446 -362225 -230519 -18496 108095 19255 -208397
34134 -208397 -375002 -367317 -213590 11110 226146 327744 261790 129486 114272 270862
34124 270862 466082 554238 535958 512538 541966 566000 448595 109956 -324064 -565561
$$ packed form
34198F85021J73736O411j00213r4206p4041j00390q7147K8169J22503N1073r2811
34187E18105p5601J16660K21286P8462j18870j02691P5900J24812p3116l18282
34177D46665l77329k41220n6733O1713Q5206M0623m24K4725Q0881P8098L2776
34166A74981O5311J74818J65764o4551k91968k25141N7812J71746m8241l17193
34156a36662l08806r1557L0790j9883l6629J02216K43117K04601L3295r7825j23925
34145b01268j00454o6804k4164K481k37K8221J31706K12023J26591q8840k27652
34134b08397j66605P685J53727K24700K15036J01598o5954j32304j5214J56590
34124B70862J95220Q8156j8280k3420K9428K4034j17405l38639m34020k41497
$$ plain form
34114 -565561 -465165 -213187 -95487 -113218 -64530 32942 -80943 -431279 -648442 -492972
34104 -492972 -245426 -276057 -459346 -393974 -69285 110682 -42173 -244454 -204589 -8429
34094 -8429 96974 41883 -91912 -224075 -266194 -140438 73617 176526 119363 45230 -12693
34083 -12693 -217478 -574638 -767391 -575845 -239818 -130538 -224723 -200249 50914 307720
34073 307720 378172 301783 194823 124275 146856 267969 341631 189494 -160435 -497645
34063 -497645 -673535 -669585 -470896 -81941 334415 543210 501229 376341 298320 256884
34053 256884 235106 243616 211348 46555 -168543 -240637 -135855 25046 237971 604155
34043 604155 1004860 1108582 837003 531111 470675 493966 315744 -19843 -273281 -403486
$$ packed form
34114e65561J00396K51978J17700j7731M8688R7472j13885l50336k17163J55470
34104d92972K47546l0631j83289O5372L24689J79967j52855k02281L9865J96160
34094h429J05403n5091j33795j32163m2119J25756K14055J02909n7163p4133n7923
34083a2693k04785l57160j92753J91546L36027J09280r4185K4474K51163K56806
34073C07720P0452p6389j06960p0548K2581J21113P3662j52137l49929l37210
34063d97645j75890L950J98689L88955M16356K08795m1981j24888p8021m1436
34053B56884k1778Q510l2268j64793k15098p2094J04782J60901K12925L66184
34043F04155M00705J03722k71579l05892o0436K3291j78222l35587k53438j30205
$$ plain form
34033 -403486 -531417 -642205 -618592 -489887 -376994 -258577 -59680 96292 33375 -98498
34023 -98498 77947 625521 1144535 1281582 1135050 1010689 997589 979562 906942 836451
34013 836451 769923 639544 440699 249612 112985 17224 -39342 -30798 33200 93359 98504
34002 98504 30574 -127687 -392481 -713473 -935066 -878087 -509262 -39119 201395 51350
33992 51350 -309232 -537123 -496851 -397709 -510652 -795063 -911719 -642507 -206938 -46881
33982 -46881 -312158 -694605 -821224 -666846 -451258 -264970 -36342 170098 118517 -229961
33972 -229961 -545487 -493588 -114825 312899 628253 805795 769549 460487 48580 -168488
33962 -168488 -95979 108635 304592 490208 660091 758281 814017 921548 1023727 914091
$$ packed form
34033d03486j27931j10788K3613J28705J12893J18417J98897J55972o2917j31873
34023i8498J76445N47574N19014J37047j46532j24361j3100j8027p2620p0491
34013H36451o6528j30379j98845j91087j36627r5761n6566Q544O3998O0159N145
34002I8504o7930j58261k64794l20992k21593N6979L68825M70143K40514j50045
33992E1350l60582k27891M0272R9142j12943k84411j16656K69212M35569J60057
33982d6881k65277l82447j26619J54378K15588J86288K28628K06440n1581l48478
33972b29961l15526N1899L78763M27724L15354J77542l6246l09062m11907k17068
33962a68488P2509K04614J95957J85616J69883R8190N5736J07531J02179j09636
$$ plain form
33952 914091 553701 219666 214088 531780 906427 1086627 996452 736997 516443 489141
33942 489141 591678 615527 477831 310099 244609 259960 303116 401979 546822 604108 486866
33931 486866 300852 185477 109037 -34261 -213581 -310822 -322511 -348583 -405072 -397767 -280855
33920 -280855 -112301 60706 259870 492926 698479 811152 838097 849574 905932 982497
33910 982497 966003 771319 468036 219522 79378 -55663 -253412 -421581 -445635 -341367
33900 -341367 -179137 37483 299732 487639 473888 290876 84977 -57987 -156770 -260684
33890 -260684 -411300 -600015 -676642 -410547 213412 836627 1025315 705984 201145 -112139
33880 -112139 -81028 186550 415940 367719 85871 -129891 -119854 -94076 -285022 -533183
$$ packed form
33952I14091l60390l34035n578L17692L74647J80200r0175k59455k20554k7302
33942D89141J02537K3849j37696j67732o5490J5351M3156R8863J44843N7286j17242
33931D86866j86014j15375p6440j43298j79320r7241j1689k6072n6489P305J16912
33920b80855J68554J73007J99164K33056K05553J12673K6945J1477N6358P6565
33910I82497j6494j94684l03283k48514j40144j35041j97749j68169k4054J04268
33900c41367J62230K16620K62249J87907j3751j83012k05899j42964r8783j03914
33890b60684j50616j88715p6627K66095O23959O23215J88688l19331n04839l13284
33880a12139L1111K67578K29390m8221k81848k15762J0037K5778j90946k48161
$$ plain form
33870 -533183 -503821 -217547 -32745 -120696 -286989 -338500 -296959 -183092 71023 366924
33860 366924 418299 167054 -55267 15474 211953 258413 216965 319816 530636 595408
33850 595408 445734 257828 146537 67109 16539 82064 249246 371280 392034 430518
33840 430518 570431 700913 652663 406304 90693 -175813 -377470 -539291 -612111 -477465
33830 -477465 -123138 233088 335435 228793 241857 549211 913887 1000899 797969 545482
33820 545482 372315 222235 65734 -53477 -160167 -313611 -431938 -363692 -150397 -4595
33810 -4595 6042 30464 132017 153062 2324 -137715 -70220 101434 115205 -86375 -321853
33799 -321853 -444874 -472468 -459293 -418146 -390573 -443175 -525740 -449685 -114117 299009 464913
$$ packed form
33870e33183K9362K86274J84802q7951j66293n1511M1541J13867K54115K95901
33860C66924N1375k51245k22321P0741J96479M6460m1448J02851K10820O4772
33850E95408j49674j87906j11291p9428n0570O5525J67182J22034K0754L8484
33840D30518J39913J30482m8250k46359l15611k66506k01657j61821p2820J34646
33830d77465L54327L56226J02347j06642J3064L07354L64676Q7012k02930k52487
33820E45482j73167j50080j56501j19211j06690j53444j18327O8246K13295J45802
33810d595J0637K4422J01553K1045j50738j40039O7495J71654J3771k01580k35478
33799c21853j23021k7594J3175M1147K7573n2602q2565P6055L35568M13126J65904
$$ plain form
33788 464913 263683 -81970 -244569 -112778 162072 368008 384032 176985 -188925 -499660
33778 -499660 -516661 -273195 -114192 -281647 -564723 -562545 -223853 118487 228329 193902
33768 193902 115857 -121021 -573513 -974740 -1011073 -743985 -505809 -444792 -419214 -312152
33758 -312152 -192497 -127682 -74679 -43781 -159572 -424132 -591581 -458271 -171730 -62433
33748 -62433 -221685 -431609 -498191 -459527 -423719 -388187 -328463 -321865 -427342 -524424 -441880
33737 -441880 -223297 -104905 -211459 -411327 -502976 -407022 -129191 302442 752993 974634
33727 974634 852690 588271 478662 560112 623489 547185 426033 355884 284522 156747
33717 156747 53194 66204 133741 116617 -6337 -117369 -113255 -9085 102268 143368 98653
$$ packed form
33788D64913k01230l45653j62599J31791K74850K05936J6024k07047l65910l10735
33778d99660j7001K43466J59003j67455k83076K178L38692L42340J09842l4427
33768A93902p8045k36878m52492m01227l6333K67088K38176O1017K5578J07062
33758c12152J19655O4815N3003L0898j15791k64560j67449J33310K86541J09297
33748f2433j59252k09924o6582L8664L5808L5532N9724O598j05477r7082Q2544
33737d41880K18583J18392j06554j99868r1649R5954K77831M31633M50551K21641
33727I74634j21944k64419j09609Q1450O3377p6304j21152p0149p1362j27775
33717A56747j03553J3010O7537j7124j22954j11032M114J04170J11353M1100m4715
$$ plain form
33706 98653 -11290 -180886 -401005 -570137 -513785 -199267 128938 185226 2153 -117089
33696 -117089 -21717 110210 90633 14709 94791 355111 649155 857959 911583 736088
33686 736088 376915 89871 96922 294524 401675 355141 335227 416506 452344 364875 307105
33675 307105 410138 550856 517676 282452 -22264 -287968 -462464 -494277 -388574 -254855
33665 -254855 -167254 -37920 224060 475670 449439 126373 -169312 -135928 161540 423539
33655 423539 512201 565884 721061 874187 820886 557584 309794 248788 294138 263056 137653
33644 137653 84371 232011 521957 786886 906689 866426 718831 529933 349624 227138
33634 227138 245143 472921 824917 1026817 851216 401917 51408 43471 241041 332512
$$ packed form
33706I8653j09943j69596k20119j69132N6352L14518L28205N6288j83073j19242
33696a17089R5372J31927j9577p5924Q0082K60320K94044K08804N3624j75495
33686G36088l59173k87044P051J97602J07151m6534j9914Q1279L5838q7469n7770
33675C07105J03033J40718l3180k35224l04716k65704j74496l1813J05703J33719
33665b54855Q7601J29334K61980K51610k6231l23066k95685L3384K97468K61999
33655D23539Q8662N3683J55177J53126n3301k63302k47790o1006M5350l1082j25403
33644A37653n3282J47640K89946K64929J19803m0263j47595j88898j80309j22486
33634B27138J8005K27778L51996K01900j75601m49299l50509p937J97570R1471
$$ plain form
33624 332512 220688 115257 252831 605049 908141 966501 874197 881142 1062604 1239610
33614 1239610 1280071 1334421 1612856 2027108 2286644 2330580 2396657 2598685 2721078 2609268
33604 2609268 2523257 2828338 3466121 4028812 4324609 4597455 5155132 6016150 7003483 7999225
33594 7999225 9002840 10068374 11273688 12658942 14153593 15678183 17328256 19250742
33586 19250742 21233052 22622691 22873595 22084704 20815142 19452163 17980892 16321432
33578 16321432 14593147 12949063 11381145 9856166 8490115 7397802 6468785 5508544
33570 5508544 4571369 3931575 3683746 3575928 3341841 3024897 2816536 2709015 2528526
33561 2528526 2263244 2122372 2223495 2410740 2467904 2359048 2156823 1876935 1533506 1263038
$$ packed form
33624C32512j11824j05431J37574L52218L03092N8360r2304O945J81462J77006
33614A239610M0461N4350K78435M14252K59536M3936O6077K02028J22393j11810
33604B609268q6011L05081O37783N62691K95797K72846N57677Q61018R87333R95742
33594G999225J003615J065534J205314J385254J494651J524590J650073J922486
33586A9250742J982310J389639K50904p88891j269562j362979j471271j659460
33578A6321432j728285j644084j567918j524979j366051j092313r29017r60241
33570E508544r37175o39794k47829j07818k34087l16944k08361j07521j80489
33561B528526k65282j40872J01123J87245N7164j08856k02225k79888l43429k70468
$$ plain form
33551 1263038 1218632 1361819 1491977 1477527 1356036 1223051 1128148 1068550 979633 744626
33541 744626 334145 -57631 -141109 161733 621464 935358 982654 851586 723611 750725
33531 750725 934562 1088927 1023324 798687 692038 861186 1154618 1310844 1235526 1011683
33521 1011683 748992 522940 382228 319425 284713 281834 370066 524750 615532 600059 608029
33510 608029 729205 859555 898376 952824 1150877 1367559 1376648 1208618 1100146 1107546 1042813
33499 1042813 835503 694747 804758 1071173 1292865 1402648 1402573 1231712 875580 495365
33489 495365 276601 215575 190542 165316 170126 147778 4208 -193020 -234388 -32340 249680
33478 249680 384110 312270 138565 -41055 -226348 -436638 -612610 -648340 -523173 -344906
$$ packed form
33551A263038m4406J43187J30158j4450j21491j32985r4903n9598q8917k35007
33541G44626m10481l91776q3478L02842M59731L13894M7296j31068j27975K7114
33531G50725J83837J54365o5603k24637j06649J69148K93432J56226p5318k23843
33521A011683k62691k26052j40712o2803l4712k879Q8232J54684R0782j5473P970
33510F08029J21176J30350L8821N4448J98053K16682R089j68030j08472P400o4733
33499A042813k07310j40756J10011K66415K21692J09783p5j70861l56132l80215
33489D95365k18764o1026k5033k5226M810k2348j43570j97228m1368K02048K82020
33478B49680J34430p1840j73705j79620j85293k10290j75972l5730J25167J78267
$$ plain form
33468 -344906 -212354 -78968 161114 473607 687379 714528 646072 580574 479357 275748
33458 275748 26444 -150713 -220539 -220287 -175025 -117099 -117802 -190690 -225201 -133779 -13246 -34370
33446 -34370 -207245 -379938 -440749 -397243 -281888 -117551 29792 97507 129241 207620 291368
33435 291368 267174 170782 176956 307403 325079 49547 -343923 -506344 -352836 -160200
33425 -160200 -197520 -381216 -395026 -108465 256353 436017 492036 697972 1082340 1307156
33415 1307156 1107811 668616 387268 405811 583063 814162 1107048 1386568 1506038 1480618
33405 1480618 1467591 1490316 1434130 1346943 1445740 1731760 1901943 1792836 1622376 1597466
33395 1597466 1573863 1375341 1192714 1318825 1662624 1903682 2027993 2310244 2772775 3057972
$$ packed form
33468c44906J32552J33386K40082L12493K13772K7149o8456o5498j01217k03609
33458B75748k49304j77157o9826K52M5262N7926p03p2888l4511R1422J20533k1124
33446c4370j72875j72693o0811M3506J15355J64337J47343O7715L1734P8379Q3748
33435B91368k4194r6392O174J30447J7676k75532l93470j62421J53508J92636
33425a60200l7320j83696j3810K86561L64818J79664N6019K05936L84368K24816
33415A307156j99345m39195k81348J8543J77252K31099K92886K79520J19470k5420
33405A480618j3027K2725n6186q7187R8797K86020J70183j09107j70460k4910
33395A597466k3603j98522j82627J26111L43799K41058J24311K82251M62531K85197
$$ plain form
33385 3057972 2941423 2652166 2524699 2567759 2550525 2356314 2091839 1944697 2049295 2412997
33375 2412997 2875556 3192126 3222039 3011056 2694535 2395274 2203264 2143506 2148509 2155920
33365 2155920 2222194 2424195 2673540 2791275 2769670 2772229 2834481 2769959 2473740 2137325
33355 2137325 2010985 2077168 2121483 2055919 2017072 2157615 2447437 2691757 2699801 2448939
33345 2448939 2107979 1876691 1804974 1807632 1811301 1783295 1651031 1351278 972125 682819
33335 682819 489849 240255 -79006 -251782 -155387 21279 45037 -31011 8982 203424
33325 203424 391289 459940 437402 382982 338817 348278 386138 320068 75793 -213896 -362421
33314 -362421 -377231 -414635 -538767 -663379 -682769 -537357 -231198 76370 111550 -191401
$$ packed form
33385C057972j16549k89257j27467M3060j7234j94211k64475j47142J04598L63702
33375B412997M62559L16570K9913k10983l16521k99261j92010n9758N003P411
33365B155920O6274K02001K49345J17735k1605K559O2252o4522k96219l36415
33355B137325j26340O6183M4315o5564l8847J40543K89822K44320Q044k50862
33345B448939l40960k31288p1717K658L669k8006j32264k99753l79153k89306
33335F82819j92970k49594l19261j72776R6395J76666K3758p6048L9993J94442
33325B03424J87865O8651k2538n4420m4165R461L7860o6070k44275k89689j48525
33314c62421j4810l7404j24132j24612j9390J45412L06159L07568L5180l02951
$$ plain form
33304 -191401 -521299 -573427 -484884 -588987 -829456 -814638 -467319 -189292 -238539 -340986
33294 -340986 -163114 159534 270348 119225 -83229 -251188 -421290 -498230 -363610 -174369
33284 -174369 -198022 -364900 -339884 -77464 60587 -137074 -394943 -376290 -171990 -105430
33274 -105430 -241026 -366575 -353498 -267327 -177208 -103356 -128122 -317781 -526500 -513565 -295712
33263 -295712 -154369 -224089 -308275 -222595 -94035 -131605 -276810 -305598 -158249 57395
33253 57395 293069 539162 643695 444372 91094 -46279 142057 372048 392184 277208
33243 277208 171038 15658 -252957 -470622 -471967 -385847 -424554 -503248 -374903 -72362
33233 -72362 112214 94277 130091 406254 757730 910633 807243 581452 382953 334547
$$ packed form
33304a91401l29898n2128Q8543j04103k40469J4818L47319K78027m9247j02447
33294c40986J77872L22648J10814j51123k02454j67959j70102p6940J34620J89241
33284a74369k3653j66878K5016K62420J38051j97661k57869J8653K04300O6560
33274a05430j35596j25549J3077Q6171R0119P3852k4766j89659k08719J2935K17853
33263b95712J41343o9720q4186Q5680J28560l7570j45205k8788J47349K15644
33253E7395K35674K46093J04533j99323l53278j37373J88336K29991K0136j14976
33243B77208j06170j55380k68615k17665j345Q6120l8707p8694J28345L02541
33233g2362J84576j7937L5814K76163L51476J52903j03390k25791j98499m8406
$$ plain form
33223 334547 515423 870984 1235341 1501674 1659017 1646571 1366861 923192 642799 715440
33213 715440 948125 1021735 876452 702469 644045 654107 585943 332846 -59960 -365344
33203 -365344 -366897 -146071 -31221 -172384 -343672 -304140 -165568 -193028 -384397 -495210
33193 -495210 -406647 -242075 -160288 -226877 -439473 -687781 -743649 -491424 -117902 119538
33183 119538 231195 371609 484727 396140 214199 261270 558023 754218 691081 659250
33173 659250 898693 1185651 1195797 1002917 894970 903452 864181 799406 862602 962408 813096
33162 813096 390993 22013 -62019 16636 62349 100333 248270 479955 671911 766769
33152 766769 770712 689514 563288 463230 369280 167411 -135504 -323139 -227863 33247
$$ packed form
33223C34547J80876L55561L64357K66333J57343j2446k79710m43669k80393P2641
33213G15440K32685P3610j45283j73983n8424J0062o8164k53097l92806l05384
33203c65344j553K20826J14850j41163j71288L9532J38572k7460j91369j10813
33193d95210Q8563J64572Q1787o6589k12596k48308n5868K52225L73522K37440
33183A19538J11657J40414J13118q8587j81941M7071K96753J96195o3137l1831
33173F59250K39443K86958J0146j92880j07947Q482l9271o4775O3196R9806j49312
33162H13096m22103l68980q4032P8655M5713L7984J47937K31685J91956R4858
33152G66769L943q1198j26226j00058r3950k01869l02915j87635R5276K61110
$$ plain form
33142 33247 234359 355322 526131 711471 680687 331880 -137421 -457442 -545414 -470061
33132 -470061 -308559 -163791 -213916 -570890 -1094917 -1467300 -1477836 -1194666 -862235 -679617
33122 -679617 -656706 -636826 -481223 -261792 -207544 -402298 -631242 -650204 -524569 -515425 -665253
33111 -665253 -734341 -601560 -488614 -638085 -949758 -1129601 -1079537 -932538 -780702 -600705
33101 -600705 -435470 -420474 -567817 -695186 -648476 -467577 -264859 -70101 108796 182062
33091 182062 68072 -158004 -321085 -348165 -328871 -360030 -398284 -317874 -97042 110120
33081 110120 126263 -49681 -252197 -345453 -323359 -210573 -3591 215886 257300 63608
33071 63608 -126852 -49031 221219 372059 290804 163500 137830 141904 104594 108165 194247
$$ packed form
33142C3247K01112J20963J70809J85340l0784l48807m69301l20021q7972P5353
33132d70061J61502J44768n0125l56974n24027l72383j0536K83170L32431J82618
33122f79617K2911J9880J55603K19431N4248j94754k28944j8962J25635R144j49828
33111f65253o9088J32781J12946j49471l11673j79843N0064J46999J51836J79997
33101f00705J65235J4996j47343j27369M6710J80899K02718J94758J78897P3266
33091A82062j13990k26076j63081k7080J9294l1159l8254Q0410K20832K07162
33081A10120J6143j75944k02516r3256K2094J12786K06982K19477M1414j93692
33071F3608j90460P7821K70250J50840q1255j27304k5670M074l7310L571Q6082
$$ plain form
33060 194247 224708 91380 -99105 -202950 -252650 -332255 -377658 -284575 -112263 1172
33050 1172 50054 127841 262895 444141 717738 1075465 1325775 1280447 1024658 805347
33040 805347 686444 518042 232032 -40623 -166701 -145890 -33917 98478 121865 -50053
33030 -50053 -285529 -339428 -168978 26005 106449 143125 212556 253279 218188 176964 151650
33019 151650 35397 -179086 -262817 -38145 313739 447597 303861 157116 209366 321780
33009 321780 230372 -89691 -395256 -491891 -475738 -583302 -829898 -922122 -606577 -20754
32999 -20754 419586 435349 78694 -406457 -742028 -691915 -234003 294252 440348 118423
32989 118423 -319187 -548118 -607329 -689456 -830181 -955903 -1044967 -1072576 -959715 -734693
$$ packed form
33060A94247L0461j33328j90485j03845m9700p9605m5403R3083J72312J13435
33050A172M8882P7787J35054J81246K73597L57727K50310m5328k55789k19311
33040H05347j18903j68402k86010k72655j26078K0811J11973J32395K3387j71918
33030e0053k35476n3899J70450J94983Q0444L6676O9431M0723l5091m1224k5314
33019A51650j16253k14483q3731K24672L51884J33858j43736j46745N2250J12414
33009C21780r1408l20063l05565r6635J6153j07564k46596r2224L15545N85823
32999b0754M40340J5763l56655m85151l35571N0113M57912N28255J46096l21925
32989A18423m37610k28931n9211q2127j40725j25722q9064k7609J12861K25022
$$ plain form
32979 -734693 -577100 -545269 -454636 -203385 15921 68979 182125 536722 778349 407816
32969 407816 -411246 -930607 -759026 -280805 -23063 -49157 -191701 -476145 -964702 -1435777
32959 -1435777 -1579964 -1399357 -1139211 -921140 -690252 -439075 -230218 -36094 213815
32950 213815 433761 432251 181307 -124489 -296868 -311482 -236069 -139408 -91876 -133750 -204673
32939 -204673 -189307 -56866 109711 225344 278810 304479 339438 393760 414054 324413 175280
32928 175280 184502 507708 994115 1290764 1190864 797120 378657 174355 281740 570880
32918 570880 713366 474994 19018 -238422 -121131 119884 172035 29671 -120389 -209887
32908 -209887 -300615 -388854 -400986 -351873 -334798 -358009 -342568 -289547 -299586 -392837 -446474
$$ packed form
32979g34693J57593L1831R0633K51251K19306N3058J13146L54597K41627l70533
32969D07816q19062n19361J71581M78221K57742k6094j42544k84444m88557m71075
32959a435777j44187J80607K60146K18071K30888K51177K08857J94124K49909
32950B13815K19946j510k50944l05796j72379j4614P5413R6661M7532m1874p0923
32939b04673J5366J32441J66577J15633N3466K5669L4959N4322K0294q9641j49133
32928A75280R222L23206M86407K96649r9900l93744m18463k04302J07385K89140
32918E70880J42486k38372m55976k57440J17291K41015N2151j42364j50060q9498
32908b09887r0728q8239j2132M9113J7075k3211J5441N3021j0039r3251n3637
$$ plain form
32897 -446474 -369987 -230709 -138212 -101089 -74454 -60998 -64564 -2266 222432 567321 856399
32886 856399 944998 831686 624532 460004 439991 567545 730326 812310 835718 923019
32876 923019 1096233 1199814 1087191 819732 588449 468960 362737 193266 44409 26099
32866 26099 78164 28966 -157801 -315442 -304564 -213817 -231242 -369386 -448444 -357855 -206274
32855 -206274 -155941 -214577 -280226 -311626 -342294 -378028 -405744 -476967 -644916 -815384 -803175
32844 -803175 -573605 -293955 -91882 91509 312674 432749 274967 -100348 -440455 -585162
32834 -585162 -560905 -425885 -205590 -2164 19952 -156004 -346362 -427741 -521750 -774246
32824 -774246 -1048569 -1046074 -733561 -448892 -484375 -710223 -769937 -578698 -429340 -569440
$$ packed form
32897d46474P6487J39278R2497L7123K6635J3456l566O2298K24698L44889K89078
32886H56399Q8599j13312k07154j64528k0013J27554J62781Q1984K3408Q7301
32876I23019J73214J03581j12623k67459k31283j19489j06223j69471j48857j8310
32866B6099N2065m9198j86767j57641J0878R0747j7425j38144p9058R0589J51581
32855b06274N0333n8636o5649l1400l0668l5734k7716p1223j67949j70468J2209
32844h03175K29570K79650K02073J83391K21165J20075j57782l75315l40107j44707
32834e85162K4257J35020K20295K03426K2116j75956j90358q1379r4009k52496
32824g74246k74323K495L12513K84669l5483k25848n9714J91239J49358j40100
$$ plain form
32814 -569440 -857320 -973705 -862712 -769075 -850937 -951746 -839607 -535037 -271032 -188812
32804 -188812 -193225 -103224 131404 370131 405924 165703 -202132 -488438 -673155 -913161
32794 -913161 -1246393 -1453555 -1333783 -1005713 -768431 -719277 -678230 -476159 -163800 77528
32784 77528 110826 -73067 -330806 -430766 -262453 18667 164142 127661 63111 68004 98292
32773 98292 124383 177479 210343 93329 -193396 -504883 -697200 -709073 -495782 -87550
32763 -87550 280379 345292 178738 118851 273930 384535 295949 238148 417193 625088
32753 625088 554642 282144 116117 124933 132585 61643 -36194 -193583 -448583 -623111 -510390
32742 -510390 -245161 -156900 -269783 -292243 -123446 -6383 -88385 -175757 -82169 71984
$$ packed form
32814e69440k87880j16385J10993R3637q1862j00809J12139L04570K64005Q2220
32804a88812m413R0001K34628K38727L5793k40221l67835k86306j84717k40006
32794i13161l33232k07162J19772L28070K37282M9154M1047K02071L12359K41328
32784G7528L3298j83893k57739r9960J68313K81120J45475l6481o4550M893L0288
32773I8292K6091N3096L2864j17014k86725l11487j92317j1873K13291M08232
32763h7550L67929O4913j66554n9887J55079J10605q8586n7801J79045K07895
32753F25088p0446k72498j66027Q816P652p0942r7837j57389k55000j74528J12721
32742e10390K65229Q8261j12883k2460J68797J17063q2002q7372R3588J54153
$$ plain form
32732 71984 100380 54440 76570 127622 73548 -71548 -179882 -219809 -272308 -363170 -388750
32721 -388750 -216433 167102 584996 772455 627039 332075 143472 113825 153689 264298
32711 264298 480142 635898 483838 77574 -234267 -260426 -148786 -52089 78120 234171
32701 234171 208760 -68038 -298382 -175631 204227 513210 608273 562963 451371 340901
32691 340901 360747 528559 611669 391612 -20385 -335079 -442098 -401645 -209908 155526
32681 155526 532845 695519 653552 607594 634939 642420 591785 534220 439443 225481 -40335
32670 -40335 -188737 -202733 -221169 -290762 -319807 -277003 -228176 -174128 -62698 33803 -32225
32659 -32225 -247138 -455703 -608640 -759095 -826702 -649760 -308025 -99213 -114155 -118948
$$ packed form
32732G1984K8396m5940K2130N1052n4074j45096j08334l9927n2499r0862k5580
32721c88750J72317L83535M17894J87459j45416k94964j88603k9647L9864J10609
32711B64298K15844J55756j52060m06264l11841k6159J11640R6697J30209J56051
32701B34171k5411k76798k30344J22751L79858L08983R5063m5310j11592j10470
32691C40901J9846J67812Q3110k20057m11997l14694j07019M0453J91737L65434
32681A55526L77319J62674m1967m5958K7345P481n0635n7565r4777k13962k65816
32670d0335j48402j3996j8436o9593k9045M2804M8827N4048J11430R6501o6028
32659c2225k14913k08565j52937j50455o7607J76942L41735K08812j4942m793
$$ plain form
32649 -118948 38270 197028 207103 192441 286543 353712 224952 21834 -24539 48075 -325
32638 -325 -230930 -441071 -437829 -222509 71954 281326 284050 113209 -38236 -40598 -433
32627 -433 -85743 -250891 -304644 -218973 -188132 -353939 -616234 -769983 -733915 -591082 -468729
32616 -468729 -431449 -466595 -532391 -597309 -625010 -559848 -392949 -230485 -208602 -327902 -459287
32605 -459287 -523306 -555193 -576603 -544144 -472418 -450675 -452591 -293279 90042 455548 525311
32594 525311 337641 158101 120204 148131 187335 293402 467688 588847 578009 510228
32584 510228 495897 538478 567396 546502 490463 406094 272082 94045 -36558 6458 219115
32573 219115 401053 368275 207052 139765 116400 -207163 -925529 -1546324 -1481897 -780428
$$ packed form
32649a18948J57218J58758J0075j4662R4102O7169j28760k03118m6373P2614m8400
32638c25k30605k10141L242K15320K94463K09372K724j70841j51445k362M0165
32627d33q5310j65148n3753Q5671L0841j65807k62295j53749L6068J42833J22353
32616d68729L7280l5146o5796o4918k7701O5162J66899J62464K1883j19300j31385
32605d59287o4019l1887k1410L2459P1726K1743j916J59312L83321L65506O9763
32594E25311j87670j79540l7897K7927L9204J06067J74286J21159j0838o7781
32584E10228j4331M2581K8918k0894n6039q4369j34012j78037j30603M3016K12657
32573B19115J81938l2778j61223o7287k3365l23563p18366o20795O4427P01469
$$ plain form
32563 -780428 -76158 167875 80930 8517 12742 -80139 -319615 -536545 -567970 -433398 -274471
32552 -274471 -186190 -126191 17257 268457 512646 640782 690369 754626 799394 706306 498589
32541 498589 380878 503753 797244 1097544 1347490 1596720 1861515 2059251 2073288 1864219
32531 1864219 1536832 1283990 1214938 1251556 1248531 1181075 1123821 1078819 961926 767644 600628
32520 600628 501039 386661 243990 226486 432965 707988 837987 878007 1072055 1432931
32510 1432931 1614625 1327834 749766 350190 355799 555418 642673 565447 444140 313034
32500 313034 133235 -21269 -18304 87092 77425 -98202 -221742 -132727 37950 110564 156822
32489 156822 349550 630495 758143 633324 374490 111303 -94948 -160990 -37218 136906
$$ packed form
32563g80428P04270K44033q6945p2413M225r2881k39476k16930l1425J34572J58927
32552b74471Q8281N9999J43448K51200K44189J28136M9587O4257M4768r3088k07717
32541D98589j17711J22875K93491L00300K49946K49230K64795J97736J4037k09069
32531A864219l27387k52842o9052L6618l025o7456n7254m5002j16893j94282j67016
32520F00628r9589j14378j42671j7504K06479K75023J29999M0020J94048L60876
32510A432931J81694k86791n78068l99576N609J99619Q7255p7226j21307j31106
32500C13034j79799j54504K965J05396r667j75627j23540Q9015J70677P2614M6258
32489A56822J92728K80945J27648j24819k58834k63187k06251o6042J23772J74124
$$ plain form
32479 136906 139086 -46925 -230710 -310396 -357061 -379937 -255946 9455 172335 50020
32469 50020 -220112 -354223 -235880 46328 346204 529996 507770 307606 48702 -205230
32459 -205230 -448877 -569593 -386545 38689 337790 253879 -37045 -204832 -212336 -263429
32449 -263429 -424615 -559949 -599819 -628593 -691924 -724654 -713541 -763054 -934559 -1134478 -1218963
32438 -1218963 -1143653 -988495 -879652 -873754 -886737 -794680 -639738 -617539 -778172 -895241
32428 -895241 -787490 -617295 -640452 -780599 -752469 -558254 -516835 -746628 -954223 -882753
32418 -882753 -683291 -628974 -686161 -634121 -469284 -400905 -479440 -485292 -237081 167197 489234
32407 489234 615721 616043 609081 640418 668583 634829 539155 440882 391066 403927 495862 672503
$$ packed form
32479A36906K180j86011j83785p9686m6665k2876J23991K65401J62880j22315
32469E0020k70132j34111J18343K82208K99876J83792k2226k00164k58904k53932
32459b05230k43647j20716J83048M25234K99101q3911k90924j67787p504n1093
32449b63429j61186j35334l9870k8774o3331l2730J1113m9513j71505j99919q4485
32438a218963P5310J55158J08843N898j2983R2057J54942K2199j60633j17069
32428h95241J07751J70195k3157j40147K8130J94215M1419k29793k07595P1470
32418h82753J99462N4317n7187N2040J64837O8379p8535n852K48211M04278L22037
32407D89234J26487L22o962L1337K8165l3754r5674r8273m9816J2861R1935J76641
$$ plain form
32395 672503 835681 800865 511914 178045 66553 178562 261137 140246 -105648 -329811
32385 -329811 -494761 -565370 -401207 39884 478546 538214 208876 -125992 -183767 -93936
32375 -93936 -103884 -182714 -122131 104513 324691 445522 517242 545449 478405 387319 410315
32364 410315 475174 342850 21863 -129561 123355 551288 785119 760190 609131 339136
32354 339136 -58697 -335137 -211528 147544 257162 -48141 -422166 -528873 -438346 -370002
32344 -370002 -332179 -218784 -58259 36483 27683 -89176 -338083 -626142 -717436 -522726
32334 -522726 -279152 -258759 -423434 -554000 -583298 -574239 -489557 -260590 -18506 34662 -32361
32323 -32361 38175 252172 322020 151028 34898 195158 387817 244484 -180340 -501510
$$ packed form
32395F72503J63178l4816k88951l33869j11492J12009Q2575j20891k45894k24163
32385c29811j64950p0609J64163M41091M38662N9668l29338l34868n7775Q9831
32375i3936r948p8830O0583K26644K20178J20831P1720K8207o7044r1086K2996
32364D10315O4859j32324l20987j51424K52916M27933K33831k4929j51059k69995
32354C39136l97833k76440J23609L59072J09618l05303l74025j06707R0527O8344
32344c70002L7823J13395J60525R4742q800j16859k48907k88059r1294J94710
32334e22726K43574K0393j64675j30566k9298R059Q4682K28967K42084N3168o7023
32323c2361P0536K13997O9848j70992j16130J60260J92659j43333m24824l21170
$$ plain form
32313 -501510 -549409 -525293 -620911 -760063 -789942 -713882 -623914 -554408 -517520 -572032 -733801
32302 -733801 -877533 -833270 -569707 -238096 -57135 -154452 -446782 -665218 -604506 -381116
32292 -381116 -318643 -521904 -725687 -682826 -532428 -576686 -807408 -918554 -762358 -526027
32282 -526027 -408142 -361323 -257651 -108625 12945 117400 227246 276216 204261 66697
32272 66697 -42937 -84692 -24015 166696 374933 391736 217233 138484 326965 541794
32262 541794 466699 181860 13183 32857 50028 43655 224366 612981 907560 895172 703443
32251 703443 501159 234775 -136197 -387360 -278580 84249 376110 459981 470107 556983
32241 556983 731422 912275 966049 749281 282016 -147880 -223581 41933 311072 298174
$$ packed form
32313e01510m7899K4116r5618j39152k9879P6060Q9968O9506L6888n4512j61769
32302g33801j43732M4263K63563L31611J80961r7317k92330k18436O0712K23390
32292c81116O2473k03261k03783M2861J50398m4258k30722j11146J56196K36331
32282e26027J17885M6819J03672J49026J21570J04455J09846M8970p1955j37564
32272F6697j09634m1755O0677J90711K08237J6803j74503p8749J88481K14829
32262E41794p5095k84839j68677J9674J7171o373J80711L88615K94579j2388j91729
32251G03443k02284k66384l70972k51163J08780L62829K91861Q3871J0126Q6876
32241E56983J74439J80853N3774k16768m67265m29896p5701K65514K69139j2898
$$ plain form
32231 298174 39358 -213805 -266051 -129142 14218 -21727 -236049 -418937 -371312 -132295
32221 -132295 71012 84407 -27383 -87919 -631 175145 302657 314196 278703 292068 310260
32210 310260 182998 -104199 -324341 -253181 28824 196345 50029 -252817 -369907 -143564
32200 -143564 224475 374530 170213 -153877 -268674 -126607 39632 60077 3758 -20457
32190 -20457 -54252 -165853 -277965 -275998 -207017 -221908 -362202 -526387 -611641 -584480 -458794
32179 -458794 -318183 -315953 -520537 -770316 -799703 -528174 -149653 71547 38892 -135489
32169 -135489 -280236 -345978 -425633 -564623 -620857 -455006 -221470 -238834 -523165 -713753
32159 -713753 -594982 -423125 -516840 -769872 -870337 -811411 -822367 -905707 -832254 -570172
$$ packed form
32231B98174k58816k53163n2246J36909J43360l5945k14322j82888M7625K39017
32221a32295K03307J3395j11790o0536Q7288J75776J27512J1539l5493J3365J8192
32210C10260j27262k87197k20142P1160K82005J67521j46316l02846j17090K26343
32200a43564L68039J50055k04317l24090j14797J42067J66239K0445n6319k4215
32190b0457l3795j11601j12112J967O8981j4891j40294j64185q5254K7161J25686
32179d58794J40611K230k04584k49779k9387K71529L78521K21200l2655j74381
32169a35489j44747o5742p9655j38990n6234J65851K33536j7364k84331j90588
32159g13753J18771J71857r3715k53032j00465N8926j0956q3340P3453K62082
$$ plain form
32149 -570172 -348407 -267247 -194473 -104227 -168240 -398605 -524700 -383768 -159121 -65749
32139 -65749 -56438 -26900 -72970 -306669 -578612 -615021 -351567 19622 253360 206668 -84149
32128 -84149 -387143 -468332 -369975 -324452 -343436 -163312 268994 561339 376010 -77818
32118 -77818 -341411 -302664 -179490 -69130 113280 309999 299258 33608 -272282 -424582
32108 -424582 -403324 -247280 -27429 74800 -75414 -310570 -315003 -68587 110611 3379
32098 3379 -292347 -628877 -993039 -1301818 -1306718 -915097 -410042 -140082 -128148 -169675 -187896
32087 -187896 -290962 -550666 -894095 -1172086 -1224726 -961194 -496193 -120155 -2269 -4468
32077 -4468 79943 203688 153631 -112460 -415402 -616284 -739285 -825636 -846315 -807310 -790829
$$ packed form
32149e70172K21765Q1160P2774R0246o4013k30365j26095J40932K24647R3372
32139f5749R311K9538m6070k33699k71943l6409K63454L71189K33738m6692k90817
32128h4149l02994q1189R8357M5523j8984J80124M32306K92345j85329m53828
32118g7818k63593L8747J23174J10360J82410J96719j0741k65650l05890j52300
32108d24582K1258J56044K19851J02229j50214k35156m433K46416J79198j07232
32098C379k95726l36530l64162l08779m900L91621N05055K69960J1934m1527j8221
32087a87896j03066k59704l43429k77991n2640K63532M65001L76038J17886k199
32077d468Q4411J23745n0057k66091l02942k00882j23001q6351k0679L9005J6481
$$ plain form
32066 -790829 -821368 -800403 -639615 -374401 -94114 156941 354122 446792 408586 284811
32056 284811 133295 -41591 -247926 -441279 -556885 -580552 -536826 -426499 -232460 8143
32046 8143 183544 194039 65969 -31895 78274 390343 660612 608732 208920 -256614
32036 -256614 -480744 -443579 -384710 -473723 -598349 -546555 -346215 -290788 -563463 -930048
32026 -930048 -954930 -534103 -67623 -10249 -358279 -723611 -844423 -815381 -796519 -733697
32016 -733697 -522987 -289153 -264002 -425149 -481386 -273870 -21866 -64949 -459166 -925159
32006 -925159 -1135380 -976251 -581566 -187129 73126 268414 522875 747707 643378 72215
31996 72215 -671963 -1123387 -1130166 -930041 -779819 -705792 -643365 -609789 -625152 -615098 -529325
$$ packed form
32066g90829l0539K0965J60788K65214K80287K51055J97181R2670l8206j23775
32056B84811j51516j74886k06335j93353j15606k3667M3726J10327J94039K40603
32046H143J75401J0495j28070r7864J10169L12069K70269n1880l99812m65534
32036b56614k24130L7165N8869q9013j24626N1794K00340N5427k72675l66585
32026i30048k4882M20827M66480N7374l48030l65332j20812K9042J8862O2822
32016g33697K10710K33834K5151j61147n6237K07516K52004m3083l94217m65993
32006i25159k10221J59129L94685L94437K60255J95288K54461K24832j04329n71163
31996G2215p44178m51424o779K00125J50222P4027O2427L3576j5363J0054Q5773
$$ plain form
31985 -529325 -449853 -445499 -411278 -212021 73250 224084 177692 82180 35313 -49245 -242005
31974 -242005 -425240 -453144 -381999 -383947 -474302 -486213 -333547 -153570 -118349 -213879 -310055
31963 -310055 -375882 -486777 -633002 -668559 -505744 -251824 -71597 4929 46134 63421
31953 63421 16377 -66711 -113322 -148173 -270297 -465412 -581976 -545602 -458637 -407157 -310088
31942 -310088 -91235 109583 75128 -176077 -379766 -345047 -160001 -49086 -119076 -280091
31932 -280091 -355295 -250697 -62400 -3537 -167374 -395317 -467022 -388136 -362647 -480193
31922 -480193 -577612 -463151 -153847 186578 441863 579641 575173 417832 170065 -64089
31912 -64089 -217522 -259873 -168080 26117 197817 231738 152211 69142 8405 -104261 -282145
$$ packed form
31985e29325P9472M354L4221J99257K85271J50834m6392r5512m6867q4558j92760
31974b42005j83235k7904P1145j948r0355j1911J52666J79977L5221r5530r6176
31963c10055o5827j10895j46225l5557J62815K53920J80227P6526M1205J7287
31953F3421m7044q3088m6611l4851j22124j95115j16564L6374Q6965N1480R7069
31942c10088K18853K00818l4455k51205k03689L4719J85046J10915o9990j61015
31932b80091p5204J04598J88297N8863j63837k27943p1705P8886K5489j17546
31922d80193r7419J14461L09304L40425K55285J37778m468j57341k47767k34154
31912f4089j53433m2351R1793J94197J71700L3921p9527q3069o0737j12666j77884
$$ plain form
31901 -282145 -414075 -420873 -392301 -480948 -692477 -856837 -806154 -537478 -211287 -34965
31891 -34965 -135323 -478785 -880979 -1117605 -1065360 -772261 -424964 -231853 -253617 -300146
31881 -300146 -73773 489911 1078218 1317802 1195337 1010967 940319 862875 672360 503380
31871 503380 494623 542190 502215 456262 510683 490156 174238 -246642 -345806 -97511 68193
31860 68193 -65873 -201797 -79436 76561 -35712 -277213 -334416 -256941 -313900 -476752
31850 -476752 -483537 -347274 -369482 -632283 -863562 -870873 -768767 -693854 -612653 -517267 -518522
31839 -518522 -620407 -660586 -588399 -543960 -546592 -384753 22039 407894 495570 330822 108646
31828 108646 -111590 -326793 -446609 -448471 -485478 -631025 -719188 -660671 -679484 -939544 -1155956
$$ packed form
31901b82145j31930o798K8572q8647k11529j64360N0683K68676L26191J76322
31891c4965j00358l43462m02194k36626N2245K93099L47297J93111k1764m6529
31881c00146K26373N63684N88307K39584j22465j84370p0648p7444j90515j68980
31871E03380q757M7567l9975m5953N4421k0527l15918m20880r9164K48295J65704
31860F8193j34066j35924J22361J55997j12273k41501n7203P7475n6959j62852
31850d76752o785J36263k2208k62801k31279p311J02106P4913Q1201R5386j255
31839e18522j01885m0179P2187M4439k632J61839M06792L85855Q7676j64748k22176
31828A08646k20236k15203j19816j862l7007j45547q8163N8517j8813k60060k16412
$$ plain form
31817 -1155956 -951584 -449307 -100030 -8730 123449 385155 445520 90454 -416810 -710166
31807 -710166 -764930 -767173 -782188 -769045 -741675 -709331 -594799 -385571 -230391 -217607 -204276
31796 -204276 -65705 19753 -207897 -646208 -879764 -703678 -366336 -203709 -224063 -205357
31786 -205357 -82413 -35035 -190174 -411744 -490064 -443775 -477671 -646665 -731102 -535178
31776 -535178 -177801 61039 100603 86427 98893 52102 -85128 -184490 -175699 -185426 -313059
31765 -313059 -413230 -287077 -3407 166775 108652 -20604 -40640 52079 177340 319501
31755 319501 490280 627611 633501 494685 304275 163441 92781 40416 -43154 -147434
31745 -147434 -216110 -207425 -125073 2657 139471 229435 211921 76641 -121604 -316545 -459616
$$ packed form
31817a155956K04372N02277L49277R1300J32179K61706O0365l55066n07264k93356
31807g10166n4764k243j5015J3143K7370L2344J14532K09228J55180J2784J3331
31796b04276J38571Q5458k27650m38311k33556J76086L37342J62627k0354J8706
31786b05357J22944M7378j55139k21570p8320M6289l3896j68994q4437J95924
31776e35178L57377K38840L9564j4176J2466m6791j37230r9362Q791r727j27633
31765c13059j00171J26153K83670J70182n8123j29256k0036R2719J25261J42161
31755C19501J70779J37331N890j38816j90410j40834p0660n2365q3570j04280
31745a47434o8676Q685Q2352J27730J36814Q9964j7514j35280j98245j94941j43071
$$ plain form
31734 -459616 -488684 -347883 -95227 79426 38263 -130525 -210416 -118394 10169 -3237
31724 -3237 -192836 -436339 -559916 -459643 -200531 -207 -25335 -187969 -239529 -94209
31714 -94209 55164 9302 -157852 -201733 -22855 242101 415827 448356 388400 296419 222452
31703 222452 199568 221398 259680 305365 352105 364609 337754 361915 514525 680435 623936
31692 623936 308477 20359 59545 383716 675280 705601 509204 237181 -12822 -207108
31682 -207108 -347754 -484990 -670115 -847665 -860929 -613307 -189985 193404 323873 100954
31672 100954 -378122 -818385 -921352 -652248 -260824 -2452 85729 101421 99729 109728 231881
31661 231881 547170 931612 1110171 953829 629788 386631 251916 31382 -402831 -905055
$$ packed form
31734d59616k9068J40801K52656J74653m1163j68788p9891R2022J28563j3406
31724c237j89599k43503j23577J00273K59112K00324k5128j62634n1560J45320
31714i4209J49373m5862j67154m3881J78878K64956J73726L2529n9956r1981p3967
31703B22452k2884K1830L8282M5685M6740J2504k6855K4161J52610J65910n6499
31692F23936l15459k88118L9186L24171K91564L0321j96397k72023k50003j94286
31682b07108j40646j37236j85125j77550j3264K47622M23322L83389J30469k22919
31672A00954m79076m40263j02967K69104L91424K58372Q8181J5692j692R999J22153
31661B31881L15289L84442J78559j56342l24041k43157j34715k20534m34213n02224
$$ plain form
31651 -905055 -1175868 -1051690 -637435 -187501 75450 43032 -250156 -604676 -749314 -572856
31641 -572856 -239283 10874 131055 242636 398424 524654 576647 581376 515398 319366
31631 319366 68236 -61346 -52528 -80632 -205916 -259928 -171385 -165746 -420431 -714871 -699218
31620 -699218 -387401 -96785 23636 102954 214845 248217 162549 98760 134707 145423 19322
31609 19322 -152796 -207481 -99059 109585 321517 420666 346832 203343 155166 187464 124113
31598 124113 -77448 -240763 -253010 -241293 -355891 -545421 -672396 -704687 -664595 -528958
$$ packed form
31651i05055k70813J24178M14255M49934K62951l2418k93188l54520j44638J76458
31641e72856L33573K50157J20181J11581J55788J26230N1993M729o5978j96032
31631C19366k51130j29582Q818k8104j25284n4012Q8543N639k54685k94440J5653
31620f99218L11817K90616J20421P9318J11891L3372q5668o3789L5947J0716j26101
31609A9322j72118n4685J08422K08644K11932R9149p3834j43489m8177L2298o3351
31598A24113k01561j63315j2247J1717j14598j89530j26975l2291M0092J35637
$$ [...]
##END NTUPLES=NMR SPECTRUM
##END=
