##TITLE=31Pdec_DE-124W40ml_CHCl3
, 24 sc
 30.1.2026
##JCAMPDX= 6.0         $$ Bruker NMR JCAMP-DX V2.0
##DATA TYPE= NMR SPECTRUM
##DATA CLASS= NTUPLES
##ORIGIN= UXNMR, Bruker Analytische Messtechnik GmbH
##OWNER= root
$$ XWIN-NMR		Version 3.5
$$ Fri Jan 30 15:26:56 2026 Russian Standard Time (UT+4h)  she@DPX200
##.OBSERVE FREQUENCY= 81.013821
##.OBSERVE NUCLEUS= ^31P
##.ACQUISITION MODE= SIMULTANEOUS
##.ACQUISITION SCHEME= undefined
##.AVERAGES= 24
##.DIGITISER RES= 17
##SPECTROMETER/DATA SYSTEM= spect
##.PULSE SEQUENCE= zgpg30
##.SOLVENT NAME= D2O
##.SHIFT REFERENCE= (INTERNAL, D2O, 0, 198.062)
##AUDIT TRAIL= $$ (NUMBER, WHEN, WHO, WHERE, WHAT)
$$ ##TITLE= Audit trail, XWIN-NMR		Version 3.5
$$ ##JCAMPDX= 5.01
$$ ##ORIGIN= Bruker BioSpin GmbH
$$ ##OWNER= she
$$ F:/spectra/data/she/nmr/P31/2/pdata/1/auditp.txt
$$ ##AUDIT TRAIL=  $$ (NUMBER, WHEN, WHO, WHERE, WHAT)
(   1,<2026-01-30 15:25:37.31 +0400>,<she>,<DPX200>,
      <created by zg, POWCHK disabled, PULCHK disabled
       configuration hash MD5:
       00 E9 B6 7A A2 85 ED C7 34 08 36 98 17 FE 4E 26
       data hash MD5: 32K
       42 19 23 11 F6 FF 7E 73 28 CE F7 C5 E0 51 9F 99>)
(   2,<2026-01-30 15:25:44.25 +0400>,<she>,<DPX200>,
      <Start of raw data processing
       efp BC_mod = 2 LB = 1.5 FT_mod = 6 PKNL = 1 PHC0 = 1387.965 PHC1 = 54.70091 SI = 64K 
       data hash MD5: 64K
       83 78 FE C6 4C C2 60 7C A6 B8 DE 87 25 7C 24 0B>)
(   3,<2026-01-30 15:26:05.31 +0400>,<she>,<DPX200>,
      <pk PHC0 = 2.198562 PHC1 = -2.2 
       data hash MD5: 64K
       A0 E6 A1 A8 96 3C 5B 8F FC ED 38 C7 F6 8B 28 40>)
(   4,<2026-01-30 15:26:09.03 +0400>,<she>,<DPX200>,
      <abs ABSG = 5 
       data hash MD5: 64K
       5D F2 22 D6 7B 43 EC F6 04 0A 3F 8E ED ED CC BF>)
$$ ##END=
$$ 
$$ hash MD5
$$ 16 A2 39 56 51 1B 63 4F BA 9E 2D 29 EB 64 E5 D3
##$RELAX= 
##$RELAX= 
##$RELAX= 
##$RELAX= 
##$RELAX= 
##$RELAX= 
##$RELAX= 
##$RELAX= 
$$ Bruker specific parameters
$$ --------------------------
##$DU= <F:/spectra>
##$EXPNO= 2
##$NAME= <P31>
##$PROCNO= 1
##$TYPE= <nmr>
##$USER= <she>
##$AMP= (0..31)
100 100 100 100 100 100 100 100 100 100 100 100 100 100 100 100 100 100 
100 100 100 100 100 100 100 100 100 100 100 100 100 100 
##$AQSEQ= 0
##$AQ_mod= 1
##$AUNM= <au_zg>
##$AUTOPOS= <>
##$BF1= 81.014009
##$BF2= 200.13
##$BF3= 200.13
##$BF4= 200.13
##$BF5= 200.13
##$BF6= 200.13
##$BF7= 200.13
##$BF8= 200.13
##$BYTORDA= 1
##$CFDGTYP= 0
##$CFRGTYP= 5
##$CHEMSTR= <none>
##$CNST= (0..31)
1 1 145 1 1 1 1 1 1 1 1 1 1 1 1 1 1 1 1 1 1 1 1 1 1 1 1 1 1 1 1 1 
##$CPDPRG= <waltz16>
##$CPDPRG1= <>
##$CPDPRG2= <waltz16>
##$CPDPRG3= <>
##$CPDPRG4= <mlev>
##$CPDPRG5= <mlev>
##$CPDPRG6= <mlev>
##$CPDPRG7= <mlev>
##$CPDPRG8= <mlev>
##$CPDPRGB= <>
##$CPDPRGT= <>
##$D= (0..31)
0 1 0 0 0 0 0 0 0 0.06 0 0.03 2e-05 3e-06 0 0 0.0002 0 0 0 0 0 0 0 0 0 
0 0 0 0 0 0 
##$DATE= 1769772336
##$DBL= (0..7)
120 120 120 11 120 120 24 19 
##$DBP= (0..7)
150 150 150 150 150 150 150 150 
##$DBP07= 0
##$DBPNAM0= <>
##$DBPNAM1= <>
$$ [...]
##$SUBNAM3= <"">
##$SUBNAM4= <"">
##$SUBNAM5= <"">
##$SUBNAM6= <"">
##$SUBNAM7= <"">
##$SUBNAM8= <"">
##$SUBNAM9= <"">
##$SW= 400.765351723535
##$SWIBOX= (0..15)
0 1 3 0 0 0 0 0 0 0 0 0 0 0 0 0 
##$SW_h= 32467.5324675325
##$TD= 32768
##$TD0= 1
##$TE= 0
##$TE2= 300
##$TE3= 300
##$TEG= 300
##$TL= (0..7)
0 120 53 12 22 120 120 120 
##$TP= (0..7)
150 150 150 150 150 150 150 150 
##$TP07= 0
##$TPNAME0= <>
##$TPNAME1= <>
##$TPNAME2= <>
##$TPNAME3= <>
##$TPNAME4= <>
##$TPNAME5= <>
##$TPNAME6= <>
##$TPNAME7= <>
##$TPOAL= (0..7)
0.5 0.5 0.5 0.5 0.5 0.5 0.5 0.5 
##$TPOFFS= (0..7)
0 0 0 0 0 0 0 0 
##$TUNHIN= 0
##$TUNHOUT= 0
##$TUNXOUT= 0
##$USERA1= <user>
##$USERA2= <user>
##$USERA3= <user>
##$USERA4= <user>
##$USERA5= <user>
##$V9= 5
##$VALIST= <valist>
##$VCLIST= <CCCCCCCCCCCCCCC>
##$VD= 0
##$VDLIST= <DDDDDDDDDDDDDDD>
##$VPLIST= <PPPPPPPPPPPPPPP>
##$VTLIST= <TTTTTTTTTTTTTTT>
##$WBST= 1024
##$WBSW= 4
##$XGAIN= (0..3)
0 0 0 0 
##$XL= 0
##$YL= 0
##$YMAX_a= 7805
##$YMIN_a= -7166
##$ZGOPTNS= <>
##$ZL1= 120
##$ZL2= 120
##$ZL3= 120
##$ZL4= 120
##$ABSF1= 198.0616
##$ABSF2= -202.7028
##$ABSG= 5
##$ABSL= 3
##$ALPHA= 0
##$AQORDER= 0
##$ASSFAC= 0
##$ASSFACI= 0
##$ASSFACX= 0
##$ASSWID= 0
##$AUNMP= <proc_1d>
##$AZFE= 0.1
##$AZFW= 0.5
##$BCFW= 0
##$BC_mod= 2
##$BYTORDP= 0
##$COROFFS= 0
##$CY= -3
##$DATMOD= 1
##$DC= 0
##$DFILT= <>
##$DTYPP= 0
##$F1P= 0
##$F2P= 0
##$FCOR= 1
##$FTSIZE= 65536
##$FT_mod= 6
##$GAMMA= 0
##$GB= 0
##$INTBC= 1
##$INTSCL= 9.790993e-09
##$ISEN= 30
##$LB= 1.5
##$LEV0= 0
##$LPBIN= 0
##$MAXI= 10000
##$MC2= 0
##$MEAN= 0
##$ME_mod= 0
##$MI= 50
##$NCOEF= 0
##$NC_proc= -7
##$NLEV= 6
##$NOISF1= 182.463
##$NOISF2= 159.3651
##$NSP= 0
##$NTH_PI= 0
##$NZP= 0
##$OFFSET= 198.0616
##$PC= 4
##$PHC0= 1390.164
##$PHC1= 52.50091
##$PH_mod= 1
##$PKNL= yes
##$PPARMOD= 0
##$PSCAL= 0
##$PSIGN= 0
##$REVERSE= no
##$SF= 81.0140089999434
##$SI= 65536
##$SIGF1= 159.3651
##$SIGF2= -187.1042
##$SINO= 113.3802
##$SIOLD= 16384
##$SREGLST= <1H.CDCl3>
##$SSB= 0
##$STSI= 65536
##$STSR= 0
##$SW_p= 32467.5324675325
##$SYMM= 0
##$S_DEV= 0
##$TDeff= 32768
##$TDoff= 0
##$TI= <>
##$TILT= no
##$TM1= 0
##$TM2= 0
##$TOPLEV= 0
##$USERP1= <user>
##$USERP2= <user>
##$USERP3= <user>
##$USERP4= <user>
##$USERP5= <user>
##$WDW= 1
##$XDIM= 65536
##$YMAX_p= 298735915
##$YMIN_p= -49141388
$$ End of Bruker specific parameters
$$ ---------------------------------
##NTUPLES= NMR SPECTRUM
##VAR_NAME=  FREQUENCY,     SPECTRUM/REAL,   SPECTRUM/IMAG
##SYMBOL=    X,             R,               I
##VAR_TYPE=  INDEPENDENT,   DEPENDENT,       DEPENDENT
##VAR_FORM=  AFFN,          ASDF,            ASDF
##VAR_DIM=   65536,         65536,           65536
##UNITS=     HZ,            ARBITRARY UNITS, ARBITRARY UNITS
##FACTOR=    0.49542278885378, 1,            1
##FIRST=     16045.7642231865, 0,            0
##LAST=      -16421.768244346, 0,            0
##MIN=       -16421.768244346, -49141388,    0
##MAX=       16045.7642231865, 298735915,    0
$$ Real data points
##PAGE= N=1
##DATA TABLE= (X++(R..R)), XYDATA
$$ [...]
37174B04484j55013o7198K0800l4988j23971L1831L02320K27826j73165l01213
$$ 204484 49471 -17727 3073 -31915 -155886 -124055 178265 406091 232926 -68287
37164f8287L0478J67397l25228q04688m85375K54519M13175p4826l56648j72830
$$ -68287 -37809 129588 -195640 -1000328 -1485703 -1231184 -818009 -892835 -1249483 -1422313
37154a422313j98411o25679n77283M20871J349531J016571j53739o79228o8251
$$ -1422313 -1620724 -2246403 -2823686 -2402815 -1053284 -36713 -190452 -869680 -937931
37145i37931O94170O93999K21632R7444N03913Q82844P01349L4436n39892n51175
$$ -937931 -243761 450238 671870 769314 1273227 2156071 2857420 2891856 2351964 1800789
37135A800789j52231J02979K9480J6141K56976K46007m52317j275091j220579
$$ 1800789 1648558 1751537 1781017 1797158 2054134 2300141 1847824 572733 -647846
37126f47846k66930M80090K28715m89440n90874J37293P99461N32152l97012q45053
$$ -647846 -914776 -434686 -205971 -695411 -1286285 -1148992 -349531 182621 -214391 -1059444
37116a059444j94023P63528P34508l71166j265805r74530R089O76652Q91929J115483
$$ -1059444 -1253467 -489939 244569 -126597 -1392402 -2366932 -2357843 -1681191 -789262 326221
37106C26221J316855J067995M18176j77307n92699r18123q91388l23310J81007
$$ 326221 1643076 2711071 3129247 2951940 2359241 1441118 549730 226420 407427
37097D07427o0329n67444l12504N31902P42382L1095m85828j34647L58673L03121
$$ 407427 347098 -220346 -532850 -948 741434 772529 286701 152054 510727 813848
37087H13848J36401L34872M13118o5356m85762j99420K96347K28388j25133m3935
$$ 813848 950249 1285121 1698239 1632883 1147121 947701 1244048 1472436 1347303 1303368
37077A303368L01110K25867j89140k53571J80487O24879P53362N26674j14149
$$ 1303368 1604478 1830345 1641205 1387634 1568121 2193000 2946362 3473036 3358887
37068C358887r16628j128564m62209K39592J67866j97024o901M07230J92778l16868
$$ 3358887 2442259 1313695 851486 1091078 1258944 1061920 1055019 1462249 1655027 1338159
37058A338159n2120Q64801J191439N68524o4625k12410m57793j008582j096922
$$ 1338159 1286039 2150840 3342279 3910803 3846178 3633768 3175975 2167393 1070471
37049A070471m02167K53388K91782K48455N47448N97557k8195n88745l51883J11698
$$ 1070471 668304 921692 1213474 1461929 2009377 2606934 2578739 1989994 1638111 1749809
37039A749809j34174q57279j110586o93525j69379J71235M38077N37492K78640
$$ 1749809 1615635 758356 -352230 -1045755 -1215134 -1043899 -605822 -68330 210310
37030B10310j37634m07859o07859p82045n03629M00173J112451P20225m02006
$$ 210310 72676 -335183 -943042 -1725087 -2228716 -1828543 -716092 4133 -397873
37021c97873r83935n17501K75354N67836K78895j94489m44355k32656K75843N24991
$$ -397873 -1381808 -1899309 -1623955 -1056119 -777224 -971713 -1416068 -1648724 -1372881 -847890
37011h47890K55799l7158J56874N08196L92916l6056j35601J19679K15615J23970
$$ -847890 -592091 -629249 -472375 35821 428737 392681 257080 376759 592374 716344
37001G16344K71555N19869K06615o44770j118272o66033K59505J044443J516205
$$ 716344 987899 1507768 1714383 1069613 -48659 -714692 -455187 589256 2105461
36992B105461J486457O75302m98719r91737n40869j51601n84832j191863r97705
$$ 2105461 3591918 4267220 3768501 2776764 2235895 2084294 1499462 307599 -690106
36983f90106k01847K82238K19152M8090j26708n87924j193206j333749p29288
$$ -690106 -891953 -609715 -390563 -342473 -469181 -1057105 -2250311 -3584060 -4313348
36974d313348K80612J171131J541827J222672N17986N1683n3103l69459j018594
$$ -4313348 -4032736 -2861605 -1319778 -97106 420880 472563 419460 50001 -968593
36965i68593j032088K05586J507017J200754l88625j263917n95831L31473L98833
$$ -968593 -2000681 -1795095 -288078 912676 524051 -739866 -1335697 -1004224 -605391
36956f05391K39515O59540R31794O5868j185337j202025M0744R36416O40438O9337
$$ -605391 -365876 293664 1225458 1291326 105989 -1096036 -1055292 -118876 521562 590899
36946E90899K00191O25489M50555k55955o84358m59357P5729M66320M99895J34581
$$ 590899 791090 1416579 1867134 1611179 926821 467464 543193 1009513 1509408 1643989
36936A643989m70824r35099r72419o50487j57016M48037R83736R62110J26728
$$ 1643989 1173165 238066 -734353 -1384840 -1541856 -1093819 -110083 852027 978755
36927I78755r51923j326246p59462N7516M58062N24458O45480P70095N39048j9186
$$ 978755 26832 -1299414 -2058876 -2001360 -1543298 -1018840 -373360 396735 935783 916597
36917I16597l90393k23351K59141O11831O64740N23173L13929J50889J71018L46786
$$ 916597 526204 302853 561994 1173825 1838565 2361738 2675667 2826556 2997574 3344360
36907C344360L95824J47161j51197k36602l61370q55716j234554n74375R13857
$$ 3344360 3740184 3887345 3736148 3499546 3138176 2282460 1047906 473531 1387388
36898A387388J573391L21209j665785k306225j287723j88014j3744k9421N38480
$$ 1387388 2960779 3281988 1616203 -690022 -1977745 -2165759 -2179503 -2208924 -1670444
36889a670444J006860M30909o62711r51135k12788O02852Q94290Q52638N55867
$$ -1670444 -663584 -232675 -895386 -1846521 -2059309 -1456457 -562167 290471 846338
36880H46338j52349p97040n16832M81371Q56958O6465p14245l63966M58786M14429
$$ 846338 693989 -103051 -619883 -138512 718446 784911 70666 -293300 165486 579915
36870E79915m10643p55648j97581L91001M05360L01047N08892O29739K63231k20457
$$ 579915 169272 -586376 -783957 -392956 12404 313451 822343 1452082 1715313 1494856
36860A494856m18018o91645j383709j754226p76788J112287K133412J337308j89914
$$ 1494856 1076838 385193 -998516 -2752742 -3529530 -2417243 -283831 1053477 863563
36851H63563q07985l30938J63868O1549k09169k32863k44103l89931k22892M42553
$$ 863563 55578 -275360 -111492 -49943 -259112 -491975 -736078 -1126009 -1348901 -906348
36841i06348Q18882J48167r46965j084002l0115R71408R49686L29867q3142k99280
$$ -906348 -87466 60701 -886264 -1970266 -2000381 -1028973 -79287 250580 167438 -131842
36831a31842n94622n30037M44613J739603K011837Q27283q39316j803119j666333
$$ -131842 -726464 -1256501 -811888 927715 2939552 3766835 2927519 1124400 -541933
36822e41933o46592P05116J421372O82653j017662j987577j254450J58137N43828
$$ -541933 -1188525 -483409 937963 1620616 602954 -1384623 -2639073 -2480936 -1937108
36813a937108l19972j095193p36835L97768J291051J370201P17770j62661n17442
$$ -1937108 -2257080 -3352273 -4089108 -3691340 -2400289 -1030088 -312318 -474979 -992421
36804i92421J48061J332980J749509P39997p99620j394407p02689K51990M68311
$$ -992421 -844360 488620 2238129 2978126 2178506 784099 81410 333400 801711
36795H01711J0472m36091m94086k60860M7518J89635j18695q50327j407747j188404
$$ 801711 812183 376092 -117994 -378854 -331336 -141701 -260396 -1110723 -2518470 -3706874
36785c706874l99338J66812K40773M26879J181389J939119J763488O18263n36380
$$ -3706874 -4106212 -3939400 -3698627 -3271748 -2090359 -151240 1612248 2230511 1694131
36776A694131q71682m89855p5977j14175n30607q47253o17746R9023P08331P25026
$$ 1694131 822449 332594 256617 142442 -388165 -1235418 -1853164 -1754141 -1045810 -320784
36766c20784L69285K23931L78814L38329j64765o88174o03927J76331J139169
$$ -320784 48501 272432 651246 989575 824810 136636 -467291 -290960 848209
36757H48209J601103J174795J42697n96663l86153K94282K99516o45261j496324
$$ 848209 2449312 3624107 3766804 3170141 2783988 3078270 3377786 2732525 1236201
36748A236201j316133m83872Q5712L10684O87152J093862R10573K49685o501L75339
$$ 1236201 -79932 -563804 -478092 -167408 519744 1613606 2524179 2773864 2767363 3142702
36738C142702N17350j33106p80809m57303L99664N08554l45611r63217m77922
$$ 3142702 3660052 3526946 2746137 2288834 2688498 3197052 2851441 1888224 1410302
36729A410302L90881L86974m74300r03812j28823J006031J135001J63815o83257
$$ 1410302 1801183 2188157 1713857 810045 681222 1687253 2822254 2986069 2302812
36720B302812n74062j04524k58744r38465j246708r39515p07906r46904j109185
$$ 2302812 1728750 1624226 1365482 427017 -819691 -1759206 -2467112 -3414016 -4523201
36711d523201o56612O7554M77337O78609J051437J303629Q07298k37512q35158
$$ -4523201 -5179813 -5112259 -4634922 -3956313 -2904876 -1601247 -793949 -1031461 -1866619
36702a866619n22768P4236K66162J86317K38996K71726n8375m39663j54989Q31376
$$ -1866619 -2389387 -2315151 -2048989 -1862672 -1623676 -1351950 -1410325 -1849988 -2004977 -1173601
36692a173601J599771J265219n6219j378534j745882r89877J84690Q30997O36279
$$ -1173601 426170 1691389 1635170 256636 -1489246 -2479123 -2294433 -1463436 -827157
36683h27157J43570j7514R7893P1581k9060K62720Q86676J132459P02590K13148
$$ -827157 -683587 -701101 -603208 -531627 -560687 -297967 588709 1721168 2423758 2636906
36673B636906J62534M7814p39043j602693j344377K2806J100794R95830M28717
$$ 2636906 2799440 2847254 2108211 505518 -838859 -816053 284741 1280571 1709288
36664A709288M29719P45578M04365o03015j220807q97506l68938n41910j217172
$$ 1709288 2139007 2884585 3288950 2685935 1465128 567622 198684 -343226 -1560398
36655a560398j444876q46078j4394M00851N09905P82728J138472R79490K07731
$$ -1560398 -3005274 -3851352 -3865746 -3464895 -2954990 -2172262 -1033790 -54300 153431
36646A53431l54656r387P12419O51714l65710j244764j082283k00974N69921R34001
$$ 153431 -201225 -210612 501807 1153521 787811 -456953 -1539236 -1740210 -1170289 -236288
36636b36288R65419N78721j35818n40914k11893K59148J3739p69029j137625p31280
$$ -236288 729131 1307852 1172034 631120 419227 678375 692114 -76915 -1214540 -1945820
36626a945820j441P45497J485392J701742O90374j075746k032529j477404m28869
$$ -1945820 -1947261 -1201764 283628 1985370 2675744 1599998 -432531 -1909935 -2338804
36617b338804J6126J22711N31974Q55311L91813m21754n09755K07494P71928O26797
$$ -2338804 -2322678 -2199967 -1667993 -812682 -420869 -842623 -1352378 -1144884 -372956 253841
36607B53841J30682k68985m68478l61210P9955L83072N5467n32337n62078m1633
$$ 253841 384523 115538 -352940 -714150 -634195 -251123 -195656 -727993 -1290071 -1331704
36597a331704K35455L0935m1477K59097L26389j43686m85457j00638O19689R71518
$$ -1331704 -1096249 -1065314 -1106791 -847694 -521305 -664991 -1150448 -1251086 -631397 340121
36587C40121Q38665L92383l57169j078899r54164J82491J161397Q62541k07381
$$ 340121 1178786 1571169 1214000 135101 -819063 -636572 524825 1387366 1179985
36578A179985p16582m90172n20718j128284j376188o22337M06821O62838J62919
$$ 1179985 463403 -26769 -547487 -1675771 -3051959 -3674296 -3267475 -2604637 -2441718
36569b441718k86639k58609K5593L09227N89848Q52135R60843Q98502Q32243Q23118
$$ -2441718 -2728357 -2986966 -2961373 -2652146 -2062298 -1210163 -249320 649182 1481425 2304543
36559B304543O18652r1721j171743j915865j665200o05265L18860M79107K73165
$$ 2304543 2923195 2831474 1659731 -256134 -1921334 -2526599 -2207739 -1728632 -1455467
36550a455467M11038P71072N76859l10114r67881n83661M76020J197592J158401
$$ -1455467 -1044429 -273357 303502 -6612 -974493 -1558154 -1082134 115458 1273859
36541A273859P41064L64115Q9369n5010L9187J93151k1625n83121q05182k73755
$$ 1273859 2014923 2379038 2468407 2413397 2452584 2645735 2624110 2040989 1235807 962052
36531I62052L57867J54221o70277q97899n1216Q24784O35039k03477m94084j11841
$$ 962052 1319919 1474140 803863 -94036 -145252 679532 1314571 1111094 617010 505169
36521E05169o3936p56683j305640r18122l0557N08471O45655P86659Q01733K30239
$$ 505169 441233 -315450 -1621090 -2539212 -2569769 -2061298 -1415643 -628984 172749 402988
36511D02988p45314j300519r49743j5000Q35749J108081O88532k7705l77602k09526
$$ 402988 -342326 -1642845 -2592588 -2607588 -1771839 -663758 24774 -2931 -380533 -590059
36501e90059j50453o03846q85086j47789J103193J454834N81572k55949m2576
$$ -590059 -740512 -1344358 -2229444 -2377233 -1274040 180794 762366 506417 463841
36492D63841O23017N92687j51717o83428n76448l37920m54167o68308m29562K70964
$$ 463841 1086858 1679545 1527828 844400 267952 -69968 -524135 -1192443 -1622005 -1351041
36482a351041Q04292O46624L9460l27501k75029l43742q01471r83141k42958Q44663
$$ -1351041 -546749 99875 139335 -188166 -463195 -806937 -1608408 -2591549 -2834507 -1989844
36472a989844J131979N97195L91920J069094J752426J434300K68362q64545j375263
$$ -1989844 -857865 -260670 131250 1200344 2952770 4387070 4655432 3790887 2415624
36463B415624j163443m90194k2494l02653q69783p33411J4101J80700m67485n29593
$$ 2415624 1252181 761987 739493 436840 -432943 -1166354 -1152253 -971553 -1439038 -1968631
36453a968631P26021J811049J216456m3896K2777J104428J056897n66946j754698
$$ -1968631 -1242610 568439 1784895 1740999 1763776 2868204 3925101 3358155 1603457
36444A603457j191152p2944J04398k29808J6822M85435Q4629r16829j070363J00067
$$ 1603457 412305 339361 443759 213951 230773 716208 800837 -115992 -1186355 -1086288
36434a086288J329378J233146n2058j190911j247282o10084k89945n21006n28135
$$ -1086288 243090 1476236 1424178 233267 -1014015 -1624099 -1914044 -2435050 -2963185
36425b963185J26945O29336Q3290q79451p87569M88639J478723J226571M40710
$$ -2963185 -2836240 -2206904 -2123614 -3003065 -3790634 -3301995 -1823272 -596701 -155991
36416a55991J16220J97363K44033L41318N63854M95408J12002K09431J019278
$$ -155991 -39771 157592 401625 742943 1306797 1802205 1914207 2123638 3142916
36407C142916J333133J56157j555127k108682j428407p96831o76389l24514N07241
$$ 3142916 4476049 4632206 3077079 968397 -460010 -1256841 -1933230 -2257744 -1750503
36398a750503J002742O91522K10412K51659O73015R75977Q90572L01574o20752
$$ -1750503 -747761 -56239 154173 405832 1078847 2054824 2945396 3246970 2626218
36389B626218j122452n73617M45976P57607L80267N11192J395852J597977J70811
$$ 2626218 1503766 930149 1376125 2133732 2513999 3025191 4421043 6019020 6189831
36380F189831j659680k095230j156914k33129J12360M49190Q66602N84705n23499
$$ 6189831 4530151 2434921 1278007 1044878 1157238 1606428 2473030 3057735 2534236
36371B534236j301374q84451j8794N7349m89826l32148R32337J909898J117161
$$ 2534236 1232862 348411 329617 386966 -102860 -435008 497329 2407227 3524388
36362C524388j016548k549588k258666p92228M52890Q75078P22054K66604l37055
$$ 3524388 2507840 -41748 -2300414 -3092642 -2639752 -1764674 -1042620 -776016 -1113071
36353a113071o79691l86262J96903K60963l69287r27919o94879J43139Q39308
$$ -1113071 -1792762 -2179024 -1982121 -1721158 -2090445 -3018364 -3713243 -3570104 -2730796
36344b730796R51006O36061L22997K66482L29666K01465r9328j65160J45868L75355
$$ -2730796 -1779790 -1143729 -820732 -554250 -224584 -23119 -122447 -287607 -141739 233616
36334B33616J99628M2380K86464L50280m35920j340651r45549N93292J438726
$$ 233616 433244 475624 762088 1112368 676448 -664203 -1609752 -1016460 422266
36325D22266O75061l76247k23987O77546R68953N06184J21748j6622l85255q21180
$$ 422266 1097327 721080 497093 1174639 2143592 2649776 2771524 2754902 2369647 1548467
36315A548467o53186l1592J31735l47166o17737k16232J95587j01159q32739j170119
$$ 1548467 895281 863689 995424 648258 30521 -185711 9876 -91283 -924022 -2094141
36305b094141p20608J85903Q20836N89657l36652r50346m70631N99215J081503
$$ -2094141 -2814749 -2628846 -1808010 -1218353 -1555005 -2505351 -2975982 -2376767 -1295264
36296a295264O92809K37897K34769K54417j13625m99470m26300p6557J32438K14224
$$ -1295264 -602455 -364558 -129789 124628 11003 -488467 -914767 -991324 -858886 -644662
36286f44662L41752L46009K1532l77868m57503k84593j99669j56430K61806J090627
$$ -644662 -302910 43099 64631 -313237 -770740 -1055333 -1255002 -1411432 -1149626 -58999
36276e8999J611889J030067m76351j626691j282197J80895J170773P46841l14640
$$ -58999 1552890 2582957 2106606 479915 -802282 -621387 549386 1296227 981587
36267I81587p08615k78714J71263K32020J08346j88428p59783j068570m79789
$$ 981587 272972 -5742 165521 397541 505887 317459 -442324 -1510894 -1990683
36258a990683M16020L47636n42229o24286O38977J575552P58738p91115j213825
$$ -1990683 -1574663 -1227027 -1769256 -2393542 -1754565 -179013 579725 -211390 -1425215
36249a425215n23363q7447j48125K66589J179109J293600J51044r01623o04424
$$ -1425215 -1948578 -2036025 -2184150 -1917561 -738452 555148 706192 -195431 -799855
36240g99855M75276R05205L34956l33712l12813K39714O44741M94177m3142n25990
$$ -799855 -324579 580626 915582 581870 269057 508771 1153512 1647689 1604547 1078557
36230A078557p34663p40976n26824O2723P81208R21547K75490l40338j82523K52011
$$ 1078557 343894 -397082 -923906 -861183 -79975 841572 1117062 776724 594201 846212
36220H46212J4316p26153r81509o14227m49504o53258l50587P17287J437444R67221
$$ 846212 860528 134375 -847134 -1461361 -1910865 -2564123 -2914710 -2197423 -759979 207242
36210B07242Q0858k7995N34806Q19366N62621K17628j04973o39325j116381r56850
$$ 207242 288100 260105 794911 1614277 2176898 2394526 2289553 1650228 533847 -423003
36200d23003l17623j6869k73332l60569J90825P71432N46209l38904r28277o50442
$$ -423003 -740626 -757495 -1030827 -1391396 -1200571 -429139 117070 -221834 -1150111 -1800553
36190a800553Q5487M96382L37067L7321Q091O4415k31790p66976q42407j19791
$$ -1800553 -1715066 -1218684 -881617 -844296 -836205 -771790 -1003580 -1770556 -2612963 -2732754
36180b732754P77916R76145M37267p8881n8216J94645J15223l23452o05649l52946
$$ -2732754 -1954838 -978693 -541426 -620307 -678523 -483878 -368655 -692107 -1297756 -1650702
36170a650702K16678O07405O97420P81683Q81900M58045p13400j700553j287558
$$ -1650702 -1434024 -826619 -129199 652484 1534384 1992429 1279029 -421524 -1709082
36161a709082K61905J210600N19190p78249j004034l859R31561R00809K55566
$$ -1709082 -1447177 -236577 282613 -495636 -1499670 -1503529 -571968 328841 584407
36152E84407k24895k21321R0310K84066m0193p40334j025289l95205N45905Q86057
$$ 584407 359512 138191 228501 512567 472374 -267960 -1293249 -1688454 -1142549 -256492
36142b56492P36584Q63867J165786O86466o71580j642597j323245l93136N1671
$$ -256492 480092 1343959 2509745 3196211 2524631 882034 -441211 -834347 -782676
36133g82676k0244p5632j86218o42137r33922k95335R26706J533551J129120N32147
$$ -782676 -802920 -878552 -1064770 -1706907 -2640829 -2936164 -2009458 -475907 653213 1185360
36123A185360L96933L96467J36133k9572K53871M30104k77395j523978k026664
$$ 1185360 1582293 1978760 2114893 2085321 2339192 2769296 2491901 967923 -1058741
36114a058741j185373J23958O80579L92361J76144N78938J092582R77262K92492
$$ -1058741 -2244114 -2120156 -1439577 -1047216 -871072 -292134 800448 1777710 2070202
36105B070202k83559m00455l09229k69385k16693j14310j09523j21074J97916
$$ 2070202 1786643 1386188 1076959 807574 590881 476571 367048 245974 443890
36096D43890P22531O35816m31918j465584j133829L25514J240180P32297j08849
$$ 443890 1166421 1802237 1370319 -95265 -1229094 -903580 336600 1068897 960048
36087I60048J51978J228745J553615M74664r36063j382778q53460k34433j9776
$$ 960048 1112026 2340771 3894386 4369050 3432987 2050209 1196749 962316 942540
36078I42540l8047j72957n90749j129032j125486l17258M94805L26732n50303
$$ 942540 904493 731536 140787 -988245 -2113731 -2430989 -1936184 -1609452 -2159755
36069b159755p77330K54849J412533J256390L9754n80170J97542J232216J022655
$$ -2159755 -2937085 -2682236 -1269703 -13313 26441 -553729 -356187 876029 1898684
36060A898684k96519j232894q92803J01700O57325M75183N221l26193l88963j53812
$$ 1898684 1602165 369271 -523532 -421832 235493 710676 715897 389704 741 -153071
36050a53071K63405M38778j0858q21667j184397o36170L90195J093515J168477
$$ -153071 110334 549112 538254 -283413 -1467810 -2103980 -1713785 -620270 548207
36041E48207R05750O09990K84812r5362l62332m06322m29914o62303q93360o22444
$$ 548207 1453957 2063947 2348759 2253397 1891065 1484743 1054829 392526 -500834 -1123278
36031a123278K12808R35442Q54812J75606k08127J04410M75332J74246m94834
$$ -1123278 -910470 24972 879784 1055390 847263 951673 1427005 1601251 1106417
36022A106417n85900P7537N66694J40643p10732r56137l57589M09858P37141O17392
$$ 1106417 520517 598054 1164748 1305391 594659 -361478 -719067 -309209 427932 1045324
36012A045324K78739j63808n75844p25197n10025o1412M11709O93155N81784J49916
$$ 1045324 1324063 1160255 584411 -140786 -650811 -712223 -300514 392641 974425 1124341
36002A124341j32965O7281L74962J31148o40353j221766j176322p57266k83973
$$ 1124341 991376 1058657 1433619 1564767 924414 -297352 -1473674 -2230940 -2514913
35993b514913K03327M79820J05180p20203r74493r2388J120592J492748R50142
$$ -2514913 -2311586 -1831766 -1726586 -2446789 -3421282 -3513670 -2393078 -900330 49812
35984D9812L13788O6317Q8231K82405N94279N95441o1517q22153p53696M1950
$$ 49812 363600 429917 518148 800553 1394832 1990273 1928756 1106603 352907 394857
35974C94857M35046r5087p13214n37828P4946J72795l89967q55558o15582J84831
$$ 394857 829903 734816 21602 -516226 -441280 -268485 -658452 -1514010 -2129592 -1944761
35964a944761R78127J294115J012990M26665M0365J02957L39463K65552k58658
$$ -1944761 -966634 327481 1340471 1767136 1807501 1910458 2249921 2515473 2256815
35955B256815q38720q88760k33768N52616N99026k58823j144403j152798m65493
$$ 2256815 1418095 529335 295567 848183 1447209 1188386 43983 -1108815 -1574308
35946a574308K4088k5533j87318k12366l59146o24232m64779L33970J162970J364773
$$ -1574308 -1550220 -1575753 -1763071 -1975437 -2334583 -2958815 -3423594 -3089624 -1926654 -561881
35936e61881R69446L42193k92127o22972k54579N59618Q32666Q7278q94931j153685
$$ -561881 407565 749758 457631 -165341 -419920 139698 972364 1059642 164711 -988974
35926i88974p52618k44782L38197J054065J262802M44561n88611n57955L51430
$$ -988974 -1741592 -1986374 -1648177 -594112 668690 1113251 524640 -33315 318115
35917C18115O83721j05337r05819o99250Q3371M72562L29895J80937K90825M60635
$$ 318115 1001836 896499 -9320 -708570 -625199 -152637 177258 358195 649020 1109655
35907A109655L72163j67047r55770j295844p04187K28263L95574l12414q75040
$$ 1109655 1481818 1314771 359001 -936843 -1641030 -1412767 -1017193 -1329607 -2204647
35898b204647o63805j42895K25524O73576J199864J080633J33715n22305j251
$$ -2204647 -2868452 -3011347 -2785823 -2112247 -912383 168250 301965 -220340 -221591
35889b21591Q56248O52631n19376j376720j325107q34884k86724L08826O27523
$$ -221591 634657 1287288 767912 -608808 -1933915 -2768799 -3055523 -2746697 -2119174
35880b119174L02848j81364l9655M41884L27639k08451j11J025659J442063N62954
$$ -2119174 -1816326 -1997690 -2037345 -1595461 -1267822 -1476273 -1476384 -450725 991338 1554292
35870A554292m00771k83814K80377J64067l49076l22310J9790k59902j026669
$$ 1554292 1153521 869707 1150084 1314151 965075 642765 662555 402653 -624016
35861f24016j216053n83709L4445K02029L65034P25873Q16111M71921J85839J47796
$$ -624016 -1840069 -2423778 -2389333 -2187304 -1822270 -1096397 -280286 191635 377474 525270
35851E25270q7806n91599o74558j6288O89915P78131M89055K32106j72205p79896
$$ 525270 437464 -154135 -828693 -844981 -155066 623065 1112120 1344226 1172021 392125
35841C92125r08695j99962M30025M9913o46757l18989P35975Q52283l50149j197997
$$ 392125 -516570 -716532 -286507 -236594 -883351 -1202340 -466365 385918 35769 -1162228
35831a162228m47748Q72564J077203J99962m35708k95580K9449K00536N04892
$$ -1162228 -1609976 -737412 339791 539753 104045 -191535 -162086 38450 543342
35822E43342Q44336N83412k68295p43202k92284L36082K08875m31619o37738j75222
$$ 543342 1387678 1971090 1702795 959593 667309 1003391 1212266 780647 142909 -32313
35812c2313K86533K46565l7555o1886L14157Q26098J004801M39304p62398j786318
$$ -32313 254220 500785 463230 401344 715501 1541599 2546400 2985704 2223306 436988
35802D36988j826192j035487l26531j51448k2547N26398J073864R06047J23728
$$ 436988 -1389204 -2424691 -2751222 -2902670 -2925217 -2398819 -1324955 -418908 -295180
35793b95180m43233l27777Q9898K34234M8403q9719R8697M86060O60277L62924
$$ -295180 -738413 -1066190 -976292 -742058 -693655 -783374 -684677 -198617 461660 824584
35783H24584j09628j34683L78046O46382K5694q51556p03942N52641J445430Q79659
$$ 824584 714956 580273 958319 1604701 1630395 778839 74897 627538 2072968 2952627
35773B952627l21262n81157K19428O98248N0021q49127p94256K2808K92854o66252
$$ 2952627 2631365 2050208 2269636 2967884 3017905 2168778 1374522 1397330 1690184 1023932
35763A023932k008733k279125r66987R64268K024739J604187M13283l92991l12616
$$ 1023932 -984801 -3263926 -4230913 -3266645 -1241906 362281 775564 382573 69957
35754F9957L43380J040852J421053J308845P81175K13592j10384l98537r60961
$$ 69957 413337 1454189 2875242 4184087 4965262 5178854 5068470 4669933 3708972
35745C708972j496365j332306m63276K55972K11154k22751l86700k73514k50644
$$ 3708972 2212607 880301 417025 672997 884151 661400 274700 1186 -249458
35736b49458k52615Q6543O37401P61797K14449m17755m43772K2392K19378j85467
$$ -249458 -502073 -415530 221871 983668 1198117 780362 336590 358982 578360 392893
35726C92893n02216J43288J459082K067293J246696j1067l44262J23713K79875
$$ 392893 -109323 33965 1493047 3560340 4807036 4795969 4451707 4575420 4855295
35717D855295l1439J0545K94535m10307k154353l049817j923890k10513K54727
$$ 4855295 4823856 4834401 5128936 4718629 2564276 -485541 -2409431 -2619944 -2365217
35708b365217n5884K96457Q62875J84093j131067r17471Q91099J798271N87402
$$ -2365217 -2421101 -2124644 -1261769 -1077676 -2208743 -3126214 -2235115 -436844 150558
35699A50558q80167q28017k15977o20253j407495j040804J76411P83821O81356
$$ 150558 -729609 -1557626 -1773603 -2393856 -3801351 -4842155 -4665744 -3881923 -3200567
35690c200567Q91054J387003J208288M75657L25590Q08509P12345k45426p96728
$$ -3200567 -2309513 -922510 285778 761435 1087025 1895534 2607879 2362453 1565725
35681A565725k31853M30887J71439m19273k19796O40671J072474N69692l43871
$$ 1565725 1333872 1764759 1936198 1516925 1297129 1937800 3010274 3579966 3236095
35672C236095r03849p56397n5284O65986Q87934N95388J80454j52646m81936o70273
$$ 3236095 2332246 1575849 1520565 2186551 3074485 3669873 3850327 3697681 3215745 2545472
35662B545472l61366L65506Q84261P76455K32174m06098r32234j010446l48647
$$ 2545472 2184106 2549612 3433873 4210328 4442502 4036404 3104170 2093724 1745077
35653A745077N88008P72780k8354p35174l24170P99370J385676R03324p0235p47076
$$ 1745077 2333085 3105865 3077511 2342337 2018167 2817537 4203213 5106537 5036302 4289226
35643D289226q53734n95083l58707m17584o45455o17824j80235K73843L01454
$$ 4289226 3435492 2840409 2481702 2064118 1418663 800839 620604 894447 1195901
35634A195901N98j09585L09276J023009J334720O89741n79073j332052r22366
$$ 1195901 1196499 1086914 1396190 2419199 3753919 4443660 3864587 2532535 1610169
35625A610169j63383k53407r25795p76380M23857J063771K4201j475452j461440
$$ 1610169 1446786 1193379 267584 -508796 -84939 978832 1003033 -472419 -1933859
35616a933859J05377J444160J400059O03041K05210M46507P21250M65389k58177
$$ -1933859 -1828482 -384322 1015737 1618778 1823988 2270495 2991745 3457134 3198957
35607C198957q06613o28403k7445R9578m66233q40475l62197L16541K35604l50679
$$ 3198957 2392344 1763941 1736496 1836074 1369841 529366 167169 483710 719314 368635
35597C68635m44276P4946L90607J71120k9879J49609L78138L70192K75263J40574
$$ 368635 -75641 -695 389912 561032 531153 680762 1058900 1429092 1704355 1844929
35587A844929k38142p29116q37545m59513k9542J94609L43473L94847J74791m3055
$$ 1844929 1606787 877671 40126 -419387 -448929 -254320 89153 484000 658791 615736
35577F15736K16252O58279M12844n65882j244740j023703n60945n90937q25809
$$ 615736 831988 1490267 1903111 1337229 92489 -931214 -1492159 -2083096 -2908905
35568b908905o85282l22998j52073K8288O11832J306363J427300Q30566m567n82336
$$ -2908905 -3594187 -3917185 -4069258 -4040970 -3429138 -2122775 -695475 135091 130524 -451812
35558d51812o50412j72876N29686R00474P37468L64897O2546j70958j79077K51557
$$ -451812 -1102224 -1275100 -745414 155060 892528 1257425 1319971 1149013 969936 1221493
35548A221493O20672L4699j248599j717139p75057J69223j61682q74250m73568
$$ 1221493 1842165 1876864 628265 -1088874 -1863931 -1694708 -1856390 -2730640 -3204208
35539c204208N25973M63624n47711o92470N56397J592910J269387M23374L7766
$$ -3204208 -2678235 -2214611 -2762322 -3454792 -2898395 -1305485 -36098 387276 425042
35530D25042l72959j372419k022055j171213N41241J411138R39148J56628k6273
$$ 425042 52083 -1320336 -3342391 -4513604 -3972363 -2561225 -1622077 -1465449 -1491722
35521a491722L20507Q17900J286603J493062J167101M34293k87510q45597j333129
$$ -1491722 -1171215 -353315 933288 2426350 3593451 4027744 3740234 2894637 1561508
35512A561508j575360j193172k51722O03193P89431L23852k75869m18529R8324
$$ 1561508 -13852 -1207024 -1458746 -855553 -66122 257730 -18139 -436668 -338344
35503c38344Q04487R20579K74300m09218m61833j56233j35177l26837j74055K41692
$$ -338344 466143 1386722 1661022 1251804 789971 633738 498561 171724 -2331 239361
35493B39361J90273m97575j042838q34301k11768K65792O62394J193501J444859
$$ 239361 429634 -67941 -1110779 -1945080 -2156848 -1891056 -1228662 -35161 1409698
35484A409698Q35504l45222j083268q41559n6605O12897R66974J021346O48867
$$ 1409698 2245202 1899980 816712 -24847 -81452 531445 1498419 2519765 3168632
35475C168632j16258p64435q08423m74273m24476p84040r17858l65739M11586
$$ 3168632 3052374 2287939 1479516 1005243 580767 -203273 -1121131 -1486870 -1075284
35466a075284N90616N6705n18814o06349l62339j36284J23859O24972J124982
$$ -1075284 -484668 -427963 -946777 -1553126 -1915465 -2051749 -1927890 -1302918 -177936
35457a77936J034120J89541p82769j088208o23308j1858J95988J27980K51911
$$ -177936 856184 1045725 262956 -825252 -1448560 -1460418 -1264430 -1136450 -884539
35448h84539O15150P49021L65132j95866m24851k83522o6347J63401N48981R16512
$$ -884539 -269389 479632 844764 648898 224047 -59475 -125822 37579 586560 1503072
35438A503072P96791J30133m67197m20360P4228L03774j21697q90799j357754
$$ 1503072 2299863 2429996 1962799 1542439 1616667 1920441 1798744 907945 -449809
35429d49809j147854m61614J61350M16672M75836N31494L74802j69166o23503
$$ -449809 -1597663 -2059277 -1897927 -1481255 -1005419 -473925 -99123 -268289 -891792
35420h91792l48890L93983O76015L36637K62613Q29411J069298J87028r58667
$$ -891792 -1240682 -846699 -170684 165953 428566 1257977 2327275 2514303 1555636
35411A555636j006966j59881J92830l40091p16854l19773R6952k00718p13939
$$ 1555636 548670 388789 581619 241528 -475326 -795099 -698147 -898865 -1612804
35402a612804o27123j14668J02544k7002M8545M69854P74742O80022M53628L89391
$$ -1612804 -2239927 -2354595 -2252051 -2279053 -2230508 -1760654 -985912 -305890 147738 537129
35392E37129L27661n4788o25856p45398k5924R44752J070179J41091p39303o17997
$$ 537129 864790 810002 184146 -561252 -587176 357576 1427755 1568846 829543 211546
35382B11546n9381k07198q61677o91657O25917J773946J687761Q79516K60429
$$ 211546 152165 -55033 -916710 -1608367 -982450 791496 2479257 3358773 3619202
35373C619202k22433r01751j317678r14001j32460K40369K79619M62187N28279
$$ 3619202 3396769 2495018 1177340 263339 130879 371248 650867 1113054 1641333
35364A641333p1779r67810j239154p51596r3986N05043J075008J070052P347j210769
$$ 1641333 1569554 601744 -637410 -1389006 -1482992 -977949 97059 1167111 1174458 -36311
35354c6311j095035K24983J075359P41156L17061N84518O97696j07577r68671
$$ -36311 -1131346 -906363 168996 910152 1227213 1811731 2509427 2401850 1433179
35345A433179q10543j84532k91988r36736q94408Q0848R60198J030502O51338
$$ 1433179 622636 438104 146116 -790620 -1685028 -1604180 -643982 386520 1037858
35336A037858L92786L33797L15020J92794k04622q35075j246604j118337p74371
$$ 1037858 1430644 1764441 2079461 2272255 2067633 1232558 -14046 -1132383 -1906754
35327a906754o35198n23914j93745r8187o74361j170179l87844J374292K329133
$$ -1906754 -2541952 -3065866 -3259611 -3357798 -4032159 -5202338 -5590182 -4215890 -1886757
35318a886757J492399o7767p63403l62928K89154O47238P50455O36964L15208
$$ -1886757 -394358 -462125 -1225528 -1588456 -1299302 -652064 98391 735355 1050563
35309A050563J07217L18060O54831N66317R5227k07831k37566n43629j343827
$$ 1050563 1157780 1475840 2130671 2696988 2792215 2584384 2346818 1803189 459362
35300D59362j921116j507080m03829L93965N44602O20053R52638J041527N58723
$$ 459362 -1461754 -2968834 -3372663 -2978698 -2434096 -1814043 -861405 180122 738845
35291G38845J95350O71054J379865J084655j89527j084794q51097k22488k2477
$$ 738845 934195 1605249 2985114 4069769 3880242 2795448 1944351 1721863 1699386
35282A699386o0193j4339k78978j025266j382622o53048M01455O38738K72119
$$ 1699386 1639193 1624854 1345876 320610 -1062012 -1715060 -1313605 -674867 -402748
35273d02748K80136O06832L56884m87580r57583o46740q7932L80027Q51654J002739
$$ -402748 -122612 484220 841104 353524 -604059 -1250799 -1338731 -958704 -107050 895689
35263H95689L65423m89542m60289K59711L44614m53185q62872k78138K88144P1403
$$ 895689 1261112 771570 311281 570992 915606 462421 -400451 -678589 -390445 -319042
35253c19042k65197j38020j25013n66893o53941j3380L55978m0067m6836R22550
$$ -319042 -584239 -722259 -847272 -1414165 -2068106 -2081486 -1725508 -1765575 -1812411 -889861
35243h89861J293364r2567j465335o71001J089235R75916q43756j496603j87515
$$ -889861 403503 310936 -1154399 -1825400 -736165 239751 -604005 -2100608 -2288123
35234b288123O87874j79841q67829K65270J703115J369118p862l48676L75880
$$ -2288123 -1600249 -1780090 -2647919 -2382649 -679534 689584 681722 333046 708926
35225G08926M50136o41025j594999j381388l78158N38568Q69693N03130k38262
$$ 708926 1159062 518037 -1076962 -2458350 -2836508 -2297940 -1428247 -925117 -1163379
35216a163379o29997l01150K36270L21382R225k92476m79018m66269O9190R68533
$$ -1163379 -1793376 -2094526 -1858256 -1536874 -1527649 -1820125 -2299143 -2765412 -2696222 -1727689
35206a727689J320427P24514J14195M10185J075195J047533M04325r8056m73042
$$ -1727689 -407262 317252 431447 841632 1916827 2964360 3368685 3270629 2797587
35197B797587j107120j462432p50534M16256O91222J69467J77756Q61207Q55237
$$ 2797587 1690467 228035 -522499 -106243 584979 754446 932202 1793409 2648646
35188B648646k66394j117444q10359l49198o60253q88840p3254Q67025N33338
$$ 2648646 2382252 1264808 454449 105251 -555002 -1443842 -1517096 -650071 -116733
35179a16733n30181o52690K93336Q79263N36574J46449J22396k61327j102886
$$ -116733 -646914 -1299604 -1006268 -127005 409569 556018 678414 417087 -685799
35170f85799j123087L33617J839500J663849J82434p63595m23364K40981L32930
$$ -685799 -1808886 -1475269 364231 2028080 2210514 1446919 1023555 1264536 1597466
35161A597466J45127K26940L61710N5624n84229j050164j143909r88210o00369
$$ 1597466 1742593 1969533 2331243 2386867 1802638 752474 -391435 -1379645 -1980014
35152a980014N0631P05233R84256Q59958O07835L55696M8665j89937r7580K65253
$$ -1980014 -1929383 -1224150 -239894 620064 1227899 1583595 1632260 1442323 1344743 1609996
35142A609996M84699L40499L5479k33851n55497r64128j178430r30826l20261
$$ 1609996 2094695 2435194 2470673 2236822 1681325 717197 -461233 -1392059 -1712320
35133a712320L21593O49859L49570n48892j242921p08069R05327K061645J635662
$$ -1712320 -1390727 -740868 -391298 -940190 -2183111 -2891180 -1985853 75792 1711454
35124A711454L48718l35609j84336n4915k10765p7060L77224L76220k38795n74584
$$ 1711454 2060172 1724563 1540227 1485312 1274547 1197487 1574711 1950931 1712136 1137552
35114A137552k02138M8372m66513j017609p07880Q476J19796k77926l17760M8962
$$ 1137552 935414 983786 517273 -500336 -1208216 -1199740 -1079944 -1357870 -1675630 -1626668
35104a626668O4749l71851m77840O5206O01491N95901L28165J81487M3445k17335
$$ -1626668 -1561919 -1933770 -2411610 -2346404 -1744913 -1149012 -820847 -639360 -595915 -813250
35094h13250l73187l19439l23457m18045j38915O79104J341507J056120k5257
$$ -813250 -1186437 -1505876 -1829333 -2247378 -2386293 -1707189 -365682 690438 665181
35085F65181r38297r14110l7080Q93164J038914L29699l82593l22048J53767P9798
$$ 665181 -273116 -1187226 -1224306 -331142 707772 1037471 654878 332830 486597 566395
35075E66395n96934q72808k39866N45699O61370K96933k1180l09373o10885m32134
$$ 566395 -30539 -903347 -1143213 -597514 63856 360789 339609 30236 -580649 -1012783
35065a012783M07046J068931Q32851L04315M11715P92351M51966m08418o48898
$$ -1012783 -605737 463194 1296045 1600360 2012075 2804426 3256392 2847974 2199076
35056B199076o6726M22818M31666M74947O41018L92906j10665p1182K66882k73869
$$ 2199076 2132350 2555168 2986834 3461781 4102799 4495705 4385040 4313858 4580740 4306871
35046D306871j482626j501116J29017J163817k3463j620756j032398R70701J360113
$$ 4306871 2824245 1323129 1452146 2615963 2592500 971744 -60654 910047 2270160
35037B270160m93603j997104j334309K04875O62840J12750k32009o5696J34090
$$ 2270160 1776557 -220547 -1554856 -1349981 -687141 -574391 -806400 -872096 -738006
35028g38006K43714L39488J25600m95209q47940l45483N46874R53583P59965M62589
$$ -738006 -494292 -154804 -29204 -524413 -1372353 -1717836 -1170962 -217379 542586 1005175
35018A005175K79608R5833o1121j36506l43837p74031j014641p11642k07175n7768
$$ 1005175 1284783 1380616 1319495 1182989 839152 65121 -949520 -1661162 -1868337 -1926105
35008a926105j92759j12834L06463P51826J017925J108444R55003M99568o4987
$$ -1926105 -2118864 -2231698 -1925235 -1173409 -155484 952960 1907963 2407531 2342544
34999B342544m86497p01749o37899j37054N67462P61666J60470m94536l46693
$$ 2342544 1856047 1154298 516399 379345 946807 1708473 1868943 1374407 1027714
34990A027714L92695P94255M69375j47448n42193n32423j46818L13975L15313
$$ 1027714 1420409 2214664 2684039 2536591 1994398 1461975 1315157 1629132 1944445
34981A944445k47528p04777n11627j06844j76033m98001l97798N5779L23388N03007
$$ 1944445 1696917 992140 480513 373669 197636 -300365 -698163 -642384 -318996 184011
34971A84011R80672J261784N54493n77731p24049O1964J78268q17154j236807
$$ 184011 1164683 2426467 2980960 2403229 1679180 1741144 1919412 1102258 -134549
34962a34549K5158J504837J338693Q9137l46831K48345M11209l84937j012072
$$ -134549 -109391 1395446 2734139 2823276 2476445 2724790 3135999 2751062 1738990
34953A738990o95753r5422M0488m2517O3711R4635k34686n65654n43644m96919
$$ 1738990 1043237 947815 988303 945786 1009497 1104132 869446 303792 -239852 -736771
34943g36771q16840j128630p48622K63403J084572J141213P63799P32070J293353
$$ -736771 -1553611 -2682241 -3430863 -3167460 -2082888 -941675 -177876 554194 1847547
34934A847547J742202J138612m66872j812424j763393o30696L24918M95546L61496
$$ 1847547 3589749 4728361 4261489 2449065 685672 54976 379894 875440 1236936
34925A236936L87922L31501p0495m54911l86480p2607j4587k84078o07501q72356
$$ 1236936 1624858 1956359 1885864 1430953 1044473 971866 957279 673201 65700 -806656
34915h06656j066416r50493l31750M22955O51610K35415k03738o1470N42291R35161
$$ -806656 -1873072 -2823565 -3155315 -2732360 -2080750 -1845335 -2049073 -2110543 -1568252 -633091
34905f33091O38369j38956p18791o74721k97862j86632l85669k69598N24838J393645
$$ -633091 5278 -133678 -852469 -1527190 -1825052 -2011684 -2397353 -2666951 -2142113 -748468
34895g48468J407265N14229l48845l96886J26509L77810k9591o37096p52851k67505
$$ -748468 658797 1173026 824181 427295 553804 931614 902023 264927 -487924 -755429
34885g55429K51331K72096n1415j53548Q2467J24576l59999q35566n13807N33563
$$ -755429 -504098 -232002 -283417 -436965 -354498 -229922 -589921 -1425487 -1939294 -1405731
34875a405731J372145J329490O83910J25798n6916l9250l5946j20479k92016m66531
$$ -1405731 -33586 1295904 1979814 2105612 2048696 2009446 1973500 1853021 1561005 1094474
34865A094474m98511l86200l37033m67697n79864m24324o7104J98901J91109r2226
$$ 1094474 595963 209763 -127270 -594967 -1174831 -1599155 -1666259 -1467358 -1276249 -1368475
34855a368475n63155r48717p97609J5968Q79315J001460M23416k7266P7700K22145
$$ -1368475 -1931630 -2880347 -3677956 -3661988 -2782673 -1781213 -1357797 -1385063 -1307363 -1085218
34845a085218m2486j51659O31435J730252J629023m7705j738343j843014p72816
$$ -1085218 -1127704 -1279363 -647928 1082324 2711347 2663642 925299 -917715 -1690531
34836a690531k26701p55752j142888l70361Q57092J207855N89196l626r5938j30642
$$ -1690531 -1917232 -2672984 -3815872 -4186233 -3329141 -2121286 -1532090 -1535716 -1631654 -1762296
34826a762296l14869j87739L23612M37622k14253o65828J01847J479758J911659
$$ -1762296 -2077165 -2264904 -1941292 -1503670 -1717923 -2383751 -2281904 -802146 1109513
34817A109513J048483J21003R1915N00564M79145k1529n32643q12708p08010L6235
$$ 1109513 2157996 2278999 2370914 2871478 3350623 3329094 2796451 1983743 1275733 1311968
34807A311968J139509J565378P43807m39617p34107k49646j28450o79155r32663
$$ 1311968 2451477 4016855 4760662 4321045 3586938 3337292 3208842 2529687 1597024
34798A597024k35276O80167O89892k53167j105705q77122M46577J847524K082098
$$ 1597024 1361748 2041915 2731807 2478640 1372935 495813 942390 2789914 4872012
34789D872012Q94764n87042j101538p85625q11587j547736j993223j320333q3418
$$ 4872012 5766776 5179734 4078196 3292571 2480984 933248 -1059975 -2380308 -2463726
34780b463726O57831O97598N08515L00062J6099j32450P7378L04848L0453o06979
$$ -2463726 -1805895 -1108297 -599782 -299720 -283621 -416071 -338693 -33845 -3392 -610371
34770f10371r89512r24889p20411m09911L46358J402230J836184R92487n10210
$$ -610371 -1599883 -2524772 -3245183 -3655094 -3308736 -1906506 -70322 922165 411955
34761D11955j295010p43433L30930O88530J54386k56930K22312J026653J069678
$$ 411955 -883055 -1626488 -1295558 -607028 -452642 -709572 -487260 539393 1609071
34752A609071L00063l07899k36355M292j6535Q2233O13391J047905Q23516K57811
$$ 1609071 1909134 1601235 1364880 1369172 1352637 1434870 2048261 3096166 3919682 4177493
34742D177493r6402l90374r31656j278351q91176k61858k89674p95234p91993
$$ 4177493 4081091 3690717 2759061 1480710 589534 327676 38002 -757232 -1549225
34733a549225j22991L28172J05897k46156k48975j02887k6683O8398O5320k30448
$$ -1549225 -1672216 -1344044 -1238147 -1484303 -1733278 -1836165 -1862848 -1794450 -1729130 -1959578
34723a959578l29759M28940J406615J076493n87380j587794o52892Q50083R74941
$$ -1959578 -2289337 -1860397 -453782 622711 35331 -1552463 -2205355 -1355272 -380331
34714c80331L698l74768J28436K63873l59513o06917J40535Q63295N32353l11348
$$ -380331 -376633 -751401 -622965 -359092 -718605 -1325522 -1184987 -321692 210661 -100687
34704a00687m87825Q8751N18442L22333j06524l03620k61288j04021J83991M89059
$$ -100687 -588512 -499761 18681 341014 234490 -69130 -330418 -434439 -250448 238611
34694B38611M46147n7878m80693j61966P31283J233455P57621j38426n14636k39068
$$ 238611 684758 626880 146187 -15779 715504 1948959 2706580 2568154 2053518 1814450
34684A814450R9485K04896K85232L22301l7754o72666q58698l36668J93728J14654
$$ 1814450 1913935 2118831 2404063 2726364 2688610 2015944 1157246 820578 1014306 1128960
34674A128960k15052j59640J86759L38033K57233J70749o781l25257l08690L36229
$$ 1128960 913908 754268 941027 1279060 1536293 1707042 1700261 1375004 1066314 1402543
34664A402543Q66241L23603r65378j705935j402325p89280m10518J27679J082831
$$ 1402543 2268784 2592387 1627009 -78926 -1481251 -2270531 -2681049 -2553370 -1470539
34655a470539J742201J353059K56370n95133q49537q63687q68402o58044j05322
$$ -1470539 271662 1624721 1881091 1285958 436421 -427266 -1295668 -1953712 -2059034
34646b059034M64783N72296J18008m41826m95281N4069N91509M83241r8618l59469
$$ -2059034 -1594251 -1021955 -903947 -1345773 -1841054 -1786985 -1195476 -712235 -810853 -1170322
34636a170322J01513Q15684J080092P33090J38448l24265n51867o66502q18265
$$ -1170322 -1068809 -253125 826967 1560057 1698505 1374240 822373 155871 -662394
34627f62394r56550q02454k01897N46218R37310P97610L57615r9820l68977k47372
$$ -662394 -1618944 -2421398 -2623295 -2077077 -1139767 -342157 15458 -84362 -453339 -700711
34617g00711K27801N40493K20043l52713k43371P14379J431902Q22316p61627
$$ -700711 -472910 67583 287626 -65087 -308458 405921 1837823 2660139 1898512
34608A898512j802309j289371J85583J116166P66190l8562k1085P95793J063619
$$ 1898512 96203 -1193168 -1007585 108581 874771 836209 815124 1610917 2674536
34599B674536O5660j079099r28132J67284O10967P17l41575M73503J525963J533147
$$ 2674536 2740196 1661097 732965 900249 1511216 1511933 1170358 1643861 3169824 4702971
34589D702971O29010j78612n57996q90210j259359j373305j246506j146883j017583
$$ 4702971 5331981 5153369 4595373 3705163 2445804 1072499 -174007 -1320890 -2338473
34580b338473o34787j59444J25877M13366R79546J392071R54243q7147o52143
$$ -2338473 -2973260 -3132704 -3006827 -2593461 -1613915 -221844 732399 645252 -6891
34571f891k99759K24752K00187q2478j626L79386O00548O45615P71865P56960
$$ -6891 -306650 -81898 118289 35811 34185 413571 1014119 1659734 2431599 3188559
34561C188559J25750q40200j122074l48295M92657L36881m10821m79384K74326
$$ 3188559 3314309 2474109 1352035 1003740 1496397 1833278 1422457 943073 1217399
34552A217399N53986l50109j282004q32733N21179J081835L73336m07151l84800
$$ 1217399 1771385 1421276 139272 -693461 -172282 909553 1282889 875738 490938
34543D90938n9244K6685K97964R97480J164385n8120j801066k388618j509825
$$ 490938 431694 458379 756343 1753823 2918208 2860088 1059022 -1329596 -2839421
34534b839421l33592L21029P54972J306941J631680J398498Q72326L99783o6878
$$ -2839421 -3173013 -2851984 -2097012 -790071 841609 2240107 3112433 3512216 3445338
34525C445338n79225q40777o04691o1225M37764P33011P46803L49335m13659j155050
$$ 3445338 2866113 2025336 1420645 1359420 1797184 2530195 3276998 3626333 3212674 2057624
34515B057624j398245r44255k3873P87466R43695M51782r5481k15704n9347j0142
$$ 2057624 659379 -284876 -308749 478717 1422412 1874194 1778713 1563009 1503662 1493520
34505A493520r6328j39004j00293J27618P72596J463744J139891l98594j498770
$$ 1493520 1397192 1258188 1157895 1285513 2058109 3521853 4661744 4263150 2764380
34496B764380n73368J360039J720284r750j501478r50056N52827J017652L55369
$$ 2764380 2191012 3551051 5271335 5261585 3760107 2810051 3362878 4380530 4735899
34487D735899k22054l66559n02239l99989L92364J140197O90901m84481p12506
$$ 4735899 4513845 4147286 3645047 3245058 3637422 4777619 5468520 4984039 4271533
34478D271533L08954J022213M79932l10752k34965J98552L7193l57511m9586O94560
$$ 4271533 4580487 5602700 6082632 5771880 5536915 5735467 5772660 5415149 5365563 6060123
34468F060123P45350o5660p04718n17707Q404K45159K86997M80133P59137Q37832
$$ 6060123 6805473 6739813 6035095 5517388 5525792 5770951 6057948 6538081 7297218 8135050
34458H135050O16055J26337n14227q88178m95821M89212J115753P27830j63967
$$ 8135050 8751105 8877442 8363215 7475037 6979216 7468428 8584181 9312011 9148044
34449I148044n00793P8406J025389J686424J820004J451288P74859K39273K30797
$$ 9148044 8647251 8725657 9751046 11437470 13257474 14708762 15483621 15722894 15953691
34440A5953691N43528N73129J74527p2756L51024J210995J848048J936198J701880
$$ 15953691 16497219 17070348 17244875 17172119 17523143 18734138 20582186 22518384 24220264
34431B4220264J624575K079316L010797L813856L847730L234943K803834L064043
$$ 24220264 25844839 27924155 30934952 34748808 38596538 41831481 44635315 47699358
34423D7699358L664588M104943M470305N066143N802678O433207O986458P480771
$$ 47699358 51363946 55468889 59939194 65005337 70808015 77241222 84227680 91708451
34415I1708451P710953P910930R038144J1554525J4433833J6404202J7735029
$$ 91708451 99419404 107330334 116368478 127923003 142356836 158761038 176496067
34408A76496067J9516184K1433384K1813790J9994908J7011505J3441976Q247350
$$ 176496067 196012251 217445635 239259425 259254333 276265838 289707814 297955164
34401B97955164P80751p389080j3972082j8364657k1308029k2952900k2756095
$$ 297955164 298735915 291346835 277374753 259010096 237702067 214749167 191993072
34394A91993072k0919843j8523392j6279177j4250245j2645829j1735513j1007000
$$ 191993072 171073229 152549837 136270660 122020415 109374586 97639073 86632073
34387H6632073r570368p539118n989366n402566n146939m676644m212103l952233
$$ 86632073 77061705 69522587 63533221 58130655 52983716 48307072 44094969 40142736
34379D0142736l633254l247705l202155l302339k624364j049454Q1377k57278
$$ 40142736 36509482 33261777 30059622 26757283 24132919 23083465 23164842 22907564
34371B2907564j194402j251771n71586n40699j457224j994682j268851k39032
$$ 22907564 21713162 20461391 19889805 19349106 17891882 15897200 14628349 14389317
34363A4389317l46687j495015k221164j600918k37324O81209P04922K26099l14772
$$ 14389317 14042630 12547615 10326451 8725533 8488209 9169418 9874340 10100439 9785667
34354I785667q01860j111407r85671m96292k00952m14622o44392l06547K22522
$$ 9785667 8983807 7872400 6886729 6390437 6189485 5774863 5130471 4823924 5046446
34345E046446K5524q83859j367298p55946J64838L51523J9109J22940P29141R26658
$$ 5046446 5071970 4188111 2820813 2064867 2229705 2581228 2600337 2723277 3452418 4379076
34335D379076L70585q2153L04724R34285O82186m48220j256439r57700j64155
$$ 4379076 4749661 4667508 4972232 5906517 6588703 6140483 4884044 3926344 3762189
34326C762189J04005j45381j02841L78467M06555n69077j725301j839512q51396
$$ 3762189 3866194 3720813 3617972 3996439 4402994 3833917 2108616 269104 -582292
34317e82292K64696Q88644J170760J179037O22636l31122q27135l71251M91889
$$ -582292 -317596 571048 1741808 2920845 3543481 3212359 2385224 2013973 2505862
34308B505862R38943P57064J59490o30579j207636j094349n35822m70747j109676
$$ 2505862 3444805 4201869 4361359 3730780 2523144 1428795 892973 422226 -687450
34299f87450j338401l56531Q98744J085382N32099N61277J147219R37626l18686
$$ -687450 -2025851 -2382382 -1483638 -398256 133843 695120 1842339 2779965 2461279
34290B461279j086092l69788P36931P39468j64776p39809o01064k93818n1733
$$ 2461279 1375187 1005399 1742330 2481798 2317022 1577213 976149 682331 630598
34281F30598L20065N80244K20815m74017n51135J93665P74724M07915l33300l64881
$$ 630598 950663 1530907 1751722 1277705 726570 920235 1694959 2102874 1769574 1404693
34271A404693K89534M73474m51507j570846j509741k69482P14297M67925k87039
$$ 1404693 1694227 2167701 1716194 145348 -1364393 -1633875 -919578 -451653 -738692
34262g38692l27526K57658L99916p9557j58181N96909J136052N28467m99424o13977
$$ -738692 -1066218 -808560 -408644 -488201 -646382 -49473 1086579 1615046 1115622 501645
34252E01645J66767O68304L85371k9110p5908j17248m80520p36650l72856L73170
$$ 501645 668412 1336716 1722087 1692977 1617069 1499821 1019301 282651 -90205 282965
34242B82965Q25884O75626J19948m98797q65759p45149k16162K39469J72622k98187
$$ 282965 1108849 1784475 1904423 1405626 539867 -205282 -421444 -181975 -9353 -307540
34232c07540n59265j72153N96310J015310P11459J23131p0593J33293J24221l08135
$$ -307540 -866805 -1038958 -442648 572662 1284121 1407252 1336659 1469952 1594173 1286038
34222A286038n85447k60372K23029K01018k01392l50226q8421K03060K93898J94336
$$ 1286038 700591 440219 663248 864266 662874 312648 224227 427287 721185 915521
34212I15521k12733q87963j183237n36153M75668P19732J75598p244O82881J320159
$$ 915521 702788 -185175 -1368412 -1904565 -1428897 -709165 -533567 -540811 142070 1462229
34202A462229R92457R5695m28634l76357j70863j12687l17362p96752j079282
$$ 1462229 2454686 2550381 2121747 1745390 1574527 1461840 1144478 347726 -731556
34193g31556m34527R32106J649857Q88274m04178q21199m07840k42624o40793
$$ -731556 -1166083 -233977 1415880 2304154 1899976 1078777 670937 428313 -212480
34184b12480r27855p31538l83343j28836P0696K7548m12714o65763J5850J221357
$$ -212480 -1140335 -1871873 -2255216 -2384052 -2313356 -2285808 -2698522 -3364285 -3348435 -2127078
34174b127078J662389R40205O0552o3118L13996N37375N33984N42716N27047L35445
$$ -2127078 -464689 475516 536068 472950 786946 1324321 1858305 2401021 2928068 3263513
34164C263513J3285l18983n12669k88733L63351P67664L18291m03080k51891O82605
$$ 3263513 3276798 2957815 2445146 2156413 2519764 3287428 3605719 3202639 2950748 3633353
34154C633353J084109M68105r5621J23106K77021m66695j344627j272190p15419
$$ 3633353 4717462 5185567 5089946 5213052 5490073 5023378 3678751 2406561 1691142
34145A691142q00161j223963p17595O47401J268542L65218q63529r59901o2236
$$ 1691142 890981 -332982 -1050577 -403176 865366 1230584 367055 -592846 -655082
34136f55082N85913K93712n13862j009077p80646j02862L96750M20935L03214
$$ -655082 -69169 224543 -289319 -1298396 -2079042 -2181904 -1785154 -1364219 -1061005
34127a061005M44042O54640M39916k18702p91040q15780k39481O65918J333768
$$ -1061005 -616963 37677 477593 258891 -532149 -1347929 -1587410 -921492 412276
34118D12276J146983J87765n30316k09987N82618O17041l51942j410400j816618
$$ 412276 1559259 1747024 1216708 1006721 1589339 2206380 1854438 444038 -1372580
34109a372580j637341j095556k31154O41396J022133J013372J216495J614055
$$ -1372580 -3009921 -4105477 -4336631 -3695235 -2673102 -1659730 -443235 1170820
34101A170820J418975L92414n40116n11396J42585N06505K68898k64600q34374
$$ 1170820 2589795 2982209 2442093 1930697 2073282 2579787 2848685 2584085 1749711
34092A749711j326772j544202j335658p51926R1640R23458J078962R9429j235047
$$ 1749711 422939 -1121263 -2456921 -3208847 -3117207 -2193749 -1114787 -1015358 -2250405
34083b250405j388095n9574J201237J043189J02632j49700M21287P57225M31046
$$ -2250405 -3638500 -3698074 -2496837 -1453648 -1351016 -1500716 -1079429 -322204 108842
34074A08842N2421j2963j10224l24042r8487P69451J523147J325089L04440o52811
$$ 108842 161263 148300 38076 -285966 -384453 384998 1908145 3233234 3537674 2884863
34064B884863r06092o00081l33765m28035n56791k34079L86522O26672L03257
$$ 2884863 1978771 1378690 1044925 616890 60099 -173980 212542 839214 1142471
34055A142471J5233Q9843r654o14828r67947l56061N03842M29309k74980k32097
$$ 1142471 1157704 1247547 1237893 623065 -344882 -700943 -197101 232208 -42772 -274869
34045b74869P30037J208270M15147o51880q10161k84204K7807q2867k81740m20561
$$ -274869 455168 1663438 2078585 1426705 616544 332340 360147 277280 -4460 -425021
34035d25021l83644J01267Q10718Q98645J51729l75135J56580R67580P92096j83085
$$ -425021 -808665 -707398 103320 1001965 1153694 778559 935139 1902719 2694815 2511730
34025B511730p28751n39258m51139p89583q49465k62551L24209L91145L43987
$$ 2511730 1782979 1243721 792582 2999 -846466 -1109017 -784808 -393663 -49676
34016d9676N79009O15434q3806j027367j240319n81018J92383N16229N46285N88746
$$ -49676 529333 1144767 1060961 33594 -1206725 -1787743 -1595360 -1079131 -532846 55900
34006E5900N67285K82352j05423j62526K30053N67303K43057n80438r70268l82035
$$ 55900 623185 905537 800114 637588 867641 1434944 1678001 1097563 127295 -254740
33996b54740N13070O97018K55827J74626P12525R65989L80675l04372l02513p4849
$$ -254740 258330 955348 1211175 1385801 2098326 3064315 3444990 3140618 2838105 2763256
33986B763256l84766p55246j76028R78761J205378J56781p41735m37824K70435
$$ 2763256 2378490 1623244 1447216 2425977 3631355 3788136 3046401 2608577 2879012
33977B879012J74487n23668q47290o46534l84731N1623R88259J727276J100172
$$ 2879012 3053499 2529831 1682541 1036007 651276 702899 1691158 3418434 4518606
33968D518606o81501k018604k026825j461143j173736q80526j30746O04822P58657
$$ 4518606 3837105 1818501 -208324 -1669467 -2843203 -3723729 -3854475 -3249653 -2490996
33959b490996P47365J194313J683587J370246M23872k15954k78678l11482n38976
$$ -2490996 -1743631 -549318 1134269 2504515 2928387 2712433 2433755 2122273 1583297
33950A583297o36241o14831q61235j173428q15913K11382R76996J039208J034122
$$ 1583297 947056 332225 -529010 -1702438 -2518351 -2306969 -1329973 -290765 743357
33941G43357J344102J237401J43908j080385j193876l38998K46437k0971n63751
$$ 743357 2087459 3324860 3468768 2388383 1194507 855509 1101946 1080975 517224
33932E17224p27445m67472L0182N96060Q57931M89791j79916m25935j16167J58342
$$ 517224 -210221 -677693 -647511 -51451 806480 1296271 1116355 690420 574253 732595
33922G32595O9014n362K18942L47871o334m64073l89162J10198K78839k31360
$$ 732595 801609 796247 1015189 1363060 1356726 892653 503491 613689 892528 661168
33912F61168q85990r63033m10145J78133K98949P0228o496K85497N81196L63650
$$ 661168 -224822 -1187855 -1598000 -1419867 -1120918 -1050690 -1057186 -771689 -190493 173157
33902A73157l99597j161104j300073o50315M01140J230893J456320J202422Q49624
$$ 173157 -226440 -1387544 -2687617 -3337932 -2936792 -1705899 -249579 952843 1802467
33893A802467N18018K5758n69835p82326l71901J30062Q2379k82684j46633O62494
$$ 1802467 2320485 2346243 1776408 994082 622181 752243 834622 551938 405305 1067799
33883A067799J352999J205784L70449n47690j150601j254197p83391n6051K37255
$$ 1067799 2420798 3626582 3997031 3449341 2298740 1044543 261152 205101 442356
33874D42356k43839j050017j507996j400606q37373Q1375J065619J559221J391291
$$ 442356 198517 -851500 -2359496 -3760102 -4597475 -4516100 -3450481 -1891260 -499969
33865d99969J118507J150761R61558o5999j344620j630780q21002j55872l85047
$$ -499969 618538 1769299 2730857 2664858 1320238 -310542 -1131544 -1287416 -1672463
33856a672463p28062k15472P55169J017492L24573m16195m64758o3696J71606
$$ -1672463 -2400525 -2615997 -1860828 -843336 -518763 -934958 -1399716 -1463412 -1291806
33847a291806J10165P2037K40614M29677M15105K87551K95217L62818Q0373n91156
$$ -1291806 -1181641 -1109604 -868990 -439313 -24208 263343 558560 921378 1001751 410595
33837D10595r28218k93095P93755J164459O30688K23457N04678O35697j53643
$$ 410595 -517623 -810718 -16963 1147496 1778184 2001641 2506319 3142016 2988373
33828B988373j078137r15046j8859J66321n78532r05599j30951O09236J32799
$$ 2988373 1910236 995190 976331 1142652 564120 -341479 -472430 136806 269605
33819B69605r74785j274357m71430M68611P65381N06664J42369L3935L28725O98311
$$ 269605 -705180 -1979537 -2450967 -1982356 -1216975 -710311 -567942 -534007 -205282 493029
33809D93029M62471m63223j123981p26283J20889K48724l19336n59439k59647
$$ 493029 955500 492277 -631704 -1357987 -1237098 -988374 -1307710 -1867149 -2126796
33800b126796l41101j102286j425143m47011R41359J205569K17396p06140n50566
$$ -2126796 -2467897 -3570183 -4995326 -5442337 -4500978 -3295409 -3078013 -3784153 -4334719
33791d334719L78559J120333J142728O79971L12407K87855K50806j62640n65280
$$ -4334719 -3956160 -2835827 -1693099 -1013128 -700721 -412866 -162060 -324700 -889980
33782h89980k26654O72356R97010K95058l51300J32733J111068J106441m4778
$$ -889980 -1116634 -444278 552732 847790 496490 629223 1740291 2846732 2801954
33773B801954j065896j139114p49031m85835j66605L80113O24779J45779n12858
$$ 2801954 1736058 596944 -152087 -637922 -804527 -424414 200365 346144 -166714
33764a66714n25454O2963N17331M69818J66574j85638o70839j193380j294368
$$ -166714 -692168 -629205 -111874 357944 524518 338880 -331959 -1525339 -2819707
33755b819707p23763O6082L14342j64259p02450n43602K11373P08089M67233L7150
$$ -2819707 -3543470 -3477388 -3163046 -3327305 -4029755 -4573357 -4361984 -3653895 -3186662 -3149512
33745c149512J97660Q38995J185814R81448P51730P95587O31680j62402j092703
$$ -3149512 -2951852 -2112857 -927043 54405 806135 1601722 2233402 2071000 978297
33736I78297j269409n34999L84186P46013M73027L0611j06995J21420L31191J11540
$$ 978297 -291112 -826111 -441925 304088 777115 807726 700731 822151 1153342 1264882
33726A264882m78225r35633q43013k24510N58661J029363Q16067L8692n70773
$$ 1264882 786657 -148976 -991989 -1216499 -657838 371525 1187592 1226284 655511
33717F55511l92199K28922L56730k83664j033157j344668j357041j207064o06518
$$ 655511 263312 492234 848964 565300 -467857 -1812525 -3169566 -4376630 -4983148
33708d983148M31717J194215J183423Q16332O48061N43524K25981n0131p9751
$$ -4983148 -4551431 -3357216 -2173793 -1357461 -709400 -165876 60105 9974 -69777
33699f9777k23553n37940k30256R59447J694515P69749p89076j044117j04507
$$ -69777 -293330 -831270 -1061526 -102079 1592436 2362185 1573109 528992 424485
33690D24485J87970o01612q82999M1761O82217m0516r02406m99797L94050L05393
$$ 424485 612455 10843 -872156 -830395 -148178 -188694 -1091100 -1590897 -1196847 -891454
33680h91454l84557k77366M87756N12101l94570r01829l16325N88151J072711
$$ -891454 -1276011 -1553377 -1065621 -553520 -948090 -1849919 -2166244 -1578093 -505382
33671e05382J288690J325624P74314k57903q43922n29300k267N1508j09766n1719
$$ -505382 783308 2108932 2883246 2625343 1781421 1252121 1249854 1301362 1191596 1139877
33661A139877l7135m12549p67737n09189J11443K99574j00524l61647J19523R68794
$$ 1139877 1102742 690193 -77544 -586733 -475290 -175716 -276240 -637887 -518364 450430
33651D50430J181682K66832j065612j564866q83659n805R7378k24899j7114O46300
$$ 450430 1632112 1898944 833332 -731534 -1615193 -1620998 -1523620 -1748519 -1765633 -1119333
33641a119333P84302K15496n8908M77214R42951M86082l30466m62362j0839Q9267
$$ -1119333 -335031 -119535 -178443 298771 1241722 1727804 1397338 934976 924137 1013404
33631A013404m02048q10852p02536l65927j27777P2164K91644L45802J32562j75193
$$ 1013404 611356 -199496 -902032 -1267959 -1395736 -1323572 -1031928 -686126 -553564 -728757
33621g28757l51111k55391K09559R74237J665884J870022J493062P11019k30629
$$ -728757 -1079868 -1335259 -1125700 -151463 1514421 3384443 4877505 5588524 5357895
33612E357895r52484j017305m60922L9424k5910k92070j27961L26675L87732n8765
$$ 5357895 4405411 3388106 2927184 2966608 2940698 2648628 2520667 2847342 3235074 3176309
33602C176309l97966k81667j02012k84378o66130q37344o88280l82197r5065M2478
$$ 3176309 2778343 2496676 2394664 2110286 1444156 606812 -81468 -463665 -558730 -516252
33592e16252Q223P833K77216O92547Q37177N23241J8156k78102j87147J62417
$$ -516252 -508029 -500196 -222980 469567 1306744 1829985 1848141 1570039 1382892 1545309
33582A545309L94313J61430l88206o39825l30682k4811k77281o73695m43422J88476
$$ 1545309 1939622 2101052 1712846 1073021 742339 717528 440247 -233448 -676870 -488394
33572d88394J95291o52693j312183q71697L49722J436477J883365J612241P27311
$$ -488394 -293103 -945796 -2257979 -3129676 -2779954 -1343477 539888 2152129 2879440
33563B879440k55836n90832k61463j91171r18100j614160j137741L13699J347572
$$ 2879440 2623604 2032772 1771309 1580138 662038 -952122 -2089863 -1776164 -428592
33554d28592J033637j53431r91680p35703K28266P56025K03501o44526m55107
$$ -428592 605045 451614 -540066 -1275769 -1047503 -291478 -87977 -732503 -1187610
33545a187610P20394J284547L47928q60782p78944J58140L12985n26441q99026
$$ -1187610 -467216 817331 1165259 304477 -474467 -316327 -3342 -529783 -1428809
33536a428809o8485Q64633P32060o3764m11983q6665L27531M85012M76310L58392
$$ -1428809 -1497294 -632661 99399 35635 -376348 -463013 -135482 349530 825840 1184232
33526A184232J50089M0024P2408j07153o76929j079504o44667L59888R30104O20697
$$ 1184232 1334321 1374345 1446753 1339600 662671 -416833 -1061500 -701612 228492 849189
33516H49189O4329M67K85028K62011j78139m39218j26047L72514M89696L63536
$$ 849189 913518 913985 1199013 1461024 1282885 843667 717620 1090134 1579830 1943366
33506A943366O50203J482791K080232J636672L58342o51869m90493O69845J735832
$$ 1943366 2593569 4076360 6156592 7793264 8151606 7499737 7009244 7679089 9414921
33497I414921J734194Q24651J57444M60168R95552N06279r10186j732817j051014
$$ 9414921 11149115 11973766 12131210 12591378 13586930 14093209 13183023 11450206 10399192
33488A0399192K23987O84207J48548o07936j093009j234093r40119m65440o08709
$$ 10399192 10623179 11307386 11455934 10847998 9754989 8520896 7580777 7115337 6506628
33479F506628j521166j949286r19965M20493K46062j053802j334826p7293Q11953
$$ 6506628 4985462 3036176 2116211 2536704 2782766 1728964 394138 316845 1128798
33470A128798J61476n85035J57798J501677J561714L51922n32627m25619j26492
$$ 1128798 1290274 705239 863037 2364714 3926428 4278350 3745723 3320104 3193612
33461C193612k50035m97452n15989l24829Q8583O32231O89257j94618j294010
$$ 3193612 2943577 2446125 1930136 1605307 1693890 2326121 3015378 2820760 1526750
33452A526750j357830l02841O42603N58482k21651q80103j059014q57715n02649
$$ 1526750 168920 -133921 508682 1067164 845513 -34590 -1093604 -1951319 -2453968
33443b453968j96375R2997O30189J329602J500244P61325j70257l83959r6107
$$ -2453968 -2650343 -2557346 -1927157 -597555 902689 1664014 1493757 1109798 1013691
33434A013691j20561l71289j10578M47507J91262j000208j772348j211226p7345
$$ 1013691 893130 521841 411263 858770 1050032 49824 -1722524 -2933750 -3011095
33425c011095M95383M64376L08555r535n84981q53193l38962M08355N62975K74284
$$ -3011095 -2515712 -2051336 -1742781 -1752316 -2337297 -3190490 -3529452 -3121097 -2558122 -2283838
33415b283838K57990N10909M24300k2724j88458J08168L12838J43315M3696L26735
$$ -2283838 -2025848 -1514939 -1090639 -1113363 -1301821 -1193653 -880815 -737500 -693804 -367069
33405c67069N64090K84140k18178k91107J10664L66037N8657m69484n74413j31692
$$ -367069 197021 481161 262983 -28124 82540 448577 507234 37750 -536663 -668355
33395f68355L11740K30939k10701l94998j03346J69564q5850o39410p82895k55816
$$ -668355 -356615 -125676 -336377 -731375 -834721 -665157 -751007 -1390417 -2173312 -2429128
33385b429128M31072O56898L85673M0901p2233O8708M73098J123011J589419J167336
$$ -2429128 -1998056 -1341158 -955485 -914584 -986817 -918109 -445011 678000 2267419 3434755
33375C434755j68724j290370j060383J51623Q54140M12064k40324j98398Q6513
$$ 3434755 3266031 1975661 915278 1066901 1921041 2333105 2092781 1894383 1980896
33366A980896j72131o08992l56978L43419M46211j91516o44038m57332j45923
$$ 1980896 1808765 1199773 842795 1186214 1632425 1440909 796871 339539 193616
33357A93616k1850K51969O63696O28427J72684J23062N88196N52849k64148n14111
$$ 193616 171766 423735 1087431 1715858 1888542 2011604 2599800 3152649 2888501 2374390
33347B374390O72996J883675J234990q11891k075567j637512n84516L3180L30300
$$ 2374390 3047386 4931061 6166051 5354160 3278593 1641081 1056565 1089745 1420045
33338A420045N07167J89108o07971j033069n73074J69422M09177J75065r0027
$$ 1420045 1927212 2116320 1508349 475280 -97794 71628 480805 655870 565843
33329E65843k49158l03106p8760M33759Q79249J033484J055109R71174M69213
$$ 565843 316685 13579 -65181 368578 1247827 2281311 3336420 4307594 4776807
33320D776807m47827j171948j298245j202121j314799j311613o28916N50932J440476
$$ 4776807 4328980 3157032 1858787 656666 -658133 -1969746 -2598662 -2047730 -607254
33311f07254J566256J041548J65694o80006r35362l41318M75085N22854k90976
$$ -607254 959002 2000550 2166244 1486238 550876 209558 684643 1207497 916521
33302I16521r49251o13443L37151R10737P90339N17311N28499N72686K54482k64782
$$ 916521 -32730 -646173 -309022 601715 1392054 1909365 2437864 3010550 3265032 3000250
33292C000250m78609k63985j7812r5739m59201r16647j346922j533562j135620
$$ 3000250 2521641 2257656 2239844 2144105 1684904 768257 -578665 -2112227 -3247847
33283c247847j25291R52712J454129J262379P52490L00484N3582N851J5070j50993
$$ -3247847 -3373138 -2420426 -966297 296082 1048572 1349056 1402638 1408489 1423559 1272566
33273A272566n44160r00841r43316o59484j47957N33940J152793J274494P90948
$$ 1272566 728406 -172435 -1115751 -1775235 -1923192 -1389252 -236459 1038035 1828983
33264A828983J72195j46686k94912n21278o63703n74357o09444j008242j187084
$$ 1828983 2001178 1854492 1559580 1038302 374599 -199758 -809202 -1817444 -3004528
33255c004528m85581O65289J219659R70853N96055M21021K17786J63144P38684
$$ -3004528 -3490109 -2824820 -1605161 -634308 -38253 382768 600554 763698 1502382
33246A502382J482507J142534m39464j771229j671803p29459q8860J57054M34903
$$ 1502382 2984889 4127423 3687959 1916730 244927 -484532 -573392 -416338 18565
33237A8565M97129o1692p09649n94454P1358L13444r4182l86393j8851O93292
$$ 18565 515694 454002 -255647 -850101 -778743 -465299 -559481 -945874 -964725 -271433
33227b71433J144452R94342K21001p94933j358226j180877q37211r69213j328428
$$ -271433 873019 1867361 2088362 1293429 -64797 -1245674 -2082885 -3052098 -4380526
33218d380526j233282o46839l7755N37428J313238J943043J730786P81043J5694
$$ -4380526 -5613808 -6260647 -6298402 -5760974 -4447736 -2504693 -773907 7136 22830
33209B2830j05058n2212k26642l10003L6239N00507N80646K63470r7068k61121
$$ 22830 -82228 -134440 -361082 -671085 -634846 -134339 446307 709777 612709 351588
33199C51588k50927k75980n66650j007243j033518k96572P16737J228176J156234
$$ 351588 100661 -175319 -741969 -1749212 -2782730 -3079302 -2362565 -1134389 21845
33190B1845R47030O31039j09530r82921j155787m81937J85411J94902j43623k73217
$$ 21845 968875 1599914 1490384 507463 -648324 -1130261 -944850 -749948 -893571 -1166788
33180a166788j05522K79594Q86125J400489J279017O02419J00195j5821l65240
$$ -1166788 -1272310 -992716 -106591 1293898 2572915 3175334 3275529 3259708 2894468
33171B894468j092319j242612k01494J099740J331989M71337n40273j205019j525400
$$ 2894468 1802149 559537 358043 1457783 2789772 3261109 2720836 1515817 -9583
33162i583j200305J3674J354431J629900P78547q6905k35163k3672K9216k5181
$$ -9583 -1209888 -1196214 158217 1788117 2566664 2479759 2244596 2220924 2250140 2224959
33152B224959j2199m3241j38778k3292L78205O69004M62025j70064q23819j051794
$$ 2224959 2212760 2169519 2030741 2007449 2385654 3054658 3516683 3346619 2522800 1471006
33142A471006n84271L11147P75858K09827q35464j184570m88085M56089Q93038
$$ 1471006 886735 1197882 1973740 2183567 1348103 163533 -324552 131537 1024575
33133A024575R38046J006100J085005R59907O65626L21236j21603o39896r70422
$$ 1024575 1962621 2968721 4053726 5013633 5679259 6000495 5878892 5238996 4268574
33124D268574r53327p44007m78127r2302K99995K94400j86943n43132k18480M47943
$$ 4268574 3315247 2571240 2093113 2000811 2300806 2595206 2408263 1865131 1646651 2094594
33114B094594N62351j90017j113930j265005m55585N54287Q29382K21068n20517
$$ 2094594 2656945 2466928 1352998 87993 -367592 186695 1016077 1237145 716628
33105G16628o71822l49858j15977l1533K99913P94206P17517k59691j396822j667140
$$ 716628 44806 -305052 -421029 -452562 -152649 641557 1359074 1099383 -297439 -1964579
33095a964579q54606M19250J399403J653422J210721N70833K67940K09765j58589
$$ -1964579 -2819185 -2399935 -1000532 652890 1863611 2434444 2702384 2912149 2753560
33086B753560q57221j133690n86797J04203J41427k46360l09558J9308K24556
$$ 2753560 1896339 762649 175852 280055 421482 175122 -134436 -115128 109428
33077A09428K09896L56635O90644P58218L35492l42128r77055j267532q03187
$$ 109428 319324 675959 1366603 2124821 2460313 2118185 1141130 -126402 -929589
33068i29589L50805J172302O88418o21399j384150j239102j047565j116697o08034
$$ -929589 -578784 593518 1281936 660537 -723613 -1962715 -3010280 -4126977 -4735011
33059d735011P65042J804353J498374N23026J5635j54493o00924p72112K41453
$$ -4735011 -3969969 -2165616 -667242 -144216 -128581 -283074 -883998 -1656110 -1414657
33050a414657J677310J712366K06854r02160m39182M01263J59637o19919n54621
$$ -1414657 262653 1975019 2181873 1279713 840531 1241794 1401431 781512 226891
33041B26891J65312J71339o89780j011951n6584J073362J071384K26317k06273
$$ 226891 392203 563542 -126238 -1138189 -1194773 -121411 949973 1176290 970017
33032I70017J83774O16463L70507l18687o76760l05864M28891P76217L67337l56763
$$ 970017 1153791 1770254 2140761 1822074 1145314 839450 1268341 2044558 2411895 2055132
33022B055132o59249m71025m55583r23038j196944n76673M74513Q69547M76636
$$ 2055132 1395883 924858 469275 -453763 -1650707 -2227380 -1752867 -883320 -406684
33013d06684K74107P69869J152623N26912o91962j347616j115919p29201p59384
$$ -406684 -132577 637292 1789915 2316827 1624865 277249 -838670 -1567871 -2327255
33004b327255r26430p44841k68800R7723K00830K73877N91459J099611J367511
$$ -2327255 -3253685 -3998526 -4267326 -4169603 -3968773 -3694896 -3103437 -2003826 -636315
32995f36315J017779L12009M4599N53933J112944P81518l25861j206236j293532
$$ -636315 381464 693473 738072 1292005 2404949 3186467 2860606 1654370 360838
32986C60838r44717o10728k96304j6856j7717k21955j76084J13319O9773l22541
$$ 360838 -583879 -1194607 -1490911 -1507767 -1525484 -1747439 -1923523 -1810204 -1740431 -2062972
32976b062972k40611M44691M23901j108361k646582k091037J79744J723208J487599
$$ -2062972 -2303583 -1858892 -1434991 -2543352 -5189934 -7280971 -7101227 -5378019 -3890420
32967c890420R57242J372500J722047O76817r63787j355534k88248P91869R87836
$$ -3890420 -2933178 -1560678 161369 838186 -125601 -1481135 -1769383 -977514 10322
32958A0322P07942M26690J14535n2480K81453P19138M07383m55578o18770K87594
$$ 10322 718264 1144954 1259489 1207009 1488462 2207600 2614983 2159405 1540635 1828229
32948A828229J038502O80858p4403k30133j66125o94719j324637r82952N055K65184
$$ 1828229 2866731 3547589 3473186 3243053 3076928 2382209 1057572 74620 79675 344859
32938C44859m08927p81288k89417J51935p1643k64559J6341q2976r94191j339969
$$ 344859 -64068 -845356 -1134773 -982838 -1054481 -1319040 -1302699 -1385675 -2379866 -3719835
32928c719835N8507J799592J586657j91445q62273M13873J322404Q6980j698872
$$ -3719835 -3661328 -1861736 -275079 -466524 -1328797 -914924 407480 494460 -1204412
32919a204412j579689K8182P31387p8854o48589N1141Q17205M10300m47589l36342
$$ -1204412 -2784101 -2755919 -2024532 -2103386 -2751975 -2700834 -1883629 -1473329 -1920918 -2257260
32909b257260O79523J280376P93247q4832l20412L01711J026007Q78946k62434
$$ -2257260 -1577737 -297361 495886 411054 90642 392353 1418360 2297306 2034872
32900B034872j312272j110869M4011O83235J77103m34291j51571L77355n3782
$$ 2034872 722600 -388269 -344258 338977 516080 81789 -69782 307573 253791
32891B53791j155650j444658m40117O59123P12696L9301l56050j63176K11219
$$ 253791 -901859 -2346517 -2786634 -2127511 -1414815 -1375514 -1731564 -1894740 -1683521
32882a683521M85266P30061R54292R58696O27229J34168j63179j1475M53897P25902
$$ -1683521 -1198255 -468194 486098 1444794 2072023 2206191 2043012 2031537 2485434 3211336
32872C211336M11992l06681r00909j108613j037216p47715j97257L51554L82950
$$ 3211336 3623328 3316647 2415738 1307125 269909 -477806 -675063 -323509 59441
32863E9441j52848n77708k95966L87065O07669k1763j001302j504016j144934
$$ 59441 -93407 -671115 -967081 -580016 27653 5890 -995412 -2499428 -3644362
32854c644362k32611N90283R40650R54859R48172R47527P56312L69936N678k55829
$$ -3644362 -3876973 -3286690 -2346040 -1391181 -443009 504518 1260830 1630766 1636444 1380615
32844A380615n06860o80178n83749l35575l16148n33627m94924M7067O48485P83162
$$ 1380615 873755 193577 -390172 -725747 -1041895 -1575522 -2070446 -2023379 -1374894 -591732
32834e91732N05162J58588j98341o51934j005206r54880n48607j15107J23140
$$ -591732 -86570 72018 -126323 -778257 -1783463 -2738343 -3286950 -3402057 -3278917
32825c278917J19930p8227k39978p1305L28974N34893N67917R94312J778912J782525
$$ -3278917 -3158987 -3237214 -3477192 -3548497 -3219523 -2684630 -2116713 -1122401 656511 2439036
32815B439036K72002j628673k105348r85252K54843O64815P05758Q62396P87464
$$ 2439036 2711038 1082365 -1022983 -2008235 -1753392 -1088577 -382819 479577 1267041
32806A267041L25483J04025L45332K06251p56261j449017p52229N68492Q13084
$$ 1267041 1592524 1696549 2041881 2248132 1491871 42854 -709375 -140883 672201
32797F72201j77700q80592l71337N51147P56652J77093o08729j237308j449837
$$ 672201 494501 -386091 -757428 -206281 550371 727464 118735 -1118573 -2568410
32788b568410q77892L66161J341181J178037J37341o87319n82757J93374Q70469
$$ -2568410 -3446302 -3080141 -1738960 -560923 -423582 -1110901 -1693658 -1500284 -629815
32779f29815R02449L53828k16669l34850j73487l35959r61715j352250p66982
$$ -629815 272634 626462 409793 74943 -98544 -434503 -1396218 -2748468 -3515450
32770c515450N99732J721553J732442O50558p20331j404688r50375J91737J023314
$$ -3515450 -2915718 -1194165 538277 1188835 468504 -936184 -1886559 -1694822 -671508
32761f71508R33740K48003k62139k54993p551J23004J20863J80617L74914N42578
$$ -671508 262232 510235 248096 -6897 -14448 108556 229419 410036 784950 1327528
32751A327528M53609Q8707k48590k25894O7241J56797j99663o40327o62641l09166
$$ 1327528 1781137 1869844 1621254 1395360 1462601 1619398 1419735 779408 116767 -192399
32741a92399j11770l86951q27214q54746k79738M29530N64701k6149o19554l76001
$$ -192399 -304169 -691120 -1518334 -2373080 -2652818 -2223288 -1658587 -1684736 -2304290 -2680291
32731b680291N58283J116986O51404k64661o97808n24907j99142J93037Q23491
$$ -2680291 -2122008 -1005022 -353618 -618279 -1316087 -1840994 -2040136 -1847099 -1023608
32722a023608J300377R37672l0656m30918K60267J060731P74558m07305j211268
$$ -1023608 276769 1214441 1183785 752867 1013134 2073865 2848423 2441118 1229850
32713A229850q40401L32656J389655J653509R97538j43815j082443j470981j491561
$$ 1229850 389449 722105 2111760 3765269 4762807 4618992 3536549 2065568 574007
32704E74007j305969o95524L84329J289722J315631O15680q7437n19539r23011
$$ 574007 -731962 -1427486 -1043157 246565 1562196 2177876 2090439 1570900 647889
32695F47889j241362j044285l73274J03072N1007o8732J71415N13881O20314P20128
$$ 647889 -593473 -1637758 -2011032 -1907960 -1856953 -1925685 -1754270 -1240389 -620075 100053
32685A00053J062279J207604O07997l79645q25178m91231l8253P7292J53080M37323
$$ 100053 1162332 2369936 2977933 2598288 1773110 1281879 1243626 1320918 1473998 1911321
32675A911321M94125q6959q19677q38830j17788M74804L61184r3949l02237k72245
$$ 1911321 2405446 2318487 1498810 659980 542192 1016996 1378180 1284231 981994 709749
32665G09749l31794m58949m26965l61950n34490o93700l12615M06495N24946k88871
$$ 709749 377955 -80994 -507959 -869909 -1404399 -2098099 -2410714 -2004219 -1479273 -1768144
32655a768144j094518q95679N9725Q53438J221986J436509J307122M64184n10419
$$ -1768144 -2862662 -3758341 -3698616 -2845178 -1623192 -186683 1120439 1584623 1074204
32646A074204n23033K69199M35680n16938j240630o87395J30092j69490q98992
$$ 1074204 551171 820370 1256050 739112 -501518 -1188913 -1058821 -1228311 -2127303
32637b127303l25694J330587J898986M77723j179089j249984k89737O7034l15011
$$ -2127303 -2452997 -1122410 776576 1254299 75210 -1174774 -1464511 -1397477 -1712488
32628a712488k84486L94762O39383j07861r36678q09459P2730P96549R87077R02356
$$ -1712488 -1996974 -1602212 -962829 -1070690 -2007368 -2816827 -2744097 -1947548 -960471 -58115
32618e8115O64910J05959o29665q83381j93327R86977J594682J069831o193n61761
$$ -58115 606795 712754 83089 -800292 -993619 -6642 1588040 2657871 2651678 2089917
32608B089917k22258M36768P84040Q09596P07563L27614m07324r15240n71267
$$ 2089917 1867659 2304427 3088467 3898063 4605626 4933240 4525916 3610676 3039409
32599C039409K02087L33379k83768n20872K16862R09123M31409o18532p79592
$$ 3039409 3241496 3574875 3291107 2770235 2987097 3896220 4327629 3709097 2929505
32590B929505j1135K64430n36206j222952p56067J10815O2943p54904j102586
$$ 2929505 2918370 3182800 2646594 1423642 667575 778390 841333 86429 -1016157
32581a016157n67401N3459J63242O8952J58195L05774L44427L46980J97736l49562
$$ -1016157 -1583558 -1530099 -1366857 -1297905 -1139710 -833936 -489509 -142529 55207 -294355
32571b94355r07227n90960O00153J339032O05890q40512j420102p21581L06766
$$ -294355 -1201582 -1792542 -1192389 146643 752533 -87979 -1508081 -2229662 -1922896
32562a922896Q58755J025191J072260Q51694K05754o17486j232078j442538j186181
$$ -1922896 -1064141 -38950 1033310 1885004 2090758 1473272 241194 -1201344 -2387525
32553b387525n12744K76671P97698R58737R02242O48502J84168j95015j52264
$$ -2387525 -2900269 -2623598 -1825900 -867163 35079 683581 867749 672734 520470
32544E20470R7933L7296k90537l27699m2437j40830q69616j359948p93306L38389
$$ 520470 618403 655699 365162 37463 -4974 -145804 -1015420 -2375368 -3168674 -2830285
32534b830285Q88471O11524K62113L12376M17274K39332K3006J9982m7412m44967
$$ -2830285 -1941814 -1330290 -1068177 -755801 -338527 -99195 -76189 -56207 -103619 -548586
32524e48586p25369j96104R35021J446907M74356j250172j970283q25359J126672
$$ -548586 -1273955 -1470059 -535038 911869 1386225 136053 -1834230 -2659589 -1532917
32515a532917K069455J387909Q0253o56586o76202n66453o59987q17337q76253
$$ -1532917 536538 1924447 2004700 1348114 671912 105459 -554528 -1371865 -2248118
32506b248118q11419n67004j49655J85528K28768K31054O05327J213484J396621
$$ -2248118 -3059537 -3626541 -3776196 -3590668 -3361900 -3130846 -2525519 -1312035 84586
32497H4586Q29237l6066n23402l93873J83047R02300J291164Q10760n08126j697742
$$ 84586 913823 877757 354355 -39518 143529 1045829 2336993 3147753 2639627 941885
32487I41885j656858m04643Q44018R92417J67597o27902o88693j89603K28469
$$ 941885 -714973 -1119616 -275598 716819 884416 256514 -432179 -621782 -393313
32478c93313J75232j64163k57772J94438Q36118R55912L52496l16072l15177K39779
$$ -393313 -218081 -382244 -640016 -445578 390540 1346452 1698948 1382876 1067699 1307478
32468A307478O30289N36349K39170j15222p22864j389145j359512l91722O21228
$$ 1307478 1937767 2474116 2713286 2598064 1875200 486055 -873457 -1265179 -643951
32459f43951P60957L25947J88962L11804j12249j143863j755963j233539j04582
$$ -643951 117006 442953 631915 943719 831470 -312393 -2068356 -3301895 -3406477
32450c406477O46586O70574K85720k2075R3145N14512N43934k78803j217247j050696
$$ -3406477 -2759891 -2089317 -1803597 -1825672 -1732527 -1218015 -674081 -952884 -2170131 -3220827
32440c220827J41293R76774Q61205P92754J402228J582256L17214j257418j297532
$$ -3220827 -3079534 -2102760 -1241555 -448801 953427 2535683 2852897 1595479 297947
32431B97947q6460L96189m84069j265849q93827j91487j71541l77820R5805J004247
$$ 297947 211487 607676 123607 -1142242 -2036069 -2227556 -2399097 -2776917 -2681112 -1676865
32421a676865J426329J135389N51002j43440r37836j428019j162876l75241L03082
$$ -1676865 -250536 884853 1435855 1292415 354579 -1073440 -2236316 -2611557 -2308475
32412b308475O76536R30627R46748L76385n99551j205668r55155k25776K20992
$$ -2308475 -1631939 -701312 245436 621821 22270 -1183398 -2138553 -2364329 -2143337
32403b143337Q1030k69394l02127K4843K66794J71626J00184M33367P78391L73552
$$ -2143337 -2062307 -2331701 -2633828 -2608985 -2342191 -2170565 -2070381 -1637014 -858623 -485071
32393d85071p05368j429308j130838l05048K20131L02183K64324K41255K46581
$$ -485071 -1190439 -2619747 -3750585 -4055633 -3835502 -3533319 -3268995 -3027740 -2781159
32384b781159L95885N70713L68708j11016m4323Q96698J717148J349389K18488
$$ -2781159 -2385274 -1814561 -1445853 -1556869 -1601192 -704494 1012654 2362043 2580531
32375B580531m19128k95033j90489m55436o80890p66791j044329j225386n47950
$$ 2580531 2161403 1866370 1675881 1220445 539555 -227236 -1271565 -2496951 -3044901
32366c044901O92575J070744R4469q58662m85822O06165R95718M98268j9408k16391
$$ -3044901 -2352326 -1281582 -1187113 -2045775 -2531597 -1925432 -929714 -431446 -450854 -667245
32356f67245m05066m79428o176O86578O88914q8117p00046n73750j98566j08009
$$ -667245 -1072311 -1551739 -1557915 -871337 -182423 -270540 -970586 -1544336 -1742902 -1850911
32346a850911m2836L93662R33710J052742P27737L28082R4130P4250K36765L41420
$$ -1850911 -1893747 -1500085 -566375 486367 1214104 1542186 1636316 1710566 1947331 2288751
32336B288751O4951m51837n77871l2593O52402Q55048O05056K03823l90448j199470
$$ 2288751 2353702 1901865 1323994 1291401 1943803 2798851 3403907 3607730 3217282 2017812
32326B017812j653665j138753L7703Q80982Q38385J60677o74452j244359j061824
$$ 2017812 364147 -774606 -736903 144079 982464 1143141 468689 -775670 -1837494
32317a837494j905J128829J273688N16397j6172J71499K83174l55682j149701
$$ -1837494 -1839399 -710570 563118 1079515 1063343 1234842 1518016 1162334 12633
32308A2633j175815n29954O8821M33619P81143Q85706L45802m96130q17241m47940
$$ 12633 -1163182 -1693136 -1624315 -1190696 -409553 476153 821955 325825 -491416 -939356
32298i39356N5964L95902P19164Q33545K19719r21759j539842j090596l02758
$$ -939356 -883392 -487490 231674 1065219 1284938 363179 -1176663 -2267259 -2570017
32289b570017r6853l51129k98372L09586R94964J219406Q18796K7009n96455n48121
$$ -2570017 -2666870 -3017999 -3316371 -3006785 -2011821 -792415 26381 53390 -543065 -1091186
32279a091186J8179L96532K69763P8364J53481J09909l55073o82617k85240L02102
$$ -1091186 -1073007 -676475 -406712 -328348 -174867 -64958 -420031 -1102648 -1387888 -1085786
32269a085786J18901n76131n02318O37079J461969Q03141n71311r82337j51612
$$ -1085786 -966885 -1543016 -2045334 -1408255 53714 856855 285544 -696793 -848405
32260h48405M77679k23183j518643j754443m57380J103017J484976P15651J2269
$$ -848405 -370726 -593909 -2112552 -3866995 -4324375 -3221358 -1736382 -1020731 -1008462
32251a008462J27519N32995L59117l57238p79713m12378L09664O08613K62469
$$ -1008462 -880943 -347948 11169 -346069 -1125782 -1538160 -1228496 -619883 -357414
32242c57414k16375k19662K31849M99508J35923m85468o27411j50220M19333P27872
$$ -357414 -573789 -793451 -561602 -62094 73829 -411639 -1039050 -1189270 -769937 -42065
32232d2065R01029R14006M08878m91492r22451m27470K48187K15689k65466l74706
$$ -42065 858964 1772970 2181848 1690356 767905 340435 588622 804311 538845 164139
32222A64139r4306J1928j167L73480R16390Q67971K68798j06968k25572q46170
$$ 164139 69833 81761 80594 454074 1370464 2238435 2507233 2400265 2174693 1328523
32212A328523j812181j754607j77793J467431J693661Q28481k8074p58851j642224
$$ 1328523 -483658 -2238265 -2416058 -948627 745034 1573515 1545441 786590 -855634
32203h55634j967788q97358P52610J263999N01387J04585R66132J921397J508228
$$ -855634 -2823422 -3720780 -2968170 -1704171 -1202784 -1098199 -132067 1789330 3297558
32194C297558n1032j319478j394361n92944J51849J76516l04199l48861N22765
$$ 3297558 3246526 1927048 532687 -60257 91592 268108 -36091 -384952 137813
32185A37813J382780R00110o81126j565923p36670P44581J324890Q97794L36311
$$ 137813 1520593 2420703 1739577 173654 -563016 181565 1506455 2404249 2740560
32176B740560r1985p41520j467830j629768j131750n27455o0805N38947J178425
$$ 2740560 2648575 1907055 439225 -1190543 -2322293 -2849748 -2910553 -2371606 -1193181
32167a193181J163804K33219p78162q19872R1975Q74675N96892n28396j391117
$$ -1193181 -29377 203842 -574320 -1394192 -1302217 -427542 169350 -359046 -1750163
32158a750163j158670j40075O31173O23183K92445K47678L90899K73371o0077
$$ -1750163 -2908833 -3048908 -2417735 -1794552 -1502107 -1254429 -863530 -590159 -650236
32149f50236j29617K40910P33995R85991Q23225K33056m66376o72610k27857J87883
$$ -650236 -779853 -538943 195052 1181043 2004268 2237324 1770948 1098338 870481 1058364
32139A058364l106l25089p0759L13410j65522j224838j502403p27696j72457m46700
$$ 1058364 1055258 730169 659410 972820 807298 -417540 -1919943 -2647639 -2820096 -3266796
32129c266796m43021O00455J495416R27129l18922n84590O7024K58877k42466
$$ -3266796 -3709817 -3109362 -1613946 -686817 -1005739 -1590329 -1523305 -1264428 -1506894
32120a506894l56915J92122M41141K8446k26745O1359K20001l1877j6249M36701
$$ -1506894 -1863809 -1671687 -1230546 -1202100 -1428845 -1367486 -1147485 -1179362 -1195611 -758910
32110g58910M25091l73253q76147l10004N48568Q19255R22252J378014J441579
$$ -758910 -333819 -707072 -1583219 -1893223 -1344655 -525400 396852 1774866 3216445
32101C216445L83818q51810q69721M741L65014j6560k23299j04808l88643r64194
$$ 3216445 3600263 2748453 1878732 1883473 2248487 2231927 2008628 1903820 1515177 550983
32091E50983p92662K44971R55965O42034q5533o45125j228339j714633j264827
$$ 550983 -241679 3292 959257 1601291 1515758 870633 -357706 -2072339 -3337166
32082c337166K19803J416369J246891K95225k61619k62022k23478j82578J35497
$$ -3337166 -3117363 -1700994 -454103 -158878 -420497 -682519 -905997 -1088575 -953078
32073i53078N14564N30598K94573J81398J49968m2821l16338n11598p16496p97891
$$ -953078 -438514 92084 386657 568055 718023 675202 358864 -152734 -869230 -1667121
32063a667121j92974J111359J963303J323735k35677j243620j216846q30568m50432
$$ -1667121 -1860095 -748736 1214567 2538302 2302625 1059005 -157841 -988409 -1438841
32054a438841K80923J272960J610616Q89511M8423J54481Q97789J045453J61217
$$ -1438841 -1157918 115042 1725658 2615169 2663592 2818073 3715862 4761315 4922532
32045D922532q46527r91162m73707k93314q07622j210623o68808M16679Q28517
$$ 4922532 4076005 3084843 2611136 2317822 1510200 299577 -369231 47448 875965
32036H75965J36672p38669p78191j31909K78292N1086l16728k32667K19356L83201
$$ 875965 1012637 273968 -504223 -636132 -357840 -306754 -623482 -856149 -636793 -253592
32026b53592k06739j166373j482400o37911O39413J207642R36423O25403O02936
$$ -253592 -460331 -1626704 -3109104 -3747015 -3107602 -1899960 -963537 -338134 264802
32017B64802L95638n3882l7396N24529N58633m09083j115604l88495Q48870R06194
$$ 264802 660440 606558 569162 1093691 1652324 1243241 127637 -260858 588012 1494206
32007A494206k8587l15901L73681N94586l87525j373239j098956J8410P26129
$$ 1494206 1465619 1149718 1523399 2117985 1730460 357221 -741735 -723325 2804
31998B804N17503k50458r59363r33758J28130J457492J750375P97581k66289o50358
$$ 2804 520307 269849 -689514 -1623272 -1495142 -37650 1712725 2510306 2244017 1593659
31988A593659p61385r18964n15715O67080J472762Q73614m01244r61102p66274
$$ 1593659 832274 -86690 -602405 64675 1537437 2411051 2009807 1048705 282431
31979B82431p45182r73641p09109J0197K84034n4774j03020N48871J071558O97074
$$ 282431 -462751 -1436392 -2145501 -2135304 -1851270 -1906044 -2009064 -1460193 -388635 308439
31969C08439j42712n20550k02964L33855N75755L03185l00546o16915j39083P30910
$$ 308439 165727 -354823 -557787 -223932 351823 655008 354462 -262453 -401536 329374
31959C29374R56059J86199p40874r20626m40058O7166L52893N07921M42786M8048
$$ 329374 1285433 1471632 730758 -189868 -629926 -562760 -209867 298054 740840 788888
31949G88888l95204n39052n06621n88990o28097k92556K00506L06543L5092q3958
$$ 788888 393684 -145368 -651989 -1240979 -1869076 -2161632 -1961126 -1654583 -1619491 -1703449
31939a703449O6258N3335j61156Q743O80679J018569M74413k09704q1580N14902
$$ -1703449 -1637191 -1583856 -1745012 -1736269 -1055590 -37021 437392 227688 146108 661010
31929F61010N29910r1118m62939l26709k61114k91284K55606J120150Q69420q71455
$$ 661010 1190920 1099802 636863 310154 49040 -242244 13362 1133512 2002932 1131477
31919A131477k326403j892215m00618L44122K70443N56338J195367J104551L97847
$$ 1131477 -1194926 -3087141 -3487759 -3143637 -2873194 -2316856 -1121489 -16938 380909
31910C80909M05496J235832J400657L87156m33148k79633l14862j298097j808206
$$ 380909 786405 2022237 3422894 3810050 3376902 3097269 2782407 1484310 -323896
31901c23896n18685J315192J641928P07487K23073L53222p1396q46139n20487
$$ -323896 -842581 472611 2114539 2822026 3045099 3398321 3326925 2480786 1960299
31892A960299O83695O87169j043439k288786j403052K32091N71031l4911P637
$$ 1960299 2643994 3331163 2287724 -1062 -1404114 -1172023 -600992 -635903 -628266
31883f28266O14673L82614p82673j450157r56789j40398L33159P47239J115650
$$ -628266 -13593 369021 -413652 -1863809 -2820598 -2960996 -2627837 -1880598 -764948
31874g64948P37883l87121j039042n43341L8350m47254j279724q77007O72588
$$ -764948 -27065 -414186 -1453228 -1996569 -1958219 -2405473 -3685197 -4562204 -3889616
31865c889616J553157Q06903l39001l21121N63823P57481k18600j067540n23371
$$ -3889616 -2336459 -1529556 -1868557 -2189678 -1625855 -868374 -1086974 -2154514 -2677885
31856b677885R01751J522595N88600p75871r35515K80045J416264J219293R1174
$$ -2677885 -1776134 -253539 335061 -440810 -1376325 -1096280 319984 1539277 1630451
31847A630451o64606o16459m61014o10757n08996K44785R60663Q24959J90720
$$ 1630451 965845 349386 -111628 -722385 -1231381 -986596 -25933 799026 989746
31838I89746n3353K047m45727j244488j191849N9968J194496J006085M3887l73851
$$ 989746 936393 938440 492713 -751775 -1943624 -1883656 -689160 316925 360812 -13039
31828a3039o4779J10702j89159l99772j52181J71229J66321K2830J31912M56703
$$ -13039 -77818 32884 -156275 -556047 -708228 -536999 -370678 -347848 -215936 240767
31818B40767N14619j15244j219689j857522j211719K56670J042043M26081m99830
$$ 240767 755386 640142 -579547 -2437069 -3648788 -3392118 -2350075 -1923994 -2423824
31809b423824l28884O85840J118765N03365j76389j25039K68359L58039J93421
$$ -2423824 -2752708 -2066868 -948103 -444738 -621127 -746166 -477807 -119768 73653
31800G3653J00888P5791M6387J32906K58986P8983l67541n21232j62611K18093
$$ 73653 174541 250332 296719 429625 688611 767594 400053 -121179 -283790 -65697
31790f5697K87535M33296R63109J378073J074045K75631l56180o35792p68702
$$ -65697 221838 655134 1618243 2996316 4070361 4345992 3989812 3354020 2585318
31781B585318p48093m74484j66477m8555P7259L73230M30322j43481r13105j127030
$$ 2585318 1837225 1362741 1196264 1147709 1224968 1598198 2028520 1885039 971934 -155096
31771a55096p85521m38020j69907L06603P05882L68929n00623q54148l44086J54828
$$ -155096 -940617 -1378637 -1548544 -1241941 -536059 -167130 -667753 -1521901 -1865987 -1711159
31761a711159K1579j27333L37987P54425J60263r38302j032840K06129J325933
$$ -1711159 -1689580 -1816913 -1478926 -724501 -564238 -1502540 -2535380 -2329251 -1003318
31752a003318R82401l90295j265342q23785M15962J395647J449944O43180l52469
$$ -1003318 -20917 -411212 -1676554 -2500339 -2084377 -688730 761214 1404394 1051925
31743A051925p19143j62790P89367J284540R32803M9224p44293j006986p12293
$$ 1051925 332782 169992 959359 2243899 3176702 3225926 2481633 1474647 762354
31734G62354k23142N087j46833l79842m02876k56141n6748K92506Q04353J062014
$$ 762354 539212 544299 397466 17624 -385252 -641393 -698141 -405635 398718 1460732
31724A460732O62740r6693m93767l12198L6709L15786P11602J130533R93188J54234
$$ 1460732 2123472 2026779 1533012 1220814 1257523 1573309 2284911 3415444 4408632 4562866
31714D562866n78416l99254M20069R11528N44243m33920j413481j764740j188838
$$ 4562866 3984450 3585196 4005265 4916793 5461036 5027116 3613635 1848895 660057
31705F60057j99295J83406l08680p71747n01881o1170j65257k88586M13650J377697
$$ 660057 460762 644168 335488 -436259 -938140 -999310 -1164567 -1453153 -1039503 338194
31695C38194J321718M01855N6382O42023Q96842J30226p09890q41532r32323j549087
$$ 338194 1659912 2061767 2118149 2760172 3657014 3787240 3077350 2235818 1303495 -245592
31685b45592j721057m32888J418558K037049J157173J40092m4440K46377K63660
$$ -245592 -1966649 -2399537 -980979 1056070 2213243 2353335 2308895 2555272 2818932
31676B818932k49897j051471j544291j127566k4341O42783L06768p7408N43983
$$ 2818932 2569035 1517564 -26727 -1154293 -1178634 -535851 -229083 -306491 237492
31667B37492J522865J394119K04973m94205L94O25113L04568o11731j193267j208143
$$ 237492 1760357 3154476 3359449 2865244 2865638 3490751 3795319 3183588 1990321 782178
31657G82178r68090o72539m57998m75167m73879P2653J023030J412124P46577
$$ 782178 -185912 -858451 -1316449 -1791616 -2265495 -2192842 -1169812 242312 988889
31648I88889j54189k29122L74583N97414l5387q50718r63977l49241J76504o6207
$$ 988889 834700 605578 980161 1577575 1542188 691470 -272507 -621748 -445244 -511451
31638e11451p45439q10750J80050J326610J437131N87857m9262J13411L85612
$$ -511451 -1256890 -2067640 -1887590 -560980 876151 1464008 1414746 1528157 1913769
31629A913769j430p69707j101984p18840o420N22071N36924M3790m78055m63397
$$ 1913769 1912339 1142632 40648 -678192 -684612 -162541 374383 418173 -59882 -523279
$$ [...]
##END NTUPLES=NMR SPECTRUM
##END=
