##TITLE=31Pdec_DE-121rm_3h
, 64 sc
 4.12.2025
##JCAMPDX= 6.0         $$ Bruker NMR JCAMP-DX V2.0
##DATA TYPE= NMR SPECTRUM
##DATA CLASS= NTUPLES
##ORIGIN= UXNMR, Bruker Analytische Messtechnik GmbH
##OWNER= root
$$ XWIN-NMR		Version 3.5
$$ Thu Dec  4 14:30:34 2025 Russian Standard Time (UT+4h)  she@DPX200
##.OBSERVE FREQUENCY= 81.013821
##.OBSERVE NUCLEUS= ^31P
##.ACQUISITION MODE= SIMULTANEOUS
##.ACQUISITION SCHEME= undefined
##.AVERAGES= 64
##.DIGITISER RES= 17
##SPECTROMETER/DATA SYSTEM= spect
##.PULSE SEQUENCE= zgpg30
##.SOLVENT NAME= Acetone
##.SHIFT REFERENCE= (INTERNAL, Acetone, 0, 198.062)
##AUDIT TRAIL= $$ (NUMBER, WHEN, WHO, WHERE, WHAT)
$$ ##TITLE= Audit trail, XWIN-NMR		Version 3.5
$$ ##JCAMPDX= 5.01
$$ ##ORIGIN= Bruker BioSpin GmbH
$$ ##OWNER= she
$$ F:/spectra/data/she/nmr/P31/2/pdata/1/auditp.txt
$$ ##AUDIT TRAIL=  $$ (NUMBER, WHEN, WHO, WHERE, WHAT)
(   1,<2025-12-04 14:29:26.26 +0400>,<she>,<DPX200>,
      <created by zg, POWCHK disabled, PULCHK disabled
       configuration hash MD5:
       00 E9 B6 7A A2 85 ED C7 34 08 36 98 17 FE 4E 26
       data hash MD5: 32K
       B8 F4 00 A8 2B 58 62 02 2D 5D F7 48 2D D9 55 DD>)
(   2,<2025-12-04 14:29:28.51 +0400>,<she>,<DPX200>,
      <Start of raw data processing
       efp BC_mod = 2 LB = 1.5 FT_mod = 6 PKNL = 1 PHC0 = 1402.254 PHC1 = 51.10034 SI = 64K 
       data hash MD5: 64K
       EE F7 F2 CD 70 0C 25 F0 96 44 88 0A C3 96 8B 93>)
(   3,<2025-12-04 14:29:43.92 +0400>,<she>,<DPX200>,
      <pk PHC0 = -8.260896 PHC1 = 0 
       data hash MD5: 64K
       92 72 BD ED 0C FA 41 FD 1A BB F5 1D 25 F5 BE 62>)
(   4,<2025-12-04 14:29:59.59 +0400>,<she>,<DPX200>,
      <pk PHC0 = 0.2000007 PHC1 = 0 
       data hash MD5: 64K
       01 FE 4C DC 5F A8 4B 8E 21 EC 8D 8D 0B F9 56 40>)
$$ ##END=
$$ 
$$ hash MD5
$$ 64 CA C6 B7 A2 7D EB F1 A5 5A 93 B1 16 45 03 9B
##$RELAX= 
##$RELAX= 
##$RELAX= 
##$RELAX= 
##$RELAX= 
##$RELAX= 
##$RELAX= 
##$RELAX= 
$$ Bruker specific parameters
$$ --------------------------
##$DU= <F:/spectra>
##$EXPNO= 2
##$NAME= <P31>
##$PROCNO= 1
##$TYPE= <nmr>
##$USER= <she>
##$AMP= (0..31)
100 100 100 100 100 100 100 100 100 100 100 100 100 100 100 100 100 100 
100 100 100 100 100 100 100 100 100 100 100 100 100 100 
##$AQSEQ= 0
##$AQ_mod= 1
##$AUNM= <au_zg>
##$AUTOPOS= <>
##$BF1= 81.014009
##$BF2= 200.13
##$BF3= 200.13
##$BF4= 200.13
##$BF5= 200.13
##$BF6= 200.13
##$BF7= 200.13
##$BF8= 200.13
##$BYTORDA= 1
##$CFDGTYP= 0
##$CFRGTYP= 5
##$CHEMSTR= <none>
##$CNST= (0..31)
1 1 145 1 1 1 1 1 1 1 1 1 1 1 1 1 1 1 1 1 1 1 1 1 1 1 1 1 1 1 1 1 
##$CPDPRG= <waltz16>
##$CPDPRG1= <>
##$CPDPRG2= <waltz16>
##$CPDPRG3= <>
##$CPDPRG4= <mlev>
##$CPDPRG5= <mlev>
##$CPDPRG6= <mlev>
##$CPDPRG7= <mlev>
##$CPDPRG8= <mlev>
##$CPDPRGB= <>
##$CPDPRGT= <>
##$D= (0..31)
0 1 0 0 0 0 0 0 0 0.06 0 0.03 2e-05 3e-06 0 0 0.0002 0 0 0 0 0 0 0 0 0 
0 0 0 0 0 0 
##$DATE= 1764844165
##$DBL= (0..7)
120 120 120 11 120 120 24 19 
##$DBP= (0..7)
150 150 150 150 150 150 150 150 
##$DBP07= 0
##$DBPNAM0= <>
$$ [...]
##$SUBNAM3= <"">
##$SUBNAM4= <"">
##$SUBNAM5= <"">
##$SUBNAM6= <"">
##$SUBNAM7= <"">
##$SUBNAM8= <"">
##$SUBNAM9= <"">
##$SW= 400.765351723535
##$SWIBOX= (0..15)
0 1 3 0 0 0 0 0 0 0 0 0 0 0 0 0 
##$SW_h= 32467.5324675325
##$TD= 32768
##$TD0= 1
##$TE= 0
##$TE2= 300
##$TE3= 300
##$TEG= 300
##$TL= (0..7)
0 120 53 12 22 120 120 120 
##$TP= (0..7)
150 150 150 150 150 150 150 150 
##$TP07= 0
##$TPNAME0= <>
##$TPNAME1= <>
##$TPNAME2= <>
##$TPNAME3= <>
##$TPNAME4= <>
##$TPNAME5= <>
##$TPNAME6= <>
##$TPNAME7= <>
##$TPOAL= (0..7)
0.5 0.5 0.5 0.5 0.5 0.5 0.5 0.5 
##$TPOFFS= (0..7)
0 0 0 0 0 0 0 0 
##$TUNHIN= 0
##$TUNHOUT= 0
##$TUNXOUT= 0
##$USERA1= <user>
##$USERA2= <user>
##$USERA3= <user>
##$USERA4= <user>
##$USERA5= <user>
##$V9= 5
##$VALIST= <valist>
##$VCLIST= <CCCCCCCCCCCCCCC>
##$VD= 0
##$VDLIST= <DDDDDDDDDDDDDDD>
##$VPLIST= <PPPPPPPPPPPPPPP>
##$VTLIST= <TTTTTTTTTTTTTTT>
##$WBST= 1024
##$WBSW= 4
##$XGAIN= (0..3)
0 0 0 0 
##$XL= 0
##$YL= 0
##$YMAX_a= 52607
##$YMIN_a= -57552
##$ZGOPTNS= <>
##$ZL1= 120
##$ZL2= 120
##$ZL3= 120
##$ZL4= 120
##$ABSF1= 0
##$ABSF2= 0
##$ABSG= 0
##$ABSL= 0
##$ALPHA= 0
##$AQORDER= 0
##$ASSFAC= 0
##$ASSFACI= 0
##$ASSFACX= 0
##$ASSWID= 0
##$AUNMP= <proc_1d>
##$AZFE= 0.1
##$AZFW= 0.5
##$BCFW= 0
##$BC_mod= 2
##$BYTORDP= 0
##$COROFFS= 0
##$CY= -3
##$DATMOD= 1
##$DC= 0
##$DFILT= <>
##$DTYPP= 0
##$F1P= 0
##$F2P= 0
##$FCOR= 1
##$FTSIZE= 65536
##$FT_mod= 6
##$GAMMA= 0
##$GB= 0
##$INTBC= 1
##$INTSCL= 9.790993e-09
##$ISEN= 30
##$LB= 1.5
##$LEV0= 0
##$LPBIN= 0
##$MAXI= 10000
##$MC2= 0
##$MEAN= 0
##$ME_mod= 0
##$MI= 50
##$NCOEF= 0
##$NC_proc= -6
##$NLEV= 6
##$NOISF1= 182.463
##$NOISF2= 159.3651
##$NSP= 0
##$NTH_PI= 0
##$NZP= 0
##$OFFSET= 198.0616
##$PC= 4
##$PHC0= 1394.193
##$PHC1= 51.10034
##$PH_mod= 1
##$PKNL= yes
##$PPARMOD= 0
##$PSCAL= 0
##$PSIGN= 0
##$REVERSE= no
##$SF= 81.0140089999434
##$SI= 65536
##$SIGF1= 159.3651
##$SIGF2= -187.1042
##$SINO= 113.3802
##$SIOLD= 16384
##$SREGLST= <1H.CDCl3>
##$SSB= 0
##$STSI= 65536
##$STSR= 0
##$SW_p= 32467.5324675325
##$SYMM= 0
##$S_DEV= 0
##$TDeff= 32768
##$TDoff= 0
##$TI= <>
##$TILT= no
##$TM1= 0
##$TM2= 0
##$TOPLEV= 0
##$USERP1= <user>
##$USERP2= <user>
##$USERP3= <user>
##$USERP4= <user>
##$USERP5= <user>
##$WDW= 1
##$XDIM= 65536
##$YMAX_p= 482626846
##$YMIN_p= -44515613
$$ End of Bruker specific parameters
$$ ---------------------------------
##NTUPLES= NMR SPECTRUM
##VAR_NAME=  FREQUENCY,     SPECTRUM/REAL,   SPECTRUM/IMAG
##SYMBOL=    X,             R,               I
##VAR_TYPE=  INDEPENDENT,   DEPENDENT,       DEPENDENT
##VAR_FORM=  AFFN,          ASDF,            ASDF
##VAR_DIM=   65536,         65536,           65536
##UNITS=     HZ,            ARBITRARY UNITS, ARBITRARY UNITS
##FACTOR=    0.49542278885378, 1,            1
##FIRST=     16045.7642231865, 0,            0
##LAST=      -16421.768244346, 0,            0
##MIN=       -16421.768244346, -44515613,    0
##MAX=       16045.7642231865, 482626846,    0
$$ Real data points
##PAGE= N=1
##DATA TABLE= (X++(R..R)), XYDATA
$$ [...]
48976 -20511 -939421 -1404153 -1659061 -1826172 -1728751 -1356763 -953839 -625109 -282256 20360
48966 20360 51634 -296025 -921695 -1621574 -2047113 -1813590 -1028411 -462653 -707193 -1331269
48956 -1331269 -1400841 -691560 182931 729182 985153 992917 615136 42879 -222836 -173340
48946 -173340 -421908 -1192575 -1827507 -1748406 -1288704 -1008188 -774000 -260408 128290 -236533
48936 -236533 -1037142 -1340748 -1061314 -1052106 -1536794 -1514306 -297448 1228689 1717986 1166554
48926 1166554 681077 747780 719291 53334 -835274 -1258721 -1124022 -746047 -324398 -40924
48916 -40924 -267603 -1163285 -2266536 -2923790 -3010942 -2891749 -2796257 -2606531 -2180783 -1536945
48906 -1536945 -731783 151770 913856 1377365 1566618 1532352 1144708 361405 -462128 -935370
48896 -935370 -1197523 -1671537 -2331985 -2735710 -2762113 -2731304 -2705097 -2317418 -1535302 -969997
48886 -969997 -1056074 -1425175 -1492968 -1216730 -870046 -536335 -305670 -519971 -1230181 -1767229
48876 -1767229 -1498315 -762000 -421102 -697998 -1115572 -1421003 -1811209 -2254063 -2335651 -1952330
48866 -1952330 -1569816 -1611565 -2052017 -2705515 -3422234 -3906606 -3858265 -3414070 -2961995 -2463088
48856 -2463088 -1573785 -559996 -328242 -1162810 -2092731 -2061522 -1239038 -586456 -505170 -600001
48846 -600001 -602120 -810295 -1468008 -2185682 -2307694 -1744161 -1213352 -1508160 -2517979 -3235986
48836 -3235986 -2986472 -2380852 -2544677 -3527878 -4185071 -3732931 -2669605 -1839618 -1340698
48827 -1340698 -884407 -567369 -551123 -449122 160358 888600 981899 452243 24899 50998
48817 50998 201775 216254 209212 163784 -163422 -677077 -956996 -1025602 -1415725 -2215628 -2785568
48806 -2785568 -2858840 -3191048 -4396506 -5655036 -5492125 -3724881 -1816233 -1179877 -1800669
48797 -1800669 -2761887 -3509835 -4106188 -4600613 -4776679 -4532170 -4077098 -3614467 -3098758
48788 -3098758 -2452503 -1796813 -1299385 -987024 -897459 -1208484 -1935078 -2665845 -2966594 -2949995
48778 -2949995 -3024277 -3131006 -2780224 -1939429 -1266459 -1140075 -1032748 -351140 566251 938967
48768 938967 715554 509941 504965 225577 -493583 -1071501 -1034568 -727739 -758818 -1142757
48758 -1142757 -1428075 -1393098 -1197920 -1021011 -934661 -1046548 -1405042 -1775905 -1814600 -1494619
48748 -1494619 -1106757 -764694 -172500 914023 2136178 2730835 2356581 1522220 1006090
48739 1006090 952063 798013 112010 -787557 -1207622 -895270 -296301 -88663 -552377 -1283676
48729 -1283676 -1494727 -813679 154876 375607 -399735 -1358822 -1761344 -1802215 -1926761 -1873682
48719 -1873682 -1171091 -242015 -97072 -973085 -2116356 -2954327 -3596816 -4003373 -3631522
48710 -3631522 -2417550 -1319634 -1213973 -1778854 -2104543 -1968032 -1838791 -1949168 -2048556
48701 -2048556 -1914315 -1512442 -780010 189767 849545 673633 -56213 -455685 -92312
48692 -92312 597524 990297 939576 680385 503997 685881 1360936 2244191 2732086 2484850
48682 2484850 1741697 957210 352813 -44777 -187809 -84961 49713 -11323 -198156 -228866
48672 -228866 -23565 142087 -20086 -431451 -735769 -709163 -416238 43786 701407 1451920
48662 1451920 1835930 1451984 590521 86304 366555 912982 900285 174482 -676159 -1097928
48652 -1097928 -1081636 -866226 -450175 358458 1497589 2528096 3079931 3254334 3351741
48643 3351741 3307245 2798200 1986466 1638672 2141248 2827680 2845509 2372925 2253213 2599199
48633 2599199 2649072 2091544 1608887 1737590 1998693 1711570 1039781 603462 520884 460274
48623 460274 310629 237159 313913 530925 878023 1086924 731703 -45211 -494825 -430727
48613 -430727 -710602 -1838529 -2869370 -2740552 -2022414 -2015795 -2553366 -2268007 -960009
48604 -960009 -24257 -195026 -460185 108580 881440 994423 946786 1641089 2649672 2774135
48594 2774135 1926345 1216221 1277825 1587945 1559131 1406121 1594285 2013858 2106623 1609192
48584 1609192 936277 778720 1252472 1534539 696784 -1046162 -2387517 -2392555 -1395716
48575 -1395716 -233608 720979 1339571 1326131 771512 536283 1215630 2145834 2322083
48566 2322083 1897665 1727697 1721407 917051 -758415 -2056073 -2066747 -1241637 -338964 577279
48556 577279 1464358 1638225 724565 -395206 -583802 -12398 199498 -322516 -802248
48547 -802248 -594918 -38899 182899 -77295 -453157 -556368 -245964 287330 572352 256332
48537 256332 -463687 -1035188 -1172204 -1017528 -758765 -483266 -401307 -724549 -1218165 -1376602
48527 -1376602 -1240032 -1505093 -2484165 -3456306 -3549754 -2872490 -2169929 -1674186 -1045965 -335944
48517 -335944 -134308 -562590 -885365 -556187 -67779 -218507 -939050 -1452163 -1377956 -1085882
48507 -1085882 -1007217 -1122699 -1180717 -993904 -431387 513279 1513212 2049812 1903889 1338105
48497 1338105 759247 381640 186051 -51444 -673585 -1787032 -2973140 -3634834 -3630638
48488 -3630638 -3265732 -2719733 -1931642 -1067859 -550125 -427974 -242234 199925 403462
48479 403462 -76691 -900727 -1394083 -1367765 -1005702 -312494 656373 1241156 692664 -615561
48469 -615561 -1192831 -72820 1904350 2857716 1813958 -355185 -1912278 -1992019 -1279156
48460 -1279156 -1011200 -1529936 -2099159 -2080074 -1771830 -1813918 -2206917 -2440217 -2330765 -2141864
48450 -2141864 -1970641 -1642463 -1273814 -1336666 -1941695 -2554660 -2725680 -2690594 -2868080 -3054051
48440 -3054051 -2584330 -1256309 252977 982717 579244 -422632 -1117900 -1006998 -302515
48431 -302515 433202 782647 566613 -259525 -1473889 -2470269 -2665362 -2097844 -1378266
48422 -1378266 -1023873 -1067502 -1257830 -1303523 -936934 -143529 606731 760375 406419 176210
48412 176210 308103 333316 -71509 -489207 -448484 -206509 -260710 -452721 -273959 119573
48402 119573 -14607 -842939 -1596252 -1656366 -1425372 -1685188 -2477231 -3109467 -3092708 -2594283
48392 -2594283 -1973217 -1296283 -509801 159339 283581 -240340 -902614 -968438 -190296 932553
48382 932553 1653484 1675846 1281872 863382 525797 183835 -173965 -486301 -757205 -982110
48372 -982110 -991237 -612850 -32501 250220 -48617 -697061 -1314248 -1817216 -2275640 -2556946
48362 -2556946 -2510992 -2389805 -2594892 -2978863 -2920846 -2260387 -1620120 -1491459 -1530167 -1243781
48352 -1243781 -907184 -1111892 -1700229 -1941403 -1680237 -1482903 -1522768 -1145571 71903
48343 71903 1463494 1977502 1353894 198415 -760469 -1086667 -653914 249574 991212
48334 991212 1162741 970472 795924 608925 179015 -359517 -627223 -607383 -715027 -1252688
48324 -1252688 -2105019 -2935425 -3390337 -3186741 -2360230 -1425319 -960171 -1005460 -1152533 -1195331
48314 -1195331 -1332932 -1682671 -1979222 -1932372 -1606291 -1249742 -949393 -642171 -338809 -160259
48304 -160259 -208477 -499714 -969511 -1480830 -1890813 -2163383 -2369172 -2551594 -2646659 -2545763
48294 -2545763 -2191770 -1635812 -1070175 -770554 -886497 -1262220 -1549783 -1549713 -1412639 -1484606
48284 -1484606 -1963584 -2707250 -3363371 -3663790 -3567694 -3184798 -2717246 -2469413 -2616158 -2797248
48274 -2797248 -2292106 -969144 250867 444168 -13111 69280 952933 1594886 1203296
48265 1203296 236439 -570099 -1217867 -1797066 -1731755 -693946 376013 324870 -546974
48256 -546974 -1065947 -1118947 -1623801 -2621903 -2941251 -2161774 -1493591 -1935717 -2723767 -2585144
48246 -2585144 -1647758 -982554 -834951 -506693 214163 616262 210344 -488309 -632033
48237 -632033 -51546 645020 762377 187451 -558707 -959908 -1137155 -1569960 -2231214 -2538000
48227 -2538000 -2310097 -2100361 -2182036 -1927178 -878901 157662 27801 -1094410 -1922763
48218 -1922763 -1853444 -1570059 -1759617 -2168209 -2283808 -2200611 -2311063 -2634736 -2912236 -3043957
48208 -3043957 -3071044 -2954232 -2646608 -2205065 -1662112 -986909 -281587 211710 376643 267236
48198 267236 -102897 -694036 -1193101 -1266016 -1076170 -1051305 -1088391 -631953 261896 674746
48188 674746 95104 -700265 -667403 87571 637199 615880 422087 183322 -556588 -1919660
48178 -1919660 -3197806 -3629119 -3172317 -2210793 -993693 186333 664159 -93099 -1649412
48169 -1649412 -2741994 -2464695 -1133210 132519 553703 322072 198089 661784 1508894
48160 1508894 2160110 2208225 1669307 883795 273277 48330 12350 -216360 -623582 -626749
48150 -626749 192506 1286466 1539950 604116 -578010 -858622 -182691 580059 883829
48141 883829 1068676 1620665 2323176 2446899 1634675 371396 -415786 -151167 926016
48132 926016 1992451 2342987 1909273 1130298 447440 55403 6748 223251 332229 -172692
48122 -172692 -1341027 -2498993 -2852006 -2317902 -1563187 -1242721 -1393307 -1580141 -1462885
48113 -1462885 -1137526 -966659 -1095761 -1200904 -882291 -303843 -124582 -629400 -1276020
48104 -1276020 -1416039 -1105564 -717072 -103937 1068713 2284551 2428155 1328860 176740
48095 176740 -78701 54496 -313308 -866067 -574186 578078 1445732 1331997 797287
48086 797287 614357 699804 494133 -146358 -873484 -1337695 -1457798 -1464063 -1834248 -2841209
48076 -2841209 -3993004 -4311296 -3400318 -1894412 -639383 168665 770152 1220303 1399282
48067 1399282 1326105 1043647 447235 -368415 -865710 -676187 -291207 -590112 -1688390
48058 -1688390 -2749574 -3029412 -2666284 -2239459 -1899731 -1299468 -311293 525405 539974
48049 539974 -111628 -378007 470685 1777304 2200734 1454834 640150 629635 932073 710978
48039 710978 173018 36980 138955 -294950 -1159688 -1465724 -1003591 -874862 -1852692 -3129503
48029 -3129503 -3397657 -2534203 -1480115 -900525 -724315 -764455 -1050558 -1520850 -1893032
48020 -1893032 -1945694 -1689300 -1303832 -1075381 -1218841 -1574314 -1721737 -1588472 -1586203 -1869959
48010 -1869959 -1925770 -1373628 -751312 -827648 -1405145 -1560797 -983585 -322634 -172351 -437188
48000 -437188 -834093 -1302193 -1643283 -1417075 -603791 120193 157316 -369893 -1064211 -1828419
47990 -1828419 -2542575 -2667856 -1852891 -699322 -262470 -833724 -1736700 -2271523 -2308830
47981 -2308830 -1940598 -1175583 -237774 323639 229833 -66381 116943 828144 1430592 1404083
47971 1404083 926031 546714 478377 444120 226776 96608 450847 1131465 1443008 960846
47961 960846 67424 -488521 -368802 190789 763163 1006422 732092 30445 -723745 -1234491
47951 -1234491 -1563351 -1822443 -1806165 -1343030 -872498 -1112344 -2083033 -2965670 -3084642 -2581251
47941 -2581251 -1945394 -1383636 -945382 -800650 -972504 -1145816 -1149739 -1280012 -1686371 -1824975
47931 -1824975 -1158977 -140538 265524 -44248 -212958 218064 682802 631030 417606
47922 417606 610103 1013253 1067683 822268 771202 937440 872733 531037 406750 678374
47912 678374 899475 811487 830356 1275432 1628341 1190748 210186 -331514 -31173 453035
47902 453035 380797 -155579 -610203 -841386 -1113623 -1473473 -1664186 -1654893 -1754992 -2046137
47892 -2046137 -2134210 -1758871 -1300584 -1255216 -1420852 -1145941 -375470 111687 -276471 -1155459
47882 -1155459 -1763538 -2002813 -2377376 -3047572 -3515922 -3360017 -2813133 -2348153 -1996627
47873 -1996627 -1450340 -732461 -385574 -834170 -1729458 -2162795 -1601307 -488985 232978
47864 232978 149145 -314061 -612898 -774406 -1109121 -1536521 -1653093 -1378900 -1059166 -870728
47854 -870728 -573964 -10633 539148 716041 496718 56353 -492822 -1040975 -1466329 -1865331
47844 -1865331 -2441245 -2957141 -2761961 -1724874 -695574 -533479 -1044590 -1437300 -1480942
47835 -1480942 -1533780 -1706696 -1814954 -2023062 -2644375 -3266669 -2995939 -1784526 -647336
47826 -647336 -230514 -19708 569003 1157274 1135020 728074 549234 603999 552906 531701
47816 531701 817743 975550 307764 -916305 -1614996 -1374610 -929040 -951562 -1175637 -1117480
47806 -1117480 -1001344 -1367601 -2104422 -2445387 -1900116 -839879 -62928 106368 156764
47797 156764 703387 1528551 1698929 830678 -236323 -486611 -26125 328352 390633 607571
47787 607571 854012 345398 -965268 -1913363 -1610701 -646910 -168289 -361345 -552336
47778 -552336 -381896 -157392 -252439 -732524 -1418793 -1882422 -1614199 -666895 112239 1517
47768 1517 -620195 -723513 56996 1011712 1185081 256640 -1261004 -2338971 -2136372 -809273
47758 -809273 521811 958302 740626 620971 741468 768068 777557 1121472 1503787 1134788
47748 1134788 -42570 -1141480 -1638019 -2071489 -2972739 -3822267 -3758518 -2845952 -1904764
47739 -1904764 -1345615 -907178 -461983 -319181 -522992 -476121 293792 1350189 1851335
47730 1851335 1708248 1680626 2217920 2778624 2692519 2220368 2073775 2131852 1546719 245073
47720 245073 -633484 -311250 394942 161111 -1079265 -2290142 -2839124 -2914651 -2692770
47711 -2692770 -2137017 -1644804 -1877608 -2700707 -3156565 -2811882 -2326402 -2268968 -2135390 -1156526
47701 -1156526 447622 1654905 1787332 1005649 -57477 -733707 -648828 -49079 347478
47692 347478 133939 -305627 -326565 182508 774426 997185 729349 131750 -533894 -1140392
47682 -1140392 -1782802 -2445339 -2697927 -2174015 -1333480 -1157740 -1924349 -2844497 -3115235
47673 -3115235 -2731615 -2016977 -1077322 -188048 -43383 -940437 -2146996 -2708025 -2538188
47664 -2538188 -2155999 -1727614 -1051150 -216830 433718 919436 1592255 2487469 3127216
47655 3127216 2988803 1958791 484683 -583261 -681094 -281059 -438476 -1278570 -1600743
47646 -1600743 -519687 1182850 2079076 1861080 1230167 583136 -144441 -704853 -738793
47637 -738793 -583888 -838191 -1244440 -1064258 -464016 -377020 -947096 -1286867 -975440 -659737
47627 -659737 -878262 -1395873 -2074368 -3266562 -4789550 -5555051 -4952021 -3786978 -3170745
47618 -3170745 -3194026 -3332064 -3402590 -3397819 -3053034 -2379371 -2064727 -2554367 -3204104 -3108812
47608 -3108812 -2343653 -1626445 -1160662 -638108 -79629 183597 216788 410888 797664 1103290
47598 1103290 1372825 1854691 2315969 2162379 1309316 356374 -193409 -384126 -398328 -203365
47588 -203365 194039 482918 254022 -645868 -1976485 -3201295 -3815043 -3720696 -3161045
47579 -3161045 -2229700 -817667 753523 1562037 1079916 13727 -455887 -94142 349485
47570 349485 427732 603804 1385752 2418463 2830353 2263096 1258845 642381 650566 752503
47560 752503 368167 -361803 -761370 -507375 50348 489200 751310 834981 599561 156541
47550 156541 -109821 -277921 -1012952 -2419686 -3414133 -3015385 -1773153 -1015215 -1026305
47541 -1026305 -977152 -495032 -218909 -659619 -1450706 -2014354 -2195849 -1931832 -1016960 367352
47531 367352 1451212 1675787 1350285 1152715 1249965 1220202 665653 -324479 -1236339 -1602719
47521 -1602719 -1519091 -1607014 -2281538 -3218694 -3808091 -3893562 -3693001 -3270074 -2630929 -2142862
47511 -2142862 -2223774 -2689514 -2980951 -2934166 -2731458 -2257681 -1253465 -24347 816855
47502 816855 1306474 1972670 2685859 2637596 1678589 709345 375384 276293 -91504 -494789
47492 -494789 -617762 -721124 -970551 -823896 136407 1278514 1573705 832494 -278457
47483 -278457 -1088705 -1304536 -970327 -556737 -666663 -1200319 -1314494 -670414 -77417 -264984
47473 -264984 -676068 -332931 590883 995021 362175 -784599 -1698146 -1934024 -1351213
47464 -1351213 -376009 14667 -605085 -1315194 -1048467 -264451 -315063 -1296325 -1816233 -1084522
47454 -1084522 -11174 218246 -403364 -1264996 -2199960 -3165938 -3524745 -2597345 -751147
47445 -751147 758891 1042990 310840 -535611 -725346 -136582 720281 1227877 1240443 1057808
47435 1057808 894984 678588 385969 206752 235605 339569 475510 803649 1309892 1642573
47425 1642573 1546973 1196582 892977 691863 520590 407366 372072 309299 186230 141085
47415 141085 174646 -32971 -729001 -1659371 -2296574 -2413958 -2203578 -1875159 -1388194 -663487
47405 -663487 84160 395465 16369 -774098 -1436961 -1785257 -2122714 -2693228 -3254847 -3399601
47395 -3399601 -3044650 -2338887 -1361504 -312093 245860 -111845 -995238 -1574630 -1640828
47386 -1640828 -1745902 -2219666 -2656233 -2635085 -2430815 -2606375 -3211153 -3746592 -3768110 -3292174
47376 -3292174 -2750287 -2666580 -3172773 -3712338 -3449213 -2135485 -439958 647157 606910
47367 606910 -311884 -1272763 -1384265 -474593 612972 894014 452552 322799 1094163
47358 1094163 2178532 2662733 2353089 1678760 1061646 771657 982295 1509528 1769087
47349 1769087 1383243 614473 -85299 -651320 -1204976 -1605860 -1638948 -1444242 -1355382 -1432878
47339 -1432878 -1476656 -1385930 -1247971 -1192452 -1343106 -1730733 -2099582 -2055308 -1572396 -1061519
47329 -1061519 -780619 -553444 -246593 -48879 -9179 174750 535440 557625 11689 -473180
47319 -473180 -279636 231170 308753 -70583 -455058 -875194 -1590845 -2118091 -1597344 -205924
47309 -205924 785266 630356 -36311 -281109 -76333 -25950 -487912 -1401640 -2516187 -3364922
47299 -3364922 -3396055 -2579689 -1672029 -1503118 -2070107 -2533572 -2070496 -696322 668623
47290 668623 1028573 363352 -322922 -223330 332861 591163 615759 1052089 1856601 2227899
47280 2227899 1896896 1541897 1634271 1771326 1598289 1531303 1920600 2216362 1761860 913761
47270 913761 543714 730233 748417 229939 -387807 -580316 -333331 25700 145044 -234566
47260 -234566 -1088258 -1960945 -2264232 -1728581 -451825 1250065 2763964 3269677 2439405
47251 2439405 988333 95744 253269 956195 1416833 1235141 495075 -348684 -683961
47242 -683961 -253316 483828 813539 600514 338959 384080 519127 369398 -106701 -698887
47232 -698887 -1263186 -1792938 -2311753 -2782604 -3042830 -2881338 -2338803 -1832527 -1728379 -1860386
47222 -1860386 -1792354 -1525878 -1550715 -2084126 -2637527 -2595718 -1995775 -1439623 -1322726 -1424104
47212 -1424104 -1326872 -1065105 -1138372 -1820800 -2629278 -2740504 -1942338 -885474 -286863 -197418
47202 -197418 -265574 -370488 -577836 -692394 -400014 119403 176721 -649665 -1967050 -2916906
47192 -2916906 -2922280 -2086723 -1045209 -437839 -382849 -481756 -397749 -213197 -58026 248867
47182 248867 775057 1007461 431611 -544313 -916503 -382685 310725 418643 -49478 -803993
47172 -803993 -1795769 -2869251 -3479782 -3272033 -2568275 -1871861 -1268323 -725193 -539300
47163 -539300 -917326 -1433980 -1530235 -1361836 -1533505 -2061512 -2197154 -1366183 142514 1491072
47153 1491072 1974415 1428673 334124 -496360 -672214 -637355 -1015660 -1697388 -2049710
47144 -2049710 -1916198 -1766848 -1802382 -1617516 -1035741 -629145 -916537 -1509748 -1627333 -1159988
47134 -1159988 -641916 -348347 -56450 314011 473793 385058 557797 1324421 2168998 2265284
47124 2265284 1538811 712522 297589 51750 -340913 -524038 74486 1198454 1756900
47115 1756900 1024526 -559052 -2038076 -3037768 -3811130 -4399345 -4316268 -3249913 -1727581
47106 -1727581 -757249 -858329 -1630433 -2280008 -2429694 -2334330 -2383479 -2569222 -2558750 -2203894
47096 -2203894 -1771749 -1610332 -1730113 -1811258 -1547907 -953133 -426328 -488350 -1215363 -1903086
47086 -1903086 -1627039 -324595 973734 1245876 545322 -314639 -821495 -1060919 -1201855
47077 -1201855 -1282742 -1476057 -2001996 -2685919 -3069418 -3050267 -2940061 -2786209 -2189016 -1035228
47067 -1035228 110132 714894 964384 1317759 1723672 1758754 1328976 749872 231235
47058 231235 -270500 -685465 -697274 -100921 870683 1623955 1583256 657599 -543611 -1156874
47048 -1156874 -911570 -361795 -138321 -252437 -356017 -330913 -238426 12755 461900 767390
47038 767390 606352 276753 368061 908732 1395641 1622231 1827986 1944356 1409877 86298
47028 86298 -1179034 -1376420 -464353 630639 933105 155717 -1176581 -2104863 -2014280
47019 -2014280 -1263152 -797005 -1004445 -1326038 -1180980 -787473 -682781 -874622 -992288
47010 -992288 -949461 -866934 -572098 158165 939177 1044401 421276 -145962 -50873 482350
47000 482350 947907 1200098 1204342 655338 -600149 -2000001 -2673961 -2391659 -1712603 -1209541
46990 -1209541 -936753 -724661 -587556 -602011 -651249 -596256 -591247 -952205 -1715626 -2529537
46980 -2529537 -2995035 -2949984 -2439455 -1655505 -965362 -726828 -914746 -1154735 -1298700 -1675920
46970 -1675920 -2458479 -3057477 -2682491 -1455558 -448215 -505574 -1449164 -2516940 -3100020
46961 -3100020 -2899422 -1942031 -810705 -384091 -894414 -1593603 -1744211 -1504717 -1343229
46952 -1343229 -1103755 -450077 125907 -241217 -1351365 -1948943 -1400006 -484435 -167995
46943 -167995 -417460 -744663 -1153449 -1804929 -2296251 -2134287 -1652548 -1631172 -2075197 -2119006
46933 -2119006 -1249434 -21653 635835 397199 -341415 -956041 -1051325 -715452 -451610
46924 -451610 -626972 -947177 -762532 61890 921664 1214843 949015 436059 -247083 -1160173
46914 -1160173 -2081030 -2561672 -2392527 -1793928 -1157976 -758713 -692765 -934222 -1366115 -1773699
46904 -1773699 -1848419 -1342080 -406507 283242 70509 -897755 -1720019 -1788385 -1525644 -1766298
46894 -1766298 -2603457 -3256017 -3010843 -1888731 -374693 1060285 2034239 2297179 2012692
46885 2012692 1724828 1747759 1805816 1554662 1183994 1085338 1126360 803878 83064 -497417
46875 -497417 -684101 -900951 -1485207 -2025257 -1907849 -1186241 -423453 79578 388839 470285
46865 470285 227216 -49780 87305 460378 329530 -526078 -1377631 -1566431 -1420703 -1618954
46855 -1618954 -2051892 -2028706 -1458607 -1066478 -1285702 -1574550 -1209115 -343392 206740 88849
46845 88849 -150619 129023 744233 870733 94153 -1005141 -1474006 -1032302 -255346 213125
46835 213125 291578 227809 105396 -134208 -405170 -556347 -648697 -866117 -1205898 -1511348
46825 -1511348 -1735797 -1897386 -1863537 -1535494 -1205215 -1305368 -1736153 -1858769 -1313257 -462124
46815 -462124 165621 466830 531376 248951 -398013 -960725 -1010258 -855846 -1183014 -1969683
46805 -1969683 -2372082 -1869518 -955000 -338384 52253 738522 1654445 2092568 1686700
46796 1686700 883465 267116 -121582 -522509 -906381 -1101778 -1249493 -1658194 -2223781
46787 -2223781 -2395537 -1834246 -838005 -13187 257255 -48294 -701926 -1307892 -1487002
46778 -1487002 -1178743 -641541 -67687 564208 1110945 1090122 274474 -727272 -954826
46769 -954826 -177262 878263 1422282 1382335 1218865 1332668 1820720 2498127 2925848 2655389
46759 2655389 1697390 591898 -168339 -589438 -874181 -964612 -741586 -472285 -593403
46750 -593403 -1089641 -1529534 -1759453 -2116310 -2813128 -3544078 -3932931 -3970278 -3688518 -2824875
46740 -2824875 -1336537 28654 360195 -240508 -769785 -716183 -658047 -1169137 -1830498
46731 -1830498 -1934252 -1653087 -1711611 -2153507 -2310434 -1998944 -1879565 -2359564 -2881272 -2749118
46721 -2749118 -2113731 -1638379 -1604938 -1860118 -2313423 -2920609 -3342638 -3137982 -2274016 -1144701
46711 -1144701 -203296 192665 -116460 -762891 -947817 -361499 288035 236494 -163177 2405
46701 2405 673951 805185 -13237 -866470 -846299 -300220 -198729 -783053 -1417941 -1507887
46691 -1507887 -1128029 -904876 -1466665 -2749272 -3759631 -3466777 -2067124 -844122 -604423
46682 -604423 -900414 -1058370 -1149936 -1382998 -1312137 -510522 491630 852461 694546 872796
46672 872796 1652082 2407889 2516802 1840568 529583 -876912 -1373216 -433717 1046234
46663 1046234 1687070 1450378 1498326 2210875 2578348 1912839 949101 598540 650153 512370
46653 512370 346933 508048 561456 -74812 -982864 -1286561 -1013154 -853652 -773074 -27227
46643 -27227 1361939 2294507 2147786 1687184 1808030 2086858 1407590 -288691 -1703470
46634 -1703470 -1740028 -818538 -328747 -1027620 -2351027 -3302966 -3603972 -3629392 -3509687 -2953498
46624 -2953498 -2034640 -1427006 -1429874 -1362277 -567258 457096 769205 541399 890677 2113100
46614 2113100 3109544 2939106 2083815 1596459 1643995 1578193 1026463 222892 -518290 -1053039
46604 -1053039 -1256807 -1146701 -1076415 -1347057 -1690815 -1591959 -1077148 -720430 -834211 -1092711
46594 -1092711 -1048497 -642183 -94361 353596 466933 133742 -372806 -555864 -323928 -191534
46584 -191534 -618011 -1373579 -1836797 -1759614 -1440949 -1226771 -1143180 -1041983 -846313 -546465
46574 -546465 -132861 312854 550345 387888 -11058 -179549 155376 688025 828414 393283
46564 393283 -208581 -557193 -716638 -937173 -1134282 -1061927 -866889 -979379 -1420663 -1709999
46554 -1709999 -1620204 -1556913 -1903778 -2405358 -2594145 -2506470 -2501424 -2585011 -2441928 -2051630
46544 -2051630 -1725256 -1476608 -896976 99761 826322 515756 -693585 -1827682 -2157345
46535 -2157345 -1945818 -1949548 -2314125 -2323506 -1450539 -351120 -257463 -1362534 -2458887 -2518649
46525 -2518649 -2027373 -2150038 -3053471 -3882412 -4137436 -4118057 -4014099 -3573578 -2931819 -2803388
46515 -2803388 -3343757 -3635437 -2950303 -1849125 -1290404 -1209020 -842499 -100783 304730
46506 304730 -36568 -820532 -1681894 -2511345 -3088259 -3125017 -2826797 -2781714 -3105291 -3242249
46496 -3242249 -2820094 -2196405 -1920930 -2073475 -2348407 -2418376 -2036674 -1168621 -224894 188120
46486 188120 -50000 -445891 -574758 -531056 -558212 -643074 -717408 -915259 -1364489 -1967731
46476 -1967731 -2557807 -3006133 -3081355 -2564072 -1638925 -791810 -194375 353000 728694 355045
46466 355045 -886406 -2150137 -2509864 -1930678 -952679 66672 814132 645479 -782150
46457 -782150 -2672471 -3679334 -3362544 -2451442 -1694218 -1134840 -647297 -503137 -1023778
46448 -1023778 -2017700 -2865580 -3028738 -2429491 -1549232 -1119585 -1407815 -1834014 -1648224
46439 -1648224 -950761 -593681 -1024773 -1717536 -1905006 -1414829 -535260 498936 1494586
46430 1494586 2077905 1950272 1296624 605876 104641 -357675 -856550 -1130330 -955563
46421 -955563 -625723 -758697 -1533034 -2345341 -2493379 -2077998 -1812408 -1887070 -1562327 -264199
46411 -264199 1322937 1854580 911319 -531717 -1227229 -804747 226936 1146804 1503796
46402 1503796 1259758 676322 -29007 -874350 -1791114 -2318582 -2064973 -1404867 -1180915
46393 -1180915 -1605682 -1950262 -1527541 -570933 122206 122746 -265987 -334879 463636 2004126
46383 2004126 3453540 4032645 3832784 3512597 3249330 2613518 1583662 899918 979535
46374 979535 1154043 610427 -404009 -1019390 -1031001 -968712 -1035726 -777309 86625 1139172
46364 1139172 1818426 2061352 2157825 2261926 2285694 2129198 1842074 1568196 1348984 1003873
46354 1003873 344117 -459424 -953126 -958473 -780908 -697727 -576273 -262691 35353 169001
46344 169001 505135 1404660 2459977 2868749 2488944 1921176 1541917 1072662 244360
46335 244360 -665833 -1211149 -1299092 -1139676 -997049 -1128760 -1625571 -2164603 -2249417 -1832255
46325 -1832255 -1387840 -1288473 -1486262 -1898707 -2604087 -3408492 -3704446 -3163816 -2252944 -1684988
46315 -1684988 -1625188 -1785121 -2001668 -2254471 -2299711 -1811840 -889887 -15234 535385 894953
46305 894953 1182559 1230253 891372 372743 52291 66448 215673 222602 -16512 -403890
46295 -403890 -757405 -904568 -703809 -90869 801247 1616229 1991689 1811353 1173508 196274
46285 196274 -963116 -1962950 -2451111 -2451087 -2301217 -2107746 -1561725 -483110 757913 1645162
46275 1645162 2088454 2251391 2042703 1263828 191580 -509432 -574564 -414291 -434534 -511427
46265 -511427 -448552 -566679 -1302915 -2342464 -2715845 -1930348 -622730 158768 48841
46256 48841 -538980 -1167422 -1781909 -2387421 -2783734 -2858569 -2879071 -3194176 -3717756 -3914081
46246 -3914081 -3310969 -1976783 -563490 115764 -244181 -1093094 -1556696 -1426695 -1330947
46237 -1330947 -1734265 -2179165 -1956248 -1215259 -792673 -1035512 -1422340 -1396461 -986186 -471672
46227 -471672 -4575 237211 48816 -388705 -573019 -401676 -324458 -527996 -580033 -265809
46217 -265809 -120233 -554259 -1044628 -910127 -403046 -223066 -368129 -387849 -430433 -939502
46207 -939502 -1478096 -1111369 -96925 89525 -1111757 -2332830 -2115664 -808521 238745
46198 238745 583053 740860 850049 446377 -507486 -1314469 -1380554 -732171 292738 1273898
46188 1273898 1687659 1307222 644259 403126 506137 277602 -438215 -1081874 -1357365
46179 -1357365 -1574921 -1789635 -1459510 -420747 544917 719045 428615 387595 597095
46170 597095 637840 612031 921947 1348977 1239406 553254 -83444 -372013 -554755 -568152
46160 -568152 64864 1167976 1657800 968528 10978 -44905 583616 718132 -34765 -894630
46150 -894630 -1197979 -1170724 -1237599 -1376242 -1544263 -2082770 -3127372 -4042486 -4071037 -3370323
46140 -3370323 -2834367 -2913213 -3124040 -2848581 -2163280 -1585442 -1262252 -794194 132908 1205218
46130 1205218 1718141 1291056 243384 -736701 -1196995 -1129970 -692888 19120 787239
46121 787239 1069730 365244 -1108971 -2364803 -2545060 -1817674 -1128229 -1060436 -1231009
46112 -1231009 -960817 -269934 147609 -130448 -720578 -971856 -744752 -432163 -407841 -725433
46102 -725433 -1238721 -1702272 -1782929 -1313932 -630447 -342053 -566937 -625136 210498 1755111
46092 1755111 3007027 3219050 2589845 1764345 922040 -295892 -1987532 -3495143 -3970630
46083 -3970630 -3311650 -2271721 -1639639 -1547709 -1651744 -1713615 -1761666 -1814795 -1743534 -1435286
46073 -1435286 -918138 -297887 281330 619734 598478 387385 336939 553755 710440 413632
46063 413632 -294575 -925836 -1053466 -765897 -546206 -680151 -885682 -701642 -204695 -14880
46053 -14880 -438309 -967174 -988632 -666953 -538206 -410305 507021 2179490 3261234 2601104
46043 2601104 729123 -808365 -1274033 -1200406 -1199376 -1134040 -678760 -63747 177283 -87973
46033 -87973 -513506 -814126 -1118472 -1719090 -2526852 -2872557 -2072729 -339719 1107106
46024 1107106 1192683 176115 -656833 -452911 436748 1124367 1124520 474309 -575787 -1613766
46014 -1613766 -2117846 -1876269 -1265022 -857574 -863428 -1115220 -1393599 -1518478 -1330645 -896391
46004 -896391 -574208 -558569 -511591 -31590 620662 725672 51274 -868534 -1531116 -2095788
45994 -2095788 -2940068 -3928756 -4524000 -4492098 -4142263 -3843223 -3543754 -2851472 -1485052
45985 -1485052 367852 2075089 2979535 2894752 2185731 1345650 612810 88370 24141
45976 24141 666136 1786528 2660074 2686252 1913760 834734 -178094 -1024512 -1595645
45967 -1595645 -1702840 -1423810 -1253534 -1603272 -2206699 -2339023 -1733966 -1026054 -1047379 -1830686
45957 -1830686 -2599398 -2693904 -2175247 -1467779 -800030 -235317 81406 105551 128751 378343
45947 378343 470783 -199592 -1448388 -2233626 -1875523 -876887 -145196 174643 532832 941530
45937 941530 861640 160681 -498206 -512337 -109057 95924 -17288 -26485 347889 858734
45927 858734 1024696 609651 -186379 -916177 -1297281 -1454509 -1652658 -1836597 -1698230 -1237870
45917 -1237870 -914928 -1057131 -1420103 -1584029 -1526615 -1496698 -1523817 -1397480 -1023137 -510093
45907 -510093 -6037 317073 283925 15130 7372 528254 1084791 951902 159714 -525658
45897 -525658 -609977 -379050 -334763 -600400 -1016130 -1364954 -1327011 -674030 237271 609203
45887 609203 172850 -383778 -351881 11668 -34580 -511527 -658231 -64283 768832 1205633
45877 1205633 1298943 1455046 1623204 1348636 585799 -45448 -43526 261312 142329 -511123
45867 -511123 -1035994 -886530 -258323 359832 832839 1219544 1330345 989819 552876 538130
45857 538130 765167 499301 -397797 -1080613 -799119 127402 795584 782468 323489 -225481
45847 -225481 -620205 -631768 -208200 299369 405557 -16411 -671733 -1132569 -1042300 -302646
45837 -302646 684456 1216639 1013166 474917 -28172 -703051 -1724108 -2524116 -2387478
45828 -2387478 -1503434 -696446 -266472 95222 309671 -189395 -1335515 -2156442 -2111498
45819 -2111498 -1918199 -2407469 -3199563 -3316572 -2692875 -2203006 -2338652 -2672491 -2678825 -2365554
45809 -2365554 -1899693 -1214729 -319378 419900 651120 446256 99023 -238751 -481752
45800 -481752 -441308 -71694 280731 246671 -20859 -59874 126807 -43415 -852898 -1651417
45790 -1651417 -1505746 -334053 1009698 1743175 1810704 1457576 687586 -440918 -1314860
45781 -1314860 -1182702 -116925 912966 1115997 688134 337632 344302 459085 526338 710241
45771 710241 1064373 1317086 1291957 1202450 1226314 1072270 437912 -235436 -91166 892927
45761 892927 1595476 1161096 271395 319582 1509261 2566744 2432324 1449016 524349
45752 524349 -159216 -946400 -1696692 -1790797 -1082740 -203944 176633 -27125 -464260 -721372
45742 -721372 -544680 -76842 129206 -262524 -752233 -510550 448261 1179589 1096511 752026
45732 752026 925554 1405378 1272580 199707 -1088576 -1665935 -1331658 -642819 -314916
45723 -314916 -649897 -1318295 -1610993 -1059073 105616 1166322 1598065 1452343 1110104
45714 1110104 821591 565455 241596 -164207 -623742 -1115426 -1498355 -1461202 -872316 -188316
45704 -188316 -150625 -866685 -1513925 -1305551 -499635 15353 -22019 8300 573418 1294013
45694 1294013 1512517 1080161 282259 -634685 -1516420 -2155836 -2415521 -2313583 -1804105
45685 -1804105 -783238 438131 1056739 611809 -354237 -936102 -981949 -1050169 -1347371
45676 -1347371 -1333473 -571797 496695 971375 491482 -421960 -918895 -555117 419240
45667 419240 1312044 1533369 1041082 336169 -19397 53157 99132 -293548 -886586 -958003
45657 -958003 -195016 790809 1103298 584059 -124609 -446640 -394533 -228862 -74772 -38739
45647 -38739 -286023 -743029 -1025560 -890194 -495199 -61790 374772 692233 591430 97966
45637 97966 -227789 37348 617173 1024366 1275207 1659054 2079744 2157717 1841340 1456087
45627 1456087 1256234 1304327 1613222 2002181 2024160 1495585 898297 769618 907366 726744
45617 726744 189175 -273677 -599423 -1108002 -1708579 -1874384 -1521192 -1185902 -1160894 -1166308
45607 -1166308 -1109200 -1403050 -2126278 -2558478 -2135646 -1370396 -1199225 -1731975 -2251336 -2288188
45597 -2288188 -2141224 -2322071 -2884567 -3392191 -3354133 -2682641 -1841687 -1502259 -1956311 -2899614
45587 -2899614 -3771214 -4179800 -4056973 -3641866 -3333785 -3326668 -3381535 -3180128 -2812691 -2570745
45577 -2570745 -2346020 -1723023 -699487 204276 686871 1025981 1520230 2043959 2368631
45568 2368631 2470619 2297469 1706131 905922 490361 700385 1076780 1153524 1048758 1027881
45558 1027881 962909 668912 361146 300576 334313 249823 252125 614181 1148880 1481691
45548 1481691 1557855 1459910 1085041 498935 245297 721601 1532484 2028211 2190290 2383698
45538 2383698 2547240 2349667 1935028 1759994 1799451 1618051 1127678 559574 -194842 -1385873
45528 -1385873 -2564284 -2828240 -2072739 -1183839 -776957 -551622 -197520 -98230 -611608
45519 -611608 -1322870 -1626158 -1569687 -1538111 -1478900 -1050249 -306334 308743 527141 392058
45509 392058 -23866 -579211 -819216 -267481 894086 1767722 1613347 677240 -65991
45500 -65991 -31549 330441 237614 -233332 -165107 858535 2035865 2438464 2286679 2400436
45490 2400436 2763305 2616872 1884817 1419735 1623014 1851646 1624524 1447341 1792123
45481 1792123 2104991 1679634 896464 653976 951917 960566 294377 -637350 -1447157 -2119907
45471 -2119907 -2542654 -2451194 -1975361 -1606166 -1486047 -1294714 -940206 -754518 -817125 -674998
45461 -674998 -22520 841459 1545261 2161060 2806309 3140116 2759019 1883674 1193486 1055561
45451 1055561 1259987 1432500 1360429 952511 251171 -431434 -691361 -512184 -383935 -775607
45441 -775607 -1579043 -2194820 -2097341 -1233454 -2849 958030 1062255 182037 -1076553
45432 -1076553 -1752313 -1461901 -863628 -905629 -1628909 -2054402 -1397248 -99192 633763
45423 633763 182930 -901039 -1636540 -1599957 -1052698 -384873 214296 591539 541148 108303
45413 108303 -251062 -128982 313721 613500 728497 1058458 1678225 2077214 1934507 1659801
45403 1659801 1727227 1891233 1625211 1006033 509099 190171 -161001 -241135 446429 1466161
45393 1466161 1680185 910730 393126 1047559 2187582 2659912 2503517 2571300 3037373
45384 3037373 3272333 2945418 2352411 1780321 1371826 1537734 2642623 4188138 5080697
45375 5080697 4925777 4436063 4341894 4474233 4219040 3419467 2491520 1920319 1877975 2154580
45365 2154580 2346165 2256998 2098281 2109362 2140819 1943041 1687959 1717363 1865652 1600129
45355 1600129 865662 231427 89291 243311 457787 872044 1588050 2279454 2542000
45346 2542000 2358775 1984401 1606769 1296511 1084809 999672 1205050 2008495 3367493
45337 3367493 4501488 4546653 3617854 2639930 2063239 1429134 396770 -557301 -890318
45328 -890318 -823396 -905265 -1212492 -1465959 -1521915 -1264326 -408171 1053006 2486518 3176313
45318 3176313 3009180 2292510 1298495 390152 83729 358155 300301 -833146 -2432134
45309 -2432134 -3112436 -2347578 -900201 227818 627035 393529 -63296 -111130 565091
45300 565091 1475310 1947202 2170493 2901163 4118997 4853704 4615682 4169126 4369012
45291 4369012 4868007 4626961 3333115 1689939 488315 -59251 -114377 161107 619995
45282 619995 1014891 1056727 624130 -67551 -574701 -643009 -475154 -402727 -371498 -57210
45272 -57210 525295 928501 919974 864462 1227113 1950794 2569333 2767932 2630963 2470626
45262 2470626 2567683 2954326 3335254 3366920 3115741 3075706 3620612 4582340 5445088 5796260
45252 5796260 5556696 5009579 4672475 4859874 5249797 5171517 4483369 3860345 3981767 4719669
45242 4719669 5423023 5743755 5790605 5626652 5091901 4199698 3363764 3037103 3255377 3651813
45232 3651813 3851753 3770511 3557433 3348399 3159714 3002704 2943541 2962435 2923089 2839235
45222 2839235 2958257 3292386 3281414 2395731 1002805 86908 37701 267413 183488 -54553
45212 -54553 -40591 200274 474379 854098 1329521 1470105 1047351 635149 887160 1452930
45202 1452930 1367959 425436 -600210 -1116746 -1333578 -1555137 -1600455 -1292939 -953778 -958294
45192 -958294 -1181030 -1283079 -1258014 -1314687 -1434870 -1405393 -1171679 -885438 -675499 -546668
45182 -546668 -419303 -181808 140286 232472 -196254 -830929 -846167 143342 1514181 2326314
45172 2326314 2334292 1962724 1530249 995431 378914 -105525 -443344 -873116 -1319276 -1171259
45162 -1171259 -37477 1468804 2177803 1687595 874126 835210 1586314 2206126 2177576
45153 2177576 2018233 2339208 2793242 2532609 1491846 555336 408768 830508 1305555
45144 1305555 1749942 2257782 2621938 2625180 2509850 2640795 2885872 2824843 2445048 2125652
45134 2125652 1992901 1800348 1449153 1103547 722806 50343 -712016 -770949 293241
45125 293241 1791202 2638796 2621894 2483326 2821028 3391456 3642056 3526907 3443276 3512498
45115 3512498 3336181 2619898 1766468 1490262 1859625 2113750 1637892 795291 415691
45106 415691 673876 987185 974136 915995 1091358 1227855 1013424 716548 762290 949729
45096 949729 694279 -9197 -451454 -163382 478943 841226 844206 867317 1090576 1317770
45086 1317770 1393310 1458054 1699645 2055594 2317653 2463813 2747115 3409883 4381480 5353774
45076 5353774 6135022 6782278 7336587 7651476 7729192 8092517 9415118 11665569 13972910
45067 13972910 15639527 17082892 19413745 23185673 28037430 33679771 40642930 49353440
45059 49353440 58465666 64784525 65466357 60375835 52087444 43631419 36469363 30510627
45051 30510627 25404578 21221584 18008284 15315370 12559029 9716504 7383240 6089620
45043 6089620 5693813 5539234 5154699 4654140 4378790 4301701 4038062 3438921 2862491 2693979
45033 2693979 2864402 3111384 3488298 4213353 5096753 5556402 5288292 4597490 3988871
45024 3988871 3744014 3957634 4571284 5164980 5107902 4266369 3329351 3103607 3643789 4351521
45014 4351521 4745909 4809663 4718962 4603433 4543559 4513409 4340300 3932597 3448927 3002087
45004 3002087 2365228 1347593 364696 181433 1032295 2366008 3529626 4349202 4947491
44995 4947491 5366400 5560830 5505199 5161797 4571440 4046015 3964995 4261494 4419995 4136936
44985 4136936 3693002 3521085 3708861 4082739 4443225 4524816 4090901 3320413 2737287 2481839
44975 2481839 2071476 1254236 630023 841190 1494181 1604964 961717 302868 141678
44966 141678 169999 19142 -94820 106757 313252 22654 -640211 -955739 -433090 653974
44956 653974 1561059 1796850 1580598 1580951 2122851 2766050 2890108 2549393 2331001 2400568
44946 2400568 2234709 1479505 570340 171419 383397 864467 1413946 2038397 2680851
44937 2680851 3277198 3905324 4547545 4925608 4932098 4967435 5383710 5819908 5684675 5217800
44927 5217800 5425921 6847103 8923170 10782401 12163129 13334721 14584134 16169258
44919 16169258 18478011 21820113 26168946 31397734 37719890 45678489 55590971 66793024
44911 66793024 77111143 83252116 82557152 75055585 63670769 52030462 42109100 34002504
44903 34002504 27302547 21912927 17744227 14518040 12157531 10833556 10363473 10025614
44895 10025614 9289391 8375974 7774047 7499778 7175668 6582885 5759450 4763871 3770658
44886 3770658 3254377 3561268 4255731 4363073 3465158 2238958 1673899 1957638 2365403
44877 2365403 2142723 1293338 499497 369059 804119 1160739 1062024 888949 1250340 2102356
44867 2102356 2784856 2945943 2952156 3160882 3250859 2728161 1804770 1204713 1165650 1190526
44857 1190526 903152 656534 1005318 1893637 2700705 2940057 2639751 2136490 1789826
44848 1789826 1900160 2612702 3707317 4579457 4644225 3868477 2852502 2290580 2356625
44839 2356625 2694226 2948576 3104638 3281270 3485707 3764771 4352148 5356568 6447055
44830 6447055 7182303 7574904 7991156 8552603 9039984 9416379 10018852 11080880 12404146
44821 12404146 13672142 14810829 15910403 17086750 18544403 20435639 22476781 24030745
44813 24030745 24773945 24975170 24937046 24533536 23536667 22013212 20117789 17907984 15701838
44804 15701838 14154680 13502471 13125699 12388276 11511137 10991949 10561336 9560552 8172970
44795 8172970 7389302 7699729 8568239 9266680 9509395 9216574 8480697 7969323 8545482
44786 8545482 10150413 11781904 12931059 14291350 16557775 19201494 21023508 21385077
44778 21385077 20350395 18206516 15550960 13387639 12308384 11752120 10698296 8928238
44770 8928238 7096259 5833603 5346435 5585121 6128285 6132540 5133601 3779281 3083292
44761 3083292 3080063 2956949 2420795 2072249 2330888 2817465 3054497 3075186 3037346 2849839
44751 2849839 2505654 2247235 2089451 1682745 963830 455898 573980 1052564 1388491
44742 1388491 1460289 1421209 1397839 1587293 2196143 2943798 3101472 2433667 1643547 1422994
44732 1422994 1524064 1337501 963580 997569 1528333 2116080 2642952 3393394 4217110 4361325
44722 4361325 3444893 2092479 1264292 1274444 1729141 2152999 2377059 2450885 2441563 2352319
44712 2352319 2164036 1930525 1772766 1723758 1673733 1567425 1535258 1691590 1936395 2122567
44702 2122567 2264585 2370992 2241114 1724228 1082469 794746 1029264 1527297 1913991
44693 1913991 1893759 1305227 335837 -411278 -445907 26220 370454 331891 235894 425725
44683 425725 887675 1444118 1939703 2202922 2188087 2185127 2516359 3006672 3165068 2919150
44673 2919150 2704151 2755196 2831003 2782085 2832665 3038937 3013362 2571714 2193160 2377621
44663 2377621 2891921 3118199 2884578 2502129 2206434 2040415 2158407 2784406 3866684
44654 3866684 5070672 6080914 6723429 6960910 7018116 7335397 8137975 9231933 10447645
44645 10447645 12002437 14126177 16633959 19205493 21701377 23743006 24426225 23182104
44637 23182104 20690323 18194580 16065054 13824355 11456998 9677437 8742907 8015451
44629 8015451 7119530 6623089 6955326 7422149 7097886 6167800 5535648 5412482 5149026
44620 5149026 4386363 3619966 3514959 4176675 5169534 5860681 5775153 5036256 4416584 4518985
44610 4518985 4968144 4904777 4222291 3700110 3837586 4207402 4195743 3770071 3161055 2354100
44600 2354100 1396825 754688 750293 940002 677206 110968 -47161 316021 525470 225318
44590 225318 -42363 274338 865726 1095589 978394 1014352 1319140 1587831 1816214 2328200
44580 2328200 2979725 3066174 2395348 1868759 2428833 3769453 4702167 4660841 4248041 4258368
44570 4258368 4698467 4973529 4661124 3841974 2890182 2172121 1867035 1960704 2418492 3248539
44560 3248539 4211128 4659254 4140290 3179396 2924828 3770748 4799575 4953480 4342278
44551 4342278 3879761 3927690 3965101 3547840 2921606 2466711 2054160 1340790 434158 -119931
44541 -119931 66269 918621 2161376 3593478 4986763 5911535 5943640 5111435 3970755
44532 3970755 3106860 2672269 2546862 2748624 3332008 3963456 4101259 3756322 3618297
44523 3618297 4131176 4844546 5083575 4916306 4926735 5246086 5415240 5172640 4811755 4660867
44513 4660867 4675687 4692917 4711284 4776992 4900050 5201404 5882296 6980234 8370250 9936493
44503 9936493 11432792 12329253 12305946 11832648 11654381 11683903 11105415 9720951 8405680
44494 8405680 7864670 7689982 7208513 6624449 6599526 7128878 7583625 7639491 7506184 7387193
44484 7387193 7298794 7318151 7498219 7643073 7616661 7708817 8237232 8995727 9597267 10126076
44474 10126076 10874081 11663292 12099786 12328253 12795325 13342888 13302893 12517440 11542737
44465 11542737 10796161 10218566 9812673 9710523 9597009 8920010 7878333 7330339 7443565
44456 7443565 7363350 6630713 5954764 5963236 6122112 5736744 5239781 5474526 6259530 6733298
44446 6733298 6770243 6985145 7510112 7822317 7798403 7961593 8504125 8903814 8780896 8443873
44436 8443873 8295084 8282086 8228500 8181222 8103373 7667015 6724546 5706660 5243749 5540804
44426 5540804 6266715 6879656 7000213 6709092 6543499 6948351 7678887 8009552 7575978
44417 7575978 6728000 6005519 5578845 5313203 5121524 5108531 5480280 6298113 7204672 7582168
44407 7582168 7269595 6916005 7192001 7820481 7955015 7451290 7087224 7395678 7941332
44398 7941332 8072699 7872560 7958847 8655709 9670804 10371639 10231133 9309601 8430983
44389 8430983 8523698 9645028 11027759 12158807 13259212 14508454 15456715 15650281 15312342
44380 15312342 14886120 14342925 13518079 12766511 12605750 12859217 12747149 11794773 10223136
44371 10223136 8554876 7278644 6773325 7029662 7431605 7270344 6553377 5965577 6010849
44362 6010849 6540238 7151430 7665459 8057786 8198551 7882369 7061177 5995643 5204941
44353 5204941 5182082 6013106 7264407 8282447 8587869 8083542 7104203 6226348 5737770
44344 5737770 5326685 4667692 4219719 4782298 6144456 6972221 6442264 5246646 4432134
44335 4432134 4017882 3558843 3351881 3935504 4778644 4715455 3663744 2807892 2939610
44326 2939610 3602864 4087778 4328271 4504127 4613293 4818651 5457984 6333554 6730220
44317 6730220 6529707 6529037 7147107 7590346 7011735 5894280 5464550 6093864 7062653 7712649
44307 7712649 8080603 8380381 8498992 8265429 7926764 8084229 9060983 10327651 10808986
44298 10808986 10101995 9198211 9441403 10870791 12342019 13298376 14411541 16114876 17603169
44289 17603169 18112152 18352822 19608852 21893331 24067582 25544076 26860289 28632895
44281 28632895 30881658 33490011 36556564 40112159 44044281 48318391 52683780 56208402
44273 56208402 57850619 57632794 56599853 55441702 53763325 50926668 47026553 42719759
44265 42719759 38526192 34590376 30825563 27121893 23680382 21131241 19887025 19380977
44257 19380977 18522074 17029010 15718308 15258755 15263997 14985341 14351922 13828322 13628474
44248 13628474 13588804 13597421 13698204 13870752 14002030 13953069 13466106 12257330 10468117 8786802
44238 8786802 7816343 7493024 7374293 7258318 7191194 7077930 6725216 6244146 6058495 6427283
44228 6427283 7130692 7663059 7661139 7201130 6740552 6665796 6855652 6857792 6526232 6213677
44218 6213677 6232500 6448416 6597195 6662368 6649435 6316126 5552738 4818433 4717118 5198388
44208 5198388 5606937 5536282 5250488 5197840 5449525 5735456 5763612 5380929 4650217 3914110
44198 3914110 3615739 3910838 4535821 5105181 5419294 5458453 5276481 5033557 4997193 5337339
44188 5337339 5959764 6662666 7416560 8331923 9314428 9910428 9671313 8682621 7604146
44179 7604146 7105078 7306276 7807809 8154311 8179864 8016910 7952677 8232622 8809424 9284036
44169 9284036 9282806 8911701 8634228 8650544 8628013 8183704 7451638 6972187 7093556 7655590
44159 7655590 8261683 8734004 9233791 9961693 10823192 11485829 11757610 11767818 11742282 11803063
44149 11803063 12073411 12676689 13398478 13677772 13336116 13039703 13492959 14366527 14714879
44140 14714879 14416192 14406863 15320170 16698577 17931135 19209214 20960998 22952504 24684396
44131 24684396 26273233 28191146 30422529 32691102 35415603 39597097 45542973 52235177
44123 52235177 58131399 62189227 64068602 63915458 62306616 60136525 58224863 57000735
44115 57000735 56551074 56880557 58180948 60891004 65194109 70179528 73821457 74349152
44107 74349152 71655708 67042967 61764654 56328547 51078590 46646966 43450481 41185008
44099 41185008 39253014 37563480 36658830 37073638 38655911 40558029 42035329 43312374
44091 43312374 45378209 48718126 52599256 55966698 58647640 61132060 63604344 66076049
44083 66076049 69269381 74241438 80833971 87362760 92280127 95536063 98020907 100408057
44075 100408057 102982314 105923069 109216770 112854601 117618261 125067317 136157927 150429022
44067 150429022 167133138 186443200 208632171 232709154 257233562 282455134 310439862
44060 310439862 342688723 378284105 414306209 446864198 471267676 482626846 478229586
44053 478229586 460048108 434513502 409303265 389832861 377944059 372733436 371694313
44046 371694313 371029500 365952968 352335547 329103155 298932923 266176630 234207948
44039 234207948 204845957 179349075 158552851 141910732 127584289 114172141 101826471
44032 101826471 91276080 82410580 74442775 66961858 60077189 53782987 47914676 42660743
44024 42660743 38460957 35340502 32868515 30799223 29175538 27694561 25647933 22894060
44016 22894060 20390944 19197115 19168157 19169877 18492055 17524968 16976172 16927113 16922852 16612500
44006 16612500 15908750 14727499 13051104 11288300 10170043 10070817 10635986 11256823 11723665
43997 11723665 12173860 12547611 12466513 11726482 10634381 9681574 9046097 8596987 8259107
43988 8259107 8117064 8165834 8202881 8065191 7811211 7569334 7362396 7200384 7158092 7159638
43978 7159638 6882866 6216206 5685473 5953196 6857260 7481113 7397948 7299936 7962609 9063583
43968 9063583 9669900 9583158 9412826 9412568 9121155 8359459 7800092 8141384 9308102 10868595
43958 10868595 12638009 14345466 15301376 15169998 14711642 14904236 15462702 15096773 13336266
43949 13336266 11296453 10304127 10386186 10563270 10192631 9479898 8861028 8407385 7929114
43940 7929114 7352479 6788140 6284985 5684886 4862327 4080408 3864991 4352421 4943801
43931 4943801 4876839 4062655 3117033 2662350 2882725 3656525 4714113 5624891 6009261
43922 6009261 5902208 5660181 5466481 5223016 4950061 4895122 5117588 5344616 5414449 5489225
43912 5489225 5618086 5512325 5106398 4964993 5621479 6713646 7337484 7251714 7209378 7929600
43902 7929600 9165908 10121469 10560032 11109576 12445870 14494818 16642902 18562325 20533832
43893 20533832 22985624 26069832 29815543 34273611 39096610 43243409 45692010 46470682
43885 46470682 46505661 46396442 45857368 44495990 42531396 40368668 37956187 35078547 31970639
43876 31970639 29108858 26576103 24143945 21907356 20388170 20017082 20838891 22623280
43868 22623280 24898362 27050238 28949849 31472161 35805325 42090785 49248508 56300132
43860 56300132 63222296 70018913 75433721 77356897 74610652 67995515 59600251 51427084
43852 51427084 44639179 39556791 35888624 33009687 30353884 27766870 25528921 24023027
43844 24023027 23338709 23134399 22875541 22278967 21574432 21277378 21643675 22410713 23175868
43835 23175868 23945984 25083389 26694141 28401746 29964888 31854487 34801068 38849347
43827 38849347 43303120 47638809 51994350 56588898 61161349 65331588 69067009 72241244
43819 72241244 74011717 73343718 70232511 65893036 61573382 57543166 53372099 48819324
43811 48819324 44221138 40263566 37569635 36291578 35920702 35662386 35137050 34580514 34356016
43802 34356016 34597246 35443802 37205238 39934986 43088541 45978017 48413409 50525499
43794 50525499 52061885 52297675 50739173 47649999 43811903 39966739 36499296 33401802
43786 33401802 30434950 27459754 24644171 22227609 20167169 18263038 16566785 15300178
43778 15300178 14334192 13184691 11721644 10464251 9818533 9355898 8344240 6834108
43770 6834108 5669426 5383580 5582436 5607005 5401534 5417883 5904716 6624391 7193330 7447653
43760 7447653 7468092 7397826 7268056 6973942 6466924 5946649 5699187 5715951 5691010 5489436
43750 5489436 5369066 5561576 5880902 6021308 6059893 6325718 6845848 7236075 7137959 6533712
43740 6533712 5682245 4996094 4908289 5533119 6440072 7038659 7196497 7215158 7231754 6992808
43730 6992808 6262394 5134093 3901171 2948243 2772882 3647168 5091583 6094584 6096454
43721 6096454 5467139 4875743 4575673 4505135 4656317 5024748 5532723 6288936 7562533
43712 7562533 9206234 10535627 11178422 11616152 12391544 13204255 13448071 13337339 13725391
43703 13725391 14899395 16305419 17541538 18963005 21109939 24038751 27415434 30881785
43695 30881785 34181000 37232036 40138044 42832446 44790447 45502460 45168664 44436456
43687 44436456 43467580 41782019 39044422 35490288 31576588 27778845 24707776 22710962
43679 22710962 21258133 19453156 17301726 15673895 14816319 13872980 12323961 10900189
43671 10900189 10336156 10081779 9207564 7954293 7336906 7596539 8040340 8160442 7975735
43662 7975735 7477952 6693451 6156890 6370204 6889856 6939417 6834759 7625619 9217951
43653 9217951 10148126 9649583 8707905 8378098 8217612 7409229 6505151 6703397 7812312
43644 7812312 8274623 7241390 5535826 4351231 3912554 3790300 3777376 3905826 4053475
43635 4053475 4085441 4195343 4697577 5561272 6440927 7120638 7682209 8225342 8632881 8729370
43625 8729370 8586749 8513039 8664413 8781043 8507310 7970890 7783665 8341717 9369211
43616 9369211 10354158 11163312 11875385 12225384 11763445 10625937 9683382 9715480 10725733
43607 10725733 12182710 13578859 14587588 15106948 15509573 16526230 18455033 20724407
43599 20724407 22692279 24630368 27279351 30528453 33348753 35271469 37148890 39872790
43591 39872790 42901840 44856764 45321374 45173889 45057831 44384389 42319624 39187091 36222075
43582 36222075 34118432 32415384 30382534 28036012 26023355 24760493 24007976 23283692
43574 23283692 22435712 21645871 20984729 20241508 19311307 18528756 18330744 18650583 18967196
43565 18967196 19015010 19127430 19694540 20538957 21115533 21212685 21178640 21459706 22128003 22933237
43555 22933237 23712702 24647368 26043353 27847302 29561873 30878424 32251725 34402208
43547 34402208 37218262 39710978 41321990 42729471 44893001 47788024 50757518 53768306
43539 53768306 57462691 62064460 67164775 72786517 79787575 88732829 99009907 109638572
43531 109638572 120522298 132324925 145396046 159346149 173448736 186874688 198581484
43524 198581484 207506340 213066411 215357308 215013519 213144530 211230127 210624358 211999787
43516 211999787 215262910 219684734 223799969 225507244 222922176 215334799 203242461 187743391
43508 187743391 170287218 152643294 136282263 121657095 108611804 97447386 88846534
43501 88846534 82659991 77691643 73156070 69587588 67670497 66821140 65755424 64011370
43493 64011370 61975732 59644707 56384999 52001955 47155501 42505835 38228388 34599432
43485 34599432 32164319 30797083 29335341 26864151 23878287 21496501 19966660 18718300
43477 18718300 17524307 16655648 16008704 15090537 14017100 13576017 13949980 14261008 13936779
43468 13936779 13739881 14627046 16134696 16893921 16571633 16332329 17236774 19000715 20692903
43459 20692903 22038572 23519821 25528322 27936907 30442315 32983099 35760375 38953038
43451 38953038 42346774 45162707 46422226 45712292 43581934 41038782 38633467 36117015
43443 36117015 32995924 29319707 25816515 23233733 21662032 20654045 19903527 19455711
43435 19455711 19166660 18430226 16862162 14961797 13562356 12784463 12128146 11508178 11424194
43426 11424194 11936614 12271272 11895971 11345910 11383381 11847808 12049392 11933301 12026734 12387145
43416 12387145 12465368 12096658 11836936 12040676 12273384 12072770 11818732 12330708 13809418
43407 13809418 15585988 16852943 17390625 17621788 18113282 19002666 19904010 20492440 21091123
43398 21091123 22358088 24387728 26559711 28456682 30518862 33485469 37515975 42228102
43390 42228102 47373215 53111160 59765357 67555037 76263574 84749811 91079590 93848699
43382 93848699 93561611 92399204 92593533 95167810 99756406 104691754 107145885 104281945
43374 104281945 95313697 82435455 69274703 58371296 50169983 43894776 38709744
43367 38709744 34137217 30096933 26928211 25097372 24590506 24693737 24532767 23758989 22612664
43358 22612664 21410022 20121075 18494371 16553594 14851003 14030139 14061283 14137049 13576601
43349 13576601 12685412 12352937 12817017 13258796 12802628 11570415 10452449 10054335 10186465
43340 10186465 10270247 9935662 9247405 8587997 8314816 8367431 8300843 7908373 7652654 8123465
43330 8123465 9147400 9891003 9912356 9637959 9602341 9690602 9504178 9085990 8754580 8433375
43320 8433375 7744826 6767374 6131260 6179339 6470898 6381121 5873800 5401664 5297347 5580904
43310 5580904 6191554 7042816 7875450 8361794 8439535 8390768 8552245 9021893 9577556 9748987
43300 9748987 9085106 7621223 6091936 5401554 5728635 6294436 6157509 5175060 4094269
43291 4094269 3751134 4259192 4970776 5189334 4883086 4625228 4809298 5089547 4787390
43282 4787390 3759883 2603548 2000491 2128911 2741445 3476255 3937602 3823760 3291427
43273 3291427 2964298 3227219 3658696 3536372 2814726 2176687 2097040 2295292 2283431 2084850
43263 2084850 2116890 2560195 3126610 3391787 3189877 2730552 2424304 2512472 2806757 2918223
43253 2918223 2794166 2827060 3313325 4026030 4528230 4727306 4861364 5064895 5244185 5337446
43243 5337446 5413781 5491815 5494359 5419392 5344195 5213212 4838182 4217675 3706035 3735240 4407550
43232 4407550 5384854 6126388 6291040 6049518 5968327 6400076 6991843 7021232 6270568 5326901
43222 5326901 4890900 5009198 5184829 5074023 4804771 4653259 4651505 4579385 4228753 3662377
43212 3662377 3301832 3694966 4988571 6597305 7613506 7682296 7319172 7211926 7392460
43203 7392460 7383928 7042301 6780612 6819648 6683307 5853250 4658999 4000370 4247806 4907087
43193 4907087 5391793 5594874 5555841 5147870 4468180 4076043 4339356 4837264 4923758 4679604
43183 4679604 4758294 5384703 6074077 6395845 6508798 6760161 7119787 7235529 6873886 6194467
43173 6194467 5677036 5726213 6224235 6629088 6683483 6742685 7104159 7398438 7177373 6772948
43163 6772948 6849753 7314821 7519950 7469845 7868164 8858633 9737702 10205733 10847287 11860100
43153 11860100 12365843 11794598 11068939 11391250 12481761 13115456 13005695 13025005 13705912
43144 13705912 14585158 15109462 15307997 15388555 15346289 15125443 14646062 13664191 12149041
43135 12149041 10725738 10104513 10108233 9944936 9430843 9179900 9474385 9733848 9406468
43126 9406468 8774308 8540776 9045071 10073088 11032153 11244396 10580660 9868614 10086350
43117 10086350 11054500 11563741 10935091 9762623 8900616 8448127 8069464 7623995 7051054
43108 7051054 6237218 5437691 5273405 5872093 6531876 6632561 6314645 5861662 5110349
43099 5110349 4063719 3428831 3767871 4566134 4893716 4635216 4362178 4359733 4557737 5122118
43089 5122118 6251064 7500346 8092794 7881049 7363814 6829888 6143103 5304053 4549609
43080 4549609 3918555 3357274 3198964 3819814 4796200 5150539 4592333 3869994 3729306
43071 3729306 4132203 4657544 5031935 5050652 4618699 4176659 4506188 5763053 7202133
43062 7202133 8168286 8806359 9407136 9655098 9148783 8261169 7761810 7721111 7430497 6448775
43052 6448775 5200288 4357848 4003942 3679113 3105526 2584693 2608142 3231152 4038483
43043 4038483 4714551 5340993 5958117 6188006 5743437 5121864 5214453 6201542 7375662
43034 7375662 8149147 8641801 9037178 8978531 8091850 6705484 5530872 4871074 4598331
43025 4598331 4684638 5231883 6076923 6867592 7529791 8206260 8677536 8320885 6904113
43016 6904113 5129105 4055514 4032835 4415379 4364691 3769034 3209400 3064619 2957209
43007 2957209 2352165 1513463 1360089 2250150 3383756 3758520 3373988 3026100 3126422
42998 3126422 3305726 3189088 2974799 2997674 3164638 3202512 3168507 3238128 3114101 2226521
42988 2226521 701894 -365578 -73974 1098014 1834627 1699114 1642472 2496135 3605280
42979 3605280 3689861 2744456 2132207 2656218 3445484 3295640 2440054 2158887 2915866 3778922
42969 3778922 3801710 3241420 3041465 3599669 4499155 5167657 5337549 4986900 4285128 3621920
42959 3621920 3307916 3151130 2669973 1865113 1402688 1736372 2376125 2490328 2032653
42950 2032653 1674122 1645112 1386737 660409 303436 1209051 2955746 4251117 4615763
42941 4615763 4794956 5366366 5776083 5251808 4091165 3359702 3539297 4099633 4385813
42932 4385813 4377039 4396885 4485825 4392588 4049429 3773368 3929636 4487307 4978865 4934477
42922 4934477 4387181 3940068 4268763 5487563 6990124 7962337 8112382 7902342 8032701
42913 8032701 8723365 9553754 9950599 9700970 9023824 8348209 8056087 8200186 8363655
42904 8363655 8027251 7205962 6459447 6108993 5805596 5212520 4776418 5270822 6683423
42895 6683423 8087282 8658979 8422185 7980154 7945889 8681208 10137844 11790079 13055140
42886 13055140 13886517 14637914 15320326 15458903 14850209 14008173 13547005 13415319 13048067
42877 13048067 12108191 10846623 9826799 9417804 9469156 9453586 9034715 8424170 8024161
42868 8024161 7902819 7914574 8111218 8578769 9047053 9221452 9378231 9991211 10847609 11265574
42858 11265574 11163525 11071821 11030368 10470797 9436021 8825234 8913773 8690921 7446771
42849 7446771 6094479 5916360 6661422 6957269 6194435 4981617 3988957 3312893 2898269
42840 2898269 2742365 2650015 2402703 2113134 1910018 1500558 634602 -246352 -471701 -45811
42830 -45811 524505 1051908 1661126 2219483 2473566 2532029 2566996 2370719 1939450 2051091
42820 2051091 3267307 4673274 4742732 3343427 1778835 914124 473670 255857 690467
42811 690467 1771246 2620757 2739601 2770826 3399683 4251009 4497825 3984212 3223602 2752617
42801 2752617 2850683 3415654 3841030 3527082 2714702 2257522 2456682 2811196 3033813 3463658
42791 3463658 4211720 4755191 4756440 4524950 4327458 3995130 3508928 3170078 2935748 2496723
42781 2496723 2249701 3068370 4711802 5691801 5309572 4561389 4293067 3838645 2552287
42772 2552287 1368571 1421453 2129851 2191025 1717712 1825427 2647754 3322479 3602481 4004578
42762 4004578 4583409 4925330 5150387 5594392 5746272 4916529 3752366 3543316 4082759
42753 4082759 3848466 2454406 1286799 1343490 2016385 2550891 3180094 4030038 4264328
42744 4264328 3314354 1939032 1128470 807681 470852 250601 420990 565019 245265
42735 245265 -23557 532877 1609773 2097181 1576059 811082 755041 1556154 2533791 2829697
42725 2829697 2186367 1269622 1026429 1644843 2486757 3046894 3390916 3546651 3242822
42716 3242822 2610401 2407860 3041398 3977952 4633401 5208562 6057898 6847247 7050811
42707 7050811 6802777 6555993 6329389 5996131 5881497 6267069 6621498 6174241 5102194
42698 5102194 4380212 4525141 5152915 5700111 5939138 5829515 5477577 5250115 5417193
42689 5417193 5728935 5803911 5769306 5961763 6180477 5925999 5305128 4964602 5064269 5024711
42679 5024711 4490729 3928914 3960938 4538895 5087088 5200585 4993906 4900348 5197483 5683571
42669 5683571 6002900 6394984 7654553 9922261 12011513 12680420 12249085 12060427 12521350
42660 12521350 12756152 12278552 11817423 11989592 12161979 11410714 9942572 8756875 8320672
42651 8320672 8335424 8541842 9012059 9705299 10327975 10691051 10833603 10817331 10716204 10739734
42641 10739734 11052225 11524084 11920455 12230596 12538849 12712329 12580421 12376608 12633874
42632 12633874 13557408 14737339 15577487 15895036 16074585 16680251 17826018 18855242 18823363
42623 18823363 17486379 15676124 14480711 14151551 14029998 13446677 12420837 11481505 11029398
42614 11029398 10942542 10723969 10054074 9231151 8919970 9358374 10009587 10200125 9917518
42605 9917518 9700017 9874954 10245409 10490748 10552953 10593053 10822501 11405782 12299077 13176700
42595 13176700 13749419 14134689 14621725 15068692 14902759 13856939 12412203 11344305 11071125
42586 11071125 11557978 12515728 13421220 13641909 12970366 11974720 11490726 11748807 12211569
42577 12211569 12227515 11613139 10646266 9796792 9519067 10017029 11036134 12018476 12561663
42568 12561663 12610235 12182647 11184401 9691912 8217132 7354829 7166187 7191232 7165557
42559 7165557 7459884 8542279 10111972 11143380 10983245 10185679 9929895 10633674 11499775
42550 11499775 11589428 11009881 10673342 11052550 11660129 11827846 11553691 11321343 11400967 11678368
42540 11678368 11993969 12270134 12349073 12048833 11425458 10715560 9983022 9099655 8148429
42531 8148429 7542402 7563383 8003927 8447490 8683005 8622368 8069909 6991731 5934142
42522 5934142 5702196 6468332 7527334 8124106 8232809 8269060 8343773 8271928 8202805 8640178
42512 8640178 9604688 10235961 9694163 8287808 7236510 7277151 7900355 8130751 7732688
42503 7732688 7329465 7488823 8065743 8513934 8558724 8341230 8021272 7531801 6825573 6150578
42493 6150578 5832044 5841839 5859073 5778890 5826180 6028160 5980007 5491026 5112273 5454025
42483 5454025 6164997 6287843 5653104 5179069 5557292 6360692 6860488 7039979 7198455
42474 7198455 7151092 6631142 6097537 6258818 6998086 7657368 8260184 9414354 10886216
42465 10886216 11395731 10356926 8925639 8572413 9241073 9755935 9647467 9618669 10222412
42456 10222412 10930189 10863402 9970073 9055622 8797915 9054955 9190678 8860654 8247220
42447 8247220 7577892 6799320 5959067 5527560 5814292 6260138 5980871 5023451 4368926
42438 4368926 4518278 4828527 4615570 4171590 4091251 4205122 3968020 3531101 3604047 4396941
42428 4396941 5423146 6291487 7006667 7457872 7289422 6493455 5638965 5252402 5252899 5149888
42418 5149888 4593020 3669344 2821170 2436688 2397251 2221695 1843547 1894316 2828299 4116406
42408 4116406 4867571 4980543 5016992 5138391 4985737 4601119 4603961 5228858 5934661 6292836
42398 6292836 6614701 7302270 8125129 8590877 8630847 8510893 8366268 8138033 7686441 6757964
42388 6757964 5211076 3484141 2397291 2229766 2452905 2626875 2949780 3489374 3547733
42379 3547733 2552395 1166277 665946 1359117 2343409 2746726 2488640 1831668 954205
42370 954205 157063 -174632 -119492 -209036 -577938 -635163 33611 895361 1128552 768170
42360 768170 620080 1134200 1911895 2384465 2477523 2399236 2179162 1764300 1364957 1364345
42350 1364345 1925244 2872438 3858968 4467041 4342253 3568554 2801194 2635251 2890478
42341 2890478 2954868 2794392 3012388 3756509 4239573 3747074 2560377 1386201 398791
42332 398791 -526950 -1117198 -1043405 -646517 -452592 -184424 782448 2071448 2510239 1867476
42322 1867476 1336752 1899329 3129476 4091231 4514631 4478505 3805768 2612382 1792725
42313 1792725 2029050 2735803 2836044 2243889 1733766 1616392 1448136 957075 425290
42304 425290 133851 134803 575722 1550678 2588921 2989406 2782037 2722907 3210881 3850770
42294 3850770 4263187 4648238 5215961 5649161 5581178 5177292 4775936 4275981 3394848 2375642
42284 2375642 1905901 2238289 2758724 2672141 1976166 1479258 1793414 2562962 2947308 2694721
42274 2694721 2302657 2146166 2040033 1862369 1946799 2366020 2412027 1524515 353987 65255
42264 65255 783752 1590429 1950767 2185081 2451964 2329947 1810409 1771571 2827894 4384215
42254 4384215 5477781 5974475 6213926 5992138 4841137 3144078 2065222 2227820 3094134
42245 3094134 3802223 4049349 3938426 3496178 2755752 2020080 1635835 1601213 1666022 1726577
42235 1726577 1854810 1999197 1976881 1819943 1820759 2055234 2126846 1695684 1105817 1081552
42225 1081552 1789474 2596073 2879472 2719331 2580347 2651723 2798584 2911231 2968599 2913685
42215 2913685 2731329 2481435 2059302 1245676 313814 183758 1393475 3133209 3942388
42206 3942388 3332845 2176405 1515735 1560070 1873137 1949160 1470208 527185 -250894 -252116
42196 -252116 322855 710663 706856 918536 1695662 2474509 2584489 2166076 1812621 1730935
42186 1730935 1766207 1922579 2293326 2628570 2475305 1757935 916941 477080 655372 1306626
42176 1306626 2071273 2620793 2846868 2779765 2433531 1964193 1836376 2379136 3178498 3426652
42166 3426652 2986874 2606609 2932839 3873198 5130351 6714733 8526521 9991540 10608351
42157 10608351 10438235 9641353 8029814 5614849 3147050 1480912 703251 443856 686812
42148 686812 1575889 2642780 2994583 2310404 1126618 133016 -365782 -341898 114141
42139 114141 774729 1406263 1925001 2262471 2298943 2189308 2446198 3312557 4325140 4917819
42129 4917819 5181882 5572026 6134257 6534498 6627624 6521101 6336375 6386166 7220010 8848120
42119 8848120 10218599 10197199 8903341 7434347 6498986 6017789 5788536 5681676 5330427
42110 5330427 4503659 3701916 3549867 3759743 3656546 3554940 4407946 6045441 7060991
42101 7060991 6750486 5931527 5415133 4909334 4057725 3367464 3253821 3151304 2480384
42092 2480384 1655954 1248882 975409 493040 403404 1324483 2599756 3141107 3070710 3272100
42082 3272100 3689108 3456495 2591520 2139281 2474677 2780429 2608588 2765376 3981317
42073 3981317 5608056 6433859 6260835 5969108 6302022 7133912 7816189 7908535 7635830
42064 7635830 7730170 8649569 9961649 10822407 11048948 11252405 11826252 12345987 12235697
42055 12235697 11575775 10888542 10422820 9989089 9319896 8346151 7256674 6426528 6110651
42046 6110651 6117224 6001495 5637235 5312000 5202602 5122784 4914305 4700830 4561938 4318388
42036 4318388 3858205 3328039 2794478 2124765 1472606 1400685 2061318 2652866 2300965 1279685
42026 1279685 734452 1226891 2132922 2585563 2504999 2435968 2684175 2928018 2640250 1775157
42016 1775157 1005748 1160018 2297259 3487489 3731687 2992865 2063685 1545350 1323976
42007 1323976 1004609 417018 -418286 -1424598 -2335959 -2705814 -2316010 -1449878 -592334
41998 -592334 20710 440734 759609 982261 1047673 878502 512632 220097 302541 715205
41988 715205 1123380 1430445 1943447 2795479 3496322 3418956 2592530 1668392 1170402 1102556
41978 1102556 1254827 1525707 1841685 2032856 1962049 1679974 1388955 1310232 1540429 1926860
41968 1926860 2153144 2070255 1820387 1484184 840267 -199689 -1126353 -1302537 -842200
41959 -842200 -470432 -443057 -215901 567575 1374428 1550266 1328556 1425388 1834441 1715587
41949 1715587 592572 -835885 -1345932 -445393 1181193 2396333 2715155 2717527 3320572
41940 3320572 4644805 5793584 5850198 4845267 3548445 2585106 2086460 1976663 2131610
41931 2131610 2293092 2247017 2144775 2336178 2870199 3481358 4065537 4771877 5539419 5953344
41921 5953344 5765537 5236854 4741039 4330512 3982710 4007117 4767759 6043167 7059912
41912 7059912 7299880 7027766 6852688 6975519 7154253 7320459 7803049 8736722 9588495
41903 9588495 9702058 9198753 8873713 9158492 9641557 9765227 9565369 9484561 9828076 10638652
41893 10638652 11694352 12357104 11932632 10616421 9577853 9514605 9596255 8631383 6933379
41884 6933379 6024068 6515551 7291658 7074310 5990377 5152905 5281395 6210888 7397232
41875 7397232 8496799 9604662 11086584 13007892 14762023 15593299 15424243 14728802 13669407
41866 13669407 11967880 9696365 7568385 6227957 5707959 5692657 5819266 5666908 5027023
41857 5027023 4280522 3961931 3970830 3878789 3894326 4547126 5373929 5104656 3507518 1901829
41847 1901829 1335112 1403669 1512064 2038904 3269960 4297198 4230196 3676761 3744531 4249065
41837 4249065 4242207 3775401 3719572 4155324 4337426 4117130 4078431 4276301 4069095 3268134
41827 3268134 2335008 1404703 252854 -702589 -580660 537221 1456943 1445778 967942
41818 967942 596403 236909 -186946 -259599 216133 804060 1129914 1304893 1400343 1253972
41808 1253972 1012077 1049011 1177489 887563 561868 1287435 3014952 4099792 3400368
41799 3400368 1814145 905201 916740 1078637 1103815 1297839 1667737 1937887 2197503 2704454
41789 2704454 3220811 3218836 2617265 1825474 1254007 1138357 1509032 1982958 1994901 1566627
41779 1566627 1340492 1531336 1526440 988974 602162 1053452 1954829 2520202 2700200 2835825
41769 2835825 2761646 2165806 1400694 1034857 959342 786642 744203 1248818 1931526 2075674
41759 2075674 1813693 1927329 2585492 3184055 3345058 3214735 2858400 2208044 1543702
41750 1543702 1208677 922405 177970 -796042 -1315401 -1340490 -1368063 -1332756 -652316 602598
41740 602598 1614833 2020132 2216705 2343528 1990233 1174813 585784 493017 375147 28977
41730 28977 91405 931147 1875422 2140003 1841547 1564143 1573012 1922159 2644851 3344339
41720 3344339 3314218 2616680 2325262 3079080 4103726 4373152 4047007 3890887 3861422 3303057
41710 3303057 2226970 1366369 1053273 965554 1030798 1699003 3035942 4216240 4365849
41701 4365849 3604974 2907845 2995923 3540414 3527409 2455891 1073620 652621 1518222
41692 1518222 2669605 2986244 2383831 1542390 978218 837694 1244053 2236449 3419062
41683 3419062 4126996 4033888 3421017 2895299 2947931 3611843 4389479 4677275 4374468 3896265
41673 3896265 3592451 3506782 3722816 4404373 5298866 5754680 5549710 5211307 5203541 5350907
41663 5350907 5447915 5812030 6672956 7570403 8006241 8206240 8547464 8722659 8294473 7671633
41653 7671633 7607149 7999105 8147508 8004480 8114241 8353977 7870147 6503437 5274684
41644 5274684 5083855 5774800 6836624 8113683 9281028 9490374 8363534 6799140 5986563
41635 5986563 5960531 5876963 5446353 5240362 5570405 5855580 5427804 4483033 3840441 3958120
41625 3958120 4499561 4837305 4771643 4683770 5072930 6036112 7190397 8015537 8249318 8055815
41615 8055815 7874314 7996076 8208833 7997098 7207148 6330988 5936592 5991299 6012958 5744264
41605 5744264 5349471 5031898 4830398 4804373 5065659 5521408 5832780 5738223 5293862 4812126
41595 4812126 4695210 5196608 6095611 6719348 6590244 5977217 5514096 5385041 5237919
41586 5237919 4797580 4157097 3518944 3045439 2896377 3011577 2987943 2651145 2541480 3145038
41576 3145038 3802920 3348081 1968747 1402996 2774702 5087501 6542258 6667195 6346066
41567 6346066 6232951 6058175 5365829 4199915 3015479 2339199 2426546 2905719 2988403
41558 2988403 2423005 1926323 2176540 2720867 2550496 1548111 629547 494808 919040
41549 919040 1306537 1304085 803065 -15030 -490779 31559 1313280 2374018 2783709 3247449
41539 3247449 4563980 6495395 8088144 8723181 8410706 7395239 6028284 4892639
41531 4892639 4518988 4883900 5458241 5763015 5658428 5147002 4225475 3046548 1994969
41522 1994969 1372465 1016095 393811 -774101 -1997692 -2309774 -1238819 591160 1995332
41513 1995332 2290783 1666053 663272 -324959 -1037978 -1256213 -963025 -391455 239270
41504 239270 861814 1380416 1637338 1692711 1847829 2201186 2453727 2367043 2124174 1961516
41494 1961516 1739689 1254593 721237 464658 277811 -338862 -1261973 -1645225 -988011
41485 -988011 128539 736202 636557 457673 681879 1059200 1084776 716520 348743 213094
41475 213094 122381 -121583 -320567 -113217 481713 1020910 1154970 948300 621253 259908
41465 259908 -52047 -104890 132346 301550 150027 97406 785764 2001424 2589579 1769697
41455 1769697 189807 -726799 -320283 758668 1403679 1060555 -85229 -1463728 -2429477
41446 -2429477 -2497408 -1637611 -380326 535267 718936 369151 9942 10589 292821 439690
41436 439690 124621 -502290 -882210 -591756 170541 743297 713640 385889 417869 1034719
41426 1034719 1791649 2163847 2145870 2065195 1964679 1519988 608287 -372459 -941007 -1060324
41416 -1060324 -999907 -873844 -646950 -485148 -651056 -944164 -649158 655278 2449626
41407 2449626 3745085 4090284 3812586 3345167 2717251 1821748 839843 123703 -186508
41398 -186508 -187885 45345 500684 1028175 1331521 1224157 778957 222410 -195104 -267581
41388 -267581 10564 322212 284359 -71667 -265291 62021 704213 1147963 1097761 592305
41378 592305 -188710 -966896 -1356476 -1146401 -588484 -150841 26171 221437 712555 1494278
41368 1494278 2366959 3026865 3125296 2615798 2053500 2086811 2508479 2305494 971343 -660107
41358 -660107 -1356831 -974706 -450922 -431753 -500609 87751 1347495 2522323 2920179 2566784
41348 2566784 2059818 1878410 1903263 1701013 1236243 1022344 1411517 2012149 2112241 1504228
41338 1504228 584087 -190870 -591478 -558294 -310471 -372325 -950908 -1360261 -705689 803095
41328 803095 1923338 1976278 1641550 1738734 1933398 1389223 248700 -436523 -167337 427399
41318 427399 646368 668065 1046042 1673185 1792594 1029074 33098 -146440 729049 1739509
41308 1739509 1799426 816376 -413625 -1298230 -1896988 -2200153 -1651159 67701 2173901
41299 2173901 3405703 3442653 3136531 3281895 3681769 3619166 2839634 1764438 936601
41290 936601 533421 403819 422518 672195 1179439 1577517 1388520 764693 513861 1023063
41280 1023063 1559665 1234062 380956 187021 961475 1649464 1361255 599785 410445
41271 410445 894423 1283813 1155745 784338 362084 -338313 -1288041 -1810624 -1340327 -264072
41261 -264072 474032 504376 321706 421873 634058 582549 427989 655994 1266645 1702813
41251 1702813 1627541 1277746 925680 530062 170119 241265 769516 1058546 633453 106323
41241 106323 361643 1209545 1719752 1688958 1747547 1989302 1639316 469059 -484792 -278778
41231 -278778 611261 1043664 737783 342295 411758 1006193 1970931 2949826 3402365 3252384
41221 3252384 3253631 4034997 5020471 5055842 3984211 2810242 2296881 2193060 2013273 1837550
41211 1837550 1994113 2500711 3190141 3980006 4678133 4862062 4319762 3421640 2780499
41202 2780499 2653425 2812197 2826156 2357892 1403646 407488 -41011 213945 737373 1018165
41192 1018165 989386 943393 1090471 1328196 1356914 955109 220405 -452494 -735406 -679454
41182 -679454 -541906 -392941 -115375 269529 555281 620717 481744 102352 -522607 -1108835
41172 -1108835 -1309487 -1259802 -1430515 -1765435 -1484765 -155890 1418294 1931788 1072368
41163 1072368 -189772 -790526 -612949 -266925 -242715 -525606 -812381 -831622 -512370 -20818
41153 -20818 389786 689543 1184730 2143160 3286201 3854527 3326505 1977589 606198
41144 606198 -176086 -217119 416773 1537439 2650062 3106665 2719280 1996039 1560697
41135 1560697 1553310 1759449 1976527 1950407 1333743 203727 -659797 -626516 -197179 -456746
41125 -456746 -1574313 -2593307 -2844848 -2752276 -2833888 -2673849 -1608052 21416 1109562
41116 1109562 1154355 690846 357593 160349 -171528 -602772 -838932 -642748 96550 1307819
41106 1307819 2521495 3007705 2497265 1635474 1362775 1866663 2466097 2537791 2155875
41097 2155875 1661131 1052352 255103 -289030 30134 996999 1557461 1107391 282336
41088 282336 14810 231483 114968 -585767 -1256060 -1434455 -1390024 -1429897 -1270246 -569800
41078 -569800 322103 718157 565386 583254 1350972 2538031 3184925 2685644 1454073
41069 1454073 590254 793990 1610763 1909402 1145896 -37454 -569271 -117126 674565
41060 674565 999297 717980 328805 249049 325442 182970 -79784 88656 861353 1626264
41050 1626264 1760248 1492504 1507099 1914951 2239541 2315124 2452797 2613446 2203296 1063137
41040 1063137 20963 -43726 772046 1783199 2697899 3620467 4385215 4586345 4255630
41031 4255630 3964735 4118790 4450126 4299621 3259652 1606302 229400 -48079 695493
41022 695493 1488624 1522295 979674 554179 438729 265671 -82947 -158016 423942 1381611
41012 1381611 2000052 1807644 930333 -87470 -698400 -649601 -25937 827284 1386842
41003 1386842 1215152 434250 -196369 -37880 664326 1169551 1283180 1441991 1784849
40994 1784849 1870906 1518648 1200779 1273486 1491473 1643685 1910321 2124587 1548773 95637
40984 95637 -1065603 -1043624 -581973 -726313 -837903 510341 2926956 4194530 3165833
40975 3165833 1232769 353071 801949 1576334 2023125 2184221 2185240 2136254 2285176 2640870
40965 2640870 2744054 2305696 1732489 1514381 1395418 701404 -663943 -2020656 -2653592
40956 -2653592 -2400572 -1528207 -334387 982724 2122871 2536804 1817772 402691 -513813
40947 -513813 -232376 534775 545056 -391123 -1352673 -1635387 -1322835 -621839 392633 1224835
40937 1224835 1147014 309944 -195590 202157 845597 1002813 841895 709170 351933 -374825
40927 -374825 -806061 -353942 497604 943657 1065297 1394915 1765874 1591813 973884 550873
40917 550873 449558 317811 241540 652542 1360119 1658335 1532691 1841839 2978081 4091981
40907 4091981 4095941 2972211 1694189 1122313 1274043 1581238 1688357 1855415 2376196
40898 2376196 2751220 2091735 545339 -496424 -184315 574227 517719 -103660 -232467
40889 -232467 4922 -476349 -1655607 -2156607 -1332624 -165715 410525 753409 1371619
40880 1371619 1770210 1418691 936970 1208754 1928031 2092610 1540958 1000911 859298
40871 859298 816105 650573 481057 259105 -246139 -863900 -1036913 -545915 255942 986862
40861 986862 1560420 1953342 2158749 2446452 3143635 3970819 4076309 3032130 1445673
40852 1445673 260415 -278177 -601046 -964457 -1089873 -692291 31099 664562 1094839
40843 1094839 1490781 1881127 2086540 2091481 2135956 2277400 2178755 1624328 1009137 917317
40833 917317 1307563 1521068 1115217 331476 -326630 -636509 -648127 -426576 -5911 536410
40823 536410 1071003 1411370 1359459 920346 400103 68585 -181757 -563103 -912559 -891871
40813 -891871 -586074 -397123 -325719 58044 755808 1037219 368009 -763584 -1356758 -1004404
40803 -1004404 -188242 337319 223773 -229451 -355688 164345 831548 908734 500038 529627
40793 529627 1463951 2647217 3276888 3476367 3841757 4342928 4348082 3571242 2429143 1526816
40783 1526816 1229641 1649168 2607681 3627010 4281971 4547015 4601070 4477139 4166907
40774 4166907 3840446 3634109 3424041 3109735 2856957 2734589 2459167 1927086 1612086
40765 1612086 1861145 2159157 1831755 1229381 1337776 2253035 2944355 2705251 2015392
40756 2015392 1633930 1562069 1375538 1032659 804181 721592 572088 289642 42606 52874
40746 52874 475652 1234878 1853580 1763490 992994 274838 257339 844441 1476216 1765333
40736 1765333 1656715 1276442 899550 814352 949544 869327 400640 12916 253639 1010698
40726 1010698 1681566 1925284 1891996 1805360 1688121 1501613 1255879 957081 693531 771078
40716 771078 1467934 2566825 3387139 3459070 3034022 2775559 3034186 3584436 4018012 4162930
40706 4162930 4024646 3537337 2669160 1744888 1324554 1592460 2102396 2334308 2278849 2204557
40696 2204557 2095580 1755784 1341213 1260769 1502417 1562039 1200530 815877 837047 1175427
40686 1175427 1572048 2075801 2760635 3288549 3265637 2878346 2678738 2770542 2660763 1977767
40676 1977767 944145 11561 -643089 -1072769 -1269366 -1167395 -824987 -387127 107206
40667 107206 718318 1384035 1857405 2002579 2102958 2660937 3754719 4739949 4844379
40658 4844379 4041020 3066565 2528520 2304765 1991501 1628027 1620829 2076476 2569409 2598259
40648 2598259 2040744 1164947 429308 257802 697370 1196093 1023338 128892 -637243
40639 -637243 -448092 494078 1220427 1229848 1041905 1359138 2074804 2486443 2256148 1690231
40629 1690231 1163931 804654 790724 1354935 2219817 2594822 2201761 1860537 2480889 3809705
40619 3809705 4833525 5149317 5132130 4884447 4020210 2708681 1986880 2496221 3565948
40610 3565948 4104952 3871753 3315421 2698310 2089564 1842737 2252169 2843105 2734558
40601 2734558 1769488 726706 332920 531749 812302 845119 669154 534825 620132 718950
40591 718950 348459 -540524 -1174407 -740404 570438 1809178 2450555 2736829 2900679
40582 2900679 2791857 2444928 2280618 2365482 2095340 1125789 129058 4818 623586 985274
40572 985274 532599 -261968 -673285 -614808 -563899 -894901 -1524708 -2116656 -2445636 -2509930
40562 -2509930 -2359514 -1978691 -1458418 -1139666 -1281372 -1573137 -1328669 -342912 714804
40553 714804 1007879 452392 -297818 -611614 -344548 335812 1219037 2048646 2482588 2280254
40543 2280254 1583820 948189 927035 1496443 2019288 2033068 1975224 2715202 4310189 5699215
40533 5699215 5877710 4972894 3845376 3042854 2607318 2549038 2843354 3061086 2631716
40524 2631716 1541274 299608 -778658 -1726927 -2356366 -2219557 -1379414 -590087 -352532
40515 -352532 -355256 -284675 -566496 -1580962 -2593793 -2428359 -1123962 -740 103867
40506 103867 -174576 138012 994464 1697251 2054216 2408550 2839359 3134429 3460229 4259093
40496 4259093 5354091 5880793 5428900 4684414 4535065 4981942 5386101 5432377 5327585
40487 5327585 5287469 5398534 5885985 6928913 8132063 8691214 8295543 7511711 7056571
40478 7056571 6971206 6757435 6125556 5316631 4720341 4379391 3962374 3208311 2321360 1785577
40468 1785577 1770884 1965186 2138555 2545952 3404981 4241851 4303058 3512525 2436857 1358295
40458 1358295 129100 -926282 -860318 609906 2343329 3015584 2679678 2372481 2527309
40449 2527309 2631655 2321372 1917455 1741987 1669342 1640269 1982550 2815264 3589071 3657646
40439 3657646 3045630 2305238 1814233 1524884 1265824 1010210 880602 1018337 1359662
40430 1359662 1490168 950044 -143520 -967052 -730178 499742 1861450 2559087 2572133
40421 2572133 2552990 3091377 4090367 4908997 5130410 5000001 4931513 4812110 4198212 3121691
40411 3121691 2218054 1953240 2146019 2413660 2675875 2981578 3213119 3266393 3233862 3131812
40401 3131812 2742864 2030131 1402542 1204506 1210614 1033108 793058 914324 1407759 1868930
40391 1868930 2141663 2494580 3073935 3584483 3640837 3177512 2460526 1907870 1859243 2262642
40381 2262642 2639096 2624416 2450024 2574389 2977061 3237540 3201994 3052366 2760063 2100520
40371 2100520 1326892 1182120 1935516 2930491 3435132 3465287 3376720 3144080 2633770 2260179
40361 2260179 2666905 3791233 4812571 5119413 4901070 4668846 4572790 4415718 4119035
40352 4119035 3911590 4047967 4440906 4658081 4352753 3648809 2927876 2243001 1244717
40343 1244717 -146991 -1282629 -1324512 -162556 1453224 2639006 3058742 2993211 2969996
40334 2969996 3295018 3775515 3928891 3554900 2977687 2599367 2395910 2065447 1530046
40325 1530046 1038271 835702 931580 1145553 1264386 1241361 1295038 1618315 1962286 1871376
40315 1871376 1453973 1425403 2082464 2765927 2827370 2609292 2771247 3074903 2747928 1846831
40305 1846831 1253498 1267524 1172884 450558 -470610 -1073446 -1573801 -2338751 -3083755 -3239547
40295 -3239547 -2733855 -1936491 -1160642 -614613 -507019 -795705 -1095376 -1140121 -1063391 -1017420
40285 -1017420 -913507 -765272 -811236 -1009147 -913210 -374448 175878 472261 800490 1218561
40275 1218561 1148723 376586 -290163 -195409 -7646 -706843 -1888425 -2195668 -1181104
40266 -1181104 307560 1384217 1731150 1196753 -2978 -765263 -73329 1393025 1876714
40257 1876714 982656 178005 485856 1098907 1003683 654392 960634 1620562 1681184 1091977
40247 1091977 515738 42595 -739761 -1611720 -1752618 -946188 78667 588519 481468
40238 481468 -9703 -595067 -830343 -313374 831876 1974319 2528584 2310280 1524735
40229 1524735 698728 416719 785688 1338334 1700289 1990697 2241988 1946280 775916
40220 775916 -651024 -1430852 -1524793 -1543226 -1624617 -1329577 -554227 238903 733019 1029196
40210 1029196 1197415 1202340 1263770 1614886 1900303 1522734 613660 -90797 -396341 -845043
40200 -845043 -1616112 -2126950 -2057824 -1913759 -2073197 -2035729 -1239892 -33029 844780 1293524
40190 1293524 1679703 1933753 1537943 385610 -859011 -1349620 -790646 363790 1298358
40181 1298358 1552610 1445766 1616344 2152740 2528634 2420861 2105397 1906499 1778153
40172 1778153 1654868 1669609 1710197 1311279 408263 -296690 -203046 375966 745874 754055
40162 754055 663283 533668 363932 504178 1209999 1981714 2063089 1527977 1195619 1435272
40152 1435272 1693506 1382817 731001 468292 949382 1814671 2417172 2468205 2240185 2100232
40142 2100232 1975369 1575585 1072822 1035288 1570911 2126667 2377615 2643818 3042160 2992515
40132 2992515 2206567 1443503 1414967 1527274 734318 -781510 -1884054 -2158747 -2152272 -2094150
40122 -2094150 -1652575 -1057310 -1194025 -2202882 -3047577 -2929557 -2220665 -1574905 -1030052
40113 -1030052 -498037 -293838 -566990 -874864 -838333 -601416 -248059 479387 1432439 1879463
40103 1879463 1657066 1626411 2259632 2657833 1928252 766568 497515 1052107 1151014 280618
40093 280618 -710383 -1012576 -821162 -725628 -947019 -1368117 -1680037 -1392258 -281699 1107574
40083 1107574 1940479 2034630 1796497 1383271 664802 -51042 -119102 452605 855655 555233
40073 555233 -111838 -582961 -663913 -303290 496991 1238566 1106329 47675 -913356 -945197
40063 -945197 -498665 -572912 -1279600 -1758410 -1330183 -166212 1147124 2224495 2954213
40054 2954213 3277526 3120131 2527122 1782587 1273962 1146878 1205438 1289582 1564741 2182712
40044 2182712 2868332 3237028 3349770 3464823 3390891 2720875 1671153 970152 809910
40035 809910 643634 217757 1850 225815 299351 -214362 -715217 -388382 558686 1228681
40025 1228681 1291517 1197803 1338090 1649449 1952949 2122796 2012054 1683389 1558634 1869605
40015 1869605 2177376 1967142 1467184 1218259 1037830 240315 -1101280 -1959916 -1684172
40006 -1684172 -847382 -390595 -403844 -174393 817331 2262486 3274102 3185641 2246940
39997 2246940 1459498 1463176 1747480 1406620 517489 82619 530619 1014698 546996 -754255
39987 -754255 -1984683 -2556787 -2495515 -1982216 -1161177 -278891 417912 909111 1283431 1501845
39977 1501845 1512523 1466786 1551541 1678076 1567827 1134021 652232 572065 1151263 2124159
39967 2124159 2761769 2536700 1750115 1169246 1030882 886283 542624 509648 1121054 1807247
39957 1807247 1848361 1412987 1151010 1088809 754547 238398 200385 713680 973478 487535
39947 487535 -179225 -304918 -51936 -63556 -488658 -1014114 -1531077 -2116525 -2550066 -2524689
39937 -2524689 -2284139 -2382374 -2736977 -2598924 -1714419 -892818 -980492 -1748071 -2330783 -2397563
39927 -2397563 -2216683 -1788867 -756134 701582 1636040 1383996 340169 -689665 -1411089
39918 -1411089 -1872642 -1910179 -1468355 -1146265 -1593187 -2452026 -2714636 -2158072 -1580263 -1449426
39908 -1449426 -1269968 -725323 -497682 -1134701 -1796948 -1187569 568335 1984596 2107016
39899 2107016 1436059 870592 616730 449957 308625 156681 -226555 -857924 -1307158
39890 -1307158 -1213386 -734235 -182557 408270 992628 1170098 631817 -286456 -974529 -1298573
39880 -1298573 -1527780 -1694829 -1584515 -1290266 -1185366 -1261102 -1058825 -456541 -3593 -156899
39870 -156899 -608110 -752408 -481829 -79460 370911 905323 1178464 717141 -238067 -759319
39860 -759319 -360055 409479 827390 966852 1299687 1745773 1816192 1517189 1338925 1310252
39850 1310252 855818 -134776 -818847 -463874 549897 1338789 1668984 1870280 1990250
39841 1990250 1827164 1613009 1801644 2137523 1763146 496900 -700770 -887939 -200339
39832 -200339 601981 1098441 1277636 1131188 746112 522313 783352 1314669 1638718 1544894
39822 1544894 1065199 279697 -461868 -542956 122606 641102 173296 -834989 -1233138
39813 -1233138 -807553 -430426 -562011 -634808 -241912 48477 -323737 -888449 -866962 -374927
39803 -374927 -122744 -303114 -561149 -772319 -1005674 -897297 5045 1244913 1727322
39794 1727322 1201802 613489 624685 654179 -12067 -916442 -1110085 -666050 -522296 -967610
39784 -967610 -1267041 -932762 -479439 -523888 -832863 -816651 -489479 -315438 -359538 -215014
39774 -215014 277137 767728 928919 825384 645935 438436 294977 480005 1073811 1640884
39764 1640884 1566326 764818 -119050 -319572 276670 1036434 1286714 1041705 878999 1099939
39754 1099939 1290919 930052 198054 -214687 -67523 97405 -277617 -1013605 -1443571
39745 -1443571 -1186635 -464330 163460 200102 -408058 -1054310 -894877 162158 1105019
39736 1105019 908848 -134416 -710433 -137471 854665 1225552 934074 663823 634198
39727 634198 371614 -385211 -1198386 -1565288 -1570317 -1581612 -1638464 -1546745 -1376039 -1384970 -1480736
39716 -1480736 -1219986 -484330 226194 397800 103497 -256302 -532146 -784328 -860901 -479449
39706 -479449 269101 888327 1039465 852871 611543 401003 155095 -202141 -723272 -1292036
39696 -1292036 -1503754 -1062192 -375774 -309991 -1117650 -2023619 -2183348 -1680556 -1188006 -988860
39686 -988860 -865315 -765515 -991208 -1667308 -2436436 -2799306 -2556497 -1933707 -1442489 -1484184
39676 -1484184 -1871748 -1928187 -1309369 -466419 30354 257663 511730 489457 -305595 -1477984
39666 -1477984 -1954696 -1416239 -716143 -631279 -942044 -1088557 -1015999 -899295 -661125 -325030
39656 -325030 -328114 -866248 -1318369 -938547 152147 1211535 1853223 2225144 2430714 2359863
39646 2359863 2027406 1627066 1307907 1200054 1440602 1824238 1739978 916616 -62941 -482522
39636 -482522 -388783 -197477 181484 1014690 1821596 1742098 785710 -190234 -765708 -1275555
39626 -1275555 -1753673 -1629105 -816680 -102188 67251 250598 855863 1220575 675080
39617 675080 -228184 -524560 -324681 -438559 -857234 -706095 366131 1730549 2751232
39608 2751232 3336164 3436326 2897209 2059147 1693779 1967043 2123384 1574463 686643
39599 686643 77570 -255239 -568031 -675758 -308690 186066 227809 -79029 -115809 196871
39589 196871 230545 -330929 -988299 -1276545 -1509463 -2107149 -2597232 -2090692 -744416 41725
39579 41725 -710356 -2208777 -2783133 -1888155 -601238 -137488 -496792 -814461 -523824
39570 -523824 235766 992795 1246209 654533 -537088 -1392464 -1180974 -373396 -164480
39561 -164480 -900521 -1595420 -1304052 -418739 -91706 -706643 -1494365 -1564461 -836616 78592
39551 78592 563475 494015 312552 624158 1501421 2227046 2013306 983077 113757 118412
39541 118412 698977 1090373 1056880 1012802 1255095 1450880 1058357 96451 -739599 -782409
39531 -782409 -61718 862877 1604009 2178608 2529710 2265005 1220826 2956 -543515
39522 -543515 -344610 -89069 -181319 -249902 100431 587356 706611 495878 363805 431135
39512 431135 549831 761657 1144367 1308891 728475 -343085 -928211 -535045 253030
39503 253030 684867 763676 840725 843965 541907 189571 179494 255583 -163377 -939744 -1284078
39492 -1284078 -950006 -561216 -501999 -300588 395821 955008 589487 -421991 -1115097
39483 -1115097 -1153287 -997092 -959777 -934171 -1030541 -1602677 -2440722 -2746514 -2266891 -1739449
39473 -1739449 -1762798 -1900922 -1521177 -934417 -892029 -1304525 -1336788 -655457 254520 1023913
39463 1023913 1796310 2501905 2566902 1782584 819473 354802 188760 -225330 -818862 -1127905
39453 -1127905 -1143888 -1200359 -1183722 -672711 99685 254587 -475047 -1211959 -1122160 -555263
39443 -555263 -399305 -732660 -874472 -586837 -391549 -568771 -619055 -152177 266175 -181129
39433 -181129 -1250232 -1728816 -933723 444028 1261863 1256698 1026646 971199 863319 519958
39423 519958 305447 593174 1062353 1004284 232063 -738262 -1418831 -1831260 -2114046 -2065458
39413 -2065458 -1443715 -528777 14490 -149253 -728483 -1286165 -1766157 -2356577 -2964979
39404 -2964979 -3113689 -2493163 -1499750 -984789 -1376323 -2213873 -2719363 -2684005 -2517707 -2510734
39394 -2510734 -2459481 -2128282 -1679387 -1377354 -1164895 -857711 -541276 -424863 -472353 -555168
39384 -555168 -834434 -1547485 -2457089 -2980646 -2943144 -2780390 -2847551 -2905585 -2528901 -1753780
39374 -1753780 -1053581 -767294 -699894 -277298 830366 2118742 2492687 1448382 -154460
39365 -154460 -990077 -815087 -484479 -495335 -433602 -108611 -189808 -1023803 -1690830 -1230866
39355 -1230866 -220423 -12376 -775577 -1528174 -1986363 -2969200 -4636120 -5641362 -4830193
39346 -4830193 -2869282 -1307419 -650034 -294961 45440 -92747 -950439 -1982283 -2502082
39337 -2502082 -2359720 -1778656 -956644 -87790 500984 529109 46613 -547219 -760112 -354959
39327 -354959 422450 989228 930287 367168 -228253 -517350 -519293 -459187 -517676 -677479
39317 -677479 -741462 -571458 -341279 -416284 -921615 -1574596 -1997179 -2031874 -1736711 -1323526
39307 -1323526 -1150647 -1454720 -1967491 -2118500 -1739596 -1193726 -691657 -25941 749041
39298 749041 1026489 567980 125590 414488 943495 766752 54849 -168735 244672 311821
39288 311821 -369652 -816788 -168508 921901 1189960 438847 -477054 -922293 -939634 -674854
39278 -674854 -121937 518119 769892 324556 -660267 -1642956 -1958158 -1284675 -111705
39269 -111705 576256 391742 -21162 22489 301781 280085 174084 616960 1472204 1861041
39259 1861041 1401526 650030 207922 129762 377622 1066817 1900391 2069534 1244936 157602
39249 157602 -335536 -344345 -546176 -1040723 -1261786 -900839 -309696 50196 68633 -199503
39239 -199503 -747544 -1425656 -1821783 -1625376 -1060562 -766561 -1145679 -1828963 -1896559 -800338
39229 -800338 923173 2071964 2005340 1233681 635066 371653 -54126 -829564 -1444937
39220 -1444937 -1429385 -1064726 -1012984 -1418892 -1783861 -1743057 -1577923 -1745866 -2194012 -2504730
39210 -2504730 -2577989 -2706537 -2938688 -2862401 -2243841 -1432899 -801393 -220233 423154 622808
39200 622808 -86131 -1089457 -1192965 -214122 753893 865673 488893 303556 271986 97182
39190 97182 9786 326243 688995 556252 178876 314539 1079762 1759011 1725553 1015661
$$ [...]
##END NTUPLES=NMR SPECTRUM
##END=
