##TITLE=1H_LR-709-C1-OCR
 DMSO, 8 sc, 
 29.1.2020
##JCAMPDX= 6.0         $$ Bruker NMR JCAMP-DX V2.0
##DATA TYPE= NMR FID
##DATA CLASS= NTUPLES
##ORIGIN= UXNMR, Bruker Analytische Messtechnik GmbH
##OWNER= root
$$ XWIN-NMR		Version 3.5
$$ Wed Jan 29 16:34:14 2020 Russian Standard Time (UT+4h)  she@DPX200
##.OBSERVE FREQUENCY= 200.1315
##.OBSERVE NUCLEUS= ^1H
##.DELAY= (6, 6)
##.ACQUISITION MODE= SIMULTANEOUS
##.ACQUISITION SCHEME= undefined
##.AVERAGES= 8
##.DIGITISER RES= 18
##SPECTROMETER/DATA SYSTEM= spect
##.PULSE SEQUENCE= zg30
##.SOLVENT NAME= CDCl3
##.SHIFT REFERENCE= (INTERNAL, CDCl3, 0, 15.7039)
##AUDIT TRAIL= $$ (NUMBER, WHEN, WHO, WHERE, WHAT)
$$ ##TITLE= Audit trail, XWIN-NMR		Version 3.5
$$ ##JCAMPDX= 5.01
$$ ##ORIGIN= Bruker BioSpin GmbH
$$ ##OWNER= she
$$ F:/spectra/data/she/nmr/H-F/1/audita.txt
$$ ##AUDIT TRAIL=  $$ (NUMBER, WHEN, WHO, WHERE, WHAT)
(   1,<2020-01-29 16:33:13.26 +0400>,<she>,<DPX200>,
      <created by zg, POWCHK disabled, PULCHK disabled
       configuration hash MD5:
       00 E9 B6 7A A2 85 ED C7 34 08 36 98 17 FE 4E 26
       data hash MD5: 16K
       C2 F2 89 E8 C5 7A 99 6F 7F 65 65 6C E8 02 C5 B7>)
$$ ##END=
$$ 
$$ hash MD5
$$ E1 46 97 7F 4F 66 3B 87 27 A8 47 93 89 CD BA BA
##$RELAX= 
##$RELAX= 
##$RELAX= 
##$RELAX= 
##$RELAX= 
##$RELAX= 
$$ Bruker specific parameters
$$ --------------------------
##$DU= <F:/spectra>
##$EXPNO= 1
##$NAME= <H-F>
##$PROCNO= 1
##$TYPE= <nmr>
##$USER= <she>
##$AMP= (0..31)
100 100 100 100 100 100 100 100 100 100 100 100 100 100 100 100 100 100 
100 100 100 100 100 100 100 100 100 100 100 100 100 100 
##$AQSEQ= 0
##$AQ_mod= 1
##$AUNM= <au_zg>
##$AUTOPOS= <>
##$BF1= 200.13
##$BF2= 200.13
##$BF3= 200.13
##$BF4= 200.13
##$BF5= 200.13
##$BF6= 200.13
##$BF7= 200.13
##$BF8= 200.13
##$BYTORDA= 1
##$CFDGTYP= 0
##$CFRGTYP= 5
##$CHEMSTR= <none>
##$CNST= (0..31)
1 1 145 1 1 1 1 1 1 1 1 1 1 1 1 1 1 1 1 1 1 1 1 1 1 1 1 1 1 1 1 1 
##$CPDPRG= <>
##$CPDPRG1= <>
##$CPDPRG2= <>
##$CPDPRG3= <>
##$CPDPRG4= <mlev>
##$CPDPRG5= <mlev>
##$CPDPRG6= <mlev>
##$CPDPRG7= <mlev>
##$CPDPRG8= <mlev>
##$CPDPRGB= <>
##$CPDPRGT= <>
##$D= (0..31)
0 1.2 0 0 0 0 0 0 0 0.06 0 0.03 0 0 0 0 0.0002 0 0 0 0 0 0 0 0 0 0 0 0 
0 0 0 
##$DATE= 1580301192
##$DBL= (0..7)
120 120 120 120 120 120 120 120 
##$DBP= (0..7)
150 150 150 150 150 150 150 150 
##$DBP07= 0
##$DBPNAM0= <>
##$DBPNAM1= <>
##$DBPNAM2= <>
##$DBPNAM3= <>
##$DBPNAM4= <>
##$DBPNAM5= <>
##$DBPNAM6= <>
##$DBPNAM7= <>
##$DBPOAL= (0..7)
0.5 0.5 0.5 0.5 0.5 0.5 0.5 0.5 
##$DBPOFFS= (0..7)
0 0 0 0 0 0 0 0 
##$DE= 6
##$DECBNUC= <off>
##$DECIM= 24
##$DECNUC= <off>
##$DECSTAT= 4
##$DIGMOD= 1
##$DIGTYP= 9
##$DL= (0..7)
0 120 120 120 120 120 120 120 
##$DP= (0..7)
150 150 150 150 150 150 150 150 
##$DP07= 0
##$DPNAME0= <>
##$DPNAME1= <>
##$DPNAME2= <>
##$DPNAME3= <>
##$DPNAME4= <>
##$DPNAME5= <>
##$DPNAME6= <>
##$DPNAME7= <>
##$DPOAL= (0..7)
0.5 0.5 0.5 0.5 0.5 0.5 0.5 0.5 
##$DPOFFS= (0..7)
0 0 0 0 0 0 0 0 
##$DQDMODE= 0
##$DR= 18
##$DS= 0
##$DSLIST= <SSSSSSSSSSSSSSS>
$$ [...]
##$SUBNAM2= <"">
##$SUBNAM3= <"">
##$SUBNAM4= <"">
##$SUBNAM5= <"">
##$SUBNAM6= <"">
##$SUBNAM7= <"">
##$SUBNAM8= <"">
##$SUBNAM9= <"">
##$SW= 24.9337058887773
##$SWIBOX= (0..15)
0 0 2 0 0 0 0 0 0 0 0 0 0 0 0 0 
##$SW_h= 4990.01996007984
##$TD= 16384
##$TD0= 1
##$TE= 0
##$TE2= 300
##$TE3= 300
##$TEG= 300
##$TL= (0..7)
0 120 120 120 120 120 120 120 
##$TP= (0..7)
150 150 150 150 150 150 150 150 
##$TP07= 0
##$TPNAME0= <>
##$TPNAME1= <>
##$TPNAME2= <>
##$TPNAME3= <>
##$TPNAME4= <>
##$TPNAME5= <>
##$TPNAME6= <>
##$TPNAME7= <>
##$TPOAL= (0..7)
0.5 0.5 0.5 0.5 0.5 0.5 0.5 0.5 
##$TPOFFS= (0..7)
0 0 0 0 0 0 0 0 
##$TUNHIN= 0
##$TUNHOUT= 0
##$TUNXOUT= 0
##$USERA1= <user>
##$USERA2= <user>
##$USERA3= <user>
##$USERA4= <user>
##$USERA5= <user>
##$V9= 5
##$VALIST= <valist>
##$VCLIST= <CCCCCCCCCCCCCCC>
##$VD= 0
##$VDLIST= <DDDDDDDDDDDDDDD>
##$VPLIST= <PPPPPPPPPPPPPPP>
##$VTLIST= <TTTTTTTTTTTTTTT>
##$WBST= 1024
##$WBSW= 4
##$XGAIN= (0..3)
0 0 0 0 
##$XL= 0
##$YL= 0
##$YMAX_a= 403147
##$YMIN_a= -252594
##$ZGOPTNS= <>
##$ZL1= 120
##$ZL2= 120
##$ZL3= 120
##$ZL4= 120
##$ABSF1= 10
##$ABSF2= 0
##$ABSG= 5
##$ABSL= 3
##$ALPHA= 0
##$AQORDER= 0
##$ASSFAC= 0
##$ASSFACI= 0
##$ASSFACX= 0
##$ASSWID= 0
##$AUNMP= <proc_1d>
##$AZFE= 0.1
##$AZFW= 0.1
##$BCFW= 1
##$BC_mod= 2
##$BYTORDP= 1
##$COROFFS= 0
##$CY= 11.3945322036743
##$DATMOD= 1
##$DC= 2
##$DFILT= <>
##$DTYPP= 0
##$F1P= 16.9975609425685
##$F2P= -3.02152046262296
##$FCOR= 0.5
##$FTSIZE= 0
##$FT_mod= 4
##$GAMMA= 1
##$GB= 0.15
##$INTBC= 1
##$INTSCL= 1
##$ISEN= 128
##$LB= 0.24
##$LEV0= 0
##$LPBIN= 0
##$MAXI= 10000
##$MC2= 0
##$MEAN= 0
##$ME_mod= 0
##$MI= 1.114404
##$NCOEF= 0
##$NC_proc= 0
##$NLEV= 6
##$NOISF1= 3.799351
##$NOISF2= 2.8
##$NSP= 1
##$NTH_PI= 0
##$NZP= 0
##$OFFSET= 15.70392
##$PC= 1
##$PHC0= -9795.352
##$PHC1= 23.40081
##$PH_mod= 1
##$PKNL= yes
##$PPARMOD= 0
##$PSCAL= 0
##$PSIGN= 0
##$REVERSE= no
##$SF= 200.130013532006
##$SI= 16384
##$SIGF1= 3
##$SIGF2= 2
##$SINO= 400
##$SIOLD= 16384
##$SREGLST= <1H.CDCl3>
##$SSB= 0
##$STSI= 0
##$STSR= 0
##$SW_p= 3612.71676300578
##$SYMM= 0
##$S_DEV= 0
##$TDeff= 0
##$TDoff= 0
##$TI= <>
##$TILT= no
##$TM1= 0
##$TM2= 0
##$TOPLEV= 0
##$USERP1= <user>
##$USERP2= <user>
##$USERP3= <user>
##$USERP4= <user>
##$USERP5= <user>
##$WDW= 1
##$XDIM= 8192
##$YMAX_p= 0
##$YMIN_p= 0
$$ End of Bruker specific parameters
$$ ---------------------------------
##NTUPLES= NMR FID
##VAR_NAME=  TIME,          FID/REAL,        FID/IMAG
##SYMBOL=    X,             R,               I
##VAR_TYPE=  INDEPENDENT,   DEPENDENT,       DEPENDENT
##VAR_FORM=  AFFN,          ASDF,            ASDF
##VAR_DIM=   8192,          8192,            8192
##UNITS=     SECONDS,       ARBITRARY UNITS, ARBITRARY UNITS
##FACTOR=    0.0002004,     1,               1
##FIRST=     0,             0,               0
##LAST=      1.6414764,     0,               0
##MIN=       0,             -252594,         0
##MAX=       1.6414764,     403147,          0
$$ Real data points
##PAGE= N=1
##DATA TABLE= (X++(R..R)), XYDATA
$$ [...]
1979a72j37k90j10j93L09L42J88M7j39k92l06q1L79M43%j59K49j22p3J79m64p6
$$ -172 -309 -599 -709 -902 -593 -251 -63 -16 -155 -447 -753 -834 -455 -12 -12 -171 78 -44 -117 62 -402 -478
2001d78K57O5K18J55k0j44l7K6l71Q6K47R4K25j28p5j47K05j17r6R4j65N94Q2
$$ -478 -221 -156 62 217 197 53 16 42 -329 -243 4 98 323 195 120 -27 178 61 -35 59 -106 488 570
2024E70j21k40j88j93N2L41N12k15p5p4l65O1k97L86kKK7K90m1l86l18K52j27
$$ 570 449 209 21 -172 -120 221 733 518 443 369 4 65 -232 154 152 154 181 471 430 44 -274 -22 -149
2047a49J73M21R6l4j41k1k12j09J56k21J86J59k1l1K34j78n23o1QJ22L88lK17
$$ -149 24 445 541 507 366 345 133 24 180 -41 145 304 283 252 486 308 -215 -276 -268 -146 242 239 456
2070D56j94L62p53O0n2J57k39M6L87k34K84l64j27l7j75N1L51Nr5L2l47L8j47
$$ 456 262 624 -129 -69 -121 36 -203 -157 230 -4 280 -84 -211 -248 -423 -372 -21 -16 -111 -79 -426 -388 -535
2093e35M2K6L19J28k63n9J68m55J61l38J04N41nK74j36M3n13p0J01J51M2J75j87
$$ -535 -493 -467 -148 -20 -283 -342 -174 -629 -468 -806 -702 -161 -166 108 -28 15 -498 -568 -467 -316 -274 -99 -286
2116b86J10O7n16J89N9J85N7K3m1L69R8m37j98K06l42K41K20N46k91l63R1M9j54
$$ -286 -176 -109 -625 -436 -377 -192 -135 -112 -153 216 314 -123 -321 -115 -457 -216 4 550 259 -104 -13 36 -118
2139a18J8j2J69J10N4J65o4j95j38Jj19K18L08J27Q2m27o7l0j2k3j2N65l28L73
$$ -118 -100 -112 57 167 221 386 322 127 -11 -10 -129 89 397 524 606 179 112 82 70 47 35 600 272 645
2163F45k98Pj48j65l06M58L25k05M67j42j58l55m7o3j80L08j7K29L02j98k69L4
$$ 645 347 354 206 41 -265 193 518 313 780 638 480 125 78 15 -165 143 126 355 657 459 190 224
2185B24l04rJ58M09k9j65J80o14J42k29m0M3J46K04R4J72K4m64J68p61N39J59
$$ 224 -80 -89 69 478 449 284 464 -150 -8 -237 -277 -234 -88 116 210 382 406 -58 110 -651 -112 47
2207D7k90M60r4j11p1j25j05j21J66n7M03J43m46K77m70k84N7M65k8J79j28J0
$$ 47 -243 217 123 12 -59 -184 -289 -410 -244 -301 102 245 -201 76 -394 -678 -621 -156 -184 -5 -133 -123
2229a23r3k41j09J01k47J20N70J89j87L7q69M21j47K22J26l4Q7L06r4l19q9K50
$$ -123 -216 -457 -566 -465 -712 -592 -22 167 -20 17 -852 -431 -578 -356 -230 -264 -177 129 35 -284 -373 -123
2251a23l23J1L00J92o0L16l23m08l8K7L14J66J32k3j10J19k96K24j38j13J25L22
$$ -123 -446 -435 -135 57 -3 313 -10 -418 -456 -429 -115 51 183 160 50 169 -127 97 -41 -154 -29 293
2273B93P0p0j93o5j61K0k9J44j3L20R1l40K39l82J24N6J80L46m56J59J38Lk12
$$ 293 363 293 100 35 -126 -106 -135 9 -4 316 407 67 306 -76 48 104 284 630 174 333 471 474 262
2296B62n12k8J80L89J90J64m91O6J5j74r2K11j21J7L81k3l8l47q2k68m6K38L71
$$ 262 -250 -278 -98 291 481 645 154 220 235 61 -31 180 59 76 457 434 396 49 -33 -301 -347 -109 262
2319B62J5q4K56o14J32o8J22L68J30k72P6O9k52M3n10K57j49J11M45j83O9J19
$$ 262 277 193 449 -165 -33 -101 21 389 519 247 323 392 140 183 -327 -70 -219 -108 337 154 223 342
2341C42l98j59j14K69n4M9L8K8k61j38J92m12P7l9J83K46K72l24L5n22J66m5M14
$$ 342 -56 -215 -329 -60 -114 -65 -27 1 -260 -398 -206 -618 -541 -580 -397 -151 121 -203 -168 -690 -524 -569 -155
2364a55P2n8J29j25k74K26J47m53O8L6K45L17O8k45j55k67j54K46J11K17m1K54
$$ -155 -83 -141 -12 -137 -411 -185 -38 -491 -423 -387 -142 175 243 -2 -157 -424 -578 -332 -221 -4 -45 209
2386B09j70j79L95k50m41L52k12M52J15J25j32j77k67j88K96j9K64m3O2l28N31
$$ 209 39 -140 255 5 -436 -84 -296 156 271 396 264 87 -180 -368 -72 -91 173 130 192 -136 395
2407C95k00j71K4j2q6J77M89K4j78o41N6J29J50K66n9q4k57J24O0k07L13l00J60
$$ 395 195 24 48 36 -50 127 616 640 462 -179 -123 6 156 422 363 279 22 146 206 -1 312 12 172
2430A72%J46J45j18L0k74k64K71j24N18j4k72P3j76J67l14r0j77K27N40l73L96
$$ 172 172 318 463 345 375 101 -163 108 -16 502 488 216 289 113 280 -34 -124 -301 -74 466 93 489
2452D89j37m79K5k62K98J21R6R1L7l25j09P6R2k55n8L11j39L42k09R5J36n30j93
$$ 489 352 -127 -102 -364 -66 55 151 242 279 -46 -155 -79 13 -242 -300 11 -128 214 5 100 236 -294 -487
2475d87J12J69M45N2j89n3l46j24M7J01j03L64k19J95j40j72J89m61J97L20K0
$$ -487 -375 -206 239 291 102 49 -297 -421 -374 -273 -376 -12 -231 -36 -176 -348 -159 -620 -423 -103 -83
2496h3j99K62n7p7m04m3L38L3M81j36l98n0J95J59j96K15m02k21O24J90j15k96
$$ -83 -282 -20 -77 -154 -558 -601 -263 -230 251 115 -283 -333 -138 21 -175 40 -362 -583 41 231 116 -180
2518a80L8l18J61L00L13j42j39J40L8q0N9J45j77l33J36M66j63l3L4l81l64K77
$$ -180 -142 -460 -299 1 314 172 33 173 211 131 190 335 158 -175 -39 427 264 231 265 -116 -480 -203
2540b03L93M07r1l01L10o49K15%L90m25R9j99M39K64L1n02j92l14j44N37L58o5
$$ -203 190 597 506 205 515 -134 81 81 471 46 145 -54 385 649 680 178 -14 -328 -472 65 423 358
2562C58k22M5n4J93j15Nk24K88N4j57K81j33j66l61R6O9J86J54N2j59l37L4J82
$$ 358 136 181 127 320 205 210 -14 274 328 171 452 319 153 -208 -112 -43 143 297 349 190 -147 -113 69
2585F9J68O8l05j3k37M80n2R0m11q8j15M86j02P2Q9l54o1r6m3j22N05m13N16m10
$$ 69 237 305 0 -13 -250 230 178 268 -143 -231 -346 140 38 110 199 -155 -216 -312 -355 -477 28 -385 131 -279
2609b79r8J86K59n19Qj21M87L2k40J99L5l27K71m98L76K20j8j78J04j81J96K71
$$ -279 -377 -191 68 -451 -443 -564 -77 -45 -285 -86 -51 -378 -107 -605 -229 -9 -27 -205 -101 -282 -86 185
2631A85l70l46R9M4O09m4J32l11K8j80j88K07J49l1q1L1j50J96j23M1QL1J81R7
$$ 185 -185 -531 -432 -388 221 177 309 -2 26 -154 -342 -135 14 -17 -98 -67 -217 -21 -144 -103 -95 -64 117 214
2655B14O0r5k52k74k5K14m9M68L16j51k37l43K71O7K94n55N2L29M4J27k89o7l43
$$ 214 274 179 -73 -347 -372 -158 -207 261 577 426 189 -154 117 184 478 -77 -25 304 348 475 186 119 -224
2678b24JL60L41j0L64o31K30p2m21O14l19L9q5pO1L42j39m72k31K02K22J85J5
$$ -224 -223 137 478 468 832 201 431 359 -62 552 233 272 187 180 241 583 444 -28 -259 -57 165 350 365
2701C65j22K5m23J27j63M42J65l59l28M05J6Q0j53j52k7k5N9K62j9j0m22R9j52
$$ 365 243 268 -155 -28 -191 251 416 57 -271 134 150 230 77 -75 -102 -127 -68 194 175 165 -257 -158 -310
2724c10J97r6n5J37L82l05L0J88k17l17m6L90J1p9K21N3l67j55K21j01O3J23%
$$ -310 -113 -209 -264 -127 255 -50 -20 168 -49 -366 -412 -22 -11 -90 131 184 -183 -338 -117 -218 -155 -32 -32
2747c2j62N6Q7N2r9l68q0J99j30N99k3j07qk92l7j41N77O3K56m50J37j27nn4r7
$$ -32 -194 -138 -51 1 -98 -466 -546 -347 -477 122 99 -8 -16 -308 -345 -486 91 154 410 -40 97 -30 -35 -89 -186
2772a86j63K99j17K43J4Lk01k33L36k76K75K30p1j5j64j85L97j75M7j33J96K31
$$ -186 -349 -50 -167 76 90 93 -108 -341 -5 -281 -6 224 153 138 -26 -211 186 11 58 -75 121 352
2794C52L66n78J9j24j70k13N02J63k85O32m08j33J5r7L41j86rj28L13k09O1J72
$$ 352 718 140 159 35 -135 -348 154 317 32 664 256 123 138 41 382 196 187 59 372 163 224 396
2816C96k85n18Q78k55N9J16P0k62k64q6J51J82j12n9P7m2K03Jl89j19R7K16P7
$$ 396 111 -407 471 216 275 391 461 199 -65 -151 0 182 70 11 88 46 249 250 -139 -258 -161 55 132
2839A32P3k56L02O4n07J17lJ90L0j3k20J8J43j35l4r4o0K27J01j80J89j49l90
$$ 132 205 -51 251 315 -192 -75 -78 112 142 129 -91 -73 70 -65 -99 -193 -253 -26 75 -105 84 -65 -455
2862d55Q3Q2p1J98q3L01l20K47k01K72m28J06K15j74J8J29J18m03K94n08M08r0
$$ -455 -372 -290 -361 -163 -246 55 -265 -18 -219 53 -375 -269 -54 -228 -210 -81 37 -366 -72 -580 -172 -262
2884b62K06J91j34j75J39J18n66N32m53K4K25M0K38j51Q2j62J8l24J67M0M79k34
$$ -262 -56 135 1 -174 -35 83 -483 49 -404 -380 -155 -115 123 -28 54 -108 -90 -414 -247 -207 272 38
2906C8P4j68K3J23j89J80j36j37L64M0M8j95k42j73Q7L97L24j52O7p7j70l2K9
$$ 38 112 -56 -33 90 -99 81 -55 -192 172 212 260 65 -177 -350 -263 134 458 306 373 296 126 94 123
2929A23J96j79L4J55M1J24q8m82J61l29K50K14R8k51K02L5j29j74N0K0j27K17
$$ 123 319 140 174 329 370 494 406 -76 85 -244 6 220 318 67 269 304 175 1 51 71 -56 161
2951A61J4L25j62l05J0r3K70k15J31J78m0j4j58k22P3J45k39J87J23o4l4j12Q2
$$ 161 175 500 338 33 43 -50 220 5 136 314 274 260 102 -120 -47 98 -141 46 169 105 71 -41 41
2974D1j43k15j5O9K75j11M38j32l60j52mk57J53M88O7j7k78J92l66j96N14l13
$$ 41 -102 -317 -332 -263 12 -99 339 207 -153 -305 -309 -566 -413 75 142 125 -153 39 -327 -523 -9 -322
2996c22K28J40l09M4K11j32k12J1J39J34j10o0K03J34m34M94o96R3K25K42N8l9
$$ -322 -94 46 -263 -219 -8 -140 -352 -341 -202 -68 -178 -238 -35 99 -335 159 -537 -444 -219 23 81 42
3018D2j56RJ0N0j82p4J8M68k04L0k04L26n28N3M58j45L44L2n1k07L6m28M18k56
$$ 42 -114 -105 -95 -45 -227 -301 -283 185 -19 11 -193 133 -395 -342 116 -29 315 347 296 89 125 -303 115 -141
3042a41J06K69J59m57J07k93L67l77L69J20K9m3k50K28J11m90P0K0pL63k40L39
$$ -141 -35 234 393 -64 43 -250 117 -260 109 229 258 215 -35 193 304 -186 -116 -96 -103 260 20 359
3064C59j25j61R2j57K9j93K20K04j41L89m86m3K44o5j92p9l8L46M3o8n6R8j52
$$ 359 234 73 165 8 37 -156 64 268 127 516 30 -13 231 166 -26 -105 -143 203 246 178 122 220 68
3087F8k41L02K0J00R2j77j38m3Q6l03K71j93K07L22k08n9j47k44J75r5J1K08q7
$$ 68 -173 129 149 249 341 164 26 -17 69 -234 37 -156 51 373 165 106 -41 -285 -110 -205 -194 14 -73
3110g3M00l90l14O11o23L89M2l5m8j29P9J66j25N1l93J86m6L6K68j6j43j56o9
$$ -73 327 -63 -377 234 -389 0 42 7 -41 -170 -91 75 -50 1 -392 -206 -252 -216 52 36 -107 -263 -332
3133c32Q5J4K32j42L1K67j96N3r9k33J6K38j06M1L83j23k73k4l17L90j41LK78
$$ -332 -247 -233 -1 -143 -112 155 -41 12 -87 -320 -304 -66 -172 -131 252 129 -144 -168 -485 -95 -236 -233 45
3156D5K5K8j01j95o0k73J58Q7J64J77o1p8n5K53k03M9M9J36j75j21K09M0k74K02
$$ 45 70 98 -3 -198 -258 -531 -373 -286 -122 55 -6 -84 -139 114 -89 -40 9 145 -30 -151 58 98 -176 26
3180B6j34M84m87L50J27K1q1k68j7J40%j32M80l99K64j76j90J82l2j09K16M3k73
$$ 26 -108 376 -111 239 366 387 306 38 21 161 161 29 509 110 374 198 8 190 158 49 265 308 35
3203C5K73J0j94j15R2j10q9J58J20J69j07O7l01J46q5k67L34N5k47L07k19J06
$$ 35 308 318 124 9 101 -9 -98 60 180 349 242 309 8 154 69 -198 136 191 -56 251 32 138
3225A38J7j14j54j31K24J68K4k56qK54m99K61j24M95j88j84L18l71L9j43J79j03
$$ 138 155 41 -113 -244 -20 148 172 -84 -92 162 -337 -76 -200 295 107 -77 241 -130 -91 -234 -55 -158
3247a58L89j31K08j98l89R6M8J24k15K08k18K23J07j76j13J31j98J8J02j19N11
$$ -158 231 100 308 110 -279 -183 -135 -11 -226 -18 -236 -13 94 -82 -195 -64 -262 -244 -142 -261 250
3268B50l42J51j49k56RL7k4J46M0M3j95K24J05j94l42J58K13J17N9j30K62O5n19
$$ 250 -92 59 -90 -346 -337 -300 -324 -178 -138 -95 -290 -66 39 -155 -497 -339 -126 -9 50 -80 182 247 -272
3291b72J17N6r2K76J21l18k43L09j87L35k1j41K12j68K02k4L5m96L79K4l5n8K09
$$ -272 -155 -99 -191 85 206 -112 -355 -46 -233 102 81 -60 152 -16 186 162 197 -299 80 104 69 11 220
3314B20J18k56MP3J65j97rR5l40L24r3q9j2N1J60m08k5M56j47L27m81M1J05j44
$$ 220 338 82 86 159 324 127 118 213 -127 197 104 15 3 54 214 -194 -219 237 90 417 -64 -23 82 -62
3338f2K97j84J59j80Q2P2l52J26k47K92J17j10K23q8Kp2j82m4J20j77J07J08j09
$$ -62 235 51 210 30 112 184 -168 -42 -289 3 120 10 233 145 147 75 -107 -151 -31 -208 -101 7 -102
3361a02N4n7J76j14Q4p0N4J65j7J16k62l19j31R1K03M8K3K52j79J0J24l40J19
$$ -102 -48 -105 71 -43 41 -29 25 190 173 289 27 -292 -423 -332 -129 -81 -58 194 15 25 149 -191 -72
3384g2O1Q2j35P3p8J66j59p3l50l3L25Q9r1J25j77K7J04J44J33m66l0J75J03K19
$$ -72 -11 71 -64 9 -69 97 -62 -135 -485 -518 -193 -104 -195 -70 -247 -220 -116 28 161 -305 -335 -160 -57 162
3408A62j57N2j03o5m7J99N2p5M2M1q1Q8J8j43k05L41J14k55K15%Km48j5L92P1
$$ 162 5 57 -46 -111 -158 41 93 18 60 101 20 108 126 -17 -222 119 233 -22 193 193 195 -253 -268 124 195
3433A95P0j90J09rN2k98Nl3j99L78K04k26k03L80j58j91j75K14K87n4L02k11l49
$$ 195 265 75 184 175 227 -71 -66 -99 -298 80 284 58 -145 235 77 -114 -289 -75 212 158 460 249 -100
3456a00K08N5N0j55K55k50j57J56J3J00j97K86k85j31N58q4l51Q11p94K21l38
$$ -100 108 163 213 58 313 63 -94 62 75 175 -22 264 -21 -152 406 322 -29 782 -12 209 -129
3477a29J46K74l88oK76k95L75k37J34J4k75k9L16k42M5K11l64M76o94M12n6j19
$$ -129 17 291 -97 -103 173 -122 253 16 150 164 -111 -140 176 -66 -21 190 -174 302 -392 20 -36 -155
3499a55J6K18p5m16M12L5j99QJ61k58K54J61l86K73j84N8o01O06k3l4J17kR8j48
$$ -155 -139 79 4 -412 0 35 -164 -156 5 -253 1 162 -224 49 -135 -77 -678 -72 -95 -129 -12 -14 84 -64
3523f4n0j91j22K13K06K44P4n18m0K5K50p2J26j62K17o5J74k26j9j67K34Rl00
$$ -64 -114 -305 -427 -214 -8 236 310 -208 -248 -223 27 -45 81 -81 136 71 245 19 0 -167 67 76 -224
3546b24M3J73k01%j04J02J98j15j68L95p1j45K44k83J72k89L2L96Q7l83K93j68
$$ -224 -181 -8 -209 -209 -313 -211 -13 -128 -296 99 28 -117 127 -156 16 -273 -241 155 242 -141 152 -16
3568a6J43qk04l2K36p9N1j12J13j19l6R6j22K59k27N48j81k15O9k29j11L32l45
$$ -16 127 119 -85 -117 119 40 91 -21 92 -27 -63 33 -89 170 -57 491 310 95 164 -65 -176 156 -189
3591a89N89j54r1j14m1J5o9L72j32j39O0k03k9K02j94J48r0j05K35l10K23M3O0
$$ -189 400 246 155 41 0 15 -54 318 186 47 107 -96 -125 77 -117 31 -59 -164 71 -239 -16 27 87
3614H7J26k60M1j58j17K38k14K78l6m19J84K97m8l42J88J66J97j81j69j57K34
$$ 87 213 -47 -6 -164 -281 -43 -257 21 -15 -434 -250 47 -1 -343 -155 11 208 27 -142 -299 -65
3635f5n13L77L4J00p9J73L4P2m75J71p3K02K65l28M7K41n35L33l09K30K48p26
$$ -65 -578 -201 -167 -67 -146 27 61 133 -342 -171 -244 -42 223 -105 -58 183 -352 -19 -328 -98 150 -576
3657e76O32k73O06q82M32k19jN5K38k74K12J64j70O1k38J59k45L25K2j38k82K66
$$ -576 56 -217 389 -493 -61 -280 -281 -226 12 -262 -50 114 -56 5 -233 -74 -319 6 28 -110 -392 -126
3679a26l22M08L94m94K54l6j91K76J04j39J20q6j00L7j32J47J93m62Q5L66l37
$$ -126 -448 -40 354 -140 114 78 -113 163 267 128 248 162 62 99 -33 114 307 -155 -70 296 -41
3700d1J05k00J50K17m7k10M20l97n4J41k59J71M6J99j25j54j55M82O4m77J43K5
$$ -41 64 -136 14 231 184 -26 394 -3 -57 84 -175 -4 42 241 116 -38 -193 289 353 -124 19 44
3722D4M6j3J06Kk27p8K27O1j45J79j37L75m75J73j97l5N7L61k89J03P3k07j31
$$ 44 90 77 183 185 -42 -120 107 168 23 202 65 440 -35 138 -59 -94 -37 324 35 138 211 4 -127
3745a27j76K79j09L6P0R3j58K62l04p1J89%l6L4K40m17j12L21Q4k26j25K45k7
$$ -127 -303 -24 -133 -97 -27 66 -92 170 -134 -205 -16 -16 -52 -18 222 -195 -307 14 98 -128 -253 -8 -35
3768c5j49R6k33lL71k27R8O9k35K53q9k85J16K51j99K26m21Q6M92l54J73j04L74
$$ -35 -184 -88 -321 -324 47 -180 -82 -13 -248 5 -84 -369 -253 -2 -201 25 -396 -310 182 -172 1 -103 271
3791B71m45J59Q6m34L43N4k16L12k48K35kn5k94J74L4m3J21K2J31j75j92L9J77
$$ 271 -174 -15 71 -363 -20 34 -182 130 -118 117 115 60 -234 -60 -26 -69 52 74 205 30 -162 -123 54
3814E4K0q3r0K7P8k46l6K07L2n0M8K06J70k64O0l92L60j34J37qK71m2k3j98K36
$$ 54 74 -9 -99 -72 6 -240 -276 -69 -37 -87 -39 167 337 73 133 -259 101 -33 104 96 367 325 302 104 340
3839C40l66J56K09J6o0J08l18j14K08k86J96%K61k47n8L9n4j05L71l41k04M45
$$ 340 -26 130 339 355 295 403 85 -29 179 -107 89 89 350 103 45 84 30 -75 296 -45 -249 196
3861A96P8j41q6m6q7L7J62r9k1N8J1R6j23J58m72O0M7L71k29K27j23M9k60J96
$$ 196 274 133 47 1 -86 -49 113 14 -7 51 62 158 35 193 -279 -219 -172 199 -30 197 74 123 -137 59
3885E9j12j16L07j5l36J34J72j94p2p2L15l36R9J70l72M50l54L67r0j02J46J27
$$ 59 -53 -169 138 123 -213 -79 93 -101 -173 -245 70 -266 -167 3 -369 81 -273 94 4 -98 48 175
3907A75j97J37k4m83K58k60J92K28Q3k55j51L14P4k5j9J27j37j52J28j32Q6j36
$$ 175 -22 115 91 -392 -134 -394 -202 26 109 -146 -297 17 91 66 47 174 37 -115 13 -119 -33 -169
3929a69J9M16m40n6L9K20J07l01o4N11m16K1R5J64l05K72P2l40JJ95k70M54j95
$$ -169 -150 266 -174 -230 -191 29 136 -165 -229 282 -134 -113 -18 146 -159 113 185 -155 -154 41 -229 225 30
3952C0k23K01p4M43l64L1K6K24m76L62K04Kj50q1M08n64KN88p58L64o0K80j99
$$ 30 -193 8 -66 377 13 44 70 294 -182 180 384 386 236 155 563 -1 1 589 -169 195 135 415 216
3975B16n9J39pl97J60j15M5K95P9k15j7o5l80P1J0OL76k04k78J32L54p2l10K87
$$ 216 157 296 289 -108 52 -63 -18 277 356 141 124 59 -321 -250 -240 -234 142 -62 -340 -208 146 74 -236 51
3999E1m52M17J64k94L3k73K79j5J25m02O00j16l41K92l43L84j60o8L0Q4j39L49
$$ 51 -401 16 180 -114 -81 -354 -75 -90 35 -367 233 117 -224 68 -275 109 -51 -119 -89 -5 -144 205
4021B05k08J12k18L34kj93R0P5j09K65l55k46J90k66n0M53r4J52j33r6O5J23k44
$$ 205 -3 109 -109 225 223 30 120 195 86 351 -4 -250 -60 -326 -376 77 -17 135 2 -94 -29 94 -150
4044a50O9l13K81J8R8J12l29K15k88K56k40K80l3j81N95m62K09l00K07j3J07k90
$$ -150 -81 -394 -113 -95 3 115 -214 1 -287 -31 -271 9 -24 -205 390 -72 137 -163 44 31 138 -152
4066a52K82j74k1R9r9J53J59j42J51l13O7K43k13M4qqJ10k5j03j15K0m0N03l94
$$ -152 130 -44 -65 34 -65 88 247 105 256 -57 10 253 40 84 76 68 178 153 50 -65 -45 -85 418 24
4090B4l12L20q1j22L19J08k89J69J23k05q0P5pml63M8K78L87m30Q2K03l86J78
$$ 24 -288 32 -49 -171 148 256 -33 136 259 54 -26 49 42 38 -325 -277 1 388 -42 40 243 -143 35
4113C5L6j00L42m60j28J61K09l07N74k21J0j81j58J58L09j53j95Q8O8J02j79K20
$$ 35 71 -29 313 -147 -275 -114 95 -212 362 141 151 -30 -188 -30 279 126 -69 19 87 189 10 230
4135B30p0j52k04K30N3R2j88K63j40J09l59j44L36l60J82Q5K63k65Lk63L39j58
$$ 230 160 8 -196 34 87 179 -9 254 114 223 -136 -280 56 -304 -122 -37 226 -39 -36 -299 40 -118
4157a18l4K29l86N81p26L92J65m82N35m93j12J91q7M17j71J23Jk37J4J91l7PJ87
$$ -118 -152 77 -309 272 -454 -62 103 -379 156 -337 -449 -258 -345 72 -99 24 25 -212 -198 -7 -44 -37 150
4180A50k16J77k6k64J53n7J22m38L80J31j41j1o8K36l4L2P6j20j21L02j76j65
$$ 150 -66 111 85 -179 -26 -83 39 -399 -19 112 -29 -40 -108 128 94 126 202 82 -39 263 87 -78
4202g8L3k8m7K19O1oq4m3P5r2K09j12l87N29j72j80J25O3K13n52K11N1K15p5k67
$$ -78 -45 -73 -120 99 160 154 70 27 102 10 219 107 -280 249 77 -103 22 85 298 -254 -43 8 223 148 -119
4227a19J58k44K47K49L0k87lj36K27l6J41j40P1q8j79J29M3l8j17P7k34N77j5
$$ -119 39 -205 42 291 321 34 31 -105 122 86 227 87 158 70 -109 20 63 25 -92 -15 -249 328 313
4250C13l85L44k12k7j52K11q2j35J81j33J98l41L12j39l5Q8q7J51k54K29k23k7
$$ 313 -72 272 60 33 -119 92 10 -125 56 -77 121 -220 92 -47 -82 6 -81 70 -184 45 -178 -205
4272b05J74j59q2L07k44L28l89q7J26M49l18M5m6J50k66K50p9J9J63k71K76J91
$$ -205 -31 -190 -272 35 -209 119 -270 -357 -231 218 -100 -55 -101 49 -217 33 -46 -27 136 -135 141 332
4294C32l60N9j23K92K9m1k33K8oj8M3J62k17p4K75J01Oj89j64N2j3R5Q6k53J61
$$ 332 -28 31 -92 200 229 188 -45 -17 -23 -41 2 164 -53 -127 148 249 255 66 -98 -46 -59 36 122 -131 30
4319C0k7j56J31J2J38K40m85M19m90j36M48n17M49j18K80l68J91P9K3J23k43L
$$ 30 3 -153 -22 -10 128 368 -117 302 -188 -324 124 -393 56 -62 218 -150 41 120 143 266 23 26
4341B6p9l9OK25J4J50k20m6N0k64L96l42K05p1q9O7kR2J51l9O8m95O05j82q2R2
$$ 26 -53 -92 -86 139 153 303 83 37 87 -177 219 -123 82 11 -78 -11 -13 79 230 191 259 -236 369 187 105 197
4367A97k4l80L21J57j48j63K5J08q0M7r4k53L1J60J38M0r7K20m37K16k09J96K76
$$ 197 173 -207 114 271 123 -40 -15 93 13 60 -34 -287 -256 -96 42 82 -15 205 -232 -16 -225 -29 247
4390B47m41J54j00Q1J06Rj75k38J85J33K49k40L4j22k0j9M7O2j45M53l08j39J27
$$ 247 -194 -40 -140 -59 47 56 -119 -357 -172 -39 210 -30 4 -118 -138 -157 -110 -48 -193 260 -48 -187 -60
4413f0K80k42l0j47L10k4j61L66j42l49J86J05L36l29j52J66p2r1o0k58M96j97
$$ -60 220 -22 -52 -199 111 87 -74 292 150 -199 -13 92 428 99 -53 113 41 -50 -110 -368 128 -69
4435f9K55l14K15q9j8O6j73K89j32l04K78R7p2k78N60l97K8q3J86O7j04l93L25
$$ -69 186 -128 87 -2 -20 46 -127 162 30 -274 4 101 29 -249 311 -86 -58 -141 45 112 8 -385 -60
4458f0K46j71o1J23j80J20K55J3k52k85K70M09o14J26rL76j87j6J3j75J84m69
$$ -60 186 15 -46 77 -103 17 272 285 33 -252 18 427 -187 -61 -70 306 119 103 116 -59 125 -344
4480c44N65j51NJ69l4k3j16L9J33J05n20K90l15K84j10j00K05K6j83R1k90J30
$$ -344 221 70 75 244 210 187 71 110 243 348 -172 118 -197 87 -23 -123 82 108 -75 16 -274 -144
4502a44K80k43K10j83j37L15m81K93J8j26K22K4j59K91p9r0l8K44k90M6q2J08
$$ -144 136 -107 103 -80 -217 98 -383 -90 -72 -198 24 48 -111 180 101 11 -27 217 -73 -27 -109 -1
4524arp0k12J93k58K61N0K29j18oK1P5j27l17L53k29J16l11K72M7r4O7q1K37j28
$$ -1 -10 -80 -292 -99 -357 -96 -46 183 65 59 80 155 28 -289 64 -165 -49 -360 -88 -41 -135 -68 -149 88 -40
4549d0L3j5N2l5K9m06M46l98J3M01M5k4J12k80j29P0o1k4K43l3k98L34K65J1n53
$$ -40 -7 -22 30 -5 24 -382 64 -334 -321 80 125 101 213 -67 -196 -126 -187 -211 32 -1 -299 35 300 311 -242
4574b42j38K34K21l5k2r2j6N30o78Q4Q0P6J97k09l2Q5k17J81J50k26J26j62k47
$$ -242 -380 -146 75 40 18 -74 -90 440 -238 -154 -74 2 199 -10 -42 43 -174 7 157 -69 57 -105 -352
4597c52L60O4J9M8j02j44J42O9k1J82j62QL0k72q6J98J38J7k53L14k07K44k16
$$ -352 8 72 91 139 37 -107 35 104 83 265 103 111 141 -131 -217 -19 119 136 -117 197 -10 234 18
4620A8J71k10l09K62q8Q0K72k57L57k91n0J97k43K13l0R6l39jJ65q8l2O9J67k64
$$ 18 189 -21 -330 -68 -156 -76 196 -61 296 5 -45 152 -91 122 92 188 -151 -152 13 -75 -107 -38 129 -135
4644a35L80k31k99j2M21N7Rk12L6o5M3N7n8R0o2j05J3j19J49j0l7l4J35j13K39
$$ -135 245 14 -285 -297 124 181 190 -22 14 -51 -8 49 -9 81 19 -86 -73 -192 -43 -53 -90 -124 11 -102 137
4669A37k95j2R0J58k28J74l49K56L25n51K13rO8Q0o6o2o9J78mo5j59R4q0R1K97
$$ 137 -158 -170 -80 78 -150 24 -325 -69 256 -295 -82 -91 -23 57 -9 -71 -140 38 34 -31 -190 -96 -176 -85 212
4694B12l9k13j28M15r6k9K6j91M6Q7r2%K95l12J36J1j6j62O1L6M5j05k51J00K61
$$ 212 173 -40 -168 247 151 122 148 -43 3 90 -2 -2 293 -19 117 128 112 -50 11 47 92 -13 -264 -164 97
4719I7m3k09K45k45J00K26n23N33j71L4l8k01J56K13l44O1K53r2o5R8j18l4L4
$$ 97 54 -155 90 -155 -55 171 -352 181 10 44 6 -195 -39 174 -170 -109 144 52 -13 85 -33 -67 -33
4742c3L48k27k60J58J01J4l24K68M7j82n0J79r8r9L62k11j72R1Q2J00J38k84J97
$$ -33 315 88 -172 -14 87 101 -223 45 92 -90 -140 39 -59 -158 204 -7 -179 -88 -6 94 232 -52 145
4765A45m46K52jp5J29K6k9P1J45j72j26J10R0k42N8j69L67m9k4j35J23L9k54J06
$$ 145 -301 -49 -50 -125 4 30 1 72 217 45 -81 29 119 -123 -65 -234 133 84 60 -75 48 87 -167 -61
4789f1N8j70qJ55M9j33k16L20J19r6k57L84j8k34m7J62O5Q6k13j5k4k60N68l03
$$ -61 -3 -173 -181 -26 23 -110 -326 -6 113 17 -240 144 126 -108 -155 7 72 158 -55 -70 -94 -354 214 -89
4813h9O8O8j39k9n0J03L03k81J02k85Q2K9m1J32k8J83p5k0L74m63j82K96O0Q1
$$ -89 -21 47 -92 -121 -171 -68 235 -46 56 -229 -147 -118 -159 -27 -55 128 53 33 407 -56 -238 58 118 199
4837A99k15q6J40J1j82J2lK14k94L25l02M03l30M14k03j59J55k39J08j76J04K45
$$ 199 -16 -102 38 49 -133 -121 -124 90 -204 121 -181 222 -108 306 103 -56 99 -140 -32 -208 -104 141
4859A41K2l3j53k9P9r6L7K63j00J06j88P4j46J91N3k28J30j8J03j23k85J89j2
$$ 141 163 130 -23 -52 27 -69 -32 231 131 237 49 123 -23 168 221 -7 123 105 208 85 -200 -11 -23
4882b3KK59m39J64J50j59p6L06k20Q8pJ33J18l07p3K42l00J8L01j66j89j3N1L87
$$ -23 -21 238 -201 -37 113 -46 -122 184 -36 52 45 178 296 -11 -84 158 -142 -124 177 11 -178 -191 -140 247
4906B47k11Mn8j43K65M5j73r1J37j71O3k22L22J15m7J3m0k03p8J19J99j42k8j29
$$ 247 36 40 -18 -161 104 149 -24 -115 22 -149 -86 -308 14 129 82 95 55 -148 -226 -107 92 -50 -78 -207
4930b07J19K02P4n66L17P7n2n7P1k03j2L69k32k28M72j5l83K48J81j90K35l44
$$ -207 -88 114 188 -378 -61 16 -36 -93 -22 -225 -237 132 -100 -328 144 129 -254 -6 175 -15 220 -124
4952a24L69j51J04j76M6k25J8J97J41l42K3O8M3L3O6j01J15K2l22L44q6j7J87
$$ -124 245 94 198 22 68 -157 -139 58 199 -143 -120 -52 -9 24 90 -11 104 126 -196 148 62 45 232
4975B32o1j22N5n2K87n34L26j3k68J85j48K9N7J24m6j45O1k4L07l72J12j62L63
$$ 232 171 49 104 52 339 -195 131 118 -150 35 -113 -84 -27 97 51 -94 -33 -57 250 -122 -10 -172 191
4998A91k46j30J44J79j17m3J04l29L44r9R9j79O7K71j64J53m8j49j33k3J5L97
$$ 191 -55 -185 -41 138 21 -22 82 -247 97 -2 97 -82 -15 256 92 245 197 48 -85 -108 -93 304
5020C04k45q9K11l67J49j87J41M6j53M2j71K31J4r9L02j40j7Q9J84m56K07O8k97
$$ 304 59 -30 181 -186 -37 -224 -83 -37 -190 -148 -319 -88 -74 -173 129 -11 -28 61 245 -211 -4 64 -233
5043b33P1n7J43K02j24j52Q5m2Om9m3Q4R6M0r4j01L01j82j95R8K50J1j43j55p7
$$ -233 -162 -219 -76 126 2 -150 -65 -107 -101 -150 -193 -109 -13 27 -67 -168 133 -49 -244 -146 104 115 -28 -183 -260
5068b60J85J51qJ62k51o1R4k6J29J04k63J21p7j42j8M68m93J18J47n4%j20R3r1
$$ -260 -75 76 68 230 -21 -82 12 -14 115 219 -44 77 0 -142 -160 308 -185 -67 80 26 26 -94 -1 -92
5092i2J07k74L12J08m8q9j23L17k21k68M91j56j00K07j42p6M57n38K44j16j7K75
$$ -92 15 -259 53 161 113 24 -99 218 -3 -271 220 64 -36 171 29 -47 410 -128 116 0 -17 258
5114B58j97l69J67J53L25m12J12L9QK7O8j72m8R8N7j82j4J32k39J32K08l0r2J12
$$ 258 61 -308 -141 12 337 -75 37 76 84 111 179 7 -41 57 114 -68 -82 50 -189 -57 151 121 29 141
5138A41m90L62K1j48j0J30K33k43Q1l52J82J62J09j97k1J1R2j05P6J57j42j86
$$ 141 -349 13 34 -114 -124 6 239 -4 77 -275 -93 69 178 -19 -40 -29 63 -42 34 191 49 -137
5160a37J38jk13K61m5j09R2j7l4J51lJ95k28j60O9k20Q8m7M25l42K54M1l41K14
$$ -137 1 0 -213 48 3 -106 -14 -31 -65 86 83 278 50 -110 -41 -261 -173 -220 205 -137 117 158 -183 31
5184C1k8K1K89l01j7P0M6l59L01rJ09l26N13m80L80k86j36J24K02k44j50M37n1
$$ 31 3 24 313 12 -5 65 111 -248 53 44 153 -173 340 -140 240 -46 -182 -58 144 -100 -250 187 136
5207A36K5k71L01Ln2m22J56k50M62j73Q3j00j49J53nJ54r1L05m88L15r8o6J07
$$ 136 161 -110 191 194 142 -280 -124 -374 88 -85 -2 -102 -251 -98 -103 51 -40 265 -223 92 -6 -72 35
5230C5r6J88k95J45j22J58K38mk91Q0l4n4N3O1j2j6R9k7J75k83Q2o4K71k20K3
$$ 35 -61 127 -168 -23 -145 13 251 247 -44 36 2 -52 1 62 50 34 133 106 281 -2 80 16 287 67 90
5255I0QJ22L4k91M8l3Q1k12L71j88q9J29J12j34K3l5R9l79K35R3k11J69K4k66
$$ 90 98 220 254 -37 11 -22 59 -153 218 30 -59 70 182 48 71 36 135 -244 -9 84 -127 42 66 -200
5279b00K74j77J7J51m28N97j06p7K0j40R1j3L49k67l08OP4L40k47j8J28J42O2
$$ -200 74 -103 -86 65 -363 234 128 51 71 -69 22 9 358 91 -217 -211 -137 203 -44 -62 66 208 270
5302B70k73k06K14L1J03j97K93k42J03j11j02j92N29l68P6l4J51k29n3K15l21
$$ 270 -3 -209 5 36 139 -58 235 -7 96 -15 -117 -309 220 -148 -72 -106 45 -184 -237 -22 -343
5323c43N10k88R8k04J50J47K4k83L02j95K33j40N5M1l4j01J57j34K06l29l2K28
$$ -343 167 -121 -23 -227 -77 70 94 -189 113 -82 151 11 66 107 73 -28 129 -5 201 -128 -160 68
5345F8J07j58n1O3O9O3j54R1j88J46M0l77L52k7Q4k56j19M60l56M14j10l00J44
$$ 68 175 17 -34 29 98 161 7 98 -90 56 96 -281 71 44 128 -128 -247 213 -143 271 161 -139 5
5368EL3j6N9K00m2k72n6J78k96M23j22M32m44m27J78K85j64o5p8J93o1K0J46O2
$$ 5 38 22 81 281 239 -33 -89 89 -207 216 94 526 82 -345 -167 118 -46 -111 -189 4 -57 -37 109 171
5392A71m55J09K96L9p1q7K82N1J2k52j58K58nk85m9l7Mn8K79j94P2j8J33k95N3
$$ 171 -284 -175 121 160 89 2 284 335 347 95 -63 195 190 -95 -144 -181 -177 -235 44 -150 -78 -96 37 -258 -205
5417b05K77k02L41m58M06o8k82K04k87K39k8p5P8L89j89m32K55K90k16K83j94
$$ -205 72 -130 211 -247 159 91 -191 13 -274 -35 -63 -138 -60 329 140 -292 -37 253 37 320 126
5438A26k49J65j36J02K13k33j94K61R3m51N3L38p5pOJ03j85o0n5K66k08J10Jj34
$$ 126 -123 42 -94 8 221 -12 -206 55 148 -303 -250 88 13 6 12 115 -70 -130 -185 81 -127 -17 -16 -150
5462a50K57l1ok18RJ90k72K61k52N47r7j39J16l63N03j83q8k31J91q4J09L1j05
$$ -150 107 76 70 -148 -139 51 -221 40 -212 335 238 99 215 -148 355 172 84 -147 44 -40 69 100 -5
5485eM7m1k17K18J08k10M23k89O8M6q1r7J45j97J53j33R4j21J17p3Q1Nr2r9M08
$$ -5 42 1 -216 2 110 -100 323 34 102 148 67 -30 115 -82 71 -62 32 -89 28 -45 36 41 -51 -150 258
5510B58j67m27M37j07J96l91L40l43K19J12j7Q5m08K15k7L0M3j76L41k39o0m3
$$ 258 91 -336 101 -6 190 -201 139 -204 15 127 110 195 -213 2 -25 5 48 -128 213 -26 -86 -129
5532a29J15J22q2k32K21l66M58k02O7k67K06J29J83k37K37l40k63K32l6K02j3
$$ -129 -14 108 26 -206 15 -351 107 -95 -28 -295 -89 40 223 -14 223 -117 -380 -148 -184 18 5
5553EJ41j34j23N7j72M32j68q8J79k54R9QK9l93L56k21L70Ol0k40K84l6j12J20
$$ 5 146 12 -111 -54 -226 206 38 -50 129 -125 -26 -18 11 -382 -26 -247 123 129 99 -141 143 107 -5 115
5577A15j45k11K47k8J02k67J48np2K29j21n5j53L91j42j50K69l90j84J85J78l
$$ 115 -30 -241 6 -22 80 -187 -39 -44 -116 113 -8 -63 -216 175 33 -117 152 -238 -422 -237 -59 -62
5599f2p5p1J83j27K05m17K50K38n8j48J07l8j21Q7R9k7j81K07J21Q7k72J76k9
$$ -62 -137 -208 -25 -152 53 -364 -114 124 66 -82 25 -13 -134 -47 52 25 -156 51 172 259 -13 163 134
5622A34j11q1O6p0m1J71J12QJ91l36j6n2M6o9J63J36l13k36M51J9j33j91L04k22
$$ 134 23 -58 8 -62 -103 68 180 188 379 43 27 -25 21 -48 115 251 -62 -298 153 172 39 -152 152 -70
5646g0K6M5R8l41K53L4j24J4J43n9k6k05P8J15J86m04L62M9l77M0O1n8J35m3K13
$$ -70 -44 1 99 -242 11 45 -79 -65 78 19 -7 -212 -134 -19 167 -237 125 174 -203 -163 -102 -160 -25 -68 145
5671A45J94k81p5N3k71K37j1M4L80l87r1j11J10q8j4L71k11R1k22L0J15j7N5j5
$$ 145 339 58 -17 36 -235 2 -9 35 415 28 -63 -174 -64 -152 -166 205 -6 85 -137 -107 8 -9 46 31
5695C1k05J09K75k86M0J99l10K71j44J99l16R0m12L36r5K82j88J75k10J91j22
$$ 31 -174 -65 210 -76 -36 163 -147 124 -20 179 -137 -47 -459 -123 -218 64 -124 51 -159 32 -90
5716i0o3L06J50j99k42M10n43M16M6k76m2O8J51n7k74M83k09j81J77k84L98kJ72
$$ -90 -153 153 303 104 -138 272 -271 145 191 -85 -127 -59 92 35 -239 244 35 -146 31 -253 145 143 315
5739C15k21Pl39J36J5nJ84J69k44N6J3jJ21l70J29Q0L6k5k7j02P4K23J3o34O42
$$ 315 94 101 -238 -102 -87 -92 92 261 17 73 86 85 206 -164 -35 45 81 56 29 -73 1 224 237 -397 245
5764B45m25J49L29k14lj95J25J41j45k77K45J80k05n1K21j36K46l02J95k42J50
$$ 245 -180 -31 298 84 81 -114 11 152 7 -270 -25 155 -50 -101 120 -16 230 -72 123 -119 31
5785C1K24n35J25K16j42k56K80M0k19K02j6k53L94j38P4j06p4P3j39O0J32p2L68
$$ 31 255 -280 -155 61 -81 -337 -57 -17 -236 -34 -50 -303 91 -47 27 -79 -153 -80 -219 -159 -27 -99 269
5808B69l77J13k54L40J25j44k89K90K6P3l84M45l74j93M95j56l69O00l85K2J63
$$ 269 -108 5 -249 91 216 72 -217 73 99 172 -212 233 -141 -334 161 5 -364 236 -149 -127 36
5829C6J50K79p78R6M69k52l47L15J74j40K93l70Q8j32O7J74l06L56k39j04J20
$$ 36 186 465 -313 -217 252 0 -347 -32 142 2 295 -75 13 -119 -52 122 -184 172 -67 -171 -51
5850e1oJ68k86J46p1L85k77O2J13l66j74M27m8J6kn9J63k30K9J69J19j85L3l31
$$ -51 -57 111 -175 -29 -100 285 8 70 183 -183 -357 70 22 38 36 -23 140 -90 -61 108 227 42 75 -256
5874b56K68M3q1K93j33j41K7J25J86l91J17j78L4q6L4m8M11Rj08j78m0M74l62
$$ -256 12 55 -26 267 134 -7 20 145 331 -60 57 -121 -87 -173 -139 -187 224 233 125 -53 -93 381 19
5897A9K23m24R8J86N7l03K94m67K36r0K28j48q0L79k37J7R0k91K82m49M39k11
$$ 19 242 -182 -84 102 159 -144 150 -317 -81 -171 57 -91 -171 208 -29 -12 78 -213 69 -380 59 -152
5919a52K34k55J90k1k80M49j90j45M89j22n30L23o4Q6l13K25M7j1J69K36k98k1
$$ -152 82 -173 17 -4 -284 165 -25 -170 319 197 -333 -10 -74 12 -301 -76 -29 -40 129 365 67 46
5941D6j43J01n0J15k02j10j66L16L2J52l4q5J17oj44p9M22l76K06j07q4k3k09
$$ 46 -97 4 -46 69 -133 -243 -409 -93 -61 91 57 -28 89 83 -61 -140 282 -94 112 5 -79 -102 -311
5964c11J98j11J34R5j41M40l74L75r3k72N07o10K06l5J10j45l6k3J75j76K12j58
$$ -311 -113 -224 -90 5 -136 304 -70 305 212 -60 447 -163 43 8 118 -27 -63 -86 89 -87 125 -33
5986c3J08j6j52J96j61J16k10J32q1m6J79j8R3r5j9J62O4l49M01k11J78j64j26
$$ -33 75 59 -93 103 -58 58 -152 -20 -101 -147 32 14 107 12 -7 155 219 -130 271 60 238 74 -52
6009e2J12J5r6J25j34M38k53j32j2J75J1p9l11L80k21K3l45K15J57R1M32l59j84
$$ -52 60 75 -21 104 -30 408 155 23 11 186 197 118 -193 187 -34 -11 -356 -141 16 107 539 180 -4
6032do6j05L48j86K02l32O4pK46K54l33l55K26J01l8J10q3L1J03Q2k30K3n9j26
$$ -4 -70 -175 173 -13 189 -143 -79 -86 160 414 81 -274 -48 53 15 125 42 73 176 258 28 51 -8 -134
6056a34J61m9J33k73J95j17J02l6j24L16q1l07K77J17m15J30J76o3k13K1K43k8
$$ -134 27 -22 111 -162 33 -84 18 -18 -142 174 93 -214 63 180 -235 -105 71 8 -205 -184 59 31
6078C1M8j97L55l29P1P2p2K29l26Q3q0O9q7J35J86j45K53l78j08N05l80J64j17
$$ 31 79 -118 237 -92 -21 51 -21 208 -118 -35 -115 -46 -133 2 188 43 296 -82 -190 315 -65 99 -18
6101a8j95K29JrRk40J33l1L0J16K38l40J00j95j18L01O4l02K11P3J56j94R0j78
$$ -18 -213 16 17 8 17 -223 -90 -121 -91 25 263 -77 23 -172 -290 11 75 -227 -16 57 213 19 109 -69
6125f9P3K54l0k16o6J50l0m6M6j07j4m0J70j73L97l88j65L74p6J83l11p0J62l22
$$ -69 4 258 228 12 -54 96 66 20 66 -41 -55 -95 75 -98 299 -89 -254 120 44 227 -84 -154 8 -314
6149c14j3K81J55r9J09k16o7K25J41j53J23j55j51m3J69pJ22m1m22N94l1m05K34
$$ -314 -327 -46 109 10 119 -97 -164 61 202 49 172 17 -134 -177 -8 -15 107 66 -356 238 207 -198 36
6172C6J2L8K3r3l7o1K01k16J28ol10K69r4J10k51J61k19K67j21L7j14K73K2l15
$$ 36 48 86 109 16 -21 -82 119 -97 31 25 -285 -16 -110 0 -251 -90 -309 -42 -163 -126 -240 33 55 -260
6196b60J27J19O7l51O0P0J08k60M93j33j47K87r0J6j31j82K3l0K74J32k11k21
$$ -260 -133 -14 53 -298 -238 -168 -60 -320 173 40 -107 180 90 106 -25 -207 -184 -214 60 192 -19 -240
6218b40L51l6j76k7Q3P2J05n2l09M06k58m7K35j34K63l51j7L9K33l54J48n1l1
$$ -240 111 75 -101 -128 -45 27 132 80 -229 177 -81 -128 107 -27 236 -115 -132 -93 140 -214 -66 -117 -148
6241a48M42k13J5k58K00P8J01j63Nk68K40j34j2J93q2l7L6MJ44k62n7K94J19k26
$$ -148 294 81 96 -162 38 116 217 54 59 -209 31 -103 -115 78 -4 -41 -5 -1 143 -119 -176 118 237 11
6265A1L32l59l9J3K47J0k38n7j12K75j45K1K41l15k7m6P3%J53k84k7M82j5k81
$$ 11 343 -16 -55 -42 205 215 -23 -80 -192 83 -62 -41 200 -115 -142 -188 -115 -115 38 -246 -273 209 194 -87
6289h7K85j75j61q7P4M08j32k21q8N07k53j03N9l03J07J09k0J70J0l2k12n7J64
$$ -87 198 23 -138 -225 -151 257 125 -96 -184 323 70 -33 26 -277 -170 -61 -81 89 99 67 -145 -202 -38
6312c8N8o8J80o3j24O2p8O0k54L33j13nJ47j24J98k21J86m3o0l1J55k11J34P3
$$ -38 20 -48 132 69 -55 7 -71 -11 -265 68 -45 -50 97 -27 171 -50 136 93 33 2 157 -54 80 153
6336A53k48J83N7k52N2J5J9j2%k13K76k03L26k31R2Qj59J00J06Mm2P7q1l13J67
$$ 153 -95 88 145 -107 -55 -40 -21 -33 -33 -246 30 -173 153 -78 14 22 -137 -37 69 73 31 108 27 -286 -119
6361a19M5J02P0k94j23K83k9L61l91J71k28K03K41l52l8R5R1K13j26j03j62K27
$$ -119 -74 28 98 -196 -319 -36 -65 296 -95 76 -152 51 292 -60 -98 -3 88 301 175 72 -90 137
6383A37j23o9K05l36K79j60O5M0k45K75k40Q9J44J6k37J72J15m20K80l09L89J35
$$ 137 14 -55 150 -186 93 -67 -2 38 -207 68 -172 -83 61 77 -160 12 127 -293 -13 -322 67 202
6405B02l92q2L0K12K18J52o9k09p2J27p9j93J38j93K02k9J28l6O6K12m09L20M3
$$ 202 -190 -272 -242 -30 188 340 271 62 -10 117 38 -155 -17 -210 -8 -37 91 55 121 333 -76 244 287
6428B87m11K01k51P8J4P5p4J90j08k13K67l0j71K81nl50M82j52j97O6R7p8j4j67
$$ 287 -124 77 -174 -96 -82 -7 -81 109 1 -212 55 25 -146 135 130 -220 262 110 -87 -21 76 -2 -16 -183
6452a83J45N7n0J39j42k66K13L32l77j7J72K17j15j18J03j93j01J03L5O0k12J13
$$ -183 -38 19 -31 108 -34 -300 -87 245 -132 -149 23 240 125 7 110 -83 -184 -81 -46 14 -198 -85
6474h5K37k63r1M1L61k88L02l34P6j91L94R2j43k10jJ13j21k6K5J59k05K19M6
$$ -85 152 -111 -202 -161 200 -88 214 -120 -44 -235 159 251 108 -102 -103 10 -111 -137 -112 47 -158 61 107
6497A07J57j39j20j8J32jk65R9J10l07O9k9J20J7q8M42l00k54J88J39k66J37K43
$$ 107 264 125 5 -13 119 118 -147 -48 62 -245 -176 -205 -85 -68 -156 286 -14 -268 -80 59 -207 -70 173
6520A73j14Q6q3j80J43k16k56N56q8R4j05l29M24k44J59K54n58N18p0j37K12j43
$$ 173 59 145 62 -118 25 -191 -447 109 21 115 10 -319 105 -139 20 274 -284 234 164 27 239 96
6542I6k08n9K68j05K9j73J16L18l73J66L8M4j31q3j93K49j2Rj33L19k74O7J61
$$ 96 -112 -171 97 -8 21 -152 -36 282 -91 75 113 157 26 -57 -250 -1 -13 -4 -137 182 -92 -25 136
6565A36N2m04J15J27o4j28M21m09P5n3J41k9l86K23J91m3PK04l12or7L15J70L7
$$ 136 188 -216 -101 26 -38 -166 255 -154 -79 -132 9 -20 -406 -183 8 -35 -28 176 -136 -142 -239 76 246 283
6589B83k78J96n0j17m3J94l68J11J87q4k29K04n7j28O9J32lr9M3o9PJ21Ok84K78
$$ 283 5 201 151 34 -9 185 -183 -72 115 31 -198 6 -51 -179 -110 22 19 -80 -37 -106 -99 22 28 -256 22
6614B2J38m5K2k52Q1m2O1N8n8L8K8k56K51l7j08r3J77J23ok7k56K62kj08J77j63
$$ 22 160 115 137 -115 -34 -76 -15 43 -15 23 51 -205 46 9 -99 -192 -15 108 102 75 -181 81 79 -29 148 -15
6640a5J87l11K73M1k38k0M2K21j86l18J37J24O6k6k7J01k95K78Rm1n5j1K26l9
$$ -15 172 -139 134 175 -63 -83 -41 180 -6 -324 -187 -63 3 -23 -50 51 -244 34 43 2 -53 -64 162 123
6664A23o0k37L04J51k80k8J4O5k2R4K8j47L57p20K79Q1r1K33j46J50n1j07MP3
$$ 123 63 -174 130 281 1 -27 -13 52 30 124 152 5 362 -358 -79 2 -89 144 -2 148 97 -10 -6 67
6688F7k18q9N19j03j18j17K8n9K00r7Q2J66k19J84l68K19k86J99J95j27J6J31
$$ 67 -151 -240 279 176 58 -59 -31 -90 110 13 95 261 42 226 -142 77 -209 -10 185 58 74 205
6710B05m16N00l83P4J65k17O0L59r6j45j28j52K10J86l37j2O3o0K44k80K40l64
$$ 205 -211 289 -94 -20 145 -72 -12 347 251 106 -22 -174 36 222 -115 -127 -64 -124 120 -160 80 -284
6732b84M0K89j72o7kJ23j48J19j6N7J55p6N6O0m5j28j34L41k28K77k20K04l40
$$ -284 -244 45 -127 -194 -196 -73 -221 -102 -118 -61 94 18 74 134 89 -39 -173 168 -60 217 -3 201 -139
6755a39J12qMJ14k09K11j35NK69k71K37j69R7J77l57O1K14O2l50K29l45ml7L06
$$ -139 -27 -35 -31 83 -126 85 -50 -45 224 -47 190 21 118 295 -62 -1 213 275 -75 154 -191 -195 -232 74
6779G4j6J25j31l52M93J04j23k60j3N00m21N1R3l41K45j02J76m8O7l5Q5j94K64
$$ 74 58 183 52 -300 193 297 174 -86 -99 401 -20 31 124 -217 28 -74 102 54 121 86 171 -23 241
6802B41l24J45k54K12l91N49m76K19K98k38o6K22R9l39L49q9r0L2j88J71j02j21
$$ 241 -83 62 -192 20 -371 178 -298 -79 219 -19 -85 137 236 -103 246 157 67 99 -89 82 -20 -141
6824a41JK18J54j48k19J90R9j74L1j22Q5L2m3m9K0J13r8j6k22O8L73K6j22j97
$$ -141 -140 78 232 84 -135 55 154 -20 11 -111 -26 6 -37 -86 -66 47 -51 -67 -289 -221 152 178 56 -141
6848a41J03j5J1K21j49k6k40O33o46J80K41k00M6o3Q0q2J33l05P7J94j00n1%K53
$$ -141 -38 -53 -42 179 30 4 -236 397 -249 -69 172 -28 18 -45 35 -47 86 -219 -142 52 -48 -99 -99 154
6872A54k30k07K87P8k29K4K83J36j65q0m34M34j10J52OR1J85o02L41K0k9L8k44
$$ 154 -76 -283 4 82 -147 -123 160 296 131 51 -383 51 -59 93 99 190 375 -227 114 134 105 143 -101
6895a01K08l5j53q1M50j24k39J88m4o6J85Pr8P3k54j18J29j29J33l8N8L70p68
$$ -101 107 72 -81 -162 288 164 -75 113 69 3 188 195 97 170 -84 -202 -73 -202 -69 -107 -49 321 -447
6918d47L72L56k90P3j55MN9L58k24J64j01l4o5l17M82pk11j09J65J6j94L45k13
$$ -447 -75 281 -9 64 -91 -87 -28 330 106 270 169 135 70 -247 235 228 17 -92 73 89 -105 240 27
6941B7M9k29J04O4K4k31J57L44l33N1P0KK3k90J88o7NL11r2k88J54k08K02L1J00
$$ 27 76 -153 -49 15 39 -192 -35 309 -24 27 97 99 122 -168 20 -47 -42 269 177 -111 43 -165 37 68 168
6966A68j61j44J10J03l56k8O7O4m6j50M78k08M9J15l10M38l68L12j45j31J36j88
$$ 168 7 -137 -27 76 -280 -308 -241 -177 -223 -373 105 -103 -54 61 -249 189 -179 133 -12 -143 -7 -195
6988a95R5L9K45r3j96P7p4J73r9k55J09L38l15K36K69l39o1J95k00J53l59J57
$$ -195 -100 -61 184 91 -105 -28 -102 71 -28 -283 -174 164 -151 85 354 15 -46 149 -51 102 -257 -100
7010a00J86p9K43l53J08k5J93j55q1L36k10J25j67n2r2K69J39m61J46j16j08M42
$$ -100 86 7 250 -103 5 -20 173 18 -63 273 63 188 21 -31 -123 146 285 -176 -30 -146 -254 188
7032A88k25J29j49o5J54j48M45m43K68p1j77K18J85j54j26j53L17j10k26J69l6
$$ 188 -37 92 -57 -122 32 -116 329 -114 154 83 -94 124 309 155 29 -124 193 83 -143 26 -10
7053a0J10K0Q1k36J28l30K57J72k62K5N2j25pp7L56j08j28K36k34J3j8Q3K53l51
$$ -10 100 120 201 -35 93 -237 20 192 -70 -45 7 -118 -125 -202 154 46 -82 154 -80 -67 -85 -2 251 -100
7077a00K31P5j21k34K95J51m04L5J74l0j04k48L37M5J08r0j3m7k04K28o3P1j30
$$ -100 131 206 85 -149 146 297 -107 -72 102 72 -32 -280 57 102 210 120 107 60 -144 84 21 92 -38
7100c8k6l6J10l61N71k54J8m0j60L05l3no6J14j46q3K87l94N18k06q2J19k33Q7
$$ -38 -64 -100 10 -351 220 -34 -16 -56 -216 89 56 51 -15 99 -47 -130 157 -237 281 75 -7 112 -121 -34
7124c4M6J24j98K8j3j39Q0j69N11l19J46k43K78J13j07k23K49J41m54L56l0j65
$$ -34 12 136 -62 -34 -47 -186 -106 -275 236 -83 63 -180 98 211 104 -119 130 271 -183 173 143 -22
7146b2p7lK58j78J53O2j98Qq1j20J80n5M1K2m45K55N20m47K83m44J92J44o0J23
$$ -22 -99 -102 156 -22 131 193 -5 3 -78 -198 -18 -73 -32 -10 -455 -200 320 -127 156 -288 -96 48 -12 111
7170A11M7J03k91J10j25j20p3J55k75N55rk99L31j04j26J33j06p7R2k86J61r8
$$ 111 158 261 -30 80 -45 -165 -238 -83 -358 197 188 -111 220 116 -10 123 17 -60 32 -254 -93 -191
7192a91K00J28j0K09j77p4L1j06J00k81nK24Q9l58J92Q1O5k58R1k43L49p1j37
$$ -191 9 137 127 336 159 85 116 10 110 -171 -176 48 137 -221 -29 52 117 -141 -50 -293 56 -15 -152
7215a52K41N3l31m9K52j42j86J39j51K73K26n4l67K78K28k26J74k07J40j42K72
$$ -152 89 142 -189 -238 14 -128 -314 -175 -326 -53 173 119 -248 30 258 32 206 -1 139 -3 269
7236B69n10P7J91K8K5j07q0K2j14L99j31m1J5Q8l5j75M14k24q3Q0j30j64K70j16
$$ 269 -241 -164 27 55 80 -27 -107 -85 -199 200 69 28 43 131 96 -79 335 111 28 108 -22 -186 84 -32
7260c2o3N5J75K1P6O9j37j99M6j1Q0k75K30j35J84l20K58j35J42L03j25k90o0
$$ -32 -95 -40 135 156 232 301 164 -35 11 0 80 -195 35 -100 84 -236 22 -113 29 332 207 -83 -143
7283a43K39j12Q4k01N1j34M02l21L13j61K2J68J5k85L30m45L50K9r0j72J04j14
$$ -143 96 -16 68 -133 -82 -216 186 -135 178 17 39 207 222 -63 267 -178 172 201 111 -61 43 -71
7305g1L19k56j87J13J99k18r6K15K0J25q6MJ52j55k72L35l11K89k63m6L89k74
$$ -71 248 -8 -195 -82 117 -101 -197 18 38 163 77 81 233 78 -194 141 -170 119 -144 -190 199 -75
7327g5K84l61K0M14l91l9M0K06k2j26j29n2O1K72j04k7j06Q7J37k27L31j52k32
$$ -75 209 -152 -132 282 -109 -148 -108 98 76 -50 -179 -231 -170 102 -2 -29 -135 -48 89 -138 193 41 -191
7350a91J83l76J96R0n3N04k97k86M73l42K03j62P3J36P4j77J28m12J07M9K38m1
$$ -191 -8 -384 -188 -98 -151 353 56 -230 243 -99 104 -58 15 151 225 48 176 -236 -129 -80 158 117
7372A17n0K0p6j29JL38l34L6j14K49k45K77r9M3km2j56K57pp0Q3N6oj75j59R1
$$ 117 67 87 11 -118 -117 221 -113 -77 -191 58 -187 90 -9 34 32 -10 -166 91 84 14 97 153 147 -28 -187 -96
7398i6j24J05J20J73j21j80j87L71j09j32L18Q6l38K45M1k05Nj97K82q8J25l47
$$ -96 -220 -115 5 178 57 -123 -310 61 -48 -180 138 224 -114 131 172 -33 -28 -225 57 -31 94 -253
7420b53K79Rj35L50l99M0m8M84j92j58J93q9o3k61J82q6O5k7K72j65j3j45K66
$$ -253 26 35 -100 250 -149 -109 -157 327 135 -23 170 81 18 -243 -61 -147 -82 -109 163 -2 -15 -160 106
7443A06m33J60L89l14J58lk57K27j92K38n4j6m2L0J94k75J40nK07l46m1K19q6
$$ 106 -327 -167 222 -92 66 63 -194 33 -159 79 25 9 -33 -3 191 -84 56 51 258 -88 -129 90 4
7466D%j63K01r2k84N6J93J19M1K3k63j91P15n16R8j13Q4j32o8J16M7K46r6q4k32
$$ 4 4 -159 42 -50 -334 -278 -85 34 75 98 -165 -356 359 -157 -59 -172 -88 -220 -288 -172 -125 121 25 -59 -291
7491b91K71K38j05J0K9o9k55P9MJ53k24J99m2j65J39J16J09j72k55K14k28L30
$$ -291 -20 218 113 123 152 83 -172 -93 -89 64 -160 39 -3 -168 -29 87 196 24 -231 -17 -245 85
7513H5r3J09j10k0L8rj57R1J33q1N6N6j06l94M53k4K55l36o6q0K28o2O6L2j6J74
$$ 85 -8 101 -9 -29 9 0 -157 -66 67 -14 42 98 -8 -402 51 27 282 -54 -120 -200 28 -34 32 64 48 222
7539B22l71K47L01o72K53J68r7N0rR8j80k24M06M2j74K2j30l2L4J55j14n5M9L3
$$ 222 -149 98 399 -273 -20 148 51 101 92 190 10 -214 192 234 60 82 -48 -80 -46 109 -5 -60 -11 22
7563B2l0K49q4M3m05L28k74J54k0L22m58J92m3l62K35r3M41l17M8J40j87R3r9
$$ 22 -8 241 157 200 -205 123 -151 3 -17 305 -153 39 -4 -366 -131 -224 217 -100 -52 88 -99 -6 -105
7586a05L1r0J40j5PJ9J03j23j6k45L14m19K41J34M2k1o0J07Q6k33l9M43n37M11
$$ -105 -74 -164 -24 -39 -32 -13 90 -33 -49 -294 20 -399 -158 -24 18 -3 -63 44 130 -103 -142 301 -236 175
7610A75k95J14j5J08j37M5r1jM4r3M24k12p9l12M02r8J04j84J99k47L6J45j6L0
$$ 175 -120 -6 -21 87 -50 -5 -96 -97 -53 -146 278 66 -13 -325 77 -21 83 -101 98 -149 -113 32 16 46
7634D6k30J44k3N7m7j23M1k55M3P55n78K54n7k14K16J5j87j76M41rj38K11q5j56
$$ 46 -184 -40 -63 -6 -53 -176 -135 -390 -347 408 -170 84 27 -187 29 44 -143 -319 122 113 -25 186 101 -55
7658e5N2L09k55j9k29M12k13J66j50r8J21l0J53j6J70k14k61K92k02K20l11J25
$$ -55 -3 306 51 32 -197 215 2 168 18 -80 41 11 164 148 318 104 -157 135 -67 153 -158 -33
7680c3K91l27j78O9R6%K50l17L10k15K02p1j84NL19k64N3K7j73J34J34j89j2J09
$$ -33 258 -69 -247 -178 -82 -82 168 -149 161 -54 148 77 -107 -102 217 -47 6 33 -140 -6 128 -61 -73 36
7704C6J10j53j98K08J5M1pj01J66j32k14J02Q0M9J21m6O5q9k68L90j08l20L15
$$ 36 146 -7 -205 3 18 59 52 -49 117 -15 -229 -127 -47 2 123 77 142 53 -215 175 67 -253 62
7727F2J6j82L11k64J39k87K22jp0J85n9J35n29L11J09k21j65K61j7QLJ2K13k77
$$ 62 78 -104 207 -57 82 -205 17 16 -54 131 72 207 -322 -11 98 -123 -288 -27 -44 -36 -33 -21 192 -85
7751h5j54J2J54J38l06K16j15K79k87j86M20k1ql16K13j86q1J83N36k97P7j03
$$ -85 -239 -227 -73 65 -241 -25 -140 139 -148 -334 86 65 57 -259 -46 -232 -313 -130 406 109 186 83
7773H3M9J53n41K44j11K2r0K23M0k59J18L25k00o6nr0J92o3n2L60o26N38k26k51
$$ 83 132 285 -256 -12 -123 -101 -191 32 72 -187 -69 256 56 -10 -15 -105 87 24 -28 332 -294 244 18 -233
7797b33M43l23Q3j21L1k6J04k4M7j7K39j66p0m9L68l00L14m08K55k52j82M29j89
$$ -233 210 -113 -30 -151 -120 -146 -42 -66 -19 -36 203 37 -33 -82 286 -14 300 -108 147 -105 -287 142 -47
7820d7n3J74J91k12j8j54L5j09J30k15J84J10k5J48k41K5J26n7rJ99k04K49m05
$$ -47 -100 74 265 53 35 -119 -84 -193 -63 -278 -94 16 -9 139 -102 -77 49 -8 -17 182 -22 227 -178
7843a78K03j10K11n1R6k40Lmp8K30q2r2O0K01m3r5m9R7n3k25N77n49M8J63q9J18
$$ -178 25 -85 126 75 171 -69 -66 -70 -148 82 0 -92 -32 169 126 31 -18 79 26 -199 378 -171 -123 40 -49 69
7869F9Kk0j38O5r5P2j21J72J46n4j59K99j53k09J4L04m0o4k60j88L75m1j44J01
$$ 69 71 51 -87 -22 -117 -45 -166 6 152 98 -61 238 85 -124 -110 194 154 90 -170 -358 17 -24 -168 -67
7893f7R4r3P2R5l41K57J9j63J18l03L94o2j01K31l70J42k9L47l76J29J24p5j21
$$ -67 27 -66 6 101 -240 17 36 -127 -9 -312 82 20 -81 150 -220 -78 -107 240 -136 -7 117 42 -79
7916g9K15P4k80J90p0l7J41m15J84K94k13K0NP1J80m55M22k98J24km9k58l9L17
$$ -79 136 210 -70 120 50 13 154 -261 -77 217 4 24 29 100 280 -175 247 -51 73 71 22 -236 -275 42
7940D2k35L0J93O0j09L6p7J52j30J59j46J06kP2k95J44J24J6o6K9j30Q0j0j67
$$ 42 -193 -163 30 90 -19 17 -60 92 -38 121 -25 81 79 151 -144 0 124 140 74 103 -27 53 43 -124
7964a24M1K48j40j81J14k3J4J85K9j48j53J21j91L09k4j63J11nj33q2J17J07K09
$$ -124 -83 165 25 -156 -42 -65 -51 134 163 15 -138 -17 -208 101 77 -86 25 20 -113 -195 -78 29 238
7987B38l56J70K06k98o5MJ3j9o6K74k88L12j13j14Q7j99J5K06M6j3k79J37p8L23
$$ 238 -118 52 258 -40 -105 -101 -88 -107 -173 101 -187 125 12 -102 -15 -214 -199 7 53 40 -239 -102 -180 143
8011A43r3j37K22l18K02P6k5M8j54L6O2K9K51k30j94R1j39K17j00O2K30j89k37
$$ 143 50 -87 135 -183 19 95 70 118 -36 0 62 91 342 112 -82 9 -130 87 -13 49 279 90 -147
8034a47J90M0k33M01o6p0j83n9K28K2m05K53K2O4p6K29l86N8K02o1O0R1m42K75
$$ -147 43 83 -150 251 185 115 -68 -127 101 123 -282 -29 -7 57 -19 210 -176 -118 84 23 83 174 -268 7
8058Gj48L46k92J13K27k90J0N8L0j99M64j93k28J37J76j26ll38J24L81m13M8J8
$$ 7 -141 205 -87 26 253 -37 -27 31 61 -138 326 133 -95 42 218 92 89 -249 -125 256 -157 -109 -91
8081i1q4L25J69J4j43j11N9j6q8m9K63j58k37m8N51l54OK00k86n9K87j9j06L9
$$ -91 -175 150 319 333 190 79 138 122 34 -15 248 90 -147 -195 356 2 8 208 -78 -137 150 131 25 64
8105F4J86l29j15J63N7J36l14M22j76p0j4r4K94rk79O0k07L50l34K93R7j39NO
$$ 64 250 -79 -194 -31 26 162 -152 270 94 24 10 -84 210 201 -78 -18 -225 125 -209 84 181 42 47 53
8129E3j90j02J52l1L7j32J54o1L53k38n2K54k82P8J27l38K96n0P5n9j38P1j15
$$ 53 -137 -239 -87 -118 -81 -213 -59 -120 233 -5 -57 197 -85 -7 120 -218 78 28 103 44 -94 -23 -138
8152a38L26j35n8L05k50p6R5N2l00K38J50k43J03j85Q7OR4k45l8J47J24k23K92
$$ -138 188 53 -5 300 50 -26 69 121 -179 59 209 -34 69 -116 -29 -23 71 -174 -212 -65 59 -164 128
8175A28J24k75k3J61LJ17l56L54k74j58L23j24j16K40k63k1
$$ 128 252 -23 -46 115 118 235 -121 233 -41 -199 124 0 -116 124 -139 -160
8191a60
$$ Imaginary data points
##PAGE= N=2
##DATA TABLE= (X++(I..I)), XYDATA
0@%%%%%%Qj6J6k4L2l2M0n6O5p8R5j12J35j59J85k17K52k89L36l84M37n01N67o42
$$ 0 0 0 0 0 0 0 8 -8 8 -16 16 -16 24 -32 33 -45 50 -62 73 -86 99 -118 134 -155 181 -203 234 -267 300 -342
30c42P25q12R11j020J139j272J416j571J744j936K144k375K629k909L224l575
$$ -342 383 -429 482 -538 601 -671 745 -826 918 -1018 1126 -1249 1380 -1529 1695 -1880
46a880L970m418M932n528O225p058Q076r348J0989j3209J6397k1390L0414n1927
$$ -1880 2090 -2328 2604 -2924 3301 -3757 4319 -5029 5960 -7249 9148 -12242 18172 -33755
60c3755J97033K39869k42879k21655j19465J35323K11189J45491p5524j98097
$$ -33755 163278 403147 160268 -61387 -180852 -45529 165660 311151 235627 37530
70C7530j72295J9717J65213J72468L143j65326k09040o0757J33951K22213J08166
$$ 37530 -134765 -115048 50165 222633 225776 60450 -148590 -209347 -75396 146817 254983
81B54983r5314k28205j71407J0816J72995J74630L0181j39429j83639p8205Q7365
$$ 254983 159669 -68536 -239943 -229127 -56132 118498 148679 9250 -174389 -252594 -165229
92a65229J63752R3534o3978j63863j16774M4825J76452J61022Q732j44427j70930
$$ -165229 -1477 92057 28079 -135784 -252558 -207733 -31281 129741 138473 -5954 -176884
103a76884n1614J09438J83026J12884l8761j46048j23923M391J23787J34362L0232
$$ -176884 -228498 -119060 63966 176850 138089 -7959 -131882 -127491 -3704 130658 160890
114A60890r3524j24621l4139R4040J42072O6825o4210j39625r7909K6332J30205
$$ 160890 67366 -57255 -91394 2646 144718 211543 147333 7708 -90201 -63869 66336
125F6336J27479K0253j01673j40241p0121M4875J10244P4663l0067j08356q9903
$$ 66336 193815 214068 112395 -27846 -97967 -53092 57152 131815 101748 -6608 -96511
136i6511M858Q5930Q0800j581q6885j00577l1655O3525J06241O1235l5371j07164
$$ -96511 -91653 -5723 75077 73496 -13389 -113966 -145621 -82096 24145 85380 50009 -57155
148e7155r5923j1434P7148R6837L4076n2156q4565m0567L6027P5617M8852j5565
$$ -57155 -153078 -164512 -87364 9473 43549 -8607 -93172 -133739 -97712 -22095 26757 11192
160A1192o1342m7229J6991P6408P9627K0297n4395q3053m2820L5383Q8038P2528
$$ 11192 -50150 -97379 -80388 -3980 75647 95944 41549 -41504 -84324 -48941 39097 111625
172A11625J963o2181o7684j7272M0483N9539K7835k3010m7590k7171J9425N1566
$$ 111625 113588 51407 -16277 -33549 6934 66473 94308 71298 23708 -3463 15962 67528
184F7528L7834j3134o0319o2665j3026M8384O7189K7480l5250p0649n3687l573
$$ 67528 105362 92228 31909 -30756 -43782 4602 71791 99271 64021 -6628 -60315 -63888
196f3888L9074M4136J1282l0244m4305k0199K0184L8439J7997k4271n0029l2245
$$ -63888 -24814 19322 30604 360 -43945 -64144 -43960 -5521 12476 -11795 -61824 -94069
208i4069J7836N5754N0120K579m6359n8651k7089K4364N6126M4819L961l3121
$$ -94069 -76233 -20479 29641 32220 -14139 -72790 -99879 -75515 -19389 25430 29391 -3730
220c730l7992p341K9863M0839J6329k2021l4450q114L3484N0220K5712j9205m9634
$$ -3730 -41722 -49063 -19200 21639 37968 15947 -18503 -26617 6867 57087 82799 63594 13960
233A3960m1447j233M1467N2946K5283k2179m8946l6685M836L5688L1295k235l2357
$$ 13960 -27487 -28720 12747 65693 90976 68797 19851 -16834 -11998 23690 54985 52750 20393
246B0393l0112K88K9980K9738q76l7387m8943k3539J9992M6944L5761o509m4870
$$ 20393 -9719 -9431 20549 50287 49411 12024 -36919 -60458 -40466 6478 42239 35730 -9140
259i140n0026j8345K4749M1869K0674j5768l3407j6897J4740L0585J7741j2812
$$ -9140 -59166 -77511 -52762 -10893 9781 -5987 -39394 -56291 -41551 -10966 6775 -6037
271f037l4082k6636P275M0204M5116J4326k7762m7700k7585J6747M5971L8149
$$ -6037 -40119 -66755 -59480 -19276 25840 40166 12404 -35296 -62881 -46134 -163 37986
283C7986L933k6954k7901l129K3464K7684Q046j9137k7654q928K2452L7812K2048
$$ 37986 41919 14965 -12936 -16065 7399 35083 43129 23992 -3662 -12590 9862 47674 69722
296F9722j4508m1564l6602k499L2859L9610J2975k2267l5909k0378P071K3116
$$ 69722 55214 13650 -22952 -25451 7408 47018 59993 37726 1817 -18561 -11490 11626
308A1626J4782p738k4525j9538L993K4996K3181l517l2166l7844j2965K3916L8949
$$ 11626 26408 18670 -5855 -25393 -21400 3596 26777 23260 -8906 -46750 -59715 -35799 3150
321C150K2201j0460l3276k8540l408K1341K6653J0091j2535k0146o158J5212K3894
$$ 3150 25351 14891 -18385 -46925 -50333 -28992 -2339 7752 -4783 -24929 -31087 -15875 8019
334H019J0806j4002k6390j5598J3003L4157K8676J016k3660k9356j0253J4880
$$ 8019 18825 4823 -21567 -37165 -24162 9995 38671 39687 16027 -13329 -23582 -8702
346h702K7858J8849k511j8006j5928J748J6461J4444k935k0245j8964N09K1557
$$ -8702 19156 38005 35494 17488 1560 3308 19769 34213 31278 11033 -7931 -7422 14135
359A4135K3507N157j8456k9011j9619K841K1235K2156M477j5462k2186j1191N799
$$ 14135 37642 42799 24343 -4668 -24287 -21446 -211 21945 26422 10960 -11226 -22417 -16618
372a6618J3481O052q845j5895o582R925J7929R936q535k1600j9114k048J7463
$$ -16618 -3137 2915 -5930 -21825 -28407 -18482 -553 9383 848 -20752 -39866 -41914 -24451
385b4451K4161J3572o042j9406j6049j080J4234J6105M387p616q210K190J1667
$$ -24451 -290 13282 7240 -12166 -28215 -29295 -15061 1044 5431 -2185 -10395 -8205 3462
398C462J1594N85j1132j4049o020R596K0858J6805Q74j5580j9314q435P744J5382
$$ 3462 15056 15641 4509 -9540 -15560 -5964 14894 31699 32573 16993 -2321 -10756 -3012 12370
412A2370J0560j903r605o979R05O456L267n480j1870r335J523J2706J4430L578
$$ 12370 22930 21027 11422 4443 5348 11804 15071 9591 -2279 -11614 -10091 2615 17045 20623
426B0623j1411k0353j4589Q67J4724J5138M365q375j1836o257J751N937L423k147
$$ 20623 9212 -11141 -25730 -24863 -10139 4999 9364 989 -10847 -17104 -15353 -9416 -5993 -8140
440h140o377l409N815J1925Q807l166j3279j3431k354J1941J6858J1171j422j0454
$$ -8140 -14517 -17926 -12111 -186 8621 5455 -7824 -21255 -23609 -11668 5190 16361 14939 4485
454D485j0243k364O574Q650M401k702m612J46O460P692J893q344j2621o718O126
$$ 4485 -5758 -8122 -1548 7102 11503 8801 4189 4335 10795 18487 20380 12036 -585 -7303 -1177
469a177J4332J1938J106j0990j4139q412J964R049Q190Q01o258p801k140M273
$$ -1177 13155 25093 26199 15209 1070 -7342 -5378 3671 11861 12662 6404 -1397 -3537 736
483G36L889k538q893p976L20Q787J0461L689o538j2710j0875n68R052J2142N276
$$ 736 4625 2087 -6806 -14782 -14462 -5675 4786 8475 1937 -10773 -21648 -22216 -13164 -1022 4254
498D254l866q084n939J440N801M436j201n181k010M736R332N989j743q367r585
$$ 4254 388 -7696 -13635 -12195 -6394 -1958 -3159 -8340 -10350 -5614 3718 9707 7964 -403 -9988
513i988k123O983J2449Q892K10q588r541k676M533O829K724k620l152n75L562
$$ -9988 -12111 -5128 7321 16213 16423 7835 -1706 -4382 151 6980 9704 7084 3932 3357 6919
528F919L633P0n666q796m669K941R983Q655M20q890j1143p032J827P151O361P93
$$ 6919 10552 10622 4956 -3840 -8509 -5568 4415 13070 13490 4600 -6543 -13575 -11748 -4597 1764 2557
544B557m147m525j319J945J768j518m394l734J155O069P702L313m053q925o647
$$ 2557 -1590 -6115 -7434 -5489 -3721 -5239 -9633 -13367 -12212 -6143 1559 4872 819 -8106 -14753
559a4753K04P243Q288M523r60l830l143l48K041K233L60j524P70L205N760L112
$$ -14753 -14549 -7306 982 5505 4545 715 -2428 -2776 -735 1498 1858 334 1104 4309 10069 13181
575A3181k574o208o561j379M866Q434N647j51n020o249m466L35L119K589M80j087
$$ 13181 10607 4399 -2162 -3541 1325 9759 15406 15255 10235 3986 -480 -145 2974 5563 6043 4956
591D956r10J16O41q29m067n513k719K520N488M948P82l601o337n504j662L097
$$ 4956 4046 4162 4803 3974 -93 -5606 -8325 -5805 -317 4631 5413 1812 -4525 -10029 -11691 -8594
607h594M953L358L51k222j472n92o6n39j299p86J120M055M571K760j116m555n337
$$ -8594 -3641 -283 68 -2154 -3626 -4218 -4284 -4823 -6122 -6908 -5788 -1733 2838 5598 4482 -73 -5410
624e410j892L021O283N185K367j976m191k848n74J632J494M92k59R69K181J181
$$ -5410 -7302 -4281 2002 7187 9554 7578 3387 539 -35 1597 3091 3583 3324 4293 6474 7655
640G655o67l153n014l268O29M719N658K055l085n927n190j477K056L030J830j71
$$ 7655 6988 3835 -1179 -4447 -3818 901 6559 8614 5529 -398 -5588 -7065 -5009 -1979 -149 -320
656c20j676j879J45P12r32k797k997l97L512N365L402r33n011n591k163K689N803
$$ -320 -1996 -3875 -3730 -3018 -3950 -6747 -9744 -10141 -6629 -1264 2138 1205 -3806 -9397 -11560 -8871 -3068
673c068L910J220j483k669q12J182J245j36p09p21K461M501L886k90m612n518
$$ -3068 842 2062 579 -2090 -2902 -1720 -475 -611 -1320 -2041 420 4921 8807 8517 3905 -1613
689a613k176K838N809N381R90l216m878k984N79K678J746j234j877l99J983K288
$$ -1613 -3789 -951 4858 10239 11229 8013 3135 151 730 3408 5154 3920 2043 1644 3627 5915
705E915j98l118n650l146R52N015N091J247l430n301m526k21K895L515O61j512
$$ 5915 5717 2599 -3051 -6197 -5245 -230 4861 6108 2678 -2623 -7149 -7370 -4475 -960 -299 -1811
721a811j198O9J791J099j819l984k196J597N101N222K046k445n188m230M3M118
$$ -1811 -3009 -2940 -1149 -50 -1869 -5853 -8049 -6452 -1351 3871 5917 3472 -1716 -5946 -5903 -1785
737a785M997K519r29j778j171R24Q97l48k072j495R28L662M236J616k607n709
$$ -1785 3212 5731 4802 3024 1853 2777 3674 3326 1254 -241 687 4349 8585 10201 7594 1885
753A885m596l82L787M169K342j269k994l134r94O02L23j445j735r1K305K429J260
$$ 1885 -2711 -3093 694 4863 7205 5936 2942 -192 -1186 -584 -261 -1706 -3441 -3532 -1227 1202 2462
770B462k284m794m238j024K808M705K869n38k913k462j303O14R99M33l36Q52J919
$$ 2462 178 -4616 -8854 -9878 -7070 -2365 504 -34 -2947 -5409 -6712 -6098 -5099 -4666 -5002 -4150 -2231
787b231K737R25j408l509l477Q58L319M959L339j07k632l285j421J180K012J607
$$ -2231 506 1431 23 -3486 -6963 -6105 -2786 2173 5512 5405 2773 -512 -1933 -753 1259 2866
803B866M27P8P43J266Q8j438k699k416L2K358L724J981j038k795l953j682O84
$$ 2866 3293 3371 4114 5380 5468 4030 1331 -1085 -1053 1305 5029 7010 5972 3177 -776 -2458 -1774
820a774J383R78L05m18K76q5q39j510k352j883M37K723L023J447j107k746k832
$$ -1774 -391 587 892 474 750 665 -174 -1684 -4036 -5919 -5482 -2759 264 1711 604 -2142 -4974
837d974j373R66K376K382N89k4k44J84r5r48j268P1J210K872K577R51j029k180
$$ -4974 -6347 -5381 -3005 -623 -34 -58 -302 -118 -213 -1161 -2429 -2358 -1148 1724 4301 5252 4223 2043
855B043j807o97J526K525J576K3r6n39m03j182j031o60P6J304J428J529j83j936
$$ 2043 236 -461 1065 3590 5166 5189 5093 4554 4151 2969 1938 1278 1354 2658 4086 5615 5432 3496
873C496l041j763n84J113J416J542k82j413j092j149r60j176m53L00J406J574
$$ 3496 455 -1308 -1892 -779 637 2179 1897 484 -608 -1757 -2717 -3893 -4346 -4046 -2640 -1066
889a066J148o05k621k076j234J63K416K160J168Jj007j015p94l8m0O32J147J694
$$ -1066 82 -523 -3144 -5220 -6454 -6291 -3875 -1715 -547 -546 -1553 -2568 -3362 -3400 -3440 -2808 -1661 33
907C3J828P28m90j990k019m25J320K743J786Q05o34j408p49l93l91QO8Q45Q90
$$ 33 1861 2589 2099 109 -1910 -2335 -1015 1728 3514 4319 3685 2277 1528 1135 744 752 820 1665 2555
926B555J462N44j532k433k511q51J453K296J436K64j319k051j809o43n2L66K01
$$ 2555 4017 4561 3029 596 -1915 -2766 -1313 983 2419 2683 1364 -687 -2496 -3139 -3191 -2825 -2624
943b624P43J086Q59l47j376k277j538Q3J719L036J524L37j613j693j266N53J177
$$ -2624 -1881 -795 64 -283 -1659 -3936 -5474 -5391 -3672 -636 888 1225 -388 -2081 -3347 -2794 -1617
960a617P44J102N20Q17R82K1n02j730j533K66K087K607J652K92j795k105q92o6
$$ -1617 -873 229 749 1566 2548 2569 2067 337 -1196 -930 1157 3764 5416 5708 3913 1808 916 850
978H50J058J409J46O7M8J28j00r00j897j444K7J241J975J170n04k276k585j322
$$ 850 1908 3317 3463 3530 3578 3706 3606 2706 809 -635 -608 633 2608 3778 3274 998 -1587 -2909
996b909M28J419P38K22k64k74r04K13o58j120q29J11J502K035J190o57k064j817
$$ -2909 -2481 -1062 -324 -102 -366 -640 -1544 -1331 -1989 -3109 -3938 -3827 -2325 -290 900 243 -1821 -3638
1014c638j02L94J896J561Q32m39n91m87L25r4l70j54N24J126J317J037m85j380
$$ -3638 -3740 -3346 -1450 111 943 504 -87 -574 -249 -343 -713 -867 -343 783 2100 3137 2652 1272
1032A272j945l38O08J588J424P2l09j114q19m46j8n24K90J05O59Q51J76r70j767
$$ 1272 -673 -1011 -403 1185 2609 2681 2372 1258 439 -7 -25 -549 -259 -154 505 1356 1532 562 -1205
1051a205j500n73R84J074J513r9r19j276j106n0J0O03N60L18O38M98o3q72p37
$$ -1205 -2705 -3278 -2294 -1220 293 194 -725 -2001 -3107 -3157 -3147 -2544 -1984 -1666 -1028 -530 -593 -1465 -2202
1070b202o09Q7R98J516J338J32o16j125n26j15O83P84P85R36R2L2K03p81p94n57
$$ -2202 -2811 -2724 -1726 -210 1128 1260 644 -481 -1007 -1122 -439 345 1130 2066 2158 2190 2393 1612 818 261
1090B61J58J256J329P81k31q15j138j191l48R84L96P23J26k06k68r34q25o71k05
$$ 261 419 1675 3004 3785 3554 2739 1601 410 62 1046 1442 2165 2291 2085 1817 883 58 -613 -818
1109h18L32Q21O69N62p08r10j296p70K58N55Q32K39N06j4o58o41n58j79l37J103
$$ -818 -486 335 1004 1566 858 -52 -1348 -2118 -1860 -1305 -473 -234 272 258 -400 -1041 -1599 -1778 -2115 -1012
1129a012J183P30K54m60p65q58l98N89Q05O89L46K17J84n08l12q57j34O5R59R44
$$ -1012 171 901 1155 695 -70 -928 -1326 -737 68 757 1103 1320 1504 996 684 -173 -307 -242 717 1661
1149A661K53O5n69j054q62l59M75N54P73K70k73l88p89o92n81k0K67L21Q13K76
$$ 1661 1914 1979 1410 356 -506 -865 -390 164 937 1207 934 546 -243 -935 -1516 -1536 -1269 -948 -135 141
1169A41l10r99o28n21j31M63N52Q32n9k74k56l36l36l53K16M18O23R64L09n17
$$ 141 -169 -1168 -1796 -2317 -2448 -1985 -1433 -601 -660 -934 -1190 -1526 -1862 -2215 -1999 -1581 -958 6 315 -202
1189b02m74n49j60J70O45J070J19J19N2l08k63l94J09L49P23O86J2n0l78q37l49
$$ -202 -676 -1225 -1385 -1215 -570 500 619 738 790 482 219 -175 -66 283 1006 1692 1704 1654 1276 439 90
1210I0K23L37N3N76N9k12k69k24o59j31L4J81M11M20j21K7n94o11m33O9K92O79
$$ 90 313 650 703 1279 1338 1126 857 633 -26 -157 -123 58 469 889 768 795 201 -410 -843 -774 -482 197
1232A97L27M8m87m44m55m1J87J92O94K01K95j16j12k40o29m48N91O49N30N69j1
$$ 197 524 572 85 -359 -814 -855 -668 -476 218 419 714 598 486 246 -383 -831 -240 409 939 1508 1497
1253A497q30p1l47J01M5J26O70oK20p3l28r23k69p0L51M40N03P5j68q04m49o63
$$ 1497 667 596 249 350 395 521 1191 1185 1405 1332 1004 81 -188 -258 93 533 1036 1111 943 139 -310 -973
1275i73L77M25P0L4n4J04J1m74p55j25R0L84K61M24K6j88q09m30k05L87K19M04
$$ -973 -596 -171 -101 -67 -121 -17 -6 -480 -1235 -1360 -1270 -886 -625 -201 -175 -363 -1172 -1602 -1807 -1420 -1201 -797
1297g97N13M1o26J66l91q4j66K76L52O61K33J41k17q66j48K90J45O54K7L66n6
$$ -797 -284 -243 -869 -703 -1094 -1178 -1344 -1068 -716 -55 178 319 102 -764 -912 -622 -477 177 204 570 514
1318E14j96j06l85L7k0M24J17N5j12K60j47m64o84j62Q78J94J54K45l39j22l10
$$ 514 318 212 -173 -136 -156 268 385 440 328 588 441 -23 -707 -869 9 203 357 602 263 141 -169
1339a69l39n3K36M60J64j19K4m7p9n11k3k11M58M71J44K71l51n8n20j18M85M50
$$ -169 -508 -561 -325 135 299 180 204 157 78 -433 -456 -667 -209 262 406 677 326 268 -252 -370 115 565
1361E65J70J95J79k73j55l23L07j31j37M83K65K62N6p57k81R7k89L69M35j28K8
$$ 565 735 930 1109 836 681 358 665 534 397 880 1145 1407 1463 706 425 522 233 602 1037 909 937
1382I37k13M0m71l68lL64q4P4J64j81k9k19l00O2m45L98j00P47k76K1o74n64L26
$$ 937 724 764 293 -75 -78 286 202 276 440 259 230 11 -289 -227 -672 -274 -374 373 97 118 -556 -1120 -794
1405g94j42M18j08M19j93o2j39P6j57k49J17N09L06K10k9p21J36l65J11J68K85
$$ -794 -936 -518 -626 -207 -400 -462 -601 -525 -682 -931 -814 -305 1 211 182 -539 -403 -768 -657 -489 -204
1426b04J43m0K80k78p3k36R1J3j60J29N56J51k33l55k78j07k24N48M97J46l5n53
$$ -204 -61 -101 179 -99 -172 -408 -317 -304 -464 -335 221 372 139 -216 -494 -601 -825 -277 220 366 331 -222
1448b22j26k32k34n2O63j04J98j53L4Q8l12k70n4M48J5N04M08l15l66k46J0J09
$$ -222 -348 -580 -814 -866 -203 -307 -109 -262 -228 -140 -452 -722 -776 -328 -313 191 599 284 -82 -328 -318 -209
1470b09J32K12J1P6L36J25j56m09J76j52L12P4O43j88K8l04k76k60L99L47j45
$$ -209 -77 135 146 222 558 683 527 118 294 142 454 528 1171 983 1011 707 431 171 570 917 772
1491G72j0N05n66J00O7l93k83k32K41L32M10j57j81n75l94J51J29M50K04m09j4
$$ 772 762 1267 701 801 868 475 192 -40 201 533 943 786 605 30 -364 -213 -84 366 570 161 147
1512A47k5k62k38k14Q1J95M20qK08m3k02p55J66l73O79M46l02J96j24N7j41k7
$$ 147 122 -140 -378 -592 -511 -316 104 96 304 261 59 -696 -530 -903 -224 222 -80 116 -8 49 -92 -119
1534a19k01P4K99r4L51L13m81K3n65nK06J73J81K59k95j22l59LM0l45K47j86K21
$$ -119 -320 -246 53 -41 310 623 142 165 -400 -405 -199 -26 155 414 119 -3 -362 -359 -319 -664 -417 -603 -382
1557c82M56l47J06n19k37k12K51M64J16J01l16j50j4j8m7j26J25L68J52K18j8
$$ -382 74 -273 -167 -686 -923 -1135 -884 -420 -304 -203 -519 -669 -683 -701 -748 -874 -749 -381 -229 -11 -29
1578b9l49j7m82K05M64l0O03ok20k70J12J98j69M4M00j8j27N16j58k17l47R2j33
$$ -29 -378 -395 -877 -672 -208 -238 365 359 139 -131 -19 179 10 54 454 436 309 825 667 450 103 195 62
1601F2J59P96J49k86l68p4j25k99K02L67j58p0q4J53jj13l96k24J16K45O79P4
$$ 62 221 1017 1166 880 512 438 313 14 216 583 425 355 271 424 423 310 -86 -310 -194 51 730 804
1623H04j86n73n01J63L64N1K43J89k09l14J18L02k26k11J0L7L16M53J16l08q80
$$ 804 618 45 -456 -293 71 122 365 554 345 31 149 451 225 14 24 61 377 830 946 638 -242
1644b42j01Q7M85L51j14o0L8k40J35J55k14j48j89j38J63N62M46k93n31p09m9
$$ -242 -343 -256 229 580 466 406 444 204 339 494 280 132 -57 -195 -32 530 976 683 152 -557 -606
1665f06K45O79j67j03j63l13l19J26L31l35l61l0L27O71j98m08l70l32K50K70
$$ -606 -361 318 151 48 -115 -428 -747 -621 -290 -625 -986 -1016 -689 -18 -216 -624 -994 -1326 -1076 -806
1685h06P70k11k80O1m64K39k7M30l40K5n4O68M7M5k63l08j51O2M03N54J56j86
$$ -806 -36 -247 -527 -466 -930 -691 -718 -288 -628 -603 -657 11 58 103 -160 -468 -619 -557 -154 400 556 370
1707C70n51k45M37R7L24m38J02l1L20J99j95p5k90m53N7O27L72O6m68l54l00O2
$$ 370 -181 -426 11 108 432 -6 96 65 385 584 389 314 24 -429 -372 255 627 693 225 -129 -429 -367
1729c67O58m8n2Mm00K21P5P3r8r5l83J18N16L10O2k69m86R4q3N37J83k12O0l3
$$ -367 291 243 191 195 -205 16 91 164 66 -29 -412 -294 222 532 594 325 -161 -67 -150 387 570 358 418 385
1753C85k66M48o8K9l51j99L63L77L78k6k82m55l77j65P61K20J10m42j5J49k51
$$ 385 119 567 499 528 177 -22 341 718 1096 1070 788 333 -44 -209 552 772 882 440 425 574 323
1774C23J48j75j68l03L17K78ll87Pp07Q7P5L38M74K6o00l63K11jK27L5m42k51
$$ 323 471 296 128 -175 142 420 417 30 37 -670 -583 -508 -170 304 330 -270 -633 -422 -423 -196 -161 -603 -854
1797h54N86M3J15o9m07pm37L80M51L72k45k50j95K36j49J55K75m14J3J62M10k06
$$ -854 -268 -225 -110 -179 -586 -593 -1030 -650 -199 173 -72 -322 -517 -281 -430 -275 0 -414 -401 -239 171 -35
1819c5J52m05k36O4m7N61L69J79m42l23l09j23M25r9K37k87K89K15j98J91j66
$$ -35 117 -288 -524 -460 -507 54 423 602 160 -163 -472 -595 -170 -269 -32 -319 -30 185 -13 178 12
1840A2n32J77k9L68P4J67m05l13M7k44P20K10r6j92j69j8N6M16k16j57k72m5O03
$$ 12 -520 -343 -372 -4 70 237 -168 -481 -434 -678 42 252 156 -36 -205 -223 -167 249 33 -124 -396 -441 162
1863A62L98P4m04k72j97K82N58Q0O3k21R6j46l8L14l45j06j86N32j25N51j72l68
$$ 162 560 634 230 -42 -239 43 601 681 744 523 619 473 435 749 404 298 112 644 519 1070 898 530
1885E30m87l53O41J26J40k67J91n70K68K53j34j72l15k68L52L36K01n43j52P1
$$ 530 43 -310 331 457 597 330 521 -49 219 472 338 166 -149 -417 -65 271 472 -71 -223 -152
1905a52m09J03N93K1J17k41m00J52j52M92j76R1j55j75L59K28k4o56j98k34O33
$$ -152 -561 -458 135 156 273 32 -368 -216 -368 124 -52 39 -116 -291 68 296 272 -384 -582 -816 -183
1926a83M75K11k83m17j32p1q7N61m1m18M08l73J33K61nm72m06ML94L94N0J54m89
$$ -183 292 503 220 -197 -329 -400 -487 74 33 -385 23 -350 -217 44 39 -433 -839 -835 -441 -47 3 157 -332
1949c32l3m93K26N67n6l34K75j93j35J81J35K9j91j88K46K10L25k54k50k62q1
$$ -332 -365 -858 -632 -65 -121 -455 -180 -373 -508 -327 -192 -163 -354 -542 -296 -86 239 -15 -265 -527 -608
1970f08K75K36p6L27k01o7nN79l89K1l84L04K44L8J63j77j61l35o0K77L38N25
$$ -608 -333 -97 -173 154 -47 -114 -119 460 71 92 -292 12 256 294 457 280 119 -216 -276 1 339 864
1992H64j96k94l0j34J18j69q6J00P0p8L85K4l8k57k15J4P8J17P2L48m96J5M3j71
$$ 864 668 374 344 210 328 159 73 173 243 165 550 574 536 279 64 78 156 273 345 693 197 212 255 84
2016H4K19k16k13L69K24Q2m03O5j8k99j79J62O08k0J66o91r1r4L03km3K47j02
$$ 84 303 87 -126 243 467 549 146 211 193 -106 -285 -123 485 465 631 -60 -151 -245 58 56 13 260 158
2039A58J79j59j41p4k42m6p0M73J04R8M8m50m1j11j79K69J04p9k72M73J86k90
$$ 158 337 178 37 -37 -279 -325 -395 78 182 280 328 -122 -163 -274 -453 -184 -80 -159 -431 42 228 -62
2061f2j15k04n75M33L66J92J40o5n58mj57M16j54P3J81o1j5k32Q2j53K1j09L00
$$ -62 -177 -381 -956 -523 -157 35 175 110 -448 -452 -609 -193 -347 -274 -93 -154 -169 -401 -319 -472 -451 -560 -260
2084b60L3L08j93J72k57m09P1%K87K83j66P9k10K27M5m85L68j71M6K42K37k3J88
$$ -260 -227 81 -112 60 -197 -606 -535 -535 -248 35 -131 -52 -262 -35 10 -475 -107 -278 -232 10 247 224 412
2107D12o69J76m3J2M39N8n2l55J12j11j5l39N50r1J07J70M2j06J14m5l24r7K24
$$ 412 -257 -81 -124 -112 327 385 333 -22 90 -21 -36 -375 175 84 191 361 403 297 411 366 42 -55 169
2130A69Q1K26K8j4p3p0m84p0J45M12L98l66L07j29m88O9o5J25L24j16J03K8m86
$$ 169 250 476 504 490 417 347 -137 -207 -62 350 748 382 689 560 72 141 76 201 525 409 512 540 54
2153E4k65K11j26K85j12J37K50l2j81j67jMm96M54K83j56J34Q0p80K66r8k67O96
$$ 54 -211 0 -126 159 47 184 434 402 221 54 53 57 -439 15 298 142 276 356 -424 -158 -256 -523 173
2176A73m83L34J97o0j08j53k76l97L67R7o9L67J44j81k10k14j50J78o8L45m7R9
$$ 173 -310 24 221 161 53 -100 -376 -773 -406 -309 -378 -11 133 -48 -258 -472 -622 -444 -512 -167 -214 -115
2198a15J79m35k26J46J7N9j28M66q8K11o4l70r6R4l75N87K51j58L57l17l01l83
$$ -115 64 -371 -597 -451 -434 -375 -503 -37 -125 86 22 -348 -444 -350 -725 -138 113 -45 312 -5 -306 -689
2220f89J83K37l5P2N19m67L74j10l42p5j56L15P3M19j66k1j7j42p7k5Q0J73J08
$$ -689 -506 -269 -304 -232 287 -180 194 84 -258 -333 -489 -174 -101 318 152 131 114 -28 -105 -130 -50 123 231
2243B31K25r4j90J36l17J22j41K90K0J06%K39l53l08j27Q5K3NN35J50k71k08K37
$$ 231 456 362 172 308 -9 113 -28 262 282 388 388 627 274 -34 -161 -76 -53 -48 487 637 366 158 395
2266C95j93k53R8J37K27m0kJ64k11j16l47J77K22J26n4N3k6j17j25q8k8J08R8
$$ 395 202 -51 47 184 411 371 369 533 322 206 -141 36 258 384 330 383 357 240 115 27 -1 107 205
2289B05j60J35J58k49j65j82O0R8M5K69P9J65m77p7j87K6J04J41r6J01J09j33
$$ 205 45 180 338 89 -76 -258 -198 -100 -55 214 293 458 -19 -96 -283 -257 -153 -12 -108 -7 102 -31
2311c1kk68j9R1L7K68r9J07J8o34j47J33J86L27jR9q5l8Kj07k12M6R3j73Q54l6
$$ -31 -33 -301 -320 -229 -192 76 -23 84 102 -532 -679 -546 -360 -33 -34 65 -20 -58 -56 -163 -375 -329 -236 -409 445 409
2337D09m80k80k88K77j55K9J79R3M7L8kJ82j95j71j46K31J97L03N9j90p8k10m68
$$ 409 -71 -351 -639 -362 -517 -488 -309 -216 -169 -131 -133 49 -146 -317 -463 -232 -35 268 327 137 59 -151 -619
2360f19L25J31L74j45L16k67J61k96j1l1j88M86j6k45O87k03j34o87K39m2L13
$$ -619 -294 -163 211 66 382 115 276 -20 -31 -62 -250 236 220 -25 662 459 325 -362 -123 -165 148
2381A48K98j36k66J92j0j05n8J0l82L42L98k10L96p7o51J06k29K70J60L24J08
$$ 148 446 310 44 236 226 121 63 73 -309 33 431 221 617 540 -111 -5 -234 36 196 520 628
2402F28k88l53J30N9r9O7l44P7J50O38k04k18q2n26j28K93P09l0m70L3Q4O4k48
$$ 628 340 -13 117 176 77 144 -200 -123 27 665 461 243 161 -365 -493 -200 509 479 9 42 126 190 -58
2425e8p4L5j55N04k02K62n0k06k00j62NJ42J09K37j17K6m22K7r6L76n19J84K27
$$ -58 -132 -97 -252 252 50 312 262 56 -144 -306 -301 -159 -50 187 70 96 -326 -299 -395 -19 -538 -354 -127
2448a27K13l52L37k5l67l90K66L81l66P23m72o9j46m40N41L07k08n8J65k1K05
$$ -127 86 -266 71 46 -321 -711 -445 -64 -430 293 -179 -248 -394 -834 -293 14 -194 -252 -87 -108 97
2469I7p9m57J27j6o9L9N80k88j05p6k63J74K60j43K89J25r7K3o06K97K79J1o97
$$ 97 18 -439 -312 -328 -397 -358 222 -66 -171 -247 -510 -336 -76 -219 70 195 98 121 -485 -188 91 102 -595
2492e95N23J15K60N4j47k80P7j70J89j02K65J66k21m6J43l4J99l38k10M71J6J46
$$ -595 -72 43 303 357 210 -70 7 -163 26 -76 189 355 134 88 231 197 396 58 -152 319 335 481
2514D81J10l45l48l36L47K44K28k03P8N7j97QJ8J51j52j60J73K2L62K44n20m49
$$ 481 591 246 -102 -438 -91 153 381 178 256 313 116 124 142 293 141 -19 154 176 538 782 262 -187
2536a87j01l7K28M66J59J5m75k2q3M9K9Q3o4J66k3l22O59l54m91j22K11K76K26
$$ -187 -288 -325 -97 369 528 543 68 46 -37 12 41 124 60 226 203 -119 540 186 -305 -427 -216 60 286
2559B86N6r4k97j52J93q4J47l16N9K22p6OJ04k38j29o4J46K8L15K00l22l58mn7
$$ 286 342 248 -49 -201 -8 -92 55 -261 -202 20 -56 -50 54 -184 -313 -377 -231 -203 112 312 -10 -368 -372 -429
2583d29K1P7L86k40K99j30j27N5lo53N4K75L18J90J2j97l68M4JP2J65l2R1j4j09
$$ -429 -408 -331 55 -185 114 -16 -143 -88 -91 -744 -690 -415 -97 93 105 -92 -460 -416 -415 -343 -178 -210 -119 -133 -242
2608b42K00n2J41J7m78J41P20m15K86k12k33j40j28M80o4K53j32r2J21j74K48
$$ -242 -42 -94 47 64 -414 -273 447 32 318 106 -127 -267 -395 85 21 274 142 50 171 -3 245
2629B45j44QKM1J42M8K5j39m41K22l50P8M42lL11n38r5L76j05j25O1j11K19o9
$$ 245 101 109 111 152 294 342 367 228 -213 9 -341 -263 179 176 487 -51 -146 230 125 0 61 -50 169 100
2653A00j22M30o2k81j64K80L6J29m3j00k95NnM17j89K18k57K14j7m4M23p02j52
$$ 100 -22 408 346 65 -99 181 217 346 303 203 -92 -87 -92 325 136 354 97 311 294 250 673 -29 -181
2676a81p4n5K78L69j88j32r8r7K64L8n3K3M6m62J98K08r3r6k14O4J57P1j45K45
$$ -181 -255 -310 -32 337 149 17 -81 -178 86 124 71 94 140 -322 -124 84 -9 -105 -319 -255 -98 -27 -172 73
2700G3l68K48k60K1J93M15m87l6k52J38K35J06j98l71N02j41K71j70O6k29k73
$$ 73 -295 -47 -307 -286 -93 322 -165 -201 -453 -315 -80 26 -172 -543 -41 -182 89 -81 -15 -244 -517
2721e17p2M15K14k18L30kj41q4p0n1M1p6k09K34j5L14K98m32l86L15r0O7J55R
$$ -517 -589 -174 40 -178 152 150 9 -75 -145 -196 -155 -231 -440 -206 -221 93 391 -41 -427 -112 -202 -135 20 29
2745B9j7OJ64k58l7L43n52K07k41J92O21k74R4j88j97K80j03K48n6J36l34p1K6
$$ 29 12 18 182 -76 -113 230 -322 -115 -356 -164 457 183 277 89 -108 172 69 317 261 397 63 -8 18
2768A8J65K51m75J66j6K2J4J64j74j46o0K42J84k43J83j04l7k76N45m8j25j02
$$ 18 183 434 -41 125 109 131 145 309 135 -11 -71 171 355 112 295 191 154 -122 423 375 250 148
2790A48j8l4K51p6P5n41J07K1J23K81k53J45j39j41p7Q1K85j66j14O5R0J8L48
$$ 148 130 96 347 271 346 -195 -88 -67 56 337 84 229 90 -51 -128 -47 238 72 -42 23 113 131 479
2813D79n75j00j31J10O4M96l52K66k82R6l57k32N10j83L51j46k40K17l0k56J40
$$ 479 -96 -196 -327 -217 -153 343 -9 257 -25 71 -286 -518 -8 -191 160 14 -226 -9 -39 -295 -155
2834a55n66M55K80jk12J28j24q8l30K87j49N11k91K0J29N5k62J77j65k02L30j
$$ -155 -721 -266 14 13 -199 -71 -195 -283 -613 -326 -475 36 -255 -235 -106 -51 -313 -136 -301 -503 -173 -174
2856a74J97k17J63l7k86n6J19P1J72K19j69M9j74J39k8k92n5N38o4L44j32q6k03
$$ -174 23 -194 -31 -68 -354 -410 -291 -220 -48 171 2 51 -123 16 -12 -304 -359 179 115 459 327 241 38
2879C8k92O1K93J27j6j32N3j69K5r8L9J8O1J17K51o1N1k12k77j59L07K2L29J14
$$ 38 -254 -193 100 227 211 79 132 -37 -12 -110 -71 -53 8 125 376 315 366 154 -123 -282 25 47 376 490
2903D90k01Jk87l10N74q8k8m07K21K77Q6r4l7k28n7L17k86J35M59j1k54m08K86
$$ 490 289 290 3 -307 267 179 151 -256 -35 242 328 234 197 -31 -88 229 -57 78 537 526 272 -136 150
2926A50j27K68J25j94k16L12l09J48q6K4k16J34mK1l8N1j09J77k82j25J86J54
$$ 150 23 291 416 222 6 318 9 157 71 95 -121 13 9 30 -8 43 -66 111 -171 -296 -110 44
2948D4rk66L13j22M8l75Q8L82n8j6O8O0j73o6k45J53k35K11j25K95o6n8j95L70
$$ 44 35 -231 82 -40 8 -367 -279 103 45 29 97 157 -16 -82 -327 -174 -409 -198 -323 -28 -94 -152 -347 23
2972B3J08n36J94J02p6L89j11k34o7k35J60l4K22N28m93rK66l50m3j09j31K40
$$ 23 131 -405 -211 -109 -185 204 93 -141 -208 -443 -283 -317 -95 433 -60 -69 197 -153 -196 -305 -436 -196
2994a96M13k68K67k62l4J88m22J76l9L92Q8k51N7j70K29l74o0N89l59L58r0j42
$$ -196 217 -51 216 -46 -80 108 -314 -138 -177 215 303 52 109 -61 168 -206 -266 323 -36 322 232 90
3016I0m0j21Rk7K17j6J31J84k59J14n9j44j06J29l6j1K28K94m56k92J26J80r8
$$ 90 50 -71 -62 -89 128 112 243 427 168 282 223 79 -27 102 66 55 283 577 121 -171 -45 135 37
3039C7K15q0J89k12Qr5k35N31m97J47r8K45K03j42k5j52j7q4J6n4l6L66j27j42
$$ 37 252 172 361 149 157 62 -173 358 -139 8 -90 155 358 216 191 39 22 -62 -46 -100 -136 230 103 -39
3063c9N9k60L09q4k35J87J01J12J50j22k39L14l85K2J07J26M1K03k03m42K78j04
$$ -39 20 -240 69 -15 -250 -63 38 150 300 178 -61 253 -132 -110 -3 123 164 367 164 -278 0 -104
3085a04j23K49k05J27M6o5K36k76l47P1K69L02j31P4k68ln4p1m6k8N2j04O05r6
$$ -104 -227 22 -183 -56 -10 -75 161 -115 -462 -391 -122 180 49 123 -145 -148 -202 -273 -319 -347 -295 -399 206 110
3109A10j55Q3k15j30j4K29K90l92J51J2kJj0m26J27M34r8R6p2R3o9j60j26O06
$$ 110 -45 38 -177 -307 -321 -92 198 -194 -43 -31 -33 -32 -42 -468 -341 93 -5 91 19 112 43 -117 -243 363
3133C63j78J5N7l78L1J11j73L4ON4J18n5M64l67M9p8l0j44K87K00K8k00l6k5j36
$$ 363 185 200 257 -121 -90 21 -152 -118 -112 -58 60 5 469 102 151 73 43 -101 186 386 414 214 178 153 17
3158A7m3j23J66R1j9J22JKK86m82L2j74L16k16L42J44n71K61n9K6K9j69M9K4K65
$$ 17 -26 -149 17 108 89 211 212 214 500 18 50 -124 192 -24 318 462 -109 152 93 119 148 -21 28 52 317
3183C17j33j38J41k30RJ80N2Ln5l09J20n3Q2j34K29j02K19j65Q1q9L02l42j33
$$ 317 184 46 187 -43 -34 146 198 201 146 -163 -43 -96 -14 -148 81 -21 198 33 114 25 327 -15 -148
3206a48j1J39k81K83L23l76q6k9j00N0J13J57p8m9p8J55k66RJ23o3oK6L07k96
$$ -148 -159 -20 -301 -18 305 -71 -157 -186 -286 -236 -123 34 -44 -93 -171 -16 -282 -273 -150 -213 -219 -193 114 -182
3230a82J71N3l21k77O12k06L01o9j43j78M86l53L7J62j63K72n6J00q4k48j48K97
$$ -182 -11 42 -279 -556 56 -150 151 82 -61 -239 247 -106 -69 93 -70 202 146 246 162 -86 -234 63
3252F3j46r2J68J16j74jJ11j1k2j75J17m8j25J64J6J56J87j71j85l54O41J88n66
$$ 63 -83 -175 -7 109 -65 -66 45 34 12 -163 -46 -94 -219 -55 -39 117 304 133 -52 -406 235 423 -143
3275a43K51J13l63J34j16jJ73J17j47M33n87M69k46k6J27k55N35l51K42j07m7
$$ -143 108 221 -142 -8 -124 -125 48 165 18 451 -136 333 87 61 188 -67 468 117 359 252 205
3296B05j35J82j5j75J33M9j75J18R6j17M7l32L0M3J16Q4R8k3q9K4l47K02l1j04
$$ 205 70 252 237 62 195 244 69 187 283 166 213 -119 -89 -46 70 154 252 229 140 164 -183 19 -12 -116
3320a16J00j22J96j84K53l30j15M01n0kO2r9qk03J04o6K48r1j47Q8O1j24O2J54
$$ -116 -16 -138 58 -126 127 -203 -318 83 33 31 93 -6 -14 -217 -113 -179 69 -22 -169 -81 -20 -144 -82 72
3344G2j9n5j11j9J65K30k25l37J98l32M35R5j4n4K4j34j21J39R0l21q9QK81K8
$$ 72 53 -2 -113 -132 33 263 38 -299 -101 -433 2 97 83 29 53 -81 -202 -63 27 -294 -383 -375 -94 -66
3368f6k18K70q0L3l49L53L5k28j45J34K14m19M27k72M15l88J28n3M44j18n17K60
$$ -66 -284 -14 -94 -61 -410 -57 -22 -250 -395 -261 -47 -466 -39 -311 104 -284 -156 -209 235 117 -400 -140
3390a40N7j76J83P7k86N06r7q3o0K72k79l4J88j20J92pK48l82j31L6j96K75M03
$$ -140 -83 -259 -76 1 -285 221 124 41 -19 253 -26 -60 128 8 200 193 441 59 -72 -36 -232 43 446
3413D46j85m4k13k02K78k18L94l6r5j15K77o7m65N08j3k96J82j9J09k54K47j07
$$ 446 261 217 4 -198 80 -138 256 220 125 10 287 220 -245 263 250 -46 136 117 226 -28 219 112
3435A12L16m61N8K38k6j98K41k85K79m22L05k55P4J22J29k8k37M18R7o76l4K82
$$ 112 428 -33 25 263 237 39 280 -5 274 -148 157 -98 -24 98 227 199 -38 380 477 -199 -233 49
3457D9O8k13J80l2L01m20J46P4q2k08K58j66k5O17o56J67m34K79r5Q2j7R8j33
$$ 49 117 -96 84 52 353 -67 79 153 71 -137 121 -45 -70 547 -109 58 -376 -97 -192 -110 -127 -29 -162
3480a62P1Rj32K41Jk61J6k81L51J99J96m36J16l83N6K91K63j28j18j27n8R1K1
$$ -162 -91 -82 -214 27 28 -233 -217 -498 -147 52 248 -188 -72 -455 -399 -108 155 27 -91 -218 -276 -185 -164
3503a64J59k85J63K11k61L51l66J80k33K82m0j00Q3j56L91j57J58k05K91j48l36
$$ -164 -5 -290 -127 84 -177 174 -192 -12 -245 37 -3 -103 -20 -176 215 58 216 11 302 154 -182
3524a82K24k7J50k87L51k12J49k44k6K73l9n6K09k35P5j02k01K28N7j9r6K17N6
$$ -182 42 15 165 -122 229 17 166 -78 -104 169 130 74 283 48 123 21 -180 48 105 86 -10 207 263
3547B63o1l38J15k09K42L00m15R6l19M19k08M23n02K06R8J64k98M2n5j1J26k54
$$ 263 202 -136 -21 -230 12 312 -103 -7 -326 93 -115 308 -194 12 110 274 -24 18 -37 -48 78 -176
3569a76K21Q1L65l83J64l35J76kj29J31k1q1j3QK4p1r1j72K53j27O4L03j22l7
$$ -176 45 126 491 108 272 -63 113 111 -18 113 92 11 -2 6 30 -41 -132 -304 -51 -178 -114 189 67 30
3593C0j92N4k24K75O1Q8l24J18J93l03J09K19l08K41j37J47p0Q6k07j03L54j84
$$ 30 -162 -108 -332 -57 4 92 -232 -114 79 -224 -115 104 -204 37 -100 47 -23 63 -144 -247 107 -77
3615g7k78K70j10K10m1M8n9n0q0K1J42J1Nj19K76J1k78q2k4OJ74J6L23l88J29
$$ -77 -355 -85 -195 15 -26 22 -37 -87 -167 -146 -4 7 12 -107 169 180 -98 -180 -204 -198 -24 -8 315 -73 56
3640E6j73R5k91K62J4R2K5k09M02m35K54l63K44J43R8j07k83K99J07m02K11k32
$$ 56 -117 -22 -313 -51 -37 55 80 -129 273 -162 92 -271 -27 116 214 107 -176 123 230 -172 39 -193
3662a93K33n2j95M63oj52j09J90m4q4%J72j63J83j26J59k57M5R3j21L22m3K0n2
$$ -193 40 -12 -207 256 250 98 -11 179 135 51 51 223 60 243 117 276 19 64 157 36 358 315 335 283
3686B83j11l61m0K49l0n4K82k33R4l89M33J7J37k24j15n3K93k08m4o4l1j43N0
$$ 283 172 -189 -229 20 -10 -64 218 -15 79 -310 123 140 277 53 -62 -115 178 -30 -74 -138 -169 -312 -262
3709b62RK88j9K5K5l09K76j61p6K38Q9J00mO6lm91J77L2l18R7K10p8J82J3r3k79
$$ -262 -253 35 16 41 66 -243 33 -128 -204 34 123 223 219 285 282 -209 -32 0 -318 -221 -11 -89 93 106 13 -266
3735b66K80J7k09o8K05nr2j48J03P6K10o09L18n9J65l7k19mJ74m4J29O4J8J5k04
$$ -266 14 31 -178 -246 -41 -46 -138 -286 -183 -107 103 -506 -188 -247 -82 -119 -338 -342 -168 -212 -83 -19 -1 14 -190
3760a90m3N6j52K53k34K48j1O8r3J26j37P9l75N56k70J87R8J7j07K2k12O9k73
$$ -190 -233 -177 -329 -76 -310 -62 -73 -5 -98 28 -109 -30 -405 151 -119 68 166 183 76 98 -114 -45 -318
3783c18N25j51Q8O9q9m5L2o3J71J20k52L81l06j84Q0k12N94m06p8K41kl28j13
$$ -318 207 56 144 213 124 79 111 48 219 339 87 468 162 -22 58 -154 440 34 -44 197 195 -133 -246
3806b46L14l09J24j69L61J3%j07J68j90M9q9Q2J87l97K46K33L1k61J60j13N4j53
$$ -246 68 -241 -117 -286 75 88 88 -19 149 -41 8 -81 1 188 -209 37 270 301 40 200 87 141 -12
3829a2K22j95n0rl6R9l1J03r2j68L22j89K9j25L03m2O3m47J48J11r9J06JjJ81
$$ -12 210 15 -35 -44 -80 19 -12 91 -1 -169 153 -36 -7 -132 171 129 192 -255 -107 4 -95 11 12 11 192
3854A92j59L9k90L33m27K24o6L50r5l77K42N3L1n99L66K20j43J25l11K53k50P8
$$ 192 33 72 -218 115 -312 -88 -154 196 101 -276 -34 19 50 -549 -183 37 -106 19 -292 -39 -289 -211
3876b11O7l34L27J57J3r7J93k55K19j56J37j7k2R2j36j64j97L86j04m0L92j64
$$ -211 -144 -478 -151 6 19 -78 115 -140 79 -77 60 43 21 113 -23 -187 -384 2 -102 -142 250 86
3898H6p9j80k14N40k51J33k76K87J06j23J89k01j15j56J95l9P8j07K57j20J94
$$ 86 7 -173 -387 153 -98 35 -241 46 152 29 218 17 -98 -254 -59 -98 -20 -127 130 10 204
3919B04k51j43K7J78nr6L89l79M23l35Q2J13M2k61l1L75j03j17l26M3N59l48j15
$$ 204 -47 -190 -163 15 10 -86 303 -76 347 12 94 207 249 -12 -43 332 229 112 -214 -171 388 40 -75
3942g5J03K33o2k23J29k48L9N6J32M4q2K85k02k78K07j48K3J79K3R9k65K00j88
$$ -75 28 261 199 -24 105 -143 -104 -48 84 128 46 331 129 -149 58 -90 -67 112 135 234 -31 169 -19
3965a9l51L62r6m1k88P04k43P5q9J32k04r5K91l62j33J58J70k7j1J12k45j2J2
$$ -19 -370 -8 -104 -145 -433 271 28 103 14 146 -58 -153 138 -224 -357 -199 -29 -56 -67 45 -200 -212 -200
3988b00R6L09k59j80j9o4J88n7J3n1L19r2Q8j05N5j43M01j21j62M5k33K47j31
$$ -200 -104 205 -54 -234 -253 -317 -129 -186 -173 -224 95 3 91 -14 41 -102 299 178 16 61 -172 75 -56
4011e6M9j52K93k57o7K66j89oL60k97L4M2k28P7k9J69j27p1L37j86j27J82m73
$$ -56 -7 -159 134 -123 -190 76 -113 -119 241 -56 -22 20 -208 -131 -160 9 -118 -189 148 -38 -165 17 -456
4034d56K57O9J79N4k05J2R2k5P3j93n6M02Qj38j93L36l24J7K29J14k40L89Mr3
$$ -456 -199 -130 49 103 -102 -90 2 -23 50 -143 -199 203 211 73 -120 216 -108 -91 138 252 12 401 405 312
4058C12j55J13j69J5m1j46J71JQ9N4j65L24k80m7K41j67J91On56L41j35R4P9j80
$$ 312 157 270 101 116 75 -71 100 101 190 244 79 403 123 76 317 150 341 347 -209 132 -3 91 170 -10
4082a0N1j8K08J0n02N05l63J60j07r8J63m4j61K71J05k61K8K6k41J98L62k40j60
$$ -10 41 23 231 241 -261 244 -119 41 -66 -164 -1 -45 -206 65 170 -91 -63 -37 -278 -80 282 42 -118
4105a18K11l24K58j30n5P9j39L21K29p19N03n4n15K44L00R8q7o0j61J1K61j42
$$ -118 93 -231 27 -103 -158 -79 -218 103 332 -387 116 62 -453 -209 91 189 102 42 -119 -108 153 11
4127A1k43N19m09J73k90M62j65k11Nj00n0K31O8o4r4j60O2J21K25j67j59J17J97
$$ 11 -232 287 -122 51 -239 223 58 -153 -148 -248 -298 -67 1 -63 -157 -317 -255 -134 91 -76 -235 -118 79
4150G9j35o0k2P4n8j72J60K83m35J77j60J19qJ29M0M1j02P7j51M99p7j18J7l12
$$ 79 -56 -116 -138 -64 -122 -294 -134 149 -286 -109 -269 -150 -158 -29 11 52 -50 27 -124 375 298 180 197 -115
4174a15l17L22P5j19J93N4M3l40M27l58K58P2j06O2M3l37L96j14M1j17J60j04
$$ -115 -432 -110 -35 -154 39 93 136 -204 223 -135 123 195 89 151 194 -143 253 139 180 63 223 119
4196A19Q8k06k62L22l88L43M3K27l24K63J57o11J71J66k27N9J19k33J53j4j76
$$ 119 207 1 -261 61 -327 16 59 286 -38 225 382 -229 -58 108 -119 -60 59 -174 -21 -35 -211
4217b11k06N26j14J16rQ0k77j06K45j86J9L57j08j18K35j19k69J00%k7J97l30
$$ -211 -417 109 -5 111 102 182 -95 -201 44 -142 -123 234 126 8 243 124 -145 -45 -45 -72 125 -205
4239b05K09k9lL9j43K76r6J47l53p2J73q4K4P2k38N2K18n1j05L7M3M0q1K14q3
$$ -205 4 -25 -28 11 -132 144 48 195 -158 -230 -57 -141 -117 -45 -283 -231 -13 -64 -169 -132 -89 -49 -130 84 1
4264Aj88J90q5K47l94M30l20J41k61j30L69j18N2j05L61m08L13r1M9P4lk69K45
$$ 1 -187 3 -82 165 -229 201 -119 22 -239 -369 0 -118 -66 -171 190 -218 95 4 53 127 124 -145 100
4287A00K09r1j04K03j96l48O64l95k60N45n5k04O3j4k39n2J06q3K28J71k15o0
$$ 100 309 218 114 317 121 -227 437 42 -218 327 272 68 131 117 -122 -174 -68 -151 77 248 33 -27
4309b7kQ8Q7k8k20J91N9l04J33j30J03j56l1L28j18Q2n9j13n2j7P2J66ro0M08
$$ -27 -29 59 146 118 -102 89 148 -156 -23 -153 -50 -206 -237 91 -27 55 -4 -117 -169 -186 -114 52 43 -17 391
4334C91k62q9K53j87k08L59l2o9j7j17K63l68L8L40j22j51J50k44J02K7L1J39
$$ 391 129 40 293 106 -102 257 225 156 139 22 285 -83 -45 295 173 22 172 -72 30 57 88 227
4356B27m96K93J56k50K32j33P6J03l26R6K4J14j76O3j35j4Mj81j9K20p4J60r3
$$ 227 -269 24 180 -70 162 29 105 208 -118 -22 2 116 -60 3 -132 -146 -142 -323 -342 -122 -196 -36 -129
4379a29J51k00lJ59k1j21M0J65k07L44l53M17L7m98r5N55n3l79J74j04O1J33l1
$$ -129 22 -178 -181 -22 -43 -164 -124 41 -166 178 -175 242 279 -219 -314 241 188 -191 -17 -121 -60 73 42
4402D2k18J69q5O9p5K87l90O2L33R2l8k10P2M0l34M8J14J85j66J5Nk3J22j41n4
$$ 42 -176 -7 -92 -23 -98 189 -201 -139 194 286 248 38 110 150 -184 -136 -22 163 -3 12 17 -6 116 -25 -79
4427g9j65N12k96lk53L47j58K16j18P7r1J25J17l31k29K04J53l5J4K11l53J25
$$ -79 -244 268 -28 -31 -284 63 -95 121 3 80 -11 114 231 -100 -329 -125 28 -7 7 218 -135 -10
4449a0nj06m2K78M1k44P3K18n5J3k06m7L39k30m1o1J57L8p7J78k23J8K9N4Q4Q7
$$ -10 -15 -121 -163 115 156 -88 -15 203 148 161 -45 -92 247 17 -24 -85 72 110 33 211 -12 6 35 89 173 260
4475B60l23O3j7K19j25o1J8K35j16j27Q8k84J74q4J53j8K4j6j82L26j44l27J31
$$ 260 -63 0 -17 202 77 16 34 269 153 26 114 -170 4 -80 73 55 79 63 -119 207 63 -264 -133
4498a33K82j56R2o8L5j11n3K1p1L24l09M06m07j86L56R3Q7p07J41M81n60L59O9
$$ -133 149 -7 85 17 52 -59 -112 -91 -162 162 -147 259 -148 -334 22 115 202 -505 -364 117 -443 -84 -15
4521a5l46K39n2J55K10j38l61L94K01l02j59K42j16P7k88L68l14J92N8q5q2J56
$$ -15 -361 -122 -174 -19 191 53 -308 86 287 -15 -174 68 -48 29 -259 109 -205 -13 45 -40 -122 34
4543C4p9J03L5m2J03K1J17l14j28J13J70k52K96k77j0m1lJ82J90l70j68L32q9
$$ 34 -45 58 93 51 154 175 292 -22 -150 -37 133 -119 177 -100 -110 -151 -154 28 218 -152 -320 12 -77
4566g7K94l91n8J35K59o6j20J97k5Q0J08m44R0L53k45J15r8J98k53M0O6j55J93
$$ -77 217 -174 -232 -97 162 96 -24 173 148 228 336 -108 -18 335 90 205 107 305 52 92 158 3 196
4589A96k63K15k67M86l25K3j13J96q2j79J29m4rl3L8j5N93l78j90J14k14N1L46
$$ 196 -67 148 -119 367 42 65 -48 148 66 -113 16 -28 -37 -70 -32 -47 546 168 -22 92 -122 -71 275
4612B75k25M8l41J78J92k2k0l08L1K09R7rj32l9L86l41J9n1k67L14J03k10j20
$$ 275 50 98 -243 -65 127 105 85 -223 -192 17 114 105 -27 -66 320 -21 -2 -53 -320 -6 97 -113 -233
4635b33K03k9J3j43L16l27J40R6k6j89L66k85J71j20j79K86q5k59J81Q8k13J28
$$ -233 -30 -59 -46 -189 127 -200 -60 36 10 -179 187 -98 73 -47 -226 60 -25 -284 -103 -15 -228 -100
4657a00j01L11l7j09k45K32J35k21N9k49L10k3J35k31j36O41l05J1jN8J84l98
$$ -100 -201 110 73 -36 -281 -49 86 -135 -76 -325 -15 -38 97 -134 -270 371 66 77 76 134 318 -80
4679h0j26K10k04L61o5j35o7P2O1j49Q7J02L41k81j55q0MJ03n4R8J6Q9J46r4j81
$$ -80 -206 4 -200 161 96 -39 -106 -34 27 -122 -35 67 408 127 -28 -108 -104 -1 -55 43 59 148 294 200 19
4704A9O0L58m02Pj46J08J9M9M1j82L6j22J95n6K88l71n5O9L15k24q2K3L61j86
$$ 19 79 437 35 42 -104 4 23 72 113 -69 -33 -155 40 -16 272 -99 -154 -85 230 6 -76 -53 308 122
4728A22o1K71n92n4K33J00p0J25k0k34J77J91j51K48l58J14j44l3J16J97l36L18
$$ 122 61 332 -260 -314 -81 19 -51 74 54 -180 -3 188 37 285 -73 41 -103 -136 -20 177 -159 159
4750A59l16J6R3L77n00JP1M87l25q8N3k79J58J74k3j09r2J18oL20l13J3j52R0
$$ 159 -157 -141 -48 329 -171 -170 -99 388 63 -25 28 -251 -93 81 58 -51 -143 -25 -31 289 -24 -11 -163 -73
4774g3P5n8O0n6P9o5M4R1k02K91k43J30k74J58L94l05j45M02m39L9L27j91J14
$$ -73 2 -56 4 -52 27 -38 6 97 -105 186 -57 73 -201 -43 351 46 -99 303 -136 -97 230 39 153
4797A53Nj52R1j60j1j03J30O20n40J85j03j53l87J76O6L33k52M6k28J72J0J77
$$ 153 158 6 97 -63 -74 -177 -47 573 33 218 115 -38 -425 -249 -183 150 -102 -56 -284 -112 -102 75
4819G5J72k20k02ON44k16l34M0N1K41j62M8j32J29J83J8k63J58k10j6n0M4J2L21
$$ 75 247 27 -175 -169 375 159 -175 -135 -84 157 -5 43 -89 40 223 241 -22 136 -74 -90 -140 -96 -84 237
4843B37l83J9J75k64L67j29J95j45Ok01n1K4K05j67M6J18J16m6M0R3j04j78J33
$$ 237 -146 -127 48 -216 151 22 217 72 78 -123 -174 -150 55 -112 -66 52 168 122 162 255 151 -27 106
4866A06l05K96p1o0L7o2jP5l3j2l61L52P4j21K1K38k74LJ57r4OL6r3L4r6J56L09
$$ 106 -199 97 26 -34 3 -59 -60 15 -18 -30 -391 -39 35 -86 -65 173 -101 -98 59 -35 -29 7 -86 -52 -148 8 317
4893C17l87O0j87K22j29O8PL24q3m9J43m44J24K15l38J24j84K53k91J35J23M4
$$ 317 -70 -10 -197 25 -104 -36 -29 295 212 163 306 -138 -14 201 -137 -13 -197 56 -235 -100 23 67
4915F7k9q8M0K27k48J98j43J5M0k47J48K86j49k26l17L63j16J51K05n3k93r3K06
$$ 67 38 -50 -10 217 -31 167 24 39 79 -168 -20 266 117 -109 -426 -63 -179 -28 177 124 -169 -262 -56
4938e6O3j77J94O4k0J63n02K75p6l2J68M5J7M5r9N7K08n32L94l50j3K49l0j51
$$ -56 7 -170 24 88 68 231 -271 4 -72 -104 64 109 126 171 72 129 337 -195 199 -151 -164 85 55 -96
4962i6J49j04L43j52p5k04m8L58j86R2m5k4j48m5L01k21j90K95O0J5k89J59r2
$$ -96 53 -51 292 140 65 -139 -187 171 -15 77 32 8 -140 -185 116 -105 -295 0 60 75 -214 -55 -147
4985a47m5M3L21l69K84O8l52J74K1k59L26j1L8k75N4j49M70n7j15j65j0K15j26
$$ -147 -192 -149 172 -197 87 155 -197 -23 -2 -261 65 54 92 -183 -129 -278 192 135 20 -145 -155 60 -66
5008f6K40j74J21J01nj36j35m39K64K67j80OKK5q0K09k93J76j36N1N7J09L4Q5
$$ -66 174 0 121 222 217 81 -54 -493 -229 38 -142 -136 -134 -109 -189 20 -273 -97 -233 -182 -125 -16 18 103
5032A03J5o8Pl21R2K49k29J78m17J72L36l24M9J45k5O8K3l10L53p7Q3rJ02n10
$$ 103 118 50 57 -264 -172 77 -152 26 -391 -219 117 -207 -158 -13 -38 30 53 -257 96 19 102 93 195 -315
5056c15Q6J59Q4J91k31j06L83l61M9K16R5j77L1M6j37J69P5r8q6J5n1J10j18L9
$$ -315 -229 -70 14 205 -26 -132 251 -110 -61 155 250 73 104 150 13 182 257 159 73 88 37 147 29 68
5080F8O7l7J00q9j30J59j22K84l02j14K80o5n7N3P0l35K34j47K40Ll44M95l54
$$ 68 135 98 198 109 -21 138 16 300 -2 -116 164 99 42 95 165 -170 64 -83 157 160 -184 311 -43
5103d3J54k57L9n0J37J8j18j25M6L08o9m6K67j27m90N12n4j77k54N98j53J7J40
$$ -43 111 -146 -107 -157 -20 -2 -120 -245 -199 109 40 -6 261 134 -356 156 102 -75 -329 269 116 133 273
5126B73M0m16K55M6k6l18J07j4j17J18J15p2j24O7j50k5K69N0j59k27L34lO8J67
$$ 273 313 -103 152 198 172 -146 -39 -53 -170 -52 63 -9 -133 -66 -216 -241 28 78 -81 -308 26 23 91 258
5150B58k80m4O0J55j50m9j25K03Jj38J48j77J97L3j71O4o6R1M6n6j62K15L6k24
$$ 258 -22 -66 -6 149 -1 -50 -175 28 29 -109 39 -138 59 92 -79 -15 -81 10 56 0 -162 53 89 -135
5174a35J76n2k75K46k20K23q7J58o6j9K5Rq6N1j9N0K00k56L0J35k01j3N7K95j47
$$ -135 41 -11 -286 -40 -260 -37 -124 34 -32 -51 -26 -17 -103 -52 -71 -21 179 -77 -47 88 -113 -126 -69 226 79
5199G9J61k06lP2k06K46Rm11K02j74L46k38J99j64K24l21P9J17j25J26j8j54K4
$$ 79 240 34 31 103 -103 143 152 -259 -57 -231 115 -123 76 -88 136 -185 -106 11 -114 12 -6 -160 -136
5222a36K27p4J01j41J60k17N1J33L0J49k46M5K4J63l78j8q5L58j4J30l49j3K96
$$ -136 91 17 118 -23 137 -80 -29 104 134 283 37 82 106 269 -109 -127 -212 146 132 262 -87 -100 196
5245A96m21M84l37K24k43r3j37K53r6K95k21j56J94N0K03j74j69K09l14N12j72
$$ 196 -225 259 -78 146 -97 -190 -327 -74 -170 125 -96 -252 -58 -8 195 21 -148 61 -253 259 87
5266H7K08k64j16On2M83m44L2j69Q0K47j21j31K43k54L17J9j90k9KJ88p4k85L57
$$ 87 295 31 -85 -79 -131 352 -92 -60 -229 -149 98 -23 -154 89 -165 152 171 -19 -48 -46 142 68 -217 140
5290A40q5j58k25L75q6K8j73pJ70l0J5j47l0o3M4J40L44l13o0J73j30J18k44K05
$$ 140 55 -103 -328 47 -39 -11 -184 -191 -21 -51 -36 -183 -213 -276 -232 -92 252 -61 -121 52 -78 40 -204 1
5314AK5J87m66K14q6j80K32J96o17L95K06k73K62J05k05J72l53O6L63l69J69j78
$$ 1 26 213 -253 -39 -125 -305 -73 123 -494 -99 107 -166 96 201 -4 168 -185 -119 244 -125 44 -134
5336a34L03k35P3p1L20l64J02k01M99m80K47K4m6K7kJ45l07k53M01K16k18k98
$$ -134 169 -66 7 -64 256 -108 -6 -207 292 -188 59 83 37 64 62 207 -100 -353 48 264 46 -252
5358b52J86P6N2p0Q1J10j56L2k4J31k81QJ07J20p3l72M42k8J12k73J65k54N10
$$ -252 -66 10 62 -8 73 183 27 59 35 166 -115 -107 0 120 47 -325 117 89 201 -72 93 -161 349
5381C49l11l99L27N3L15n40J34j8j10J59j53M7O8q2K78j94J17k14J95J73P1q4
$$ 349 38 -361 -34 19 334 -206 -72 -90 -200 -41 -194 -147 -79 -161 117 -77 40 -174 21 194 265 181
5403A81l31J29j04L46l72J30K71l05K18j77Q6n9M5k2j33j0P8J17k34K86pj58J02
$$ 181 -150 -21 -125 221 -151 -21 250 -55 163 -14 72 13 58 36 -97 -107 -29 88 -146 140 133 -25 77
5426G7N7k18J35P4K3K7m46K28K6L45l74L39m58K66o1K8P9j99J61L8O8j15l91M22
$$ 77 134 -84 51 125 148 175 -271 -43 -17 328 -46 293 -165 101 40 68 147 -52 109 147 215 100 -291 131
5450A31j20O2J60q9j8L7J20k21k5k3MK65l77O2L65n39K13l9R2Q4j6J58l94K29
$$ 131 11 73 233 144 126 163 283 62 37 14 18 283 -94 -32 333 -206 7 -32 60 144 128 286 -108 121
5474A21q2J14Jl81M2K8J09O1O0L45m50rJ21Q7nj54J13r2k9M8jk45M3R7J97k11
$$ 121 39 153 154 -227 -185 -157 -48 13 73 418 -32 -41 80 167 162 8 121 29 0 48 47 -198 -155 -58 139 -72
5500g2k46M65k85M0Q5k3J25J7O2K0n24M68q1j68m6K35p9p8j38Q8J71l66M33q5
$$ -72 -318 147 -138 -98 -13 -36 89 106 168 188 -336 132 51 -117 -163 72 -7 -85 -223 -135 36 -330 103 18
5524A8N5k0o4j59L03k17o7l04O27l49M54m38J89n3P8r4o2N3l9J45m7O6j1k90L93
$$ 18 73 53 -11 -170 133 -84 -151 -455 172 -177 277 -161 28 -25 53 -41 -103 -50 -89 56 9 75 64 -226 167
5549A67k86M7K53j40K22o24L18j16L24j0L2j59j88J24O9M1%k57J81J87Q2j50l44
$$ 167 -119 -72 181 41 263 -361 -43 -159 165 155 187 28 -160 -36 33 74 74 -183 -2 185 267 117 -227
5572b27K24l41L69ln6J57m54K89P2p0n6N8J56k58K45P3j6o6j69M81m53J79j91
$$ -227 -3 -344 25 22 -34 123 -331 -42 30 -40 -96 -38 118 -140 105 178 162 96 -73 408 -45 134 -57
5595e7k33N23k29m1j10J70K4J51l26R3K45j90l3k25M17k13j4L15j39j90N0J74
$$ -57 -290 233 4 -37 -147 23 47 198 -128 -35 210 20 -13 -238 179 -34 -48 267 128 -62 -12 162
5617A62k62K52k62K31R3k23j61K81o2J25J62k96m8J61n8J57o2k93J4PK58k00J80
$$ 162 -100 152 -110 121 214 -9 -170 111 49 174 336 40 -8 153 95 252 190 -103 -89 -82 176 -24 156
5640A56k48J16rk5K10r6j28R5l03L98j57J9m3p9J70k7q6J1j35L7K52nQ0k37l25
$$ 156 -92 24 15 -10 200 104 -24 71 -232 166 9 28 -15 -94 76 49 -37 -26 -161 -124 128 123 203 -34 -359
5665c59J52L00j83J87k94J95K60j31l31K49k35J64P3j64M2l8J23Jj45r8L61m76
$$ -359 -207 93 -90 97 -197 -2 258 127 -204 45 -190 -26 47 -117 -75 -113 10 11 -134 -232 129 -347
5687c47K37J47MK26m82K84q4J86M3j20J45k13j27L09j43k06R4J79k31K6L17j48
$$ -347 -110 37 41 267 -215 69 -15 171 214 94 239 26 -101 208 65 -141 -47 132 -99 -73 244 96
5709I6j56L7J35M6m61K45L36l62J87O4l42j69L20k50K02K68m69L14Q4J25k68K03
$$ 96 -60 -23 112 158 -303 -58 278 -84 103 167 -175 -344 -24 -274 -72 196 -273 41 125 250 -18 185
5731A85l8k01J44j1K5k01Q0K57m84J92J05k1ol08L84n9j01n2L33k21LK0k81N1
$$ 185 147 -54 90 79 104 -97 -17 240 -244 -52 53 32 26 -282 102 43 -58 -110 223 2 5 25 -256 -205
5755b05j27M2L50j39N4J47l60J72k9J23k46O00l93L8j77k00M10o9q7K93k54l8
$$ -205 -332 -290 60 -79 -25 122 -238 -66 -95 28 -218 382 -11 27 -150 -350 60 -9 -96 197 -57 -95
5777i5j36J69L1j61L38j01J62P4n04K62J18k42PL69J23n07K03m45K22j44L04N3
$$ -95 -231 -62 -31 -192 146 45 207 281 -223 39 157 -85 -78 291 414 -93 110 -335 -113 -257 47 100
5799A00n3l09K26j12J23k4M37j91m68L17k30j3K28j83P3J10k95J12J48K67l58
$$ 100 47 -262 -36 -148 -25 -49 388 197 -271 46 -184 -197 31 -152 -79 31 -264 -152 -4 263 -95
5820i5K30J7j69J97j82j4pK34k58l0j24R9J89q6J13m4l78jM02J6K3l10M03l13
$$ -95 135 152 -17 180 -2 -16 -23 211 -47 -77 -201 -102 87 1 114 70 -308 -309 93 109 132 -178 225 -88
5844h8q0L22N5k26K39p1N7l19M37j95j93J23K5O6o5m2L01r1M6k36N7j13q8q1K77
$$ -88 -168 154 209 -17 222 151 208 -111 326 131 -62 61 86 152 87 45 346 255 301 65 122 9 -79 -160 117
5869A17j17R5j36J98k2k47J29J0m6k24P9K15j10j28L28k42K74k98N6j15J16l58
$$ 117 0 95 -41 157 135 -112 17 27 -19 -243 -164 51 -59 -187 141 -101 173 -125 -69 -184 -68 -426
5891d26M32j9o9L4M8L0n9J14q2J23m4l86M74r6n83P11J1l84N0J91J77m16L73P3
$$ -426 6 -13 -82 -48 0 30 -29 85 3 126 82 -304 170 74 -509 202 213 -171 -121 70 247 -169 204 277
5915B77k71O8Rj17J95j87k27K00O8J44j29L6kj02K95k37m21L93j58M3K74k81P3
$$ 277 6 74 83 -34 161 -26 -253 -53 15 159 30 66 64 -38 257 20 -401 -8 -166 -123 151 -130 -57
$$ [...]
8191c4
##END NTUPLES=NMR FID
##END=
