##TITLE=1H_DE-Solv
 200.13MHz, ,
 8 sc
 
 30.10.2025
##JCAMPDX= 6.0         $$ Bruker NMR JCAMP-DX V2.0
##DATA TYPE= NMR FID
##DATA CLASS= NTUPLES
##ORIGIN= UXNMR, Bruker Analytische Messtechnik GmbH
##OWNER= pz
$$ XWIN-NMR		Version 3.5
$$ Thu Oct 30 14:13:13 2025 Russian Standard Time (UT+4h)  she@DPX200
##.OBSERVE FREQUENCY= 200.1313
##.OBSERVE NUCLEUS= ^1H
##.DELAY= (6, 6)
##.ACQUISITION MODE= SIMULTANEOUS
##.ACQUISITION SCHEME= undefined
##.AVERAGES= 8
##.DIGITISER RES= 18
##SPECTROMETER/DATA SYSTEM= spect
##.PULSE SEQUENCE= zg30
##.SOLVENT NAME= CDCl3
##.SHIFT REFERENCE= (INTERNAL, CDCl3, 0, 14.3821)
##AUDIT TRAIL= $$ (NUMBER, WHEN, WHO, WHERE, WHAT)
$$ ##TITLE= Audit trail, XWIN-NMR		Version 3.5
$$ ##JCAMPDX= 5.01
$$ ##ORIGIN= Bruker BioSpin GmbH
$$ ##OWNER= she
$$ F:/spectra/data/she/nmr/H-C/1/audita.txt
$$ ##AUDIT TRAIL=  $$ (NUMBER, WHEN, WHO, WHERE, WHAT)
(   1,<2025-10-30 14:10:55.28 +0400>,<she>,<DPX200>,
      <created by zg, POWCHK disabled, PULCHK disabled
       configuration hash MD5:
       00 E9 B6 7A A2 85 ED C7 34 08 36 98 17 FE 4E 26
       data hash MD5: 16K
       A0 72 3A 5E 8A FD AE CC A0 11 11 49 52 6D 13 B5>)
$$ ##END=
$$ 
$$ hash MD5
$$ DF D7 3F C4 4F C1 59 4C BC B4 92 60 7C 9E C3 CF
##$RELAX= 
##$RELAX= 
##$RELAX= 
##$RELAX= 
##$RELAX= 
##$RELAX= 
$$ Bruker specific parameters
$$ --------------------------
##$DU= <F:/spectra>
##$EXPNO= 1
##$NAME= <H-C>
##$PROCNO= 1
##$TYPE= <nmr>
##$USER= <she>
##$AMP= (0..31)
100 100 100 100 100 100 100 100 100 100 100 100 100 100 100 100 100 100 
100 100 100 100 100 100 100 100 100 100 100 100 100 100 
##$AQSEQ= 0
##$AQ_mod= 1
##$AUNM= <au_zg>
##$AUTOPOS= <>
##$BF1= 200.13
##$BF2= 200.13
##$BF3= 200.13
##$BF4= 200.13
##$BF5= 200.13
##$BF6= 200.13
##$BF7= 200.13
##$BF8= 200.13
##$BYTORDA= 1
##$CFDGTYP= 0
##$CFRGTYP= 5
##$CHEMSTR= <none>
##$CNST= (0..31)
1 1 145 1 1 1 1 1 1 1 1 1 1 1 1 1 1 1 1 1 1 1 1 1 1 1 1 1 1 1 1 1 
##$CPDPRG= <>
##$CPDPRG1= <>
##$CPDPRG2= <>
##$CPDPRG3= <>
##$CPDPRG4= <mlev>
##$CPDPRG5= <mlev>
##$CPDPRG6= <mlev>
##$CPDPRG7= <mlev>
##$CPDPRG8= <mlev>
##$CPDPRGB= <>
##$CPDPRGT= <>
##$D= (0..31)
0 0.7 0 0 0 0 0 0 0 0 0 0.03 0 0 0 0 0 0 0 0 0 0 0 0 0 0 0 0 0 0 0 0 
##$DATE= 1761819054
##$DBL= (0..7)
120 120 120 120 120 120 120 120 
##$DBP= (0..7)
150 150 150 150 150 150 150 150 
##$DBP07= 0
##$DBPNAM0= <>
##$DBPNAM1= <>
##$DBPNAM2= <>
##$DBPNAM3= <>
##$DBPNAM4= <>
##$DBPNAM5= <>
##$DBPNAM6= <>
##$DBPNAM7= <>
##$DBPOAL= (0..7)
0.5 0.5 0.5 0.5 0.5 0.5 0.5 0.5 
##$DBPOFFS= (0..7)
0 0 0 0 0 0 0 0 
##$DE= 6
##$DECBNUC= <off>
##$DECIM= 32
##$DECNUC= <off>
##$DECSTAT= 4
##$DIGMOD= 1
##$DIGTYP= 9
##$DL= (0..7)
0 120 120 120 120 120 120 120 
##$DP= (0..7)
150 150 150 150 150 150 150 150 
##$DP07= 0
##$DPNAME0= <>
##$DPNAME1= <>
##$DPNAME2= <>
##$DPNAME3= <>
##$DPNAME4= <>
##$DPNAME5= <>
##$DPNAME6= <>
##$DPNAME7= <>
##$DPOAL= (0..7)
0.5 0.5 0.5 0.5 0.5 0.5 0.5 0.5 
##$DPOFFS= (0..7)
0 0 0 0 0 0 0 0 
##$DQDMODE= 0
##$DR= 18
##$DS= 0
##$DSLIST= <SSSSSSSSSSSSSSS>
##$DSPFIRM= 0
$$ [...]
##$SUBNAM0= <"">
##$SUBNAM1= <"">
##$SUBNAM2= <"">
##$SUBNAM3= <"">
##$SUBNAM4= <"">
##$SUBNAM5= <"">
##$SUBNAM6= <"">
##$SUBNAM7= <"">
##$SUBNAM8= <"">
##$SUBNAM9= <"">
##$SW= 18.0517328524113
##$SWIBOX= (0..15)
0 0 2 0 0 0 0 0 0 0 0 0 0 0 0 0 
##$SW_h= 3612.71676300578
##$TD= 16384
##$TD0= 1
##$TE= 0
##$TE2= 300
##$TE3= 300
##$TEG= 300
##$TL= (0..7)
0 120 120 120 120 120 120 120 
##$TP= (0..7)
150 150 150 150 150 150 150 150 
##$TP07= 0
##$TPNAME0= <>
##$TPNAME1= <>
##$TPNAME2= <>
##$TPNAME3= <>
##$TPNAME4= <>
##$TPNAME5= <>
##$TPNAME6= <>
##$TPNAME7= <>
##$TPOAL= (0..7)
0.5 0.5 0.5 0.5 0.5 0.5 0.5 0.5 
##$TPOFFS= (0..7)
0 0 0 0 0 0 0 0 
##$TUNHIN= 0
##$TUNHOUT= 0
##$TUNXOUT= 0
##$USERA1= <user>
##$USERA2= <user>
##$USERA3= <user>
##$USERA4= <user>
##$USERA5= <user>
##$V9= 5
##$VALIST= <valist>
##$VCLIST= <CCCCCCCCCCCCCCC>
##$VD= 0
##$VDLIST= <DDDDDDDDDDDDDDD>
##$VPLIST= <PPPPPPPPPPPPPPP>
##$VTLIST= <TTTTTTTTTTTTTTT>
##$WBST= 1024
##$WBSW= 4
##$XGAIN= (0..3)
0 0 0 0 
##$XL= 0
##$YL= 0
##$YMAX_a= 180220
##$YMIN_a= -180302
##$ZGOPTNS= <>
##$ZL1= 120
##$ZL2= 120
##$ZL3= 120
##$ZL4= 120
##$ABSF1= 10
##$ABSF2= 0
##$ABSG= 5
##$ABSL= 3
##$ALPHA= 0
##$AQORDER= 0
##$ASSFAC= 0
##$ASSFACI= 0
##$ASSFACX= 0
##$ASSWID= 0
##$AUNMP= <proc_1d>
##$AZFE= 0.1
##$AZFW= 0.1
##$BCFW= 1
##$BC_mod= 2
##$BYTORDP= 1
##$COROFFS= 0
##$CY= -3
##$DATMOD= 1
##$DC= 2
##$DFILT= <>
##$DTYPP= 0
##$F1P= 0
##$F2P= 0
##$FCOR= 0.5
##$FTSIZE= 0
##$FT_mod= 4
##$GAMMA= 1
##$GB= 0.15
##$INTBC= 1
##$INTSCL= 1
##$ISEN= 128
##$LB= 0.25
##$LEV0= 0
##$LPBIN= 0
##$MAXI= 10000
##$MC2= 0
##$MEAN= 0
##$ME_mod= 0
##$MI= 1.114404
##$NCOEF= 0
##$NC_proc= 0
##$NLEV= 6
##$NOISF1= 3.799351
##$NOISF2= 2.8
##$NSP= 1
##$NTH_PI= 0
##$NZP= 0
##$OFFSET= 14.38212
##$PC= 1
##$PHC0= -2543.078
##$PHC1= 14.39236
##$PH_mod= 1
##$PKNL= yes
##$PPARMOD= 0
##$PSCAL= 0
##$PSIGN= 0
##$REVERSE= no
##$SF= 200.129724274929
##$SI= 16384
##$SIGF1= 3
##$SIGF2= 2
##$SINO= 400
##$SIOLD= 16384
##$SREGLST= <1H.CDCl3>
##$SSB= 0
##$STSI= 0
##$STSR= 0
##$SW_p= 3205.1282051282
##$SYMM= 0
##$S_DEV= 0
##$TDeff= 0
##$TDoff= 0
##$TI= <>
##$TILT= no
##$TM1= 0
##$TM2= 0
##$TOPLEV= 0
##$USERP1= <user>
##$USERP2= <user>
##$USERP3= <user>
##$USERP4= <user>
##$USERP5= <user>
##$WDW= 1
##$XDIM= 8192
##$YMAX_p= 0
##$YMIN_p= 0
$$ End of Bruker specific parameters
$$ ---------------------------------
##NTUPLES= NMR FID
##VAR_NAME=  TIME,          FID/REAL,        FID/IMAG
##SYMBOL=    X,             R,               I
##VAR_TYPE=  INDEPENDENT,   DEPENDENT,       DEPENDENT
##VAR_FORM=  AFFN,          ASDF,            ASDF
##VAR_DIM=   8192,          8192,            8192
##UNITS=     SECONDS,       ARBITRARY UNITS, ARBITRARY UNITS
##FACTOR=    0.0002768,     1,               1
##FIRST=     0,             0,               0
##LAST=      2.2672688,     0,               0
##MIN=       0,             -180302,         0
##MAX=       2.2672688,     180220,          0
$$ Real data points
##PAGE= N=1
##DATA TABLE= (X++(R..R)), XYDATA
0@%%%%%%%%%%%%%Qj6J6j6J6k4L2l4M2n0N9p3Q7j02J15j33J54j74J99k27K60k94
35a55L29l71M16m65N18n76O42p13P92q77R68j069J180j300J434j581J739j916
53a005K115k335K581k860L179l547L976m486N103n870O850q156R999j2815J7737
68A0466k8912J03002M9029r9464q3194j00024k0612n891J07609O1854J08409O7015
80A69287L7l9890r4269p8472r7096l6966L3090N1688R9517Q4886P6532p358l8020
93A22966p4487j02831p9789l8519L1042M5829J01286R5904N2027J3741n0247o1765
105E5157j19061o5676k8642L534P5184P7184J08894L5288J4672k7066j01023p3103
117d4658q6931j7387L288N9256J07234N8674P0610J063l3681q1480r4547n1512
$$ y = [0, 0, 0, 0, 0, 0, 0, 0, 0, 0, 0, 0, 0, 0, 8, -8, 8, -8, 8, -16, 16, -18, 24, -26, 33, -40, 47, -55, 60, -73, 81, -93, 106, -121, 139, -155, 174, -197, 219, -246, 272, -304, 338, -375, 417, -460, 508, -561, 619, -681, 753, -828, 911, -1005, 1110, -1225, 1356, -1504, 1675, -1872, 2104, -2382, 2721, -3149, 3701, -4455, 5544, -7271, 10466, -18446, 84556, 133585, 34121, -49073, -149097, -169709, -175600, -67991, -6137, 102272, 169287, 169324, 129434, 35165, -43307, -140403, -177369, -144279, -92591, 6926, 91812, 168344, 160986, 122966, 48479, -54352, -134141, -172660, -141618, -95789, 5497, 101401, 153428, 167169, 116922, 55157, -63904, -129580, -158222, -154688, -79504, -2320, 106574, 141862, 156534, 129468, 28445, -44658, -131589, -148976, -145688, -86432, 20802, 79476, 150086, 151149, 117468, 35988, -58559, -110071]
129a10071n3981K6851O0667Q6171Q0403M9429K2244n6298p0282q5516o9626l5817
141a55826J7967P0572P0215Q7675M9886R975m7143p2774p2795q3487j7346J2571
153a30510O1949P6493P3951O4253j4219k5385p4853q2442o2521l7078L4405L8351
165g7606Q9549P8251M0572J3386m8947n7090r4306o0194k0389P261O5542P1891
177G920Q2483L8891N039l1709p8488p3169o3560k1184J2310N7305P9088O5889
189H0815M6666K417l3333p4688p0579n8236k8911K1640N0757Q1232O1114M8348
201A27242N223m5379n9740q1587n1033l0289K0515O1093O3117P7672L5326N943
213A28103m0295o8705o4127o6187j4393J6593N2947P2462O0965M6357n609l4000
$$ y = [-110071, -164052, -137201, -76534, 9637, 90040, 139469, 161713, 105415, 35133, -50383, -120009, -155826, -137859, -67287, 2928, 90603, 140489, 150464, 103321, 30547, -42248, -125735, -143081, -130510, -68561, 7932, 81883, 146136, 131917, 106532, 31679, -50763, -113284, -150362, -115957, -77606, 11943, 90194, 130766, 144152, 95205, 38115, -56191, -116385, -136774, -129513, -63971, 7920, 90403, 129294, 134333, 102624, 24136, -49033, -112593, -133777, -121467, -64162, 14926, 80815, 127481, 129898, 96565, 21877, -48702, -106938, -135849, -114209, -63452, 17780, 78894, 127242, 132465, 87086, 27346, -54241, -105274, -135563, -115048, -53955, 9162, 86834, 122160, 128103, 87808, 19103, -45024, -111211, -125604, -109011, -56064, 16398, 77363, 123720, 118111, 84111]
225H4111o2649p2382n1408k3133K1896M9157O9910O5445L7126O87l6826o2548
237A9386p0994n1303k0867K0662N0852O9546O4303L3307L500m0281o0601o7721
249e0211n2085j4416J4493N5615O3852N9360L7228m645l1551o4306o2144m7728
261i6538k0328K3246M5960O7032N7023L3075J465l9847n6561o4882m7729j5078
273a13162J7895N2151O2323N7472L3651m149l5144n9193o2129m4728j6436K1655
285h9794M8258O0803N6087K8762j498l5881n6629n7761m5558j1993J8705M6938
297c9561O0671N0764L1714m735l4532n4505o0078m0305j4937K0951M7660N7459
309B0566N4007K6534l322l5120n6010n4983m2504j0852K0532M5206N8620M7767
$$ y = [84111, 21462, -50920, -102328, -125461, -103565, -54408, 15502, 80947, 118073, 118760, 81934, 19386, -51608, -102911, -123778, -103116, -52264, 17282, 81585, 114892, 118392, 78111, 17510, -50211, -102296, -116712, -102219, -46604, 17248, 76608, 113836, 109191, 77640, 13334, -48810, -96538, -116866, -93620, -47660, 19372, 76395, 109470, 110935, 71088, 14527, -50355, -98084, -113162, -95267, -43116, 19207, 76679, 110330, 106181, 71037, 11844, -50285, -95013, -111449, -89794, -41536, 19267, 75354, 104116, 102618, 66737, 10108, -47653, -93211, -105204, -86499, -39561, 21110, 71874, 103588, 98853, 64321, 9816, -50262, -90567, -105504, -84553, -36893, 20566, 74573, 101107, 97785, 62665, 6655, -48328, -90832, -101684, -81152, -35946, 22674, 70441]
321G0441K7658m912l4893n0895n5841l7442j1437J9322M5858N2894M8948K4902
333I4603n033l2123n2981n1548l8458j0568K1168M2645N5559M5905K4567m529
345H9207l5222m9316n2852l6052q575J8908M5044N1046M5299K3315p195l0906
357E2701n0235m8298l4264r481K1181M0131N1162M2206K1447m958l2925m6360
369B307m8309l3236p448J9302M1910M8980M1584K1340p097l2072m6626m7395l1122
382g7882p312K0614M1129M6521M1580J8059o786l1001m5989m2575l2269l986J8942
395f0955L8022M7318L5712K0548r368k8876m2684m5106k6142p800K1270L7033
407b1028M4719L8531J4627n050l1699m2237m2532k7780l054J7400L9789M2469
$$ y = [70441, 98099, 93187, 58294, 7399, -48442, -85884, -97321, -77999, -32141, 20753, 69701, 94603, 89570, 57447, 4466, -47082, -85540, -96108, -74940, -32295, 23264, 69169, 93736, 89207, 53985, 4669, -48183, -84235, -92810, -73902, -28858, 22188, 67487, 90802, 83607, 52701, 2466, -45832, -80096, -89577, -68396, -28265, 22897, 65103, 86550, 81592, 48667, 2307, -46002, -79238, -86686, -67384, -25474, 23506, 65090, 86430, 79333, 47261, 635, -46760, -77882, -85194, -64580, -23451, 23070, 64650, 82709, 75923, 44922, -1067, -43642, -75911, -79897, -60955, -22933, 24385, 60097, 80645, 71277, 42401, -283, -45389, -71531, -79331, -58061, -21028, 23691, 62222, 76849, 71799, 40100, -2137, -44669, -72449, -75503, -58103, -18314, 24155]
419B4155L5750J5533p629k8658m3378l7740k7162l117J7893L6839M2001L0695
431E5182J8337r963k6942m0648l7676k3262p635K3160L2472M1085L2115J3875
443G0100n362l3224l4032l9756k4157j622J7431L8141L3782L5747J1947j0209
455E8786k5264l9687l2333k7094J867J7822L0576L9764K7364J5046j2715k2386
467C1746l6278l6443j8169l911K0491K7565M0136K7479Q676m993k8597l2255l7700
480d2253j5790j782J4538L6633L1471L0172N981m978k5531l8951k5194k2963K373
493e6274J4087L3254L4172J9199J6838j2938k2452l4402k7711j5838p002K4237
505c4830K5264L2614K3248J0370o747l0624k4181l2197j6890j67J8087L0739K4354
$$ y = [24155, 59905, 75438, 67809, 39151, -4227, -41967, -69129, -72246, -54353, -17514, 24487, 55182, 73519, 63556, 36614, -4034, -41710, -64972, -72607, -49447, -16975, 24110, 56225, 70100, 64738, 31514, -2518, -42274, -66431, -68053, -50622, -12481, 21301, 57048, 68995, 58786, 33522, -6165, -38498, -65592, -63725, -45903, -15327, 24437, 51801, 66847, 54132, 31746, -4532, -40975, -59144, -63055, -42564, -14999, 25137, 52616, 61292, 56299, 27702, -4553, -42253, -58043, -59825, -45287, -8654, 22817, 52989, 58970, 53992, 28461, -10490, -35684, -58647, -56274, -42187, -8933, 25239, 44438, 61276, 48338, 25886, -8516, -36227, -52065, -59067, -34830, -9566, 23048, 46296, 56666, 49919, 19295, -4886, -37083, -53973, -54140, -36053, -5314, 19040]
518A9040L0682M781r340k3312k9911k5274k2731Q467J2999K6748L0346K1428J0345
531E4268j5926j4193l2354k7201j2412r06J9173J8899L5709J7717M702m787k4485
544A8204k4474l1530p048j165J2535L0768K4030K2890P05l060k3216l1086j8208
557c0655j6444M167J1180L0064K4305J4073J1639j2461j8338k9346j7337j3257
569d2410k867K1525J9349K6277J4099R528r526k4880j7303k5939r430n03J8428
582b3652K2802J7987K4469m59p489k1190k1500j9722j6382J0390R949K2945K1939
595B0087J6586N049j4487j1065k6562j8924r063K647J5280J5397K7904J0768L232
608C6849o943j8241j9971k3105k722q40J3015K2295J9338J5404j428k630k1067
$$ y = [19040, 49722, 54503, 45163, 21851, -8060, -33334, -56065, -47598, -34599, -7851, 22495, 43923, 54268, 38342, 24149, -8205, -35406, -47818, -48724, -29551, -10652, 25057, 42774, 47476, 42689, 18204, -6270, -37800, -44848, -46013, -33478, -2710, 21320, 44210, 44915, 41855, 18639, -12447, -30655, -47099, -42932, -31752, -1688, 22617, 36690, 48329, 35868, 17530, -11816, -29153, -42410, -45277, -23752, -4403, 21874, 35973, 45501, 35975, 11095, -6208, -32147, -41577, -42080, -23652, -850, 17137, 41606, 41147, 33658, 12468, -9032, -28754, -45136, -34746, -24797, -1852, 20087, 36673, 41722, 27235, 16170, -10392, -29316, -38379, -35732, -20452, -5055, 22849, 33617, 36849, 29906, 11665, -8306, -31411, -34133, -34973, -21958, 337, 19675, 35079, 33651, 31021, 9954]
621I954k1718j4698j0042M897R306K5225J6119J1596N802j0973j4679k3324j1152
634b3687j0227J219J6785J5355K0026Q777O445j0048j8142j4264j8527n293P37
647c0844J5766J6494J4930J5709j407o820j7574j5586j5442q785P798R417J8542
660B198J5168J2362O40j0569j1053j9902j2281o695M876J1473J3821J9254O724
673B6016K136q269j3448j5848j5064j686P41J2313J5598J4737R689j610m448j6532
687D325j4948j1598n247M715R242J8020J1814Q699J160q620j2572j6382q686o061
701b6139L864J1704J3159J3806O330K271q852j2626j2612j1530l213K465J2104
714i269J2233J2236Q441j201o526j3459j1764j0985l735N233R089J4008J0759
$$ y = [9954, -11764, -26462, -36504, -31607, -22301, 2924, 19043, 30639, 36441, 25468, 10789, -12535, -23687, -33914, -32695, -15910, -555, 19471, 28248, 34693, 24645, 6503, -7761, -26288, -31581, -30844, -15078, 1416, 16346, 32055, 30648, 23828, 6254, -9332, -24774, -33559, -25761, -16344, 2198, 17366, 29728, 30368, 19799, 8746, -11156, -23437, -30132, -25256, -13783, 38, 19292, 26016, 28152, 19883, 6435, -9413, -24477, -26163, -25422, -13109, 2489, 17226, 26915, 25305, 20857, 4325, -10623, -22221, -27468, -22753, -13511, 4509, 16323, 25022, 26182, 17562, 4990, -11392, -20078, -26139, -22275, -10571, 2588, 16394, 22724, 24995, 16143, 3517, -9095, -20625, -23838, -21373, -9269, 2964, 15200, 23641, 22440, 15914, 2455, -9309, -20294, -24029, -18796, -9707, 4301, 15060]
727A5060P814j181p834j0667j3710q363l712M815R428J1664J2094M996R6p506
741A2994j0691j1764r101j710K986R828J1413J0583N589j260o134j1603j0825
754i695q281k172M194Q907J2059R106N504j286o943j0399j1019o809k518M547
768a4805Q715J0574R191M321o03p093r536r923p010j533L592Q751R721Q681M473
783A7516j471o205r728r247o724j434M246Q099R919Q015M018j594o443r099r170
798i302n945j167M213P906R117P558L470j471o123q536q490n492r29L833P530
813c828Q523P131L194j577n852q329p935n275o28L956P339Q414O660K893j891
828A2795n909q036p649m733l89M022P156P828O194K500j853n610p559p034m381
$$ y = [15060, 22874, 21693, 13859, 3192, -10518, -18881, -22593, -17778, -8350, 3314, 15408, 20404, 20500, 12994, 2303, -9461, -18562, -20272, -17286, -7458, 3955, 14538, 20127, 18867, 12733, 1130, -9695, -17976, -20148, -15954, -7047, 5012, 14118, 19622, 18336, 11393, 994, -10025, -16834, -19352, -14805, -6090, 4484, 13675, 17996, 17393, 10300, 764, -9159, -16169, -17702, -14110, -5359, 4362, 13043, 17516, 16045, 9840, 112, -9135, -15859, -17293, -13047, -4948, 4971, 12986, 17004, 15410, 8967, -132, -9302, -15247, -16414, -12201, -4295, 4822, 12380, 15850, 14379, 8256, -280, -8770, -14262, -15191, -11358, -3828, 4695, 11826, 15020, 13443, 7591, -738, -8673, -13948, -14576, -10620, -3281, 5133, 11793, 14686, 12795, 6886, -1150, -8799, -13532, -13921, -9899, -2743, 5085, 11279, 13779, 11926, 6316, -1243, -8277, -12658]
843a2658k82L853O631P416N718K318j851n436p214o674m077n9L819O580P115N460
859A0659K025k171n370p068o341l676J39L952O305O807M969J700k053n251o505
874a879n969l334K28L635O064O146M756J555k000m885o312n500l269M12L623N749
890i80O103M362J483k314m833o179n303k795M25L862N447N904M073J066k157m902
906C262n483n185k386N13L454N422N196M034O76j952m432n580m458k628R73L154
922e420N257N265L264J096k512m121n621m321j961N71L833M690N273K934O43k055
938F815m767m613m365j618O22L426M992M082L386J75j850m351m671l415k363J363
954g152K927M768M169K723Q55k915l472m867l428j699R36L838L629M761K347K52
$$ y = [-12658, -12940, -9087, -2456, 4960, 10678, 12996, 11145, 5709, -1505, -8179, -12256, -12315, -8496, -1916, 5199, 10659, 12684, 10513, 5143, -1925, -8266, -11942, -11803, -7851, -1546, 5261, 10230, 11930, 9877, 4626, -1879, -7848, -11182, -10954, -7319, -1255, 4891, 9647, 11202, 9202, 4317, -1995, -7495, -10764, -10352, -6729, -980, 5123, 9485, 10968, 8654, 3821, -2358, -7661, -10456, -10031, -6169, -722, 5182, 9255, 10321, 8164, 3262, -2221, -7406, -9792, -9279, -5825, -403, 4793, 8827, 9503, 7551, 3119, -2461, -6919, -9547, -8574, -5420, -163, 5102, 8366, 9462, 6950, 2829, -2792, -7113, -9074, -8503, -4670, 20, 5293, 8227, 8870, 6815, 2048, -2565, -6930, -8548, -7926, -4500, 492, 4574, 7960, 8135, 6285, 1934, -2737, -6152, -8515, -7152, -4225, 543, 4712, 7435, 8290, 5375, 1903, -2964, -6392, -8091, -7155, -3317, 312, 5073, 7420, 7672]
970G672k295m118l769m158p68R33L071M242L638L019p81j559l718m287k984j539
986g401J742K066M640L686J857K86k510k918m896k351j042Q19L372L594M204J054
1002F202M55k087m131l308l130k52M00L414L983K582K404o20j539m155l121k177
1018e080j653J924K328M085K417K058J43l034k534l840j959j293J621L313K454
1033I50L790J122j17k643l017k711l349M02R79K967K953K931J951j626j104l413
1049F5l008k247m21J937J400M163K286J250n47k051k334m202r31o29J169K723
1065a377L002L149p0L42k273l282k583k008M07L40L467K854J860J390r04j432
1081B882l824j826j705p05J890K133L329J246J663o05k624k111k937j039r23K091
$$ y = [7672, 5377, 1259, -2510, -6668, -7436, -6503, -3432, 810, 4448, 7467, 6686, 5127, 1409, -2878, -5862, -7401, -5659, -3593, 1047, 4733, 6590, 6876, 4366, 1448, -3448, -5799, -6841, -6022, -2650, 944, 5148, 6202, 6657, 4570, 439, -2869, -5999, -6251, -5851, -2437, 1546, 4128, 6532, 5912, 4373, 218, -2903, -5080, -6733, -4809, -2481, 1604, 4021, 6079, 6222, 3188, 654, -3186, -5145, -6438, -4817, -1504, 950, 4740, 5862, 5745, 3102, 85, -2626, -5975, -5573, -4594, -1627, 1326, 4257, 6208, 4582, 3478, 65, -2943, -5190, -5611, -3674, -2274, 1889, 4175, 5425, 4878, 2827, 493, -3709, -4640, -5269, -4100, -1377, 1625, 4774, 4704, 5046, 2773, -509, -3092, -5100, -4693, -4353, -886, 1968, 3828, 5218, 4314, 2882, -942, -2768, -4473, -5178, -3288, -1155, 2174, 3420, 5083, 4478, 1854, -257, -3194, -4233, -5156, -3065]
1097c065K516K029K820L77k88k773k142k322k229Q43J022K820K088K429Q44j639
1113C330j127l069k043j731M26J658J476L388J414P78j094j650k263l061l54l04
1129d226J574K122K658K030l47M1k396k476k205j001N11O58L223K022J543M86
1145D217q75j673l186j216j351J03J646K129K590Q51J130j229k059k067k108o53
1161c751l45K127J967J982J847N4o37k546j683k091j137Q00J273K508J613J925
1177C906L4j324j483k583j456j224Q77J393J813K538R55M54j382j514k191k082
1193c269k83J36J711J813K304J246k71n59k226j981j849m92N98J185K598J638
1209B299J318o5j025j836k438j125r03O92J472K070J978Q43L92j344j746k038
$$ y = [-3065, -549, 1480, 4300, 4677, 4389, 1616, -526, -2848, -5077, -4234, -3212, -392, 1696, 4125, 4969, 3330, 2203, -866, -2909, -4640, -4214, -2556, -1080, 2308, 3722, 4500, 3406, 1756, -507, -3568, -3922, -4226, -2652, -530, 2128, 4158, 3811, 3852, 1456, -1020, -3225, -4226, -3715, -3057, 166, 2188, 3731, 4217, 3342, 1669, -1517, -2733, -4084, -3981, -2335, -206, 2384, 3235, 4365, 3136, 1077, -990, -3098, -3751, -4096, -1969, -2, 1980, 3827, 3881, 3244, 698, -985, -3076, -4213, -3413, -2140, 368, 1981, 3906, 3940, 2616, 1133, -1450, -2906, -4130, -3253, -1860, -47, 2491, 3446, 3900, 2518, 1004, -1187, -3269, -3552, -3416, -1705, 108, 2412, 3658, 3387, 2828, 602, -1379, -3228, -3720, -3122, -1937, 661, 2299, 3617, 3552, 2527, 691, -1747, -2872, -3775, -3083, -1611, 459, 2437, 3280, 3672, 2328, 582, -1456]
1225a456j536m56K50J903J756J906J098r9r78k107j712j688m82P22J504K126J570
1242B321J262k39j203j766k098j310o05R22J402J955J856Q25k6j260j638k020
1258a622j413k76N21J633J806J832Q64k28j020j954j808j436k57P03J518K038
1274I01J590R39l13j154j886j910j170m26Q55J542J942J589P39r3j299j756j832
1291a742j236k88P00J577J836J619P73k15j199j835j725j301j84P56J570J911
1307A017J532P70l56j236j822j782j159k13Q77J596J831J497O74k98j275j766
1323a13j725j132j69P70J605J738J506O66l29j197j766j708j144j04P98J583J831
1340A110J425O61m04j262j781j710j032j06Q85J590J785J422N97l96j288j749
$$ y = [-1456, -2992, -3448, -3198, -1295, 461, 2367, 3465, 3366, 2388, 281, -1431, -3119, -3601, -2879, -1375, 751, 2321, 3583, 3344, 2141, 375, -1723, -3033, -3638, -2716, -1314, 641, 2497, 3322, 3296, 2036, 398, -1622, -3035, -3311, -2790, -1157, 649, 2481, 3345, 3117, 2097, 143, -1665, -3101, -3358, -2655, -1137, 901, 2491, 3430, 3117, 1963, 77, -1833, -3003, -3429, -2574, -1032, 910, 2499, 3238, 3145, 1846, 90, -1742, -2978, -3266, -2566, -989, 847, 2466, 3239, 3024, 1825, -10, -1735, -3036, -3220, -2464, -894, 1017, 2549, 3319, 2963, 1727, -95, -1877, -3036, -3249, -2372, -776, 1055, 2552, 3226, 2928, 1653, -113, -1838, -2970, -3139, -2369, -764, 974, 2480, 3146, 2817, 1620, -146, -1854, -2998, -3102, -2304, -721, 1110, 2535, 3196, 2792, 1530, -251, -1961, -2993, -3099, -2214, -624, 1161, 2583, 3180, 2784, 1496, -253]
1356b53j632j060q7Q51J568J731J369N98l71j249j720j659j035p3Q82J572J739
1373A171J354N74m36j279j752j623r80k0Q79J604J759J300N51m87j274j690j570
1390a919r67q3Q71J588J680J361M59l81j266j696j556r41k7Q44J549J700J272
1407B488N50n16j233j726j542r37mR84J500J736J194N18n25j294j605j570q71
1424b853j9R42J475J605J378L75m20j237j620j467j004J15P75J548J613J249M67
1441B922n27j132j767j415q57J9R32J426J754J073M69m95j300j591j545o75r4
1458b803R71J519J527J237L12l35j357j516j394r05R7P69J638J412J216M87o61
1475B214j047j707j288r45J01J033J309J712R85N20o64j224j408j604n89p3J033
$$ y = [-253, -1885, -2945, -3032, -2181, -613, 1118, 2487, 3085, 2714, 1465, -255, -1914, -2949, -3022, -2140, -568, 1171, 2525, 3099, 2663, 1384, -368, -1991, -2971, -2991, -2112, -508, 1251, 2551, 3102, 2615, 1341, -349, -1919, -2886, -2969, -2098, -510, 1170, 2531, 2990, 2609, 1343, -353, -1909, -2850, -2877, -2033, -484, 1216, 2488, 3038, 2522, 1289, -437, -1979, -2916, -2920, -1936, -436, 1300, 2494, 3012, 2487, 1193, -412, -1982, -2853, -2872, -1930, -455, 1150, 2528, 2903, 2483, 1246, -374, -1841, -2845, -2730, -1955, -407, 1206, 2455, 2922, 2395, 1263, -504, -1919, -2776, -2757, -1825, -399, 1355, 2428, 2897, 2402, 1102, -489, -2034, -2709, -2803, -1832, -313, 1214, 2451, 2763, 2428, 1071, -445, -1839, -2744, -2647, -1878, -240, 1172, 2388, 2875, 2214, 1167, -540, -1828, -2773, -2672, -1639, -330, 1382, 2367, 2887, 2223, 999, -409, -2013, -2602, -2675, -1642]
1492a642J317J498J303J05k87j268j442j449q32K75N77J584J421J194K67n07r07
1509A207j835j135q23R1Q37J316J744P53N42n05j196j489j444l88l08J060J354
1526b19J393J110K10j42j484j272j274q33J26O58J607J070J220M56o18r82j547
1543e21j000j055J64R67J056J625Q08O39q22r29j236j555m74j01J079R49J489
1560A083J211k2j82j210j143j474o03K65L50J513J155J225J26l71p40j739r41
1577a497q17J57N71J202J634N46O31n18r51j409j228l27m04J008J105J312R07
1594A922K24pj431r75j160p63N0N59J502P28J257L27l86q87j336p69j149K49O82
1613a363R61J286Q45O70p90o82j121j288m89j60R45O55J399J028O2j24j003q99
$$ y = [-1642, -325, 1173, 2476, 2581, 2294, 1026, -416, -1865, -2697, -2422, -1845, -261, 1160, 2354, 2621, 2114, 1207, -628, -1763, -2586, -2495, -1658, -342, 1402, 2155, 2697, 2192, 996, -493, -1937, -2325, -2633, -1573, -219, 1174, 2284, 2494, 2352, 868, -404, -1678, -2511, -2385, -1727, -120, 950, 2170, 2626, 2008, 1026, -521, -1521, -2576, -2412, -1445, -389, 1236, 2044, 2683, 1861, 932, -304, -1859, -2333, -2434, -1355, -406, 1083, 2294, 2272, 2090, 880, -263, -1737, -2340, -2075, -1725, -212, 943, 2168, 2294, 1923, 1183, -556, -1497, -2314, -2157, -1586, -384, 1250, 1796, 2427, 1909, 958, -451, -1679, -2006, -2410, -1402, -297, 1015, 1922, 2146, 2139, 708, -267, -1427, -2190, -2140, -1581, -79, 649, 1906, 2233, 1847, 960, -376, -1145, -2294, -2045, -1363, -402, 884, 1729, 2399, 1609, 927, -194, -1482, -1971, -2131, -1186, -531, 868, 1896, 1958, 1834, 831, -68]
1631f8j415m63R8K77J228J007J109Q4j22o17j451p95p96J19L28J024J341N07O39
1650B034l81o44j261r61m07m38Q10Q61J136P48L57n1j081p50j072n99j74M64J127
1669b82O58J088L59j83p20r95p56r59Q4L77P94J020P90O25m92m30r39j021n51
1688a533k20O13N25J124Q24L03n3o78p67j090n10j31K24Q73Q08R45K37M8m94r62
1708H6p98p29p7J75P35R80O23N75j54m05r16q11n11l93M09N72R24O82M70M7o04
1729H80o47q73n42l20K41P18O44Q72L47J08m43p16o80q21j56J27N79P48P12N73
1749A351m0l02o59p76o17l67K36L95Q20O97M61J44l53n90q15n46l09N9M97O27
1769h7P80M34J73k57n59p08o62l03k6M30O63O31N78J49j39n97o71n84m25K2L02
$$ y = [-68, -1483, -1946, -1848, -1571, -343, 664, 1773, 1857, 1735, 1118, -333, -1128, -1924, -1805, -1477, -453, 888, 1395, 2034, 1653, 1009, -252, -1213, -1620, -2058, -1248, -387, 749, 1497, 1854, 1803, 722, -28, -1100, -1699, -1873, -1409, -282, 376, 1464, 1823, 1640, 920, -75, -831, -1790, -1706, -1329, -535, 485, 1275, 1900, 1408, 978, 39, -982, -1533, -1753, -1140, -615, 509, 1333, 1636, 1583, 905, 138, -952, -1462, -1593, -1369, -496, 312, 1257, 1494, 1542, 1048, 86, -712, -1441, -1518, -1343, -608, 372, 995, 1570, 1416, 1011, 95, -716, -1227, -1620, -1211, -639, 285, 967, 1437, 1484, 880, 233, -640, -1182, -1502, -1261, -543, 101, 973, 1320, 1428, 985, 269, -411, -1232, -1388, -1261, -682, 66, 778, 1351, 1311, 1009, 350, -426, -1043, -1410, -1174, -779, 41, 738, 1199, 1343, 990, 400, -415, -961, -1270, -1211, -714, -87, 693, 1127, 1300, 1043, 484, -224, -886, -1189, -1215, -785, -122, 509, 1087, 1236, 1097, 500, -171, -755, -1180, -1158, -856]
1790h56O42O90N09K38j93m68o68o26m28j5K98N76O97N34K66j17m37o08o64m27
1810a057j36K84N31O68N89K81o7l70o33o31m93r7J78N33O28N73L53k8l40o56n97
1831d87m67j74J78M13O59N85M09Ql27n43o52n25k79J20M64O21O36M35Q7k77n38
1852C46o57n72k68Q9M00O36O30M63J32k93n07o55n70l30P2M05N88O46M65J79k14
1873I85n08p00n64l49k8L70N96O80N22J91j11n16o99o15l80o8L42O26O49N55K19
1894A197j20m77o72o54m29l9L01O18O76N66K49o0m93o68o83m72p3K73N72P33O06
1915I51L13q1m46o74p10m97j46K80N91P09O47L58q8l97p10p18n58j52K66N86P43
1936B67O67L93o2m12p22p14n63j99K38N43P63O85M65k2m06o65q16n70k89K41N63
$$ y = [-856, -214, 476, 985, 1223, 1030, 562, -106, -732, -1160, -1175, -877, -301, 396, 930, 1196, 1079, 642, 34, -630, -1057, -1193, -909, -378, 290, 879, 1160, 1093, 723, 90, -541, -1034, -1131, -953, -420, 208, 781, 1134, 1106, 766, 110, -487, -954, -1128, -950, -537, 122, 707, 1116, 1124, 797, 254, -398, -923, -1202, -1082, -618, 3, 639, 1074, 1161, 884, 346, -311, -883, -1151, -1062, -662, -26, 604, 1067, 1199, 906, 399, -256, -826, -1156, -1084, -679, -91, 555, 1020, 1199, 985, 477, -223, -787, -1136, -1164, -794, -198, 482, 1004, 1195, 1084, 568, -131, -746, -1126, -1194, -852, -226, 423, 978, 1197, 1077, 600, -72, -726, -1155, -1194, -893, -275, 401, 967, 1216, 1156, 663, -5, -688, -1160, -1233, -960, -388, 345, 951, 1264, 1183, 737, 63, -647, -1144, -1290, -1010, -419, 290, 937, 1295, 1207, 810, 100, -618, -1176, -1328, -1062, -476, 267, 934, 1327, 1265, 853, 131, -583, -1146, -1345, -1107, -564, 199, 884, 1349, 1327, 921, 256, -560, -1130, -1419, -1178, -615]
1957f15P91P35M00P7m50p17p95o24j97J42O35P77P52M31ql12p63q00o65k29J75
1978a260N81Q22P41N19J9l53p38q65o25l65K00N84Q64P41N37J19m78o84q93o67
1998a201l09J54O72P32Q64N14Q6l99q09p67p97k75J70N21R16P64O66J2l70p18
2018D26r34o74m41K62M79Q94R16N69Q6m44o26j041p32k54L8O56Q32R72M57J30
2038A571k63r13q46q61k58O6N75J011P35O98P2k89q22r66o83n32K18N70R60Q42
2058H85N39L44n48p00j012p23m60R0P89P48J000N55J93m19q68p56j017l01J26
2077a535O33Q89Q19Q42j5l28q10r51q40m90L23M06J005J022O11J54n13n60j242
2096e80p40l23N5O73Q11J176M16K29l03r37q89r69k34o6O81J063Q12P47Q8k31
$$ y = [-615, 176, 911, 1311, 1388, 938, 221, -574, -1198, -1395, -1253, -618, 159, 911, 1342, 1334, 1022, 259, -541, -1206, -1435, -1260, -679, 143, 884, 1403, 1422, 1069, 331, -534, -1159, -1524, -1324, -740, 124, 865, 1402, 1521, 1043, 359, -534, -1201, -1510, -1356, -684, 48, 912, 1426, 1512, 1113, 304, -463, -1260, -1535, -1365, -844, 72, 836, 1502, 1514, 1144, 426, -508, -1182, -1623, -1361, -882, 12, 928, 1497, 1583, 1139, 513, -528, -1260, -1514, -1476, -820, 12, 984, 1441, 1571, 1308, 395, -451, -1312, -1570, -1504, -929, 82, 817, 1515, 1587, 1298, 476, -490, -1173, -1705, -1487, -917, 43, 885, 1424, 1768, 1220, 520, -492, -1215, -1675, -1585, -796, -48, 952, 1507, 1700, 1281, 413, -343, -1360, -1661, -1535, -902, -13, 806, 1648, 1633, 1305, 495, -456, -1296, -1786, -1463, -1057, -52, 970, 1581, 1735, 1222, 662, -580, -1320, -1643, -1588, -915, -104, 1072, 1488, 1717, 1414, 477, -412, -1381, -1615, -1681, -1000, 63, 875, 1622, 1710, 1479]
2116A479r66j001p09o35K55M93J154Q04O68L45n84p13j111p25n79Q5Q52P62J093
2135I67O19K83n26r04q09j077k87M9P26R16R09Q96q1k64r02r47r29n03L43L73
2155a148J118J002P03J51m96o32j273p52m24R1O58R16J175M63K47l74r01j021
2173d97r29k45o9P24J062Q76P38P6k31j033r95p80n33J77N58J160Q58O96L30n98
2193A345p19j193p17n83J12Q25Q43J089O08K82n29q68r02j039l26P8P73Q89R56
2212I24Q34j8l01r08r95r15m87K82M61J123R37P54J33m54p36j182q08n06J97O26
2232a039R55J189M96K49m39q67j057q97l21J2P43J002R92O46R3k91j005r50q68
2251a357m73J59O35J092Q76P25J96m67q26j108p71n37J73O77R70J051N77K50n02
$$ y = [1479, 513, -488, -1197, -1832, -1577, -1084, 70, 874, 1542, 1887, 1303, 590, -521, -1246, -1825, -1740, -888, -126, 967, 1586, 1869, 1343, 439, -370, -1447, -1734, -1685, -959, -43, 866, 1762, 1681, 1417, 515, -432, -1361, -1864, -1521, -1148, -30, 972, 1675, 1826, 1330, 698, -575, -1327, -1751, -1660, -1002, -86, 1089, 1552, 1799, 1425, 524, -497, -1426, -1671, -1740, -1016, 46, 922, 1660, 1736, 1505, 472, -523, -1303, -1836, -1659, -1101, 59, 917, 1613, 1943, 1345, 626, -567, -1284, -1867, -1755, -930, -87, 1002, 1610, 1892, 1363, 495, -407, -1446, -1772, -1694, -921, -32, 924, 1758, 1740, 1439, 531, -464, -1379, -1866, -1584, -1123, 0, 937, 1691, 1824, 1370, 634, -548, -1356, -1862, -1665, -1039, -84, 1105, 1601, 1850, 1411, 544, -513, -1410, -1731, -1719, -976, 26, 1018, 1664, 1757, 1466, 461, -489, -1357, -1830, -1671, -1036, 56, 932, 1657, 1853, 1386, 560, -548, -1319, -1856, -1683, -1006, -36, 1015, 1592, 1842, 1340]
2270A340q21j008r03m09J36P18R72J008O53Q9l73r01r86q87m34J91O12J021R80
2289I98O87J29m59p70j124q27m88J77O37J022J029O49J33m27q42j030q98l99J20
2308a683P30R71R69O79J13l96q97r74r02l95J53O19J034R31O91J75m21q53j034
2327d90q56m63J81O37R46J018O59J90m75q27j017q65l96J05O85R89R48O40J45
2346A754m15q48j030q14m21J70O02J018R46O61J27m02q29j034p94m43J19O36J003
2365FR73O25J89m47q22j044q30l98J69O56R33R48O62J21m34q16r88q34m10J32
2385a609P02R10R36O34J56m25q24r74q32m23J31O03R83R74O52J32l99p88r89q38
2405a288m14J46O04R56R32O26J62m09q47r71p81l76J30N99R34R18O47J06l90q10
$$ y = [1340, 519, -489, -1392, -1801, -1665, -947, 25, 1033, 1686, 1775, 1402, 501, -485, -1372, -1806, -1615, -1003, 18, 998, 1685, 1814, 1355, 585, -539, -1366, -1854, -1677, -1040, -18, 1011, 1660, 1793, 1366, 524, -506, -1404, -1803, -1683, -953, 18, 987, 1666, 1779, 1383, 486, -488, -1390, -1785, -1632, -1013, 21, 952, 1643, 1818, 1397, 544, -490, -1346, -1809, -1628, -991, -45, 973, 1632, 1822, 1347, 520, -497, -1362, -1758, -1653, -968, 21, 969, 1609, 1754, 1339, 491, -539, -1353, -1774, -1604, -1002, 16, 962, 1623, 1750, 1348, 519, -515, -1309, -1752, -1633, -997, 6, 979, 1604, 1793, 1346, 524, -520, -1350, -1748, -1579, -923, 10, 958, 1620, 1741, 1307, 491, -497, -1331, -1741, -1609, -907, 3, 939, 1573, 1729, 1304, 480, -494, -1326, -1749, -1618, -1015, -32, 942, 1594, 1726, 1327, 539, -450, -1288, -1702, -1556, -952, 4, 936, 1562, 1724, 1315, 468, -503, -1284, -1660, -1530, -931, 3, 921, 1568, 1674, 1284, 474]
2425D74r58q18l78J14O17R36R36O10J54l85q03r76q35l97J43O39Q88R64O46J02
2445A673l96p76r69q01l72R6O31Q98R31O18J27m04p75r73p73m24J64N68R15R37
2465H95O15J81l90p69j005p93l94J03O35Q85R30N98J31l17q45q75q44l37Q2N99
2485i15R29Q43O43J08l15p97r42p31m67J48N51R35Q72O04K35m43o88r67q14m44
2505a655J26O41P91R60O26J29l64p79q51r00l22J03N72Q85Q64P02J7k87p81r39
2525d62p46m23K09M26R69R23N61J86m08o42j083o96l91L4O40Q32J005M83K00l41
2545A276q37q44q39k70l0O48R33P42O92P6k78q65q27p19n26K48M86R10P92O60
2565A428K55n08o17r82p20m98J41O57O71J035N51K03l90p49p59r71k55L4O22P89
$$ y = [474, -484, -1302, -1680, -1566, -949, -13, 923, 1533, 1687, 1302, 499, -477, -1312, -1709, -1566, -927, -39, 925, 1571, 1673, 1277, 501, -468, -1269, -1641, -1545, -914, -16, 915, 1533, 1660, 1256, 481, -492, -1265, -1689, -1525, -957, -42, 895, 1510, 1691, 1301, 532, -473, -1266, -1660, -1557, -922, -37, 893, 1491, 1622, 1305, 460, -415, -1259, -1596, -1514, -915, 14, 857, 1500, 1608, 1293, 496, -446, -1177, -1644, -1496, -945, -10, 862, 1466, 1701, 1258, 570, -397, -1211, -1655, -1529, -888, -97, 863, 1489, 1618, 1254, 475, -376, -1276, -1598, -1495, -923, -38, 826, 1528, 1545, 1258, 477, -462, -1208, -1631, -1422, -996, -27, 896, 1457, 1643, 1235, 593, -490, -1186, -1577, -1543, -903, -71, 934, 1417, 1617, 1276, 439, -405, -1244, -1514, -1544, -896, 37, 779, 1471, 1547, 1269, 404, -423, -1142, -1668, -1420, -934, -24, 768, 1428, 1683, 1175, 558, -424, -1144, -1642, -1501, -844, -173, 862, 1413, 1616, 1226, 477, -282, -1253, -1508, -1474, -852, -63]
2585f3Q40P20n7j98p60q75p73m31K84L13J018Q04N50J74l70n70j097o54l81L1
2605a495N64Q15J048L74K89l15q39q17q20k16j48P35Q28P26O96N4k13r16p52o62
2625a064n03K12M53R80O38O74J90m61n94r73o17n71K16O25O45J013M77K53m56
2644A137o56p79r50j89J2O08P29Q61O82o7j61p80p97q18l39K34L12J003P37O14
2664A393J02l53n69j099n16m77J02N41Q32R43L48L14l71p33q47p60k09j26O80
2683h05Q01P56N95P3j92r01o76p40m03J92M50R11O17O86J50m51n88q90o11m96
2703a522J93N39O87R16M64K65m87n64q46q05k42M2O12O68Q47N94Rk37p57p46p91
2724a161k47J76L76R07P16N75K5k94o00r66n68l81J67M51Q18Q40M16K31l83o45
$$ y = [-63, 777, 1497, 1440, 1242, 482, -393, -1166, -1597, -1313, -1000, 18, 822, 1372, 1546, 1176, 606, -491, -1145, -1526, -1495, -931, -116, 932, 1306, 1595, 1280, 441, -376, -1196, -1412, -1560, -825, 3, 729, 1425, 1479, 1266, 350, -402, -1064, -1567, -1355, -902, 78, 716, 1390, 1580, 1119, 525, -448, -1065, -1636, -1420, -795, -150, 863, 1340, 1593, 1137, 481, -298, -1248, -1437, -1425, -817, -88, 773, 1455, 1388, 1227, 447, -350, -1168, -1507, -1273, -961, 42, 779, 1393, 1495, 1142, 573, -526, -1042, -1519, -1417, -876, -44, 899, 1247, 1561, 1190, 457, -390, -1150, -1359, -1485, -805, -4, 752, 1347, 1420, 1228, 327, -349, -1089, -1492, -1300, -850, 61, 678, 1364, 1514, 1063, 475, -415, -1026, -1522, -1329, -790, -103, 813, 1277, 1542, 1055, 491, -355, -1160, -1402, -1360, -748, -80, 767, 1361, 1370, 1133, 376, -370, -1161, -1408, -1232, -856, 51, 767, 1342, 1367, 1073, 473, -493, -1061, -1442, -1275, -824, -6, 834, 1250, 1481, 1098, 453]
2744D53q72o90k39l2O55P52P49N10R4k43p83p14p04l37J62M75Q40O36O23M1l76
2765A000n99q73n85m32K54M99P03Q28M45K01m43o11q25o77k85R1O06O98Q35M77
2785A307K1k84p08p33p34k44J56M98P96P24N17K8l52o59q18n75l29J68N19P82
2805H0P41M40J13m17o22q01o42k68J17N83P44P60M03J00l35p12p33o18k59J43
2825a183N36P42O92N09Kl48o56p53n87l03K04N09P48P08M40O1l99o55p25o20k74
2846a352J75N39P09P46M36J3l53o58p36o24k28K05N23P31O89L99O6l67o83p51
2866e21n48k35K10N19P24O81M07M1l98o62p00n85k30J70N55P41O70M18k7l58o85
2887A87p16n66j93K01N46P23O85L69m3l71o83o48o15j74K35N63P08O12L83ml98
$$ y = [453, -419, -1109, -1348, -1380, -725, 27, 776, 1286, 1380, 1137, 354, -360, -1064, -1401, -1239, -764, 76, 712, 1335, 1376, 1000, 401, -472, -1057, -1489, -1235, -736, -33, 795, 1240, 1441, 998, 387, -438, -1115, -1400, -1309, -703, -5, 830, 1307, 1328, 1044, 336, -397, -1131, -1375, -1219, -721, 75, 799, 1316, 1344, 992, 333, -485, -1060, -1389, -1221, -702, 80, 821, 1261, 1374, 957, 335, -466, -1108, -1376, -1259, -676, 68, 828, 1231, 1331, 996, 284, -449, -1067, -1326, -1183, -647, 95, 787, 1296, 1298, 950, 294, -459, -1046, -1349, -1145, -636, 112, 820, 1260, 1321, 922, 267, -458, -1078, -1352, -1177, -638, 71, 817, 1253, 1266, 913, 255, -481, -1105, -1333, -1128, -605, 126, 815, 1214, 1280, 913, 230, -521, -1069, -1304, -1094, -575, 149, 830, 1237, 1278, 880, 218, -482, -1067, -1297, -1127, -572, 169, 839, 1257, 1230, 872, 187, -529, -1095, -1288, -1087, -541, 182, 867, 1236, 1193, 822, 139, -509, -1124, -1298, -1063, -500, 208, 820, 1203, 1199, 801]
2908H01o17p25n51j89K29N17P33O79L66l7l90o42p30n21j87K23N58O95O26L75
2928A213k8m36o54o36n15j85K35N26P05N96L72l5m08n97p31m76k00K59N47O82
2948B34O38L31l7l98o72o68n39j55K61N76O98O09L48r5l97o45o82m54j30K53N06
2969d18O89N61L46p8m03o40o85m12j49K34N74O35O54K72l9m61o25o45m89q1J93
2990i67N92O44N87L17r8l81o96n92m39j54L12M98P39M89K74m2m49n88o67m03j30
3011a154K90N50N63O28K34l2m48o15o25m84n1K31N84O25N61K92j35l31o90n85
3031e92m56q2L09M79P13M78K72j26m19n69o83l03j19K62N30O41N46J87j8m57o05
3052a2n96m23p5J95O67N76N13K75j30l72p24n07m27p1L16M69P13L78L74k22m44
$$ y = [801, 184, -541, -1092, -1281, -1052, -535, 198, 877, 1243, 1206, 816, 174, -556, -1077, -1264, -1041, -483, 212, 838, 1213, 1185, 749, 95, -541, -1056, -1241, -1006, -480, 225, 821, 1193, 1158, 750, 153, -578, -1054, -1254, -995, -448, 234, 872, 1203, 1166, 768, 96, -572, -1111, -1266, -1005, -429, 269, 878, 1226, 1131, 734, 89, -593, -1047, -1177, -924, -418, 271, 832, 1178, 1100, 697, 57, -628, -1040, -1189, -955, -381, 254, 908, 1180, 1141, 680, 55, -590, -1079, -1160, -967, -375, 269, 856, 1173, 1075, 694, -2, -594, -1033, -1187, -875, -377, 362, 851, 1125, 1083, 634, 46, -621, -1024, -1154, -864, -314, 249, 877, 1111, 1079, 631, 16, -609, -1093, -1144, -913, -329, 296, 857, 1149, 1014, 683, -7, -592, -1048, -1130, -821, -342, 371, 849, 1121, 995, 576, 7, -676, -979, -1098, -836, -306, 335, 881, 1068, 1050, 593, -12, -608, -1031, -1106, -911, -244, 332, 845, 1120, 990, 618, -106, -613, -1040, -1111, -795, -326, 387, 765, 1139, 917, 473]
3073D73m80o52l19j58M10M74N89N59J44k1n22m98o43l94K7J91O14N15N85J82j89
3094H87k85p12n21l74j7K95M32P43L42K63j75l25o40o17j90j80L61M89O07M42
3114H25J01O5n47n38n24l50kJ94O58M55M95K40j89l36o88l85m64oL10M58O39L37
3136G48L30k54l82n13n65k71j29M24L84N32N50N7m5m74m11o10l71R7J90N25M98
3157C10N60R8k00k35o61m43l87N4K22M45O83K95K46k24k97n71n36j52j36L23M28
3178a78N77L82Q4L1n58m37m98k59l0K01N88M08M73J05r7l88n42l44m23J0K68M60
3200a67N10L49K94k57l56m61m56k61m5L46L55M87M11J20r0m50l43n86k30M1J62
3221f27M94L99N20K2j18k86n36m30l14R0J70M34N53K85K03k23k38n48l76k25o6
$$ y = [473, -7, -659, -978, -1136, -726, -252, 337, 896, 1040, 1019, 497, -1, -644, -1038, -1011, -820, -206, 309, 894, 1076, 887, 602, -110, -631, -1005, -1022, -727, -295, 448, 790, 1053, 878, 553, -87, -704, -894, -1074, -713, -224, 383, 825, 926, 991, 444, -94, -618, -968, -970, -776, -118, 337, 832, 1072, 883, 547, -141, -526, -990, -996, -686, -228, 411, 748, 1078, 824, 442, -71, -636, -907, -1036, -612, -228, 304, 854, 911, 866, 392, -19, -629, -1000, -903, -713, -188, 310, 870, 968, 768, 533, -128, -571, -958, -904, -682, -237, 446, 741, 987, 763, 466, -105, -641, -793, -929, -606, -178, 399, 781, 865, 896, 338, -99, -597, -856, -886, -685, -97, 311, 784, 889, 792, 404, -138, -482, -905, -895, -627, -167, 343, 692, 986, 729, 373, -88, -544, -805, -850, -504, -149, 338, 749, 869, 779, 329, -14, -600, -830, -789, -627, -133, 266, 786, 808, 690, 404, -132, -562, -876, -786, -616, -182, 371, 656, 859, 636, 398, -150, -526, -751, -817]
3242h17K83L82N17K57J55o1m00l87m77j68m6K01M89L58L88R0n9l61m49l40l19
3263g64L0K09M08M04L32K11j96l14m07m00k31j2K82K93M29L26J12j20l11l19m66
3284e04j72kJ77L68L83L56J03p9k77m41l62k74O1J74L64M32K72J54j42k50m28
3305h7l52j98j7K08L15L98K73J19p9l26l23l77j62rJ45L48L67L00Q5p3k85l37
3327f7l11k06j1J57L12L61K73J41j31k34l28l22k09k3J99K80L86K19R9o2k58k94
3349b9l20j71m6J74K37L76K44Q0n6k65k72k71k20m2J95K70L37K07J17o4k22l13
3371e4k81j48n4J73K57K88K42J05n4k35k71k46j94j3J65K21K70K20Q8m9k07k21
3393Bk69j87l2J53K29K55K16J22l7k18k63k59j42m1J29K27K35K29Q4k6k00k33
$$ y = [-817, -534, -152, 365, 622, 777, 716, 316, -71, -548, -716, -762, -561, -72, 286, 674, 764, 705, 344, -105, -445, -764, -734, -525, -117, 287, 619, 830, 634, 320, -87, -487, -718, -730, -448, -155, 274, 600, 712, 592, 281, -38, -504, -676, -678, -501, -133, 250, 606, 709, 630, 353, -88, -450, -724, -663, -489, -125, 307, 579, 733, 591, 341, -87, -439, -637, -654, -446, -131, 267, 540, 659, 580, 254, -69, -446, -608, -617, -472, -124, 243, 543, 628, 555, 270, -67, -378, -584, -595, -438, -126, 235, 508, 649, 518, 284, -44, -366, -575, -598, -399, -119, 267, 486, 585, 523, 265, -29, -349, -520, -566, -392, -155, 221, 465, 545, 489, 224, -48, -319, -539, -581, -386, -116, 221, 428, 545, 481, 259, -54, -335, -483, -537, -364, -107, 181, 423, 528, 474, 239, -32, -278, -472, -485, -320, -99, 171, 391, 479, 430, 223, 2, -267, -454, -486, -333, -104, 151, 367, 489, 452, 234, -29, -288, -430, -471, -342, -115, 120, 349, 433, 407, 207, -26]
3415b6k20j77L2Q1K24K35J99N5nj89k10k14j14o1R3K21K01K13Q3o1j57k12k03
3438b12j46m3J15J50K67J68Q7m7j45j80k03j28l6Q8J67K03J56N6jj50j68j63j44
3461c09qK7J67K18J28J31l7j12k13j63j08m6O3J60K09J09P6nj21j43j52j37k5
3484b91L5J56J39J54O6%j16j32j43j00k2nJ71J36J25Q7l2o0j30j43j24j3L6R1
3508a15J79R6P3Qo3j13j52q7k6K2P6J26J29N2oo7r5j27p8j7oR0J27P6Q7lm6j03
3536C7j07n0n7JQ0J34P2J00l8k4r8q7p0q2L6Q0N9R3R1Lo3o0p1p6o8M0M3P5Q2O5
3566A40%k3o4k8j48nOL9N9M4J09j5l8j9p8p1J1l7RR2O5K8K2mm7n8k3l5l5K8M0
3597c6R3J1J5L0p9Pr4k6k9J8N2N3M4L7Rm4l7o0l3Kj2M3M2J4N0j4K4n3k6m7m0j
$$ y = [-26, -246, -423, -391, -310, -86, 149, 348, 403, 398, 209, -1, -215, -329, -390, -297, -76, 125, 338, 421, 360, 203, -9, -212, -358, -401, -286, -136, 131, 299, 386, 339, 194, 14, -189, -317, -353, -265, -98, 105, 261, 317, 316, 166, -2, -165, -309, -317, -290, -123, 95, 223, 354, 317, 205, -8, -171, -279, -325, -262, -102, 107, 216, 292, 287, 166, 23, -129, -266, -291, -256, -100, 39, 193, 259, 259, 143, 11, -132, -232, -254, -259, -88, 48, 173, 260, 228, 168, 38, -105, -229, -242, -206, -115, 64, 160, 233, 241, 178, 65, -87, -174, -200, -178, -102, 24, 153, 205, 199, 132, 37, -90, -168, -185, -191, -101, 26, 102, 189, 186, 140, 37, -70, -120, -177, -176, -96, 38, 110, 210, 172, 148, 50, -37, -107, -189, -153, -73, -14, 79, 170, 173, 110, 50, -21, -97, -165, -125, -82, -7, 75, 140, 140, 117, 53, 25, -123, -128, -122, -83, -24, 20, 129, 114, 76, 57, -21, -92, -81, -118, -109, -17, 48, 76, 98, 94, 47, -11, -34, -69, -104, -76, -36, 57, 68, 83, 113, 34, 41, -53, -79, -108, -90, -38, 15, 59, 96, 105, 61, 24, -36, -69, -67, -79, -36, 6, 20, 70, 56, 80, 27, 1, -46, -86, -87]
3629h7M5L3M9J8K3lJ5j02k0k2jK4j7O8oK3%j6J6n0n1j2OOK4R7j3L2k3j7m6j8m3
3662f8l9N6K4N9K4J5ok2k7m3j2rm6P2L5K1K8kK7o4j2m7j2qJ6N9J1J3JM6n3m6l0
3695c9m8J7J2K7N5L8J6ljq2m2k4k9L2K8K3O3P6l3No9p0l7m2N9M4K1P0J1K5j9m1
3727D3r5l0j2mK6R5K5K9M4l7o3p9l0m7pP3L9Q8N3Llq5n2p5l7K3O8N6O9L9L0k9
3759A18p3q0p6j6J2O4K2R7O6J0kr8n7r3oj8O3M0P4P4oJ8o6p1j03k3j1N7O9Q5O2
3790A32QQp7n3j15o0j9M6R7Q0R3pJ9m8r3q9n8k0N3P4R2O1L5k6o5p8p8m8o4O8P7
3821e5J12P1J3Qm1j36r5o4J3M3N6J29O8M7k0l7j12j07n7kK7J09R7N1O2kp3j19
3849a4p8p5j8M7P8J29N3O2l0l5j09r2r6j0N3P4J06R7L0k6l6j45o9o4k4M4J17M8
$$ y = [-87, -42, -9, 40, 58, 81, 78, 93, -9, -29, -51, -52, -28, -45, 23, 17, 40, 40, 24, 40, -10, -61, -73, -67, -61, -37, 60, 47, 79, 56, 39, -7, -25, -68, -107, -51, -27, 32, 56, 71, 65, 43, 16, -27, -39, -48, -94, -22, 13, 34, 62, 60, 87, 23, 11, -36, -48, -56, -40, 19, 30, 43, 44, 90, 37, -9, -39, -87, -70, -58, -31, 24, 62, 78, 75, 74, -8, -50, -74, -103, -71, -43, -20, 43, 119, 86, 91, 22, -48, -85, -127, -68, -24, -3, 67, 78, 103, 84, 43, -52, -82, -94, -98, -72, 23, 48, 77, 121, 84, 21, -58, -88, -135, -142, -69, -30, 58, 111, 114, 111, 26, -26, -101, -138, -115, -47, 9, 78, 117, 147, 118, 45, -35, -111, -127, -115, -51, -29, 68, 134, 144, 142, 44, -13, -106, -112, -130, -67, -27, 47, 121, 115, 133, 67, -4, -107, -130, -141, -84, -15, 70, 132, 140, 148, 71, 18, -97, -157, -176, -130, -33, 47, 140, 133, 152, 104, 11, -78, -136, -156, -103, -29, 63, 124, 159, 133, 68, -10, -88, -136, -200, -132, -55, 57, 128, 141, 149, 108, -28, -123, -187, -174, -131, -75, 54, 122, 169, 149, 112, 0, -107, -164, -166, -139, -30, 67, 118, 180, 178, 105, -14, -92, -167, -185, -138, -60, 69, 122, 184, 154, 119, 10, -82, -178, -188, -135, -61, 45, 142, 172, 146, 110, -35, -104, -168, -192, -148, -31, 17]
3877A7J17N6k6m6j15q7j05nP0P5Q8J40PQj04o5r1j15k4M4J14J17O8L8k3l7j11
3904Ej31o2RK3R6J01R5N7k9m7j25j24n5j1N2P5J31O7P8oq2j05j21l9k8L9O1J33
3932E7P6Q9j3j04r0j11r1JN4O5J16R7N2m1p0j03q1q6MK1O1J40J21J9Rq7j52m7
3960i4p1j0K3R3J04Q9O0nq4r7j34q4J7N8R0J05R6N5l9n6j02j13p8k2N7Q7J14J03
3988A62K3j6o6j08q6j17lM7P5J40Q0O2j7n5j43r0n8j9M5J03J11P9K8pp0j17q9
4015a06l1o1M2J03J00J25j2K4o7j14j05q2k0O7R0J36O0K6J0r7j07p3j09j1P5Q6
4041e1J33N6N7Jj23r1q2p8J1L2J21J04Q7OK1j28q4j21m8%O0O9J27Q2J2J9j16p4
4069Bj26r4K1O7Q8J19N6O0m7r1o6j09o5k1Q1J13J00N6K8j7q9q2j11j4k7L1J20
$$ y = [17, 134, 190, 164, 118, 3, -84, -189, -194, -124, -49, 39, 179, 186, 194, 90, 25, -66, -181, -205, -161, -47, 70, 138, 176, 153, 116, 5, -126, -188, -179, -156, -60, 41, 136, 193, 164, 117, -8, -132, -187, -198, -146, -71, 60, 127, 205, 199, 117, 12, -109, -148, -176, -137, -76, 57, 133, 222, 209, 105, 15, -96, -187, -186, -132, -67, 49, 146, 198, 157, 87, -16, -97, -183, -179, -158, -97, 43, 164, 183, 192, 105, -47, -94, -165, -175, -152, -59, 45, 134, 194, 189, 105, 8, -126, -210, -193, -135, -45, 60, 156, 211, 172, 116, 14, -99, -177, -199, -142, -55, 59, 162, 185, 169, 103, -5, -91, -208, -211, -164, -89, 51, 131, 193, 176, 121, -22, -112, -170, -189, -144, -41, 70, 149, 177, 170, 100, -17, -106, -137, -198, -156, -53, 47, 172, 160, 184, 117, 3, -102, -184, -204, -137, -47, 89, 149, 175, 185, 88, -19, -92, -201, -212, -137, -51, 82, 138, 195, 196, 73, -18, -100, -178, -167, -135, -14, 90, 177, 183, 204, 76, -8, -129, -177, -177, -117, -48, 79, 161, 173, 192, 76, 2, -124, -218, -197, -130, -42, 77, 133, 193, 146, 55, -11, -120, -185, -206, -125, -12, 88, 144, 172, 155, 66, -16, -127, -141, -168, -137, -17]
4096a7J07P3K0k5r8j01r2o2K4O9Q5J08P0N1n6p5j21r4o4K1P2P9R3Q8J7l4j09o3
4124c4j11l7KN0J18J21O8Po2q4q2o4o6M7K6J07R4O6J4o8n9j10q9j4KO6Q4J22M5
4153A59J2m7r0j18j00K5J9K7R4J13N7J2o3n4j17q8j6M1M0J14Q9M3j8l0q3q6r5
4180a60L4J2M4Q7J05O8j1o2q5r5p3j7kJ21P9O7M1k4qj20o6r9j2L1L9J27J13L7
4208A71l9n5r4j04k5k5N1O5P5J18K6Kp1r0r1o2J5L7P5P2R5J8k7n4q9q7p6L9L6
4237i4P1R4O2M8n1q5o1q8n0j3N7O4J15O7kj0q3q8q8l6M8L2O9J01Q9k1k4m2j06
4266b5q9m5PP5R4O7Q2rn1o2j00r5k0L3M9Q0Q0Q4kp7p0p7n0p0N7O0Q1Q7M5j9k0
4297A00p8q7o2k2L7Q1O2Q5L1Pp3m6j28n2J7N6L7Q2R3nmm1j04p1m7j1N7L6J19N3
$$ y = [-17, 90, 163, 183, 158, 60, -41, -133, -195, -171, -102, -17, 91, 161, 212, 156, 81, -40, -134, -198, -177, -105, -26, 67, 155, 172, 138, 29, -34, -145, -182, -180, -130, -12, 109, 177, 184, 122, 38, -44, -108, -174, -127, -101, 6, 100, 166, 180, 112, 53, -57, -146, -160, -158, -92, -8, 114, 159, 171, 124, 34, -84, -184, -159, -140, -113, -19, 94, 151, 163, 100, 46, -71, -159, -175, -134, -94, 20, 109, 152, 134, 104, 21, -65, -160, -126, -114, -70, 17, 122, 190, 179, 117, 32, -63, -136, -153, -155, -34, 45, 112, 153, 129, 121, 1, -65, -164, -176, -145, -106, 21, 134, 171, 132, 77, -17, -121, -146, -171, -120, -55, 20, 138, 164, 166, 95, 5, -86, -148, -133, -96, -21, 51, 146, 164, 137, 83, -6, -93, -169, -130, -94, -23, 71, 133, 181, 130, 45, -16, -104, -154, -167, -110, -46, 69, 136, 134, 124, 41, -47, -135, -171, -123, -91, -22, 79, 168, 147, 123, 81, -25, -114, -159, -152, -77, 17, 84, 166, 157, 106, 44, -56, -151, -171, -138, -89, -9, 71, 155, 153, 76, 6, -71, -121, -191, -134, -74, 7, 94, 139, 120, 100, 22, -65, -127, -149, -112, -31, 31, 116, 147, 154, 81, 35, -93, -145, -128, -72, -35, 47, 140, 135, 131, 90, -14, -85, -132, -143, -86, -50, 69, 122]
4327A22M5l3o2r7r3m0m8M9J05J17P6K6j8p9j17m8q6K7L9P8J13Q1L6n0p7j08q2
4354a24l5K8L1J26Q2N7K7j9j14r3j14l9J8R4R2P4P4K0m7j11r7r6k0K6O7J04J10
4381A21M6L0p9q7r9r1m3M6R5R2J31L4j9k0j36r2p2n9O0J11Q3Q8O3j1n4j12j47
4408a21o0J7J8Q7J17R3M4j1q4r5j35n0k2O1P0J57R6J2j3r3j13j15n8j4O0J13J34
4435I5J04N6n1p9j52j13m7j2O8J21R8J28M5p2q9j46j16o8rO3J37J73M7N3o1r1
4461H2j21j37n9J0O7J38J30J34K0o3j28j36r8r8K1R4J58J34R0L7o2j45j18j11
4485a61j11K2J16J48J37Q7N4r1j23j58j23r2M9J06J20J60J15Rn3j46j84j07p1
4508b97L2J38J48J44J21lq2j38j73j30m0PJ63J55J37Q9L4j15j34j75j20n2K1J32
$$ y = [122, 167, 134, 72, -25, -118, -158, -206, -157, -52, 65, 141, 167, 149, 70, -47, -95, -181, -154, -115, -37, 76, 157, 193, 143, 66, -42, -124, -159, -131, -100, 26, 108, 165, 192, 173, 59, -34, -148, -187, -169, -75, 17, 91, 165, 185, 138, 27, -70, -166, -186, -160, -93, 11, 121, 167, 197, 118, 31, -68, -159, -202, -156, -61, 31, 162, 196, 177, 157, 21, -71, -143, -202, -142, -31, 52, 140, 203, 192, 138, 26, -121, -181, -164, -146, -59, 58, 151, 195, 184, 100, 5, -130, -180, -202, -141, -71, 86, 182, 194, 181, 88, -25, -140, -198, -212, -152, -39, 95, 199, 255, 204, 125, -27, -140, -187, -199, -131, -10, 88, 216, 261, 189, 100, -46, -162, -230, -239, -176, -39, 134, 181, 234, 173, 82, -39, -176, -235, -225, -158, -20, 110, 244, 264, 201, 73, -63, -161, -259, -238, -144, 14, 148, 238, 275, 213, 68, -50, -161, -272, -250, -134, 14, 151, 238, 292, 201, 78, -80, -203, -295, -246, -140, -20, 140, 255, 264, 211, 65, -119, -226, -297, -265, -127, 21, 165, 286, 283, 201, 63, -110, -240, -280, -273, -110, 45, 182, 271, 305, 190, 56, -119, -239, -291, -270, -138]
4532a38J84J67Q5kj05j62j72j49l6Q7J03K20J21P8J3r7j70k05p9p7O9J60J38J78
4556B11J33k4j31j39k26j21jL6J68J91J19J34m1q5j94k12j51nO1J57K28J44R0
4579C42l6j15j84k19r6m6P4J91J76J63Q6J4j64j71j95j73J2M3K10J61K04R8l3
4602C42j43k11j70j61j4Q9J79K07J77Q9m1j36j93k16j10p4J15J78K11K05L8j9
4624C42j58k04j77j77NO0K00K41J67R1q7j02k55j74j27l6R8J98K61J66J00q5j73
4647A74k18k07j03n6J32K03K34J71M6qk04j83k30j50%Q6K46J87K08P3p6j31k63
4670f9j68j79L1J09J78K68J45J04o8j64k40k15j32l0J64K02K26K31J3l8j76k07
4692a5k52j39j2R7K74K10K18N2p1j42k82k20j82N5J23K06K76J39R4o5j73k48k66
$$ y = [-138, 46, 213, 298, 296, 191, 29, -143, -292, -328, -241, -138, 82, 203, 281, 294, 197, 27, -178, -257, -334, -265, -105, 33, 211, 344, 320, 189, 50, -176, -297, -298, -262, -94, 97, 216, 350, 309, 224, 30, -182, -333, -338, -277, -120, 108, 252, 342, 306, 191, 7, -212, -308, -354, -280, -89, 87, 250, 336, 350, 186, 15, -180, -353, -341, -298, -88, 73, 277, 375, 342, 199, -12, -182, -343, -357, -268, -89, 118, 295, 384, 343, 207, 14, -202, -312, -386, -271, -93, 118, 323, 361, 342, 184, -20, -197, -374, -369, -309, -109, 132, 299, 390, 303, 201, -54, -228, -355, -391, -293, -95, 166, 332, 432, 347, 174, -44, -251, -354, -410, -278, -75, 159, 330, 376, 368, 164, -19, -249, -399, -399, -313, -67, 120, 328, 401, 325, 194, -69, -237, -416, -385, -276, -98, 170, 315, 419, 351, 187, -53, -268, -400, -430, -266, -64, 162, 393, 406, 368, 192, -15, -267, -406, -418, -321, -47, 163, 381, 433, 362, 220, -62, -282, -464, -409, -286, -80, 196, 335, 429, 364, 191, -57, -323]
4715c23q6l0J56K35K18K25M3l2k29k59k44p8j3J02L20J63K18N9m3j78l02j79j72
4738d29J2J65K23K28J73J03j23j52k74k40j60JK07K09K40J78R9m8k56k48k17j46
4760d55K1J41K40K44K29J8p3j72k97j89j69RJ33K75K90J83O5j11j82l09k38r9
4782d46J2J56K39K85J70L6m7k51k59k06j66L4J20K86K33K01O6p8j85l07k13j53
4804d73J3J69K38K37K20J00j07k30k61k36j23NK01K03K68J97O6p5k20k62k89r5
4826d54LJ31L04K61J94K4n5k35k70k52j52M1J46K71K90J85K9j06k05k75j94j53
4848d72NJ95K49K64J72P5q8k36k51k59j19M2J71K39K57J69N4o5k21k39k62j62
4870d82L0J48K43K73J82J06j21k44k59j92j67J2J82K45K72J82M2o5k39k63k07
$$ y = [-323, -409, -439, -283, -48, 170, 395, 438, 406, 177, -82, -326, -404, -417, -315, 5, 168, 386, 445, 402, 224, -78, -257, -429, -417, -252, -29, 199, 372, 475, 352, 200, -74, -314, -474, -473, -266, -57, 183, 361, 460, 412, 156, -92, -309, -455, -434, -293, -53, 191, 420, 438, 365, 193, -104, -293, -462, -453, -320, -45, 245, 428, 493, 382, 200, -109, -347, -446, -434, -278, -39, 246, 416, 452, 405, 154, -105, -311, -477, -443, -323, -37, 196, 397, 463, 385, 200, -107, -320, -473, -460, -291, -53, 184, 404, 504, 397, 167, -94, -330, -453, -448, -247, -44, 224, 421, 487, 412, 192, -70, -359, -454, -451, -320, -16, 245, 439, 463, 408, 173, -97, -349, -501, -460, -314, -43, 247, 432, 461, 355, 150, -125, -319, -472, -467, -272, -23, 241, 413, 488, 400, 164, -87, -346, -465, -423, -252, -13, 244, 413, 467, 402, 181, -58, -320, -482, -452, -304, -61, 212, 394, 500, 379, 135, -124, -316, -483, -471, -289, -44, 228, 410, 452, 387, 148, -115, -322]
4891c22j79P1J29K60K61J91L8q4k20k20k49j33N6J25K36K68J91M9q9k17k56k38
4913c32j13J3J57K68K27J86N4q5k06k71k40j18M0J53K50K24K05J9q9j96k59k18
4935c31q6K2J26K28K53J94O1j01k10k41k11j44M4J12K51K52J58O3r5j88k73k27
4957c43j17M9J55K11K27K15L4j13j54k40k52j01j1J62K18K58J58P2j05j61k65
4978a03j80j30L3J22K25K44J78N2r9j75k54j97j24J5J24K16K26J97K9q4j67k44
5000i6j89j17J1J39J99K42J50N7o5j88k26j90j22lJ16K36K49J57L7m0k21j88k20
5023b72r0k9J60K10K17J82lk1j69k67j67j22J8J01J99J96K03O4r8j49k13j87j58
5046c95K7J16J94K31J22Q8r3j64k23j68q1k6J29K02K17J53L0l0j88j76k06j24
$$ y = [-322, -501, -430, -301, -41, 220, 411, 449, 365, 145, -75, -324, -457, -401, -276, -40, 228, 419, 468, 379, 162, -94, -332, -445, -432, -275, -7, 220, 406, 460, 375, 169, -102, -342, -460, -420, -267, -17, 207, 412, 431, 342, 146, -113, -331, -417, -395, -269, -41, 212, 406, 467, 366, 156, -85, -296, -440, -396, -284, -33, 219, 377, 440, 345, 157, -116, -343, -460, -411, -256, -45, 182, 397, 431, 318, 164, -76, -328, -429, -440, -278, -60, 198, 356, 428, 323, 162, -103, -283, -413, -380, -258, -33, 211, 389, 441, 342, 167, -87, -284, -408, -393, -269, -53, 173, 370, 399, 315, 148, -96, -285, -402, -391, -252, -53, 189, 339, 396, 331, 143, -83, -273, -395, -398, -282, -46, 203, 360, 397, 357, 136, -52, -272, -362, -391, -231, -21, 196, 378, 375, 354, 185, -82, -249, -371, -353, -252, -53, 143, 346, 410, 312, 163, -50, -237, -395, -368, -252, -58, 173, 295, 383, 290, 126, -97, -265, -346, -372, -243, -41, 176, 329, 359, 329, 141, -35, -241, -365]
5068c65L9R4K18J61J73L2m0j46j96k13j31L2J32J57J96J62M4p5j44j63k25p3K
5091c29J34J44K06J33L2l1k06j29j68j11K7R4J82J45J66M7n8j05k04j47j34OR8
5114b08J84J79Q1J17r2j53j50j89n5l3J26J09J96J49L6k3j73j39j97m7LP1J51
5137e7J79J00O1k6j00j96j50j10L4P5J35J99Q2Q4o0r3j92j40p6k4J11P9J80J32
5161B27P2k6j50j65j09j18k0R0J54Q9J68P0m2j03k13p7j37K2Q2J07J62J41Q0p9
5185B25j02j65j40o1m8J36Q5J77J20M2k0j25j16j50r2j4O2J28J44J28M8k2q3k05
5209d8q8j23K0K7J61J36O4R9m0q3j47j29n6q9J15Q3J85Q2M7L2j57r0j40p0j9O2
5235a66J08J16J54J4Qj00j30j03j53K6P6P5J32J01Q8m5p6j16j28p3n4Q9O8J43
$$ y = [-365, -326, -232, -14, 147, 320, 352, 312, 166, -30, -243, -374, -342, -210, -53, 143, 305, 349, 274, 130, -33, -258, -331, -329, -195, -51, 155, 288, 320, 289, 83, -46, -214, -325, -298, -204, -22, 123, 289, 336, 278, 173, -31, -178, -312, -306, -208, -24, 155, 236, 353, 261, 108, -42, -231, -286, -319, -193, -84, 112, 261, 297, 274, 101, -38, -235, -282, -279, -208, -57, 122, 222, 283, 257, 157, -39, -189, -299, -265, -190, -55, 144, 226, 310, 250, 157, -35, -175, -251, -275, -164, -85, 95, 227, 299, 273, 123, -42, -151, -269, -289, -199, -45, 44, 212, 282, 240, 137, -76, -153, -290, -268, -186, -79, 83, 224, 304, 225, 123, -42, -182, -243, -291, -155, -70, 107, 227, 269, 249, 124, 8, -142, -234, -248, -186, -58, 86, 214, 262, 240, 157, -48, -136, -259, -239, -212, -51, 85, 149, 248, 208, 125, -22, -151, -207, -296, -181, -98, 87, 169, 216, 248, 91, 1, -139, -209, -228, -166, -58, 58, 212, 226, 234, 134, 4, -99, -252, -226, -150, -75, 57, 158, 246, 201, 125, 9, -119, -192, -246, -157, -89, 54]
5259E4J00L2K1q4r7j62m5m5N1Q7J14J50qJ3l7j31r9p3l1mJ16J09R0R9n1l4j19
5286A6j08q6l7L1J22R3R5O8j6n6p4j17j11k3M7Q8O2J14N1N2j05o1j28j15J2K4
5312a62P8J09P9Q9k0l0j21q3q5k4RP2J24O7R0l2m9o4j16o9p3L3P5J12J04L6M3
5339A92o1o6j32q2m3MQ2R2Q8Q5J9o4p4p2q9p6L3P7Q0R3R4j4m7q4r1p8j7J5M4O2
5369c0J38L3J0l1o0r9m7p2J5L1R8O0R1J6k0p4p2j23rl1P1O5J18O5J9k7q5r2o2
5398a04n1OJ5J30O7O7J5on2j25n1p5K7L5P4J02R1lj5r5o0q8o9J2L5P2Q4O6K0K0
5428A44q4p4p1n6j4MJ34O1O9J8pm1n8r9o9%L1O1R2O4N7Kq4m8r0r3K2M2L7Q9M5
5459H4M6k7j9r4r4k5%KO6R6M3P1j0p2o2m4r3l1L9Q2O9P7J0K6m5r8n0m9m2J0N8
$$ y = [54, 154, 186, 207, 123, 26, -136, -181, -226, -175, -88, 26, 176, 168, 181, 144, 13, -86, -159, -190, -194, -78, 31, 121, 220, 169, 135, 16, -92, -178, -215, -184, -62, 31, 126, 194, 178, 122, 48, -69, -180, -203, -156, -68, -6, 108, 159, 211, 106, 45, -83, -198, -186, -162, -84, 25, 104, 193, 173, 143, 22, -61, -146, -170, -161, -89, 35, 102, 192, 160, 111, 47, -69, -138, -211, -178, -103, 9, 113, 149, 192, 131, 65, -67, -149, -192, -188, -106, -14, 74, 159, 178, 114, 40, -32, -121, -197, -164, -87, -7, 86, 180, 166, 119, 35, -56, -134, -151, -136, -92, -30, 108, 141, 151, 120, 60, -39, -86, -158, -143, -112, -14, 46, 137, 153, 133, 59, -13, -136, -145, -176, -105, -40, 78, 143, 162, 135, 50, -42, -104, -155, -149, -134, -4, 63, 130, 145, 139, 87, -38, -89, -164, -137, -102, -28, 74, 165, 162, 147, 52, -8, -96, -165, -153, -118, -46, 38, 104, 124, 144, 60, -14, -85, -141, -155, -151, -17, 44, 113, 131, 124, 83, 25, -74, -143, -143, -112, -51, 41, 105, 162, 164, 80, 32, -58, -151, -129, -87, -50, 39, 84, 130, 103, 84, -10, -104, -129, -129, -127, -61, 35, 78, 149, 139, 67, 5, -39, -132, -163, -124, -42, 27, 104, 114, 140, 95, -3, -53, -102, -144, -134, -76]
5490g6J06Q2N3mn2r5m7r9j4M2N6Q0M9M6K2m4p7r2o6m1L4N8R2P2P4k8l5n6r7l3
5520i0q5L8M7R2O4R2j2j9j09m6o9l7NQ4Q0N7N3Lm2q2p4n1k3J3K0Q9R5M2Qk7q3
5551C3m3j01l4J9L9Q4Q2M4K2m3o4o5j09pJ6N0Q5N9O5J2j4n9r5j09k1J6O6Q4R4
5580A06M4J8o0n3p0r2n6J4N4R5O1J01k0l0p0j03n6j6j3M0R0N2R1Pj0q8r1k6m0
5609a21k7N8M1J07P7J1nq0j26n1k6j5P4O2J02O0Qj0p2o3j22k9j3P0P4N0Q4K9k7
5638A20o0r5l8q4lN5R4P6N7M7o0o3n9r4m8nM5Q8R6N8N3l9o7q7j01k0k1N9O1Q0
5668D5J09Ml3n7o6q6o3K4J6J06M4J03Ol2k8r3r0n4l8R4N2J05O0Mk7m7n6j29j5
5697a42K2jJ25N6Q6K1j3q4o6p2p1oM3R1N7O7Q2r9nj07n3p8l1J06J5R2Q8JQm0j06
$$ y = [-76, 30, 112, 165, 161, 109, 14, -33, -132, -146, -104, -48, 32, 81, 127, 149, 105, 28, -64, -130, -171, -137, -79, 13, 85, 159, 131, 96, 40, -57, -90, -175, -137, -90, 2, 66, 158, 146, 127, 18, -28, -97, -134, -129, -45, 35, 92, 145, 148, 106, 24, -50, -101, -124, -111, -91, -2, 93, 135, 143, 116, 33, -10, -111, -145, -126, -87, -3, 79, 123, 145, 102, 38, -27, -136, -143, -127, -77, 8, 67, 132, 144, 130, 71, -24, -133, -154, -138, -72, 12, 106, 150, 168, 108, 55, -15, -107, -163, -149, -95, 0, 61, 162, 142, 112, 42, -61, -117, -133, -146, -106, -16, 36, 127, 134, 124, 36, -55, -81, -121, -148, -90, -49, 58, 135, 146, 141, 61, -65, -116, -142, -157, -83, -21, 81, 141, 149, 139, 67, 4, -118, -147, -160, -90, -16, 34, 118, 147, 120, 60, -35, -73, -157, -160, -105, -11, 65, 122, 169, 109, 46, -13, -107, -155, -160, -115, -27, 69, 127, 180, 141, 74, -13, -114, -134, -155, -96, -35, 45, 154, 158, 125, 68, 2, -84, -147, -123, -107, -1, 43, 146, 152, 120, 92, -1, -91, -145, -183, -89, -37, 68, 128, 132, 105, 58, 2, -127, -142, -120, -121, 4, 60, 146, 167, 154, 70, 4, -68, -139, -145, -102, -11, 46, 113, 195, 96, 91, -16, -69, -147, -178, -72, -57, 35, 123, 124, 132, 92, -14]
5728a4n9o7k0M0P5J03O2M1m2l1p9q3p7J9J7Q3J00O9L0k6l6j15o2p9J4M6Q1O4N2
5757A06N1Pp2q8j26pm5O4O3J05O7%L4r0q7p8o7ML2Q0Q4R6K4jp2o7p8n3m9O5M7
5788e1R7R6L8k4r1m8q9p2mJ7O9J08P9K5K2q0r4q0q4L4j1Q4R4R1M1l2n1r9l9j00
5818a54K3QP9J26M1L6k2l7q2r4o1pJ9Q1J10J05k7K2n9r0j08n4%j1R8Q5J03K9K1
5847A80r6q1q9o2m3O7R0Q1M0R8m5o4q7q1m5k7N1O7P8R9K9rm4q1j29j1l9JJ08P3
5877B9R3J6Jj6j18r3l7k2K1O8Q5O4O4j5o9o2j15l9qK3O6R8N4L2L0q7n3j17l3j7
5907a57M6N8J03O4L5j2m6q1p1l5n6P0N1Q1N3N3m2m1n9r1k9k7pJ03O2O9M7j6n5
5936G0o0p2p3k9P0L7P6P5M6nm8q2r1q5K3J8R3Q9P3J6mm5n8j17n9J8NP2P3O7N7
$$ y = [-14, -73, -140, -160, -120, -45, 58, 120, 161, 119, 88, 9, -74, -151, -132, -115, -32, 68, 137, 167, 141, 105, -10, -72, -151, -137, -91, -10, 54, 106, 157, 164, 92, 4, -122, -129, -174, -110, -47, 58, 125, 125, 159, 69, -18, -96, -163, -159, -127, -47, 37, 133, 157, 156, 84, 17, -61, -114, -163, -98, -51, 46, 142, 180, 156, 65, 17, -72, -144, -148, -131, -62, 46, 125, 150, 172, 92, -2, -82, -166, -132, -143, -59, 35, 126, 167, 135, 84, -15, -54, -154, -131, -123, -44, 82, 123, 159, 137, 100, 18, -76, -137, -144, -125, -44, 66, 171, 144, 166, 107, 17, -91, -145, -145, -156, -58, 27, 130, 159, 180, 84, 3, -86, -148, -191, -124, -34, 47, 87, 185, 140, 76, -11, -92, -137, -164, -113, -46, 32, 131, 160, 151, 107, 26, -103, -114, -153, -152, -44, 29, 122, 138, 139, 123, 5, -88, -125, -147, -126, -58, 27, 91, 155, 140, 71, 9, -106, -145, -153, -130, -64, 34, 88, 120, 150, 63, 10, -107, -140, -157, -111, -53, 50, 114, 149, 137, 91, 10, -61, -96, -152, -82, -31, 50, 103, 156, 114, 73, 14, -77, -106, -133, -140, -37, 25, 94, 141, 125, 70, 10, -62, -135, -164, -94, -57, 19, 94, 140, 135, 87, 5, -86, -171, -148, -130, -37, 52, 125, 141, 137, 92, 34, -83, -142, -124, -119, -47, 26, 93, 150]
5967A50pp2l5r5p6k6K1N9J22N8M0j8m3q9n7q3nJ5O6J05P3J9Nl6r1q1l9l8O8O0
5997c0Q8P2K9l3jj11o6o7k5K9Q6Q9O0L3J2p5p8o8m6l8K5N2J02M5N9j9o9o6p8l4
6027a23k8K9N7R0R5K2Ko5j04n5n3J9J4Q5N2P0M1j4m1q7l8r5JK0Q2M5J17jj3p2
6057E2l5r7o9K3L5M7R0O2K2j3n1q1q6k3k8L7O0O8Q7L8l0l2q4p0k9m6M4P2J04L9
6087A06N8k6p0n7p1p1JL6M8J11K2N0j6k0p0j12k1m0M3P3N2P8K1k2m2n8q3m8PO
6117a15P3N9J05J3k6l4o3j00rl8L5O5R3N4J3Nm5p8q0l9n5M8J13M2Q4%pm7q7o6
6147h7o1J8j2J05P3L9Q2n0m5o6q5k0l9O6M5Q7L0P5m5p4kj39j8j4L8O8O7O9N2l9
6177A18n2o8o6n0rM6N1P9K1P6l9l5p7p9m3j8M7N9N6O6J3Om8r9m3l7mL6J01N7L5
$$ y = [150, 143, 71, 36, -59, -135, -161, -140, -81, 41, 99, 139, 121, 78, -11, -68, -151, -156, -141, -75, 30, 103, 122, 127, 91, 0, -81, -120, -158, -90, -30, 58, 130, 159, 126, 125, 14, -52, -119, -144, -115, -29, 60, 120, 153, 165, 90, 12, -56, -102, -140, -115, -63, 39, 84, 143, 124, 55, -11, -89, -123, -151, -122, -65, 25, 120, 142, 144, 79, -25, -80, -133, -114, -100, -15, 37, 107, 148, 134, 93, 6, -32, -127, -126, -106, -24, 21, 138, 137, 124, 52, 17, -80, -149, -126, -91, -44, 46, 108, 130, 117, 66, -15, -101, -124, -152, -115, -55, 13, 100, 138, 108, 76, -8, -78, -107, -153, -109, -37, 67, 106, 164, 138, 68, 11, -60, -131, -130, -94, -46, 65, 87, 137, 121, 101, 31, -81, -102, -142, -99, -26, 26, 104, 125, 103, 61, 3, -80, -128, -121, -115, -42, 17, 122, 135, 109, 75, 12, -88, -97, -135, -100, -35, 58, 112, 125, 130, 85, 7, -73, -112, -167, -119, -6, 36, 120, 120, 113, 66, -21, -87, -148, -130, -142, -37, 36, 75, 157, 107, 62, -4, -89, -109, -148, -82, -37, 50, 80, 155, 110, 36, 34, -105, -123, -137, -99, -31, 36, 105, 157, 118, 66, -2, -68, -118, -127, -81, -30, 49, 70, 146, 107, 72, -5, -84, -127, -145, -98, -39, 17, 83, 96, 102, 54, -45, -88, -125, -129, -93, 8, 65, 100]
6208A00J8k0p4l7p0j5j9J4J10J2Q6L1j8n7q1p6k3JL0N6Q3O8MJq6n2p6m7oN1M6
6239d6R9M2K6mm9r6m6l2l4M6Q1P1O2J1k3l1j29k8l5KJ3Q9P8M5K1qj03l9o1o3k3
6270a64R6O8L8M7jOm9m8j03k8NM4P8O8N0K1j6n8r0k1p8lN2P2Q8J4PK2p3l2p9l5
6302a02rK2N6R9M2K5l8j6r1n1n3m5O2J04K7O9M1k6n8r8n6l6QPP4J01K5K8j7m3
6332E1p2n5k1j2N0L4M9O9L6k5m0r0m0l4k9N6M5R1O9k0j5m7p4o7k0k0N6M0P0Q1
6362A16kk8l2p5o0m7K5OM4R4N4L8J0j03n5q4Oj3L8P5K8O9K7pq0l7p7n2K0kP8P6
6394E0L4L4k8m3o7l9p2J8lJ08N8K7J6Jn2l9p9l2J3KP7L3O0K4K3n1p5p1n1PK0Q5
6426a2M3O1J8j1m7l8q4l9J7J6K3R3O3jql4p5n2p3J4K9N5P9M2Qrk9n7n5p8L3L7
$$ y = [100, 118, 98, 24, -13, -83, -98, -117, -103, 7, 19, 105, 136, 118, 61, -20, -96, -119, -118, -88, -32, 51, 119, 123, 124, 38, -14, -90, -137, -143, -92, -46, 53, 95, 121, 117, 68, -28, -74, -106, -140, -94, -13, 58, 120, 131, 108, 77, -52, -80, -115, -113, -100, -11, 67, 112, 133, 125, 22, -17, -78, -141, -164, -68, 0, 38, 85, 84, 90, 41, -7, -110, -138, -133, -89, -11, 57, 107, 128, 112, 54, -36, -57, -135, -138, -86, -14, 74, 88, 95, 117, 44, 12, -67, -102, -111, -89, -33, 66, 108, 133, 95, 79, -12, -63, -116, -161, -99, 5, 32, 101, 142, 116, 58, -40, -96, -132, -124, -117, -43, 58, 83, 111, 94, 51, -21, -76, -97, -109, -59, -25, 24, 93, 129, 104, 64, -26, -66, -100, -129, -73, -28, 63, 132, 112, 97, 50, -24, -91, -111, -131, -75, -35, 35, 116, 114, 86, 54, -21, -81, -128, -103, -97, -53, 41, 95, 133, 143, 40, -15, -99, -93, -106, -68, 7, 35, 104, 131, 124, 44, 7, -70, -122, -102, -104, -26, 50, 84, 118, 90, 47, -20, -59, -131, -113, -116, -8, 50, 77, 93, 94, 42, 3, -76, -108, -95, -93, -16, 17, 77, 101, 124, 73, -2, -73, -124, -117, -97, -12, 31, 92, 110, 99, 52, 14, -70, -109, -92, -76, -53, 40, 103, 102, 94, 60, -15, -67, -140, -126, -97, -42, 37, 79, 87, 78, 49, -8, -63, -141, -108, -71]
6458g1M2N5P0pL6n8m5o6o7JL5O6N1N7K3n2j9o7m1j7k1J3N1O3K2J5K8o4n1n4m6
6489a18j2L2O7M1O7K3Ol8p1n6m7j1L1L6O0Q9j0K2n4n0p5Jp3M7P5M5M5L1pj4p4
6520Hn5m1m9O2N0M6M2M4m4l2l9m2p4PM8PP6Q2jnn7j8p9n7RL4J2J52KK6k9kn8p2
6554d7m0k9RO7N7M0N3j7k9q2l3n4LK6M8L9P0K9j4k1n8q0l1K1j1N5O1L6MPj6n8
6586El3n5j5m6J27O0L2J0%l3m2p7J0m6L3L9K0O0O1j2l4n0l6o5j9nL8P1M4K0QJ
6618G1p7l5n0j8K9K5N5N6M5Km8j9q8kk7J8N1NP8K1ml3k3p4k1k9M2oP7M7jK2m5
6651D4l9m9pm7J2K1O4O3Qj2j9J7p7m2m5K2L2N1N1K0K7n6k0l8l1k5P%P8M6%M5l5
6684F6l7j6p8k5lO0KQ3l%Lm4l2n6j4j5P5J5O6K6J7j1m4o7j7qj9J6N4N5L0kpm1
$$ y = [-71, -29, 26, 96, 89, 125, 67, 22, -44, -111, -110, -75, -9, 42, 99, 122, 70, 51, -16, -57, -74, -95, -82, -31, 32, 54, 69, 97, 33, -18, -72, -118, -130, -98, -31, 10, 77, 100, 106, 68, -3, -59, -106, -117, -86, -50, 10, 99, 89, 111, 57, 7, -68, -67, -140, -93, -18, 27, 72, 103, 96, 82, 8, -47, -88, -137, -75, -25, 21, 63, 107, 63, 31, -8, -50, -124, -117, -69, -62, 14, 96, 95, 90, 33, 15, -64, -121, -112, -78, -66, 86, 88, 114, 85, 83, 25, -47, -87, -116, -107, -40, 17, 57, 110, 93, 64, -18, -51, -105, -102, -76, -28, 11, 81, 110, 96, 75, 17, -63, -94, -73, -84, -29, 32, 68, 72, 79, 63, 5, -28, -83, -98, -144, -17, 43, 75, 85, 85, 52, 10, -67, -57, -103, -70, -31, -11, 49, 110, 98, 64, 14, -22, -87, -106, -111, -73, -2, 42, 62, 70, 71, -6, -41, -91, -109, -80, -55, 0, 56, 101, 103, 55, 36, -52, -54, -81, -63, -12, -7, 71, 92, 88, 55, 32, -42, -63, -92, -50, -56, 21, 68, 67, 89, 44, 5, -44, -51, -98, -86, -65, -1, 62, 70, 58, 39, 56, -21, -63, -108, -86, -54, -3, 48, 68, 95, 39, 19, -19, -50, -75, -68, -68, 10, 56, 56, 101, 66, 29, 13, -65, -90, -93, -33, -31, 52, 49, 49, 52, 8, -24, -80, -94, -109, -34, -19, 47, 73, 90, 79, 35, -32, -49, -57, -76, -60, -6, 49, 79, 77, 70, 29]
6718B9j7m7l8KM1K9M7J6J9j7l2n9m5MJ5rM8N1K1K1k0o1rl8l2j2L0N4K5L3L1k2
6750E8k9o2l5pk1L4O5L8J1kJ9pm2q1knL8N0nO6j4l4j9j8o7J3k9L8J7N4L2K2J1
6783H7n2n8k3l4k1M0L2M4L7j9M5l1o4Lq1M7J5MO2L5%Qn2m6k2pJ5kL0M0M8kk8M
6817E4n0n3k1%K4J3P5OLql5j8l9Kk6L1K3N0J7N5j1n6j1m8Km6M1QO0L9l1K2k2n6
6851fqj8m2J3M4M7L5qL4o0l8m4qOj8M5J1M8M5j8n8Ll8k9j7K9K2L9K3K9k7kmq7
6885e7J7J2n%M4K4mKLl3l6lk6J4J3N9J0J8ol0m1jk8K7l3O2j4O7rj3K2o0m7QJ8
6920b6k9M1J6M6K2k7k9k4j8RJ5JJ6nK6J7j4J5m1k6J1k1j0J6PL4J1J5m2k1j0k8
6952e3KqP1j6L1RQpj2p0Mk7J2N8J0K5K5k5j9k8j4k0J2J2rP4j1RK2m1k7lk0k3N
$$ y = [29, 12, -35, -73, -71, -30, -1, 46, 62, 81, 64, 32, -27, -72, -68, -53, -62, -14, 37, 58, 79, 59, -2, -11, -49, -81, -93, -63, -9, 16, 49, 80, 58, 29, -33, -68, -75, -96, -62, 3, 41, 52, 50, 69, 62, 20, -61, -63, -68, -30, 20, 15, 81, 67, 33, 14, -4, -71, -58, -87, -49, -32, 22, 54, 76, 87, 35, -23, -46, -80, -101, -61, -29, 15, 52, 33, 78, 47, -17, -14, -95, -48, -33, -29, 33, 68, 68, 76, 24, -22, -44, -51, -36, -38, -8, 32, 80, 78, 50, 54, 4, -49, -70, -70, -46, -33, 42, 48, 51, 43, 8, -10, -49, -47, -73, -42, -19, 31, 48, 103, 92, 36, 25, -23, -21, -67, -26, -18, 42, 81, 50, 72, 50, -6, -14, -32, -74, -61, -17, 30, 65, 57, 91, 31, -7, -51, -59, -53, -71, -26, -15, 33, 78, 60, 2, 5, -33, -62, -79, -50, -28, 11, 34, 63, 36, 34, 30, -57, -40, -28, -33, -33, 11, 35, 31, 33, 36, 3, -33, -36, -62, -48, -35, 24, 34, 52, 46, 16, -25, -26, -54, -27, -60, 2, -12, 55, 46, 33, 55, -5, -52, -44, -26, -55, -14, 2, 48, 70, 43, 14, -10, -28, -19, -4, -3, 13, 8, 34, 51, 37, 52, 11, -15, -4, -25, -35, -19, -12, 22, 33, 48, 6, -15, -25, -53, -51, -59, 12, -4, 27, 36, 44, 37, 25, -45, -41, -68, -56, 2, 12, 37, 62, 37, 18, -10, -24, -44, -32, -20, -29, 45, 34, 43, 65, 24, -3, -6, -26, -49, -44]
6987d4J0O0J6m2K2Nk8j4k8rk7O9k4O3Oj3K9n5j8Rl4JMM6M3K1j4l1j4k3k7MJ1%
7021b6K1L4QL7j7l8m1k9J4J6k1N0j1K6j0k6J3n1J3k1K5lL4J8L6K5l3j6m3j1k4
7052e1J1NM8NK5lJj5m8K9l5K3k0N3qL6oj2k5j2n5j6L3%L2J5J3K0l8%k5Mk4QK5
7087gJ2L1qLJ1qn7%mnpO1JJ7K4n1K3m3l4L5l5K3N5k7L5j9k2Ok1m3J7pM9MQK3r
7124C1j5k9Lk8j3PL2K4J6Mlj5k5k2MrRM2PQOJ3Pm4pm3ML8m0N5Ok8J8K6o1qj1j6
7162e7L9J7j1L2mJ0J2l8j0j2rjK0J8K1K2Pl6j2l9K3jj4L9pM6j6ll5K1n4J4k8J4
7196c2K1OL0J0Oj5j5l8j2oL5j7M5NK8Qn1j5Nk1J1j4PJ7K4KK0j9k5l0J7j8J5PK0
7231A1K3J9jj8l0pl5j7K3K6J7l%JLl8rJ3k5NL0JMJ1L3n6K6k7Om5KM1L5M%Rjj6
$$ y = [-44, -34, 26, 42, 0, 22, 27, -1, -15, -43, -52, -79, -10, -34, 29, 35, 22, 51, -4, -22, -13, -47, -46, -42, 4, 47, 68, 54, 23, 9, -14, -41, -37, -26, -26, -5, 29, 37, 74, 57, 19, -22, -51, -37, -21, -42, 8, -3, 23, 13, -13, 0, -51, -38, -59, -34, -37, -3, 15, 51, 76, 43, 27, -16, -27, -51, -40, -35, 13, 18, 43, 40, 41, 26, -22, 7, -28, -5, -25, 28, 20, 56, 50, 38, 13, 1, -54, -70, -37, -37, -5, 10, 23, 43, 5, 5, -20, -16, -40, -32, -7, 5, 36, 28, 31, 42, 34, -23, -23, -27, -32, -39, 22, 23, 40, 64, 13, 36, -7, -41, -6, -41, -18, 37, 10, 45, 26, 4, 10, -11, -54, -37, -44, 5, 9, 17, 40, 31, 16, -13, -10, -38, -51, -44, -12, 12, 28, 32, 29, 14, -11, -33, -29, -38, -29, 13, 20, 28, 34, 47, 54, 10, 3, -40, -36, 2, -38, 17, 23, -5, 13, 39, -22, -30, -41, -57, -18, -1, -12, 20, 16, 26, 38, 0, -10, -22, -31, -32, -12, 6, 27, 49, 56, 20, 8, -31, -8, -9, -23, 16, 9, 55, 39, 36, 1, 22, -32, -18, -46, -32, -11, -5, 25, 35, 41, 26, 11, -27, -39, -45, -10, -27, 18, 23, 51, 59, 8, -7, -2, -23, -12, -26, -19, -2, 22, 24, 44, 25, 0, -30, -13, -31, -16, -9, 11, 34, 53, 52, 34, 4, -3, -38, -55, -32, -6, 11, 8, 8, 9, 12, -26, -35, -22, -47, -42, -12, -11, -7, 4, 37, -19, 7, -20, -14, -59, -57, -16, 19, 23, 23, 32, 31, 15]
7269A5l8lNJ9jL0J6j6J4nk2m4J0J1j8J8K3j7J6K2m7J0m1J4qj4L1K9K1l%l5K3l7
7303b2J2l0K1PK2L4m0M6l8j4J8n1QJL3J8k6L5pjj5n0K3j4l0P0KJ0K7k7l6Qj2j7
7337c5kL0lLM5j2J2k2Jp4K0K3lJ6K2J5J9qj3m4qk6L8j0J8L0j0K5j9l0Ppjl4JJ8
7373a8J1QM5l1Jl5n8L2L3j0L0OQOKJ0m9n2L4jK3L2L6k2Jql1Jn7J2J6OmN5RJ1k9
7410B3l3J4j8k2k4M7K4Oj6M3m4j6Rj1J7n0J2N3%J5J2k2K1n7%l2J4M0J3pK7lLk4
7444A4k0j7J9j0jK7M6k2nk2pk3J1k3j9K8RN3Nl7J1k6j4jJ0k0K8jK3KM2m7jk7O
7479ij4j3L6PK6%Jk7qJ0l9jNJ9nL6J4Qj4m0m0K3k0LK1%N4K3rl4l0j5J1j8J5J9
7515eK4J7RMnl6rl0J1j9M2K2j6K4Kj3k0j2n4L9Jj2M0K9j3mMm4J1m0j2J7L2MN2
$$ y = [15, -23, -26, -21, -2, -3, 27, 43, 27, 41, 36, 14, -30, -20, -9, -27, -9, 14, -3, 13, 35, -12, -2, -43, -29, -37, -51, -20, 9, 30, 27, 27, -8, 15, -22, -10, -40, -19, -12, 10, 44, 4, 50, 12, -2, 16, -35, -27, -26, 7, 25, -1, 34, 27, 26, 11, -39, -16, -30, -60, 10, 12, 22, 49, 22, -14, -6, -18, -35, -37, -7, -10, -7, 38, 26, 38, 16, 17, -57, -37, -14, -17, -1, 21, 36, 55, 47, 34, -10, -18, -44, -6, -16, 2, 32, 22, 47, 28, -2, 5, -2, -3, -37, -36, -18, -7, 1, 46, 15, 16, -19, -77, -45, -12, -22, 8, 14, 22, 28, 30, 40, -9, -61, -27, -28, -5, 27, 63, 41, 42, 34, 3, 4, -53, -41, -25, -19, -23, 32, 41, 52, 23, -10, 4, -14, -36, -60, -13, 11, 17, 1, 44, 0, -16, -7, -18, -1, -51, -39, 14, 14, 29, 41, 19, 40, -17, -17, -49, -35, 5, 18, 11, 38, 35, 38, 14, -6, -23, -4, -14, -15, 12, 58, 36, 31, 9, 2, -21, -10, -33, -52, -24, -15, 38, 43, 6, 17, -9, -23, -24, -14, -34, -6, -7, 16, 18, 60, 13, 12, -15, -9, -23, -36, 0, 7, 33, 33, 34, 7, -1, 9, -30, -31, -26, -7, -12, 24, 38, 46, 32, -8, -48, -25, -45, -42, -21, -21, 33, 56, 47, 13, -17, -32, -21, -39, -24, -5, 19, 36, 45, 49, 44, 8, -1, -31, -20, -39, 3, 25, 9, 33, 35, 22, 2, -10, -64, -25, -24, -36, 4, 33, 20, 16, 20, -24, -13, -53, -65, -48, -16, -12, 40]
7550D0Mj2j0m3Oj6k%J0N6J6l0pJ5j2l7j2j8NK5P0k4J8qj2l7j9k8J8J7K7RK1J8
7584D8k0Km7pk3k6J4O0J2J1L8k3Jo5j3j9J4L2N0j3lM8k2j9m3l2qK0rN2K3K3J4
7617G0m2j5l4k3J6nl1K5N3N0j2l5rk1l2Pk8L6oL5N3Kll2Qn5l8J5K7M5RL6k1jP
7652E1m2l7j0PJRO1j9P2l3l7l8l3k5J7qN8M3KQmj0q7Ok1NK8J6M5K2Mll6rm9l5
7688h1L0JK2N0L8Nj7j4l5l1k1J4J8L6jN3K2n7j7m7j0m1K4rQ2K0KJ8mj8n2k4j4
7721e8kK4K8K4L5MJ6m4l4j7k0j9N3JN3L2J8k2m6m8n0k6O7J6K2N6J5J1l2l6n6o
7753d1l5OL0K1L5K7j1Ml9k8m2mJ4j0O8K9L2Lj6k4k0m8j5k5M2N5M5M1kk3n9Rq0
7786f1k9J8L1M6J9L9kj5k7m4n6qJ7mP4L0L8Rj5l1o0k2k6j0M3M3N4J7L8k9n1m4
$$ y = [40, 44, 32, 22, -21, -15, -31, -33, -33, -23, 33, 49, 19, 12, 27, 15, -22, -34, -52, -47, -22, 48, 24, 42, 34, 22, -15, -34, -62, -44, -27, 0, 9, 30, 48, 28, 30, -17, -24, -47, -73, -59, 1, 13, 24, 62, 39, 40, -25, -38, -57, -43, -11, 39, 26, 23, 71, 49, 30, -13, -45, -53, -33, -42, 10, 33, 56, 70, 28, 13, -21, -44, -28, -33, -64, -39, 14, 64, 52, 17, 8, -13, -45, -38, -66, -30, -36, -1, 52, 54, 51, 19, 27, -28, -66, -51, -24, 21, 30, 66, 45, 44, 51, 9, -28, -38, -31, -30, -21, 40, 21, 93, 60, 23, -15, -48, -73, -56, -64, -6, 37, 39, 47, 43, 33, -54, -48, -69, -64, -36, -20, 25, 47, 51, 48, 12, 3, -46, -81, -51, -50, -28, 22, 60, 65, 48, 34, -1, -32, -53, -39, -21, 15, 14, 67, 89, 32, 15, -32, -42, -83, -59, -68, 14, 34, 36, 54, 50, 32, -20, -44, -58, -60, -36, -8, 16, 51, 55, 71, 27, -7, -24, -44, -63, -10, -9, 44, 76, 94, 72, 26, -22, -72, -98, -31, -15, 7, 63, 78, 89, 57, 21, -35, -41, -76, -70, -40, -19, 16, 43, 32, 36, -3, -31, -73, -77, -63, -73, -5, 24, 56, 59, 43, 19, -1, -49, -64, -89, -47, 8, 53, 94, 92, 69, 10, 19, -61, -90, -72, -41, 5, 24, 63, 61, 46, 19, -25, -81, -89, -72, -76, -2, 28, 66, 75, 60, 29, -31, -53, -79, -89, -46, -3, 51, 68, 106, 77, 26, -18]
7818a8j6l5K0KN6N6%J8j5k6n2o4j3JO1%P1K8J3l3k7n7o0PL2k1M3O0J5L5n0J6o1
7851a4o7j1K1K0N7M0L3K4j6l1p8n1J7k7O9L4J1N9j2j1m3l1n4n0QN6N4K7K4M1m3
7882E6k4r4%l6L2N1K1L6O6Ml5o5k9m9k0J5M0N5K6L2%J4n2o9m1l0k0N3R0J6N6P
7914A06l8k3p1k7l6J8K8K2P2J8j3k0jm3n5Jn2O3L9M4N1K6l5j5p0n6J2l6O9K8K8
7945C4O3Lj1n9k0n4l0K4nN5L3N2Lqn0o3j8m2J6L6J4P1M2L2n6m1p0j5k5lM3N3L8
7978D2N9mj2l5n8n3l5L1M9K7K4O7Ql4m8j7l1l1o1Q0M0J9K0K7%o5n6k6j0j9L9N0
8010a3O9JL7k2o0l8j0m8kM0M3N1L8j3Qk1m8o7j8j6N0M7N1L3k6K3m0o9l4k5j1N1
8042c9M5M8K4L2n8m3l0m9j0PK4M6M4jM9k0j0p6l3Mm4M4K6M8N9pj2k1l9k7m9lM3
$$ y = [-18, -34, -69, -49, -47, 9, 65, 65, 83, 68, 42, -10, -74, -87, -86, -25, -25, 46, 74, 87, 54, 27, -30, -90, -83, -51, -72, -29, 31, 46, 81, 31, 47, -14, -81, -92, -71, -51, 6, 46, 79, 103, 87, 56, -22, -73, -56, -83, -14, 20, 31, 90, 78, 67, 24, -7, -61, -111, -103, -47, 7, 34, 58, 99, 56, 32, -62, -62, -98, -66, -15, 6, 42, 108, 112, 77, 12, -17, -66, -86, -71, -31, 24, 50, 82, 82, 96, 44, -25, -66, -96, -116, -63, 27, 43, 99, 106, 68, 45, -26, -53, -89, -71, -43, -21, 51, 69, 56, 36, 35, -8, -63, -62, -114, -51, -12, 32, 83, 109, 74, 59, -11, -67, -55, -91, -22, 6, 34, 97, 100, 89, 30, 10, -44, -74, -50, -55, 0, 33, 85, 88, 80, 30, -33, -51, -93, -77, -41, -27, 44, 86, 118, 62, 21, -49, -64, -89, -92, -49, 4, 42, 101, 97, 85, 50, -8, -61, -96, -65, -16, 11, 35, 102, 110, 76, 28, 11, -20, -51, -112, -32, 8, 27, 47, 74, 74, 9, -47, -73, -83, -102, -63, -13, 56, 57, 94, 72, 12, -26, -36, -84, -86, -46, -3, 48, 86, 73, 81, 60, 12, -55, -73, -89, -39, 8, 59, 92, 66, 89, 49, -20, -54, -79, -90, -39, 6, 54, 78, 110, 52, 9, -21, -70, -80, -73, -49, -3, 41, 40, 89, 69, 59, -17, -50, -46, -90, -46, -20, 28, 87, 80, 68, 47, 8, -19, -68, -71, -28]
8075b8M9K7K7Qnn0l9o2QrJ7N3L4QL9pn9l5k6l7jP6j5O0L2J6k2Op5m4j6kRM2O9
8110D8L4kJpr0Kl9k5K4L8N2M2rJ2k9m9o1j0jmM4N2J9K4l2nl6m2k5k9N5K9M5M4
8144G0rjm3Rp1k3ONM5M6pN0j3Jm1p3jk8K0L2L8M4K4qn0j9m3k3K1j1M8RM8K6k2
8179E6m2j2n3k5J0K7J6M5K2K9pk9
$$ y = [-28, 21, 48, 75, 83, 78, 28, -11, -73, -65, -74, -57, -4, 30, 38, 77, 70, 11, -24, -50, -87, -88, -12, -27, 33, 65, 81, 59, 65, -10, -54, -70, -72, -63, -21, 48, 82, 80, 81, 74, -16, -14, -53, -78, -54, -16, 36, 78, 69, 81, 52, 3, -58, -68, -69, -73, -29, 23, 42, 66, 34, 29, -7, -49, -74, -103, -48, -19, 26, 70, 61, 60, 17, 26, -45, -68, -62, -57, -12, 34, 27, 77, 64, 65, 24, -49, -50, -78, -58, -26, 12, 56, 80, 72, 22, 3, -40, -63, -42, -53, -5, 4, 52, 78, 56, 14, 2, -51, -76, -66, -39, -23, 22, 44, 73, 66, 37]
8191C7
$$ Imaginary data points
##PAGE= N=2
##DATA TABLE= (X++(I..I)), XYDATA
0@%%%%%%%%%%%%%%%%%%Qj4J4j6J6j6J6k2L0l2L4l9M5n0N8o6P2q2R2j02J14j27
40f7J42j58J74j93K13k34K58k83L11l43L79m15M56n06N61o22O91p71Q66r81J118
61E96j290J511j799K201k796L757n562J0049m1474j03785k1272k0438P7159P5594
75b7549J18478O5360O704l031j00512q9809r3093m1192L808L9057J15762P9432
87G3415P2630K3591k4163p8962j05434o7266o1216M149N3118R8286Q5908O3771
99A37827M2393m6167o7494j00694p3475n5902n785P8762O4232J03108O2530K8316
111A67651l0095q9015o1555j06166l6780O410M8476R1026O8090R2738J257k7993
123A24044n8951r8534o8761o0009K4752L9142P7126J00380N2922K5954l8119n5855
$$ y = [0, 0, 0, 0, 0, 0, 0, 0, 0, 0, 0, 0, 0, 0, 0, 0, 0, 0, 0, 8, -6, 8, -8, 8, -8, 8, -14, 16, -16, 18, -21, 24, -26, 32, -34, 38, -44, 48, -54, 60, -67, 75, -83, 91, -102, 111, -123, 135, -148, 163, -180, 199, -216, 240, -266, 295, -327, 364, -407, 459, -522, 596, -694, 817, -982, 1219, -1577, 2180, -3382, 6667, -34807, -138592, -159864, -180302, -103143, -27549, 90929, 156289, 162993, 159962, 59450, -30359, -123452, -164644, -160836, -121779, -6017, 73415, 146045, 169636, 145473, 66511, -38923, -106189, -167405, -163256, -110138, -11852, 74056, 137827, 180220, 134053, 66559, -34135, -107610, -163512, -169297, -90535, -26303, 76805, 139335, 167651, 137556, 48541, -13014, -119180, -155960, -149550, -101074, -10048, 58042, 150780, 152037, 124044, 65093, -33441, -102202, -162211, -137459, -98317, -21191, 79189, 132111, 158065, 119946, 64091]
135F4091r5487q2008l1847j369N2846P6111R6397N1387J8500k2320p2955q2772
147b9426q1182k6032p288N2049Q5308P2440O5427P126j2790p7823q2271n9351
159i3813n3357J6490L7898Q8181P3022N1034L4105m5240n5161q6854o6018l8650
171a38363l465O5776O2065Q3630N5934J5531k6882p2345o6743p7396l5026R573
183a27711M7211P3191P1115O1036Q346k6741o1551p4356o8241l6497J4418L8767
195h1013P5910P1096N4588J2461l2183n2092q5851n8579l5575P710M9739O4149
207i640Q3851M0309J6751k7214o6058o7702p0839k2637K515M6508P4652O2401
219F2897N3883O111k3719o0943p3610n4028l5724J1777M3780O7987O7238M4650
$$ y = [64091, -31396, -113404, -145251, -146620, -93774, -17663, 78734, 130121, 148621, 126301, 53346, -29426, -110608, -136640, -143928, -91879, -6571, 65869, 131296, 138422, 125632, 47809, -34462, -93813, -147170, -130680, -92782, -4601, 68421, 119455, 153560, 108320, 53159, -33695, -99713, -138363, -141828, -76052, -13987, 69643, 125577, 141108, 114226, 41881, -24862, -102258, -137284, -127711, -80500, -7309, 63806, 124842, 133188, 106447, 44896, -29460, -97701, -134198, -119780, -81013, -5103, 65993, 120581, 133042, 100859, 48767, -37084, -95663, -131238, -123528, -73789, -9640, 74211, 114520, 131271, 104057, 37999, -29703, -100542, -123179, -120664, -74156, 496, 62897, 116780, 122891, 99172, 38229, -35381, -89409, -125133, -113356, -69576, -1589, 65649, 110299]
231A10299J4316l0429n8246o9688n8154l1119J0179M5948O6055O7317M4214J2764
243A23456l2635n6208o8121n9531k4868O636M9011O1829O4500M5835M008k3863
255I0049n9632o3381n4960k8766J4942L8568O5909O0695M0760J0508l1522n1368
267C1802o7186n3227k3741Q318M6042O0371O2162M0954N397k6635n6620o3223
279c5586n1330k5122J2890M2238O0936N9765L6812P461k9136n3112n9706n1186
291h5076k0575J0117M2029N9290N4563L8928L654k6755n1225o1004m6072k3622
303a05748J3035M1638N6576N7645L3866N918k8422n2698n6920m8744j8750J2245
315i0359M0597N8030N1924L5457K809k8250m8575n7700m2848j9705J2228M0828
$$ y = [110299, 124615, 94186, 35940, -33748, -91902, -123021, -112842, -66894, -839, 66478, 110692, 123456, 90821, 34613, -33508, -93039, -117907, -111271, -62260, -431, 64069, 109904, 113912, 90049, 30417, -32964, -87924, -116690, -101748, -63180, 2729, 63424, 104184, 114692, 83170, 31802, -35384, -88611, -112352, -104034, -57992, 2379, 64541, 105495, 110892, 84257, 27637, -35586, -86916, -112038, -99148, -56910, 4026, 63791, 100603, 108064, 78928, 25816, -33890, -85076, -105651, -95534, -53505, 5785, 60348, 99276, 102930, 76175, 24950, -36054, -82126, -105748, -92713, -51075, 5501, 63146, 97012, 102930, 74508, 21810, -35110, -83854, -102604, -90359, -49762, 8268, 60192, 95649, 98458, 70208, 21633, -36067, -78915, -98620, -86392, -45564]
327d5564N2385N2933L1328L146k5932m9836n2614m4276j8015J3303L7826N4924
339I608M9189L1846L115k8543m6544n5023m1458j6596J1977M0728N0660M9637
351E8596L0024N61k5305m8303n0112m0089j6407J4440L5781N1156M5732K8119
363H4193K071k7333m3501n0207l8161j4494J2192L7696M8311M5584K7381L8k5694
376E8076m4808m9070l6717j4271J3987L7058M7451M4868K4460M49k5985m4502
388A0996m5127l6734j1100J2678L5196M7323L8932K6659k199k4472m1216m6123
400c5187l0821j5051J5421L4024M3800M1785K1218J660k7704l9925m3222l4253
412f8255r598J2418L6560M1796L9762K2916l235k4017m0948m0400l3064q826J4277
$$ y = [-45564, 6821, 59754, 91082, 94228, 68296, 18460, -34154, -78430, -96445, -83142, -45316, 9608, 58797, 90643, 93758, 65215, 18671, -36352, -77810, -94406, -82429, -41701, 8959, 58596, 88620, 89181, 63876, 15573, -34539, -74628, -91035, -76595, -40814, 10342, 56074, 84193, 86264, 58931, 15430, -34777, -72938, -87432, -75240, -37544, 10767, 56351, 83732, 83770, 58076, 13268, -35802, -72519, -86790, -72803, -35745, 11706, 56574, 81034, 81483, 55498, 10996, -34131, -70865, -81965, -69287, -34091, 13232, 52164, 78823, 76624, 52152, 10936, -35187, -66008, -81059, -65638, -31614, 12186, 53971, 75189, 76849, 49145, 9220, -34002, -68255, -77853, -65435, -28875, 12921, 52683, 75599, 72364, 48347, 7399, -33001, -66065, -74891, -60614]
425f0614L1983M2357L5956K2968n054k1939l7904m1528k7795j1332J6535K8138
437b8229M2359L6652J7017N78k6559l3994m2726k7202o487R507L5811L6711L7481
450E0919J6117k814k0246m1822l3629k9234n980J2220L0316M1337K7257K1308
462F5749m586k1729l5925l6023k1840j2561J7144K8132L6711L0155J6519K99k8275
475C3770k9501l6180k4184p339J3157L3608K8678L5604J4041m463k2262l4575
487C54k8419l0688j21J2845K6703L5287K6272J9781j1714j6345l1141l4838j8973
500e0997p770J8196K0082L6342K8508R352p90k3311k6201l6718j7211k733Q244
513d5007L0526K9173L0214P085j238j8805l5345k5104k2265k65P648K9357L2375
$$ y = [-60614, -28631, 13726, 49682, 72650, 67596, 45657, 7753, -33775, -61570, -72902, -56367, -28229, 14130, 50782, 67799, 68377, 41818, 7824, -34902, -62104, -68591, -59084, -23273, 13438, 50919, 67036, 64222, 43976, 2154, -31475, -60709, -66689, -54469, -24153, 17184, 44441, 65749, 61163, 39434, 3509, -32514, -54354, -66915, -49771, -21639, 15072, 45227, 61746, 62045, 33770, 4269, -31911, -56095, -63434, -50277, -16669, 12009, 47613, 61654, 57191, 34929, 354, -28065, -58753, -58874, -46029, -19326, 15961, 42233, 62014, 50300, 33955, 2814, -32024, -50997, -58767, -40571, -20489, 15853, 44361, 53713, 52923, 29612, 3411, -33307, -50518, -53251, -45007, -14481, 14692, 44906, 51991, 50753, 31948, -3397, -28501, -50766, -51031, -43383, -14026, 18349]
526A8349J8619J7064p704j6427l3314k4645j5681j0691J8749K1295L1214J9449
538C6277J3292r84k7140k0442k9628j6072n581J3583K8380J9413K9528Q092m905
551D3813k0476k6410k1386k4711M242J0978K2791K6252K1353J3469j3306j2049
563B4560k6551k5465j5052k228J6065J4523L1371J8752O759m100j8366k0141l0664
576c0537q245k558R364K3952K2704K3364O81L74j8125k7329j8812j5925L115N429
590c2548K6423K3466J3625J1547q389j3453k7968j6460j1886n738J6224J7316
602g841K4532J2406J0305m382k1192j6309k2179j0027m094J4221K0560J5808K1298
615C3106L782m235j8787j8309j7622j6649N456Q794K0097J8039J7108P222j1521
$$ y = [18349, 36968, 54032, 46328, 29901, -3413, -28058, -43739, -54430, -35681, -14386, 16828, 36277, 49569, 48585, 21445, 1003, -28625, -44697, -50278, -36695, -8315, 11098, 40626, 48718, 43813, 23337, -3073, -24459, -49170, -44928, -33950, -11159, 15093, 36446, 49915, 36609, 24560, -1991, -27456, -42508, -44736, -28671, -14148, 17223, 35975, 42734, 38634, 20268, 127, -30537, -38782, -41340, -31976, -8024, 14680, 38044, 38725, 39099, 20974, -6355, -25167, -41092, -37977, -32548, -6125, 17341, 30966, 42513, 34124, 20671, -7297, -23757, -35643, -41381, -25157, -7841, 16691, 29097, 39402, 35020, 13828, -2481, -24660, -34687, -38781, -24560, -4000, 11808, 33106, 36888, 32653, 13866, -4443, -22065, -38714, -33258, -24464, -4367, 13672, 30780, 38002, 26481]
628B6481r847k2327j7038j1612J358J2926J2147K4374J1833N081n940j4299j6228
641c091k2124m590j466R911J7639J7763J5818l21j295j5875j9190j4977r735L077
655b8456O471K0702J6243J1333N334p004j2062k0947j1546r188k42J1962J4535
668b865J8028Q475O638o581j4841j3942j5678n908j559J2438J4532J3564J3581
681B5882J345m266j5163j3580j3682r197M304Q085J5997J3216J1866K722q146
694A9383j0013j6587j1774p530K879R764J1888J6183Q160K979o493j1049j3606
707e816j3628l823M99R439J2645J3619R513K89l690j2685j3055j1555n296K639
721b0905P418J4749J1539Q689J490o005j0574j4365q995n780K412R059J1840J2457
$$ y = [26481, 16634, -5693, -22731, -34343, -32985, -20059, -7912, 16462, 28295, 33376, 27436, 13137, -3091, -25215, -29805, -31271, -21360, -3721, 14042, 29860, 29539, 28244, 12369, -6821, -21798, -31533, -28456, -21985, -1283, 14960, 26293, 31627, 24623, 12561, -8386, -19932, -29120, -29362, -17400, -2865, 15163, 23638, 30276, 23695, 8854, -5088, -20766, -26674, -28233, -15795, -1263, 12301, 25882, 27227, 22961, 7798, -5782, -19464, -28661, -24357, -16272, -275, 12941, 24807, 27529, 19383, 9370, -7217, -18991, -26521, -23642, -13878, -1990, 14193, 22353, 25332, 18839, 7790, -5816, -19444, -23267, -22768, -13329, -684, 12935, 22448, 22737, 19047, 6362, -6693, -18248, -23544, -20905, -13487, 1262, 12801, 21490, 22980, 16975, 6401, -7964, -16959, -22739, -20327, -11268, 572, 13029]
735A3029O478K477o271j0672j1584j0291l797J334R230J1022J0851P735M85m978
749A5048j0933j0875r598m243K979P804J1685J0106P245K71n867r595j1531q291
763a5795m041L177P883J0484J0370N650P03n834r058j0414q335k785K188P876
777g931R696R529N683k5m812r373r647p784k886K852P153J0056Q724N392q4n431
793A1112q779r649o992k588K895P334R257Q424M704j95n271q275q837o633k190
808a5683K710O918Q568P881M389l04m925p980q344o285j926K829O682Q447P386
823A0363M135o11n040p834q128n758j628L035O621Q068O980L624p92m916p402
838G17p546n289j396K896O221P551O456L334p92m682o960p166m943j180K830O117
$$ y = [13029, 19507, 21984, 15713, 5041, -6543, -16834, -20631, -19297, -10067, 955, 11806, 19541, 20026, 15048, 4115, -6760, -16358, -20601, -17622, -9818, 1867, 11973, 19218, 19489, 13622, 4027, -7504, -15795, -19836, -16659, -8776, 1708, 12078, 17728, 18431, 12597, 3539, -6875, -15210, -17995, -15807, -7931, 1765, 11294, 16977, 16952, 12140, 2767, -6880, -14664, -17550, -14698, -7545, 2511, 11235, 16627, 16543, 11112, 2333, -7316, -14308, -16896, -14001, -6667, 2590, 11014, 15718, 15523, 10252, 1977, -6860, -13493, -15683, -12973, -6055, 2513, 10394, 14783, 14479, 9554, 1574, -6770, -13055, -14981, -12152, -5470, 2977, 10363, 14498, 13887, 8847, 1013, -7115, -12873, -14501, -11466, -4845, 3223, 10203, 13827, 13035, 8119, 717, -6829, -12118, -13514, -10618, -4397, 3154, 9610, 12944, 12152, 7470, 510, -6656, -11599, -12779, -9949, -3832]
854c832P222O169L069j049m678o949o814m611r35L136N928P027N719K706j148
869A0960m709o470o442m164p37K882N694O414N417K420j127m287o225n905m068
884a0347n60K833N398O314M956K361j351m235o095n784l591n22L137N210O162
899C886M660J979j279m475n621n541l213l31K859N273N377M565J637j257m046
914D473n582m735l402M9K652M945N367L909K034j872l775n357m816k809k41L395
930e765M360N426L794J327j492m282m598m968k402K14K833M651M535M040P27j397
946G003l657m868m067k758P98K232M457M770L057J349k010l020n133l936j934
961g717m4L144L853N073K571R24j290m105m125m226j347pK720M579L587L275L41
$$ y = [-3832, 3390, 9559, 12628, 11579, 6901, -48, -6862, -11473, -12408, -9272, -3344, 3683, 9402, 12108, 10960, 6251, -219, -6661, -10825, -11562, -8680, -2986, 3428, 8845, 11265, 10138, 5851, -374, -6279, -10347, -10907, -8074, -2676, 3638, 8594, 10955, 9604, 5369, -726, -6510, -10101, -10623, -7486, -2276, 3886, 8546, 10525, 9246, 4771, -850, -6391, -9604, -9935, -7076, -1803, 3574, 8139, 9776, 8519, 4473, -1109, -5844, -9246, -9197, -6545, -1600, 3767, 7676, 9710, 7838, 4063, -1294, -6110, -8919, -9160, -5765, -1405, 4021, 7815, 9142, 7650, 3368, -1230, -6198, -8600, -8386, -5553, -902, 3633, 7673, 8400, 7003, 3346, -1522, -5589, -8347, -7549, -5317, -860, 3910, 6967, 8316, 6306, 3286, -1847, -5783, -7717, -7761, -4617, -764, 4309, 6880, 7804, 6514, 2409, -1716, -5942, -7289, -7296, -4576, 3, 3590, 6865, 7206]
978G206j110l860m277k895k502R28K227M338L578K511J370k425k847m360k970
993e088j988L84L462K934M324K254P93k045l571l077m127r10N35K830L531L244
1009C485L184o30j205l222l668k969j691J714J398L987L405K018L60k119k058
1024A989m632k304j019N40K619L005M236Q95N87j496l508l169l067q0j35K856
1040b683L740K475K201m62q31l947k885j939j617J333J930L957J906J983N73k466
1056C268k338l538j519j674J163K982K168L340J195M70k478k694k281l179m3P32
1072d426K807K471K643K181j320j065k984k547k416n79J818J144L527K257J460
1087D971n48j750j791l881j158o27J059K049K649L180M8L87j839k720k713j942
$$ y = [7206, 6096, 2236, -2041, -4936, -7438, -6510, -4283, 55, 3633, 6144, 7514, 5089, 2242, -2118, -5088, -7076, -6692, -3230, -296, 4028, 6282, 7075, 5030, 1459, -1618, -5745, -6655, -6120, -3290, 241, 3485, 6669, 6039, 4834, 1612, -2056, -5025, -6716, -5002, -3604, 383, 3788, 5806, 6166, 4047, 1989, -2643, -4947, -5966, -5426, -2807, 198, 4434, 5329, 5916, 4420, 912, -2257, -5324, -5404, -5539, -2683, 1057, 3532, 5733, 5271, 4440, 493, -2392, -4331, -5948, -4615, -2685, 1272, 3178, 5161, 5734, 3268, 930, -2608, -4127, -5801, -4638, -1656, 512, 3852, 5047, 5517, 3039, 345, -1936, -5115, -5158, -4426, -1619, 852, 3495, 5676, 4356, 3291, 307, -2240, -4656, -5235, -3417, -2273, 1254, 3511, 4971, 4423, 2673, 882, -2999, -4157, -4784, -3725, -1676, 973, 4153, 4201, 4588, 2749, 29, -2684, -4626]
1103d626M77J9K921K763K004J136p01r75l617j837j612o08J338J904L284J137
1119C007J510k91k119k121k708r15j128J625K394J917K441N46Q7k509k017k088
1135b369k072L44Q81K692J773K309J044j237j281k644j846j907J98J555J419K903
1151A762J539J011j030j482j918k882o80l27J447J707K444K158j21p1j957k116
1167e16k310j128M30N94K662K068J715M03p13j401k924j454j279J53J230K039
1183d31K528R42R65q80j765k121j983o81m51J734J902J957J643L26m68k212j742
1200g37j914j174L81J185K342J626J825K67j035j544k328j516j281N99J315J768
1216b21K295J160N14j118j474k041j979n84P3J541J651K168J346N7n81j898j884
$$ y = [-4626, -4149, -4130, -1209, 1554, 3558, 4694, 3993, 3018, -599, -2436, -4048, -4656, -3318, -1414, 1870, 3007, 4517, 4226, 2107, -14, -2722, -3637, -4765, -3140, -746, 1171, 3612, 4158, 4245, 1736, -281, -2369, -4441, -4097, -3216, -524, 1249, 3558, 4602, 3365, 2084, -560, -2406, -4313, -4115, -2560, -1141, 1762, 3301, 4312, 3282, 1800, -118, -3000, -3680, -4007, -2560, -853, 1591, 3749, 3628, 3557, 1600, -516, -2826, -3954, -3524, -2930, -268, 1800, 3515, 3918, 3205, 1804, -1120, -2574, -3853, -3700, -2470, -431, 2097, 3039, 4004, 3124, 1359, -762, -2745, -3426, -3877, -2143, -241, 1716, 3359, 3685, 3217, 1005, -737, -2651, -3825, -3444, -2259, 83, 1709, 3534, 3801, 2766, 1222, -1106, -2622, -3903, -3304, -1989, -221, 2074, 3234, 3748, 2630, 1156, -885, -2864, -3448, -3375, -1834, -183, 1985, 3331, 3388, 2807, 909, -975]
1233i75j890o47L93J127K239J725J404K3p86j664k276j393q87N12J318J994J955
1250B172R73L73j039j675j999j575n75J99J568J754J873J119J56q44j837j783
1266a140j663n90M31J357J990J665J270k4r99j695j998j370p11N88J360J926J809
1283B206J016P7j102j588j941j447n50M88J422J760J796J010k3q86j756j790j488
1300b796m77N55J345J893J642J051j14j006j702j888j313n14O24J413J848J708
1316B269R07k5j113j671j829j319m54N83J389J798J662Q81m5r95j694j772j321
1333b749m40N81J399J792J621Q97j09j082j690j750j312l56O28J482J815J539
1349B266Q80j78j097j665j761j214l49O11J432J753J532Q51j45j053j666j680
$$ y = [-975, -2865, -3512, -3119, -1992, 247, 1972, 3376, 3399, 2613, 949, -1327, -2720, -3607, -3095, -1777, 217, 2172, 3145, 3518, 2479, 804, -1195, -2770, -3345, -3146, -1578, 176, 2049, 3168, 3324, 2480, 643, -1140, -2803, -3393, -2962, -1605, 385, 2050, 3320, 3296, 2297, 602, -1396, -2766, -3477, -2889, -1529, 397, 2206, 3222, 3299, 2197, 609, -1332, -2779, -3329, -2841, -1419, 341, 2137, 3147, 3124, 2238, 482, -1308, -2796, -3273, -2718, -1373, 520, 2162, 3213, 3099, 2093, 391, -1497, -2810, -3324, -2700, -1287, 561, 2269, 3176, 3151, 2038, 367, -1462, -2781, -3235, -2652, -1263, 535, 2197, 3078, 3033, 2038, 344, -1428, -2749, -3189, -2608, -1209, 583, 2204, 3101, 2992, 1910, 220, -1530, -2842, -3198, -2570, -1088, 727, 2266, 3146, 2968, 1871, 206, -1555, -2769, -3118, -2507, -1075, 678, 2210, 3061, 2916, 1863, 197, -1483]
1365a483j247l67O55J395J768J527P95j97j033j712j695j201l10P07J441J756
1381G99J510P58j91j161j631j705j161k64O72J429J707J474P32j71j043j650j650
1398a546j153k67O28J382J751J437P47k68j026j646j651j138k57P41J396J772
1414I02J383O60j90j163j588j670j041k69P26J431J623J471O01j71j110j587j520
1431a512j181j51N55J473J646J325P67l16j011j669j523j051k72Q07J352J724
1447I63J263P05l10j176j462j682r44k63Q34J369J504J504M71j97j098j504j510
1464a533j134j6N29J399J578J341O66m24q30j706j443j025j23P43J172J850J082
1481B126O54k87j117j455j677o87l51P71J392J520J335L76J4j258j473j359j068
$$ y = [-1483, -2730, -3097, -2442, -1047, 721, 2248, 3043, 2846, 1813, 101, -1594, -2795, -3105, -2398, -957, 799, 2309, 3067, 2876, 1715, 84, -1621, -2782, -3046, -2374, -945, 762, 2236, 2968, 2797, 1754, 104, -1546, -2699, -2966, -2338, -956, 795, 2232, 2979, 2711, 1685, 39, -1612, -2750, -3007, -2266, -870, 902, 2285, 2945, 2755, 1592, 4, -1666, -2707, -2976, -2250, -819, 804, 2275, 2876, 2705, 1595, 8, -1512, -2693, -2844, -2289, -816, 830, 2155, 2922, 2606, 1595, -74, -1597, -2648, -2920, -2113, -761, 963, 2226, 2931, 2621, 1445, -17, -1699, -2643, -2906, -2072, -703, 801, 2305, 2776, 2579, 1481, -23, -1533, -2667, -2683, -2154, -755, 823, 2164, 2830, 2406, 1576, -130, -1573, -2598, -2721, -1978, -806, 1044, 2126, 2780, 2493, 1376, -79, -1756, -2443, -2794, -2023, -631, 889, 2224, 2600, 2614, 1356, -117, -1476, -2544]
1498b544n8M46J597J323J251P66m43q35j711j175j104k27Q86J129J641J049P93
1515B784m66j077j240j645p65k92R06J149J375J481L12j29j157j222j500j003
1531b489J80L09J400J295J372M46l77o34j696j178r97p1N95J032J838Q06O84l21
1549B194q84j410j540m45n04P98J188J442J143K70J92j334j212j233r01q8L71
1566a953J574R86J209O22k98q23j512q92j209j07P59R40J464Q78R15n52q84j052
1584F5j484o86l43R90P55J307J358K12o4j067r10j463q75J63K52J213J062J361
1602A846K53j96m81j507j011r87O3L14Q97J603O86P01k73o18j302j284l90n71
1620b257O63R41J324R11L24K44j136r63j176p08k06K47J402P51J142N07r1p20
$$ y = [-2544, -2602, -2156, -559, 764, 2015, 2781, 2338, 1503, -208, -1383, -2487, -2714, -1828, -699, 942, 1991, 2784, 2318, 1241, 1, -1644, -2409, -2701, -1795, -646, 729, 2210, 2522, 2393, 1236, 14, -1486, -2489, -2309, -2000, -600, 695, 2067, 2513, 2136, 1502, -194, -1372, -2369, -2440, -1845, -813, 1025, 1831, 2515, 2194, 1310, -100, -1640, -2085, -2589, -1791, -603, 839, 1982, 2252, 2444, 1110, -102, -1335, -2236, -2324, -1953, -379, 607, 1816, 2438, 2140, 1317, -195, -1087, -2296, -2403, -1644, -704, 760, 1638, 2553, 2001, 1117, 65, -1419, -2105, -2448, -1458, -703, 604, 1962, 2174, 2110, 1043, 133, -1330, -2205, -2042, -1790, -577, 485, 1846, 2099, 1903, 1422, -85, -1096, -2083, -2020, -1706, -809, 794, 1480, 2181, 1908, 1290, -12, -1296, -1686, -2257, -1594, -653, 671, 1582, 1906, 2150, 1014, 51, -1125, -1833, -2039, -1792, -390, 361, 1503, 2010, 1919, 1199]
1638A199j268o83j154n3M55P92J173Q23Q63m43n66r26j217o76l89P55N30J163
1656C78J110L30k3p85p13j296o94q9J90R30Q77J193K74k3l67j126r14q91n4J14
1676a579P49J236O61O74j23l83j043j012n44m75M20O52J097P57M33K39p47p03
1694C09j022o32l55K00R12O43J009M56J00m58r11o87r50j63J33O38Q48P81P28
1713A579j19l06p59q84o67m59L41M19Q93Q55N19Q7m59n63r76o38k97Q9N56P26
1733f3R28M28J30k60p33p32p68k55o1N20Q03O84O37J13j75o96p83o11m83J10L77
1754h90P77O95N32K97l26n27p96o42l71m2M53N94P53N41K59j55n55o66p29l85
1774a183r2L36O16P05O57J73l8n01o69o72m91m0K31O11O64O13L00j22l60p22o21
$$ y = [1199, -69, -752, -1906, -1959, -1504, -712, 461, 1284, 2147, 1704, 1138, 212, -1005, -1681, -2070, -1315, -785, 378, 1488, 1818, 1795, 1010, 297, -999, -1693, -1782, -1592, -662, 215, 1408, 1682, 1659, 1292, 166, -748, -1639, -1693, -1579, -830, 406, 1067, 1741, 1618, 1235, 192, -820, -1364, -1839, -1419, -767, 330, 1087, 1520, 1759, 1012, 309, -713, -1345, -1700, -1500, -588, 55, 1064, 1520, 1620, 1162, 251, -436, -1386, -1549, -1416, -778, 70, 851, 1579, 1460, 1154, 395, -489, -1156, -1615, -1274, -855, 38, 893, 1412, 1499, 1040, 477, -499, -1137, -1434, -1345, -789, -63, 865, 1293, 1423, 1163, 430, -302, -1070, -1325, -1386, -866, -63, 621, 1258, 1371, 1196, 500, -283, -894, -1377, -1267, -890, -113, 582, 1114, 1411, 1085, 558, -238, -880, -1251, -1293, -840, -246, 507, 1048, 1307, 1152, 597, -69, -798, -1183, -1275, -939, -323, 382, 1039, 1212, 1174, 673, 4, -668, -1159, -1199, -968, -357, 307, 920, 1220, 1098, 738, 16, -605]
1795f05m87q9K30N28O86N68L65o0l76o05o97m73j86J98M63O68O24L41Q2l73n50
1816B52o45n57k28J32M72O49O13L77P9l08n71o59n13k34J12L85O34O40L92J18
1836A140k42m99o80n41l20M1L90N91O53M62J75k16m75o35o31l46j3L73N91O34
1856D52N42J56j30m87o73n90l66n6L49N62O60N21K35j19m72o19o24m53o4K79N73
1877c24O60N85K83r5m20o53o41m77j16K24N49P00N91L16n4m30o41o39m92j76K72
1898i78N41O84O09L35l1l63o56o73n32k05K23N16P31O22L65M6l39o69p26n48k51
1919a299J87N11O96P15L97O0l58o53p10o47j96J51N21P03P12M38M8k87o97p34
1939d42o19k60J19M93P42P22N00J18l18o55p72o72l32J30M80P58P47N15J55l35
$$ y = [-605, -1092, -1181, -951, -423, 263, 831, 1196, 1136, 760, 155, -542, -1015, -1201, -1003, -540, 128, 752, 1093, 1175, 802, 252, -393, -950, -1178, -1046, -574, 75, 688, 1065, 1144, 836, 265, -394, -907, -1141, -1029, -644, -10, 630, 1022, 1140, 898, 399, -281, -822, -1142, -1101, -711, -120, 533, 995, 1170, 954, 479, -156, -787, -1133, -1146, -773, -182, 452, 994, 1150, 1020, 533, -140, -730, -1096, -1152, -803, -241, 419, 940, 1175, 1056, 584, -35, -659, -1112, -1176, -897, -324, 336, 921, 1204, 1109, 689, 36, -605, -1082, -1198, -974, -425, 275, 866, 1182, 1128, 698, 57, -582, -1074, -1250, -978, -437, 247, 856, 1191, 1160, 797, 141, -532, -1064, -1269, -1046, -530, 201, 823, 1188, 1234, 895, 226, -500, -1048, -1299, -1112, -601, 95, 810, 1207, 1267, 909, 256, -454, -1101, -1297, -1146, -625, 78, 790, 1228, 1276, 989, 292, -442, -1061, -1321, -1202, -709, 33, 755, 1255, 1373, 1055, 400, -372, -1044, -1376, -1246, -766, -8, 739, 1254, 1409, 1074]
1959A074o46q24o62l09O4N17P28P93N49J13k49o88q01p15l63O5M84P93P55O25
1979A303J39k65o40q68p07m68J23M62P81Q62N85K24l72n75r11p50l52j3N39P51
1999a52Q95N78J81k52p12p93q33l81KM51Q95Q03O40J88j88p06r43o71n71R0M19
2020a060R08Q34N94L64l44o36r55p54m89m9O37P29R33O17K91k58q33p12r24m59
2040a566kN24Q68P59Q65J62k50o60r26q00o53J59L99Q34R88O76L49l96n18j066
2060b54q87m42m7N69P45J105O16K39j73p95q77j000l16q2M27R88Q51Q04J42o9
2080A544q16j029p16o84J03L61J029R19O45N12m37o45j076p57o16j41P34P57J031
2099G18O87L39k55q68p23j069m76o2N80R09P92J021R5j76p62r77q47p31K32L06
$$ y = [1074, 428, -396, -1058, -1367, -1303, -786, -58, 735, 1284, 1397, 1148, 460, -341, -1056, -1419, -1354, -870, -77, 678, 1303, 1442, 1177, 537, -331, -1038, -1506, -1383, -921, -140, 722, 1307, 1531, 1159, 584, -327, -1077, -1429, -1442, -903, -152, 743, 1321, 1502, 1250, 538, -255, -1088, -1469, -1467, -1016, -121, 682, 1322, 1510, 1322, 616, -327, -998, -1569, -1479, -1060, -152, 682, 1276, 1640, 1296, 660, -295, -1049, -1538, -1587, -950, -221, 712, 1329, 1620, 1362, 529, -183, -1107, -1566, -1568, -1044, -176, 583, 1448, 1610, 1360, 700, -226, -1026, -1679, -1520, -1121, -287, 701, 1377, 1726, 1330, 812, -254, -1141, -1583, -1630, -1061, -316, 789, 1405, 1644, 1471, 676, -201, -1201, -1517, -1599, -1172, -184, 667, 1471, 1613, 1544, 728, -301, -1017, -1701, -1598, -1237, -208, 711, 1356, 1868, 1431, 786, -290, -1047, -1663, -1804, -1070, -313, 718, 1405, 1744, 1489, 621, -102, -1171, -1647, -1709, -1129, -220, 572, 1593, 1688, 1512, 750, -227, -1074, -1805, -1573, -1267]
2119a267R65J007P92L50m35m72j187r17n10k4N29P22J282O03L24j92q08r40j094
2138a272l04j86M97J042R15Q46J48o2q65j073p83o98J02L60J118R50O78M73l63
2157A523o69j133p82o91r6P20P96J093O85M61l60q84q21j086m40r6O65Q74Q79
2176F38R91J11j91q16r51r40p15K11L92R78J018Q51L10m40n21j216r14n45k0N62
2196a207Q11J234O29L52k37p95j004j080l51j33N52R69J006Q21J87j17q75j046
2214b84q71o01L9L93J119R50P46M24l53p36j136q04o55n3O39Q32J117O94M59l76
2234A543q02r16j053m87q3O05R26R65Q97J95k46q26r56r70o03J42M24J019R75
2253G49Q14K74l30o74j106q83o37ON73Q87J132O71L84l22p59j014j025m51p8O02
$$ y = [-1267, -302, 705, 1497, 1847, 1412, 940, -247, -1164, -1674, -1698, -1169, -447, 835, 1438, 1762, 1570, 762, -178, -1272, -1576, -1762, -1265, -223, 692, 1538, 1686, 1624, 759, -314, -1097, -1795, -1693, -1333, -215, 735, 1413, 1886, 1523, 854, -279, -1061, -1752, -1848, -1128, -332, 761, 1446, 1907, 1547, 663, -158, -1244, -1684, -1780, -1115, -241, 638, 1629, 1740, 1549, 733, -218, -1158, -1873, -1662, -1270, -292, 726, 1577, 1887, 1447, 926, -290, -1204, -1749, -1769, -1207, -396, 838, 1467, 1819, 1582, 787, -217, -1297, -1648, -1781, -1229, -260, 746, 1567, 1754, 1637, 762, -284, -1155, -1756, -1717, -1324, -205, 745, 1491, 1915, 1562, 826, -310, -1114, -1769, -1822, -1183, -351, 766, 1460, 1919, 1543, 741, -175, -1228, -1715, -1798, -1193, -267, 698, 1595, 1790, 1544, 718, -238, -1208, -1811, -1669, -1245, -226, 749, 1563, 1837, 1507, 833, -273, -1156, -1793, -1787, -1214, -327, 805, 1476, 1860, 1538, 779, -235, -1260, -1711, -1789, -1187]
2273a187R29J016P97K11j84q72j015r13n51M6M81J030R70P69K86l07p07j064r03
2292a168o01MN45R20J049P35L68l12p55j009r72n27o2O14R13J022P40L05l00p98
2312G11r75r30n45M1N24R48R72P74K78l14p27j039q91n69j3N54R23J042P56K77
2332A797k81p68r77r82m74n6N58R04J023P79K39k80p71r68r24n64N6N40R14R82
2352G47P64K59l03p37r65r28n09m6N36R12R94Q00K52k62p57j004q91n51j8N39
2372a168Q97J011P44K74l03p50r74q98n22PN43Q89J004P27K58k59p61r69q90n33
2392a673j6N02Q95R87P68K87k39p42r90r18n29n0N74Q74R99P16K74k86p23r69
2412b59q84n11MN28R03R30P28K80k75p27r47q80n31PM66R20R83O90K98k84p17
$$ y = [-1187, -258, 758, 1555, 1766, 1582, 710, -305, -1218, -1769, -1723, -1242, -212, 758, 1527, 1813, 1506, 799, -265, -1168, -1769, -1765, -1220, -300, 749, 1484, 1852, 1540, 785, -224, -1196, -1723, -1785, -1171, -258, 764, 1504, 1809, 1509, 711, -264, -1194, -1739, -1698, -1174, -226, 746, 1520, 1798, 1484, 757, -282, -1173, -1742, -1755, -1201, -278, 764, 1520, 1797, 1516, 748, -229, -1211, -1685, -1741, -1183, -279, 744, 1523, 1762, 1482, 711, -257, -1181, -1745, -1689, -1149, -235, 747, 1511, 1770, 1467, 730, -235, -1163, -1672, -1718, -1182, -270, 724, 1524, 1776, 1514, 757, -247, -1138, -1689, -1707, -1168, -271, 740, 1484, 1758, 1455, 705, -269, -1167, -1689, -1682, -1139, -250, 754, 1481, 1739, 1480, 719, -250, -1140, -1673, -1689, -1187, -292, 695, 1463, 1750, 1511, 769, -221, -1139, -1668, -1718, -1144, -270, 729, 1445, 1719, 1433, 710, -259, -1143, -1654, -1650, -1122, -219, 711, 1439, 1719, 1444, 717, -230, -1110, -1641, -1634, -1168, -248, 735, 1425, 1723, 1439, 722]
2433G22r29r11n28l7N55Q59R74P23K52k20p78r18q61n24pN26Q94R07O95L16k71
2454A439p47r57q28n51L0N09Q37R54P05L21l00o50j012q48m90p4N48Q07R86P28
2474A407K74k28p80q45r43m77J8M96Q03R32P85J76k30o91r32q25n46O5M25Q46
2494b70R45O74L24k85o13j013q40m65r3N31P72J019O58L01j90p73q56r20m30p9
2514a603M79R20Q21P62K15j79p36r43p16o18P4M07Q78Q62O81L67l33o06r35q03
2534a006n41j02O10P11R68O91L35k74p28p79r70m24m8N11P86Q42Q54O5j39o77
2554F85q93q29n48J59L02Q63R25O37L21l46m53j077p70m94o9N42O96J060N46L16
2574A573j40p39q27r48l05j90M80Q72P92P61J78q9q13q25p05o05N6L50R50P42
$$ y = [722, -207, -1118, -1646, -1683, -1128, -269, 705, 1428, 1680, 1460, 682, -236, -1097, -1621, -1628, -1102, -208, 699, 1394, 1710, 1439, 692, -265, -1093, -1644, -1614, -1105, -268, 686, 1391, 1712, 1412, 762, -250, -1098, -1588, -1662, -1114, -307, 679, 1407, 1681, 1453, 673, -172, -1115, -1592, -1574, -1078, -275, 657, 1442, 1618, 1388, 697, -235, -1060, -1606, -1541, -1116, -270, 675, 1349, 1673, 1388, 775, -238, -1078, -1543, -1636, -1105, -333, 686, 1344, 1645, 1455, 682, -174, -1094, -1524, -1603, -1124, -204, 617, 1379, 1594, 1415, 679, -264, -980, -1598, -1524, -1117, -239, 623, 1304, 1671, 1338, 732, -203, -1006, -1547, -1649, -1039, -328, 640, 1331, 1666, 1392, 664, -115, -1085, -1509, -1557, -1046, -260, 582, 1436, 1501, 1362, 685, -208, -1037, -1585, -1426, -1124, -261, 664, 1301, 1622, 1276, 823, -254, -1024, -1518, -1587, -1045, -349, 711, 1257, 1573, 1433, 694, -133, -1081, -1386, -1576, -1096, -224, 568, 1329, 1507, 1418, 605, -220, -925, -1530, -1474, -1124, -174, 568]
2594E68O73L94l80n28r61o93o09l9N89O06J020O13L63k74o82p06j042l78n5N13
2614a008P14Q08Q86O4j47o55q27q51n17J92K03R15Q40O67K43l19m08j098o82m95
2634a475oM29P21J067M43L34j73o60q53q79l08j97N24Q28P66O96J97l2q52p88
2654b18o84n90Q9L51R27O70O90L58l57n55r34n90o84M0N58N68R58N98M25l91n93
2675F36p05r74l71j01N69O24Q59P99O8p2p25p37q78m72J79K21R00P42P08J87k52
2696A205m84j047n99n23Q7L69P03J013M08L80k64o15q20q32k91j67N13P08Q63
2715F07O29J70q8p80p22p69m54L4L99Q56O19P12K60k98n64q82n81n93N0N00O59
2736b36Q50N69L25l50n57p66q38l61r1N59O24Q68O90P7j41o65p31q14m06J02L38
$$ y = [568, 1241, 1635, 1255, 727, -234, -927, -1536, -1575, -986, -380, 640, 1253, 1616, 1342, 660, -46, -1088, -1466, -1521, -1008, -294, 514, 1400, 1464, 1317, 662, -165, -1016, -1533, -1341, -1138, -223, 617, 1284, 1527, 1208, 800, -298, -980, -1475, -1481, -1052, -331, 736, 1179, 1513, 1340, 680, -173, -1052, -1360, -1557, -1033, -205, 561, 1257, 1454, 1422, 570, -218, -902, -1492, -1403, -1052, -125, 545, 1235, 1593, 1236, 681, -253, -843, -1527, -1487, -929, -361, 597, 1195, 1620, 1229, 636, -69, -1043, -1414, -1515, -946, -322, 537, 1336, 1404, 1332, 607, -130, -1008, -1480, -1301, -1080, -180, 562, 1270, 1457, 1205, 721, -326, -925, -1448, -1361, -992, -289, 724, 1132, 1512, 1248, 633, -187, -1019, -1310, -1477, -964, -256, 607, 1236, 1406, 1318, 538, -184, -953, -1407, -1373, -974, -118, 501, 1213, 1473, 1175, 611, -271, -852, -1445, -1395, -895, -236, 614, 1183, 1508, 1158, 601, -165, -1003, -1364, -1455, -896, -272, 596, 1286, 1363, 1222, 557, -174, -988, -1394, -1292, -954]
2757i54P98P33O61J36k16n47q90o53m41O4L92P34Q42M92K98l01n63q10p37l58
2777a320p0M88P12Q27N51K08j87o99p26p65l97N3M42P84P07O04J88k94n66q20
2797b80o40m22N3M48P04P97N14K01k91n67p76p44l01MM50O71Q29N53J61k31o13
2818E20p83p07l64Q8M24P35P18N79R4k41n66p83o59l67Q3M26P05P36N27K08l12
2839A061n84p63o54l63N0M42P13P65N30J23k56o21p67o20l66N1M91P21P11N30
2859A194J15k90o13p47o17l16R2M32P18P18M79J30l17n59p41o50k98O7M56P08
$$ y = [-954, -156, 577, 1238, 1374, 1158, 611, -279, -932, -1373, -1309, -917, -183, 659, 1151, 1449, 1148, 585, -225, -962, -1320, -1390, -902, -190, 637, 1188, 1396, 1209, 510, -216, -981, -1378, -1325, -883, -99, 608, 1212, 1400, 1106, 540, -280, -920, -1342, -1289, -841, -137, 660, 1174, 1375, 1084, 517, -259, -1003, -1304, -1300, -850, -179, 650, 1203, 1364, 1133, 520, -263, -970, -1334, -1246, -822, -87, 631, 1210, 1304, 1063, 497, -286, -945, -1312, -1229, -803, -98, 638, 1165, 1373, 1061, 477, -286, -940, -1303, -1253, -811, -98, 667, 1197, 1320, 1064, 443, -324, -944, -1310, -1259, -768, -47, 664, 1194, 1309, 1019, 406, -341, -958, -1274, -1182, -750, -32, 686, 1165, 1295, 978, 419, -322, -972, -1270, -1203, -747, -39]
$$ [...]
8191e1
##END NTUPLES=NMR FID
##END=
