##TITLE=1H_DE-161_oil_TFAl
 200.13Hz, DMSO-d6+CCl4.
 8 sc
 8.7.2026
##JCAMPDX= 6.0         $$ Bruker NMR JCAMP-DX V2.0
##DATA TYPE= NMR FID
##DATA CLASS= NTUPLES
##ORIGIN= UXNMR, Bruker Analytische Messtechnik GmbH
##OWNER= pz
$$ XWIN-NMR		Version 3.5
$$ Wed Jul  8 13:11:26 2026 Russian Standard Time (UT+4h)  she@DPX200
##.OBSERVE FREQUENCY= 200.1313
##.OBSERVE NUCLEUS= ^1H
##.DELAY= (6, 6)
##.ACQUISITION MODE= SIMULTANEOUS
##.ACQUISITION SCHEME= undefined
##.AVERAGES= 8
##.DIGITISER RES= 18
##SPECTROMETER/DATA SYSTEM= spect
##.PULSE SEQUENCE= zg30
##.SOLVENT NAME= DMSO
##.SHIFT REFERENCE= (INTERNAL, DMSO, 0, 14.3821)
##AUDIT TRAIL= $$ (NUMBER, WHEN, WHO, WHERE, WHAT)
$$ ##TITLE= Audit trail, XWIN-NMR		Version 3.5
$$ ##JCAMPDX= 5.01
$$ ##ORIGIN= Bruker BioSpin GmbH
$$ ##OWNER= she
$$ F:/spectra/data/she/nmr/H-C/1/audita.txt
$$ ##AUDIT TRAIL=  $$ (NUMBER, WHEN, WHO, WHERE, WHAT)
(   1,<2026-07-08 13:10:05.62 +0400>,<she>,<DPX200>,
      <created by zg, POWCHK disabled, PULCHK disabled
       configuration hash MD5:
       00 E9 B6 7A A2 85 ED C7 34 08 36 98 17 FE 4E 26
       data hash MD5: 16K
       64 49 81 CC AB 92 05 A0 2D 8E F4 CF A8 D4 5D A0>)
$$ ##END=
$$ 
$$ hash MD5
$$ 61 CF C0 24 D3 69 C1 CE 26 AE 17 05 3E B6 03 51
##$RELAX= 
##$RELAX= 
##$RELAX= 
##$RELAX= 
##$RELAX= 
##$RELAX= 
$$ Bruker specific parameters
$$ --------------------------
##$DU= <F:/spectra>
##$EXPNO= 1
##$NAME= <H-C>
##$PROCNO= 1
##$TYPE= <nmr>
##$USER= <she>
##$AMP= (0..31)
100 100 100 100 100 100 100 100 100 100 100 100 100 100 100 100 100 100 
100 100 100 100 100 100 100 100 100 100 100 100 100 100 
##$AQSEQ= 0
##$AQ_mod= 1
##$AUNM= <au_zg>
##$AUTOPOS= <>
##$BF1= 200.13
##$BF2= 200.13
##$BF3= 200.13
##$BF4= 200.13
##$BF5= 200.13
##$BF6= 200.13
##$BF7= 200.13
##$BF8= 200.13
##$BYTORDA= 1
##$CFDGTYP= 0
##$CFRGTYP= 5
##$CHEMSTR= <none>
##$CNST= (0..31)
1 1 145 1 1 1 1 1 1 1 1 1 1 1 1 1 1 1 1 1 1 1 1 1 1 1 1 1 1 1 1 1 
##$CPDPRG= <>
##$CPDPRG1= <>
##$CPDPRG2= <>
##$CPDPRG3= <>
##$CPDPRG4= <mlev>
##$CPDPRG5= <mlev>
##$CPDPRG6= <mlev>
##$CPDPRG7= <mlev>
##$CPDPRG8= <mlev>
##$CPDPRGB= <>
##$CPDPRGT= <>
##$D= (0..31)
0 0.7 0 0 0 0 0 0 0 0 0 0.03 0 0 0 0 0 0 0 0 0 0 0 0 0 0 0 0 0 0 0 0 
##$DATE= 1783501805
##$DBL= (0..7)
120 120 120 120 120 120 120 120 
##$DBP= (0..7)
150 150 150 150 150 150 150 150 
##$DBP07= 0
##$DBPNAM0= <>
##$DBPNAM1= <>
##$DBPNAM2= <>
##$DBPNAM3= <>
##$DBPNAM4= <>
##$DBPNAM5= <>
##$DBPNAM6= <>
##$DBPNAM7= <>
##$DBPOAL= (0..7)
0.5 0.5 0.5 0.5 0.5 0.5 0.5 0.5 
##$DBPOFFS= (0..7)
0 0 0 0 0 0 0 0 
##$DE= 6
##$DECBNUC= <off>
##$DECIM= 32
##$DECNUC= <off>
##$DECSTAT= 4
##$DIGMOD= 1
##$DIGTYP= 9
##$DL= (0..7)
0 120 120 120 120 120 120 120 
##$DP= (0..7)
150 150 150 150 150 150 150 150 
##$DP07= 0
##$DPNAME0= <>
##$DPNAME1= <>
##$DPNAME2= <>
##$DPNAME3= <>
##$DPNAME4= <>
##$DPNAME5= <>
##$DPNAME6= <>
##$DPNAME7= <>
##$DPOAL= (0..7)
0.5 0.5 0.5 0.5 0.5 0.5 0.5 0.5 
##$DPOFFS= (0..7)
0 0 0 0 0 0 0 0 
##$DQDMODE= 0
##$DR= 18
##$DS= 0
##$DSLIST= <SSSSSSSSSSSSSSS>
$$ [...]
##$SUBNAM0= <"">
##$SUBNAM1= <"">
##$SUBNAM2= <"">
##$SUBNAM3= <"">
##$SUBNAM4= <"">
##$SUBNAM5= <"">
##$SUBNAM6= <"">
##$SUBNAM7= <"">
##$SUBNAM8= <"">
##$SUBNAM9= <"">
##$SW= 18.0517328524113
##$SWIBOX= (0..15)
0 0 2 0 0 0 0 0 0 0 0 0 0 0 0 0 
##$SW_h= 3612.71676300578
##$TD= 16384
##$TD0= 1
##$TE= 0
##$TE2= 300
##$TE3= 300
##$TEG= 300
##$TL= (0..7)
0 120 120 120 120 120 120 120 
##$TP= (0..7)
150 150 150 150 150 150 150 150 
##$TP07= 0
##$TPNAME0= <>
##$TPNAME1= <>
##$TPNAME2= <>
##$TPNAME3= <>
##$TPNAME4= <>
##$TPNAME5= <>
##$TPNAME6= <>
##$TPNAME7= <>
##$TPOAL= (0..7)
0.5 0.5 0.5 0.5 0.5 0.5 0.5 0.5 
##$TPOFFS= (0..7)
0 0 0 0 0 0 0 0 
##$TUNHIN= 0
##$TUNHOUT= 0
##$TUNXOUT= 0
##$USERA1= <user>
##$USERA2= <user>
##$USERA3= <user>
##$USERA4= <user>
##$USERA5= <user>
##$V9= 5
##$VALIST= <valist>
##$VCLIST= <CCCCCCCCCCCCCCC>
##$VD= 0
##$VDLIST= <DDDDDDDDDDDDDDD>
##$VPLIST= <PPPPPPPPPPPPPPP>
##$VTLIST= <TTTTTTTTTTTTTTT>
##$WBST= 1024
##$WBSW= 4
##$XGAIN= (0..3)
0 0 0 0 
##$XL= 0
##$YL= 0
##$YMAX_a= 238375
##$YMIN_a= -234745
##$ZGOPTNS= <>
##$ZL1= 120
##$ZL2= 120
##$ZL3= 120
##$ZL4= 120
##$ABSF1= 10
##$ABSF2= 0
##$ABSG= 5
##$ABSL= 3
##$ALPHA= 0
##$AQORDER= 0
##$ASSFAC= 0
##$ASSFACI= 0
##$ASSFACX= 0
##$ASSWID= 0
##$AUNMP= <proc_1d>
##$AZFE= 0.1
##$AZFW= 0.1
##$BCFW= 1
##$BC_mod= 2
##$BYTORDP= 1
##$COROFFS= 0
##$CY= -3
##$DATMOD= 1
##$DC= 2
##$DFILT= <>
##$DTYPP= 0
##$F1P= 0
##$F2P= 0
##$FCOR= 0.5
##$FTSIZE= 0
##$FT_mod= 4
##$GAMMA= 1
##$GB= 0.15
##$INTBC= 1
##$INTSCL= 1
##$ISEN= 128
##$LB= 0.25
##$LEV0= 0
##$LPBIN= 0
##$MAXI= 10000
##$MC2= 0
##$MEAN= 0
##$ME_mod= 0
##$MI= 1.114404
##$NCOEF= 0
##$NC_proc= 0
##$NLEV= 6
##$NOISF1= 3.799351
##$NOISF2= 2.8
##$NSP= 1
##$NTH_PI= 0
##$NZP= 0
##$OFFSET= 14.38212
##$PC= 1
##$PHC0= -4220.513
##$PHC1= 7.792299
##$PH_mod= 1
##$PKNL= yes
##$PPARMOD= 0
##$PSCAL= 0
##$PSIGN= 0
##$REVERSE= no
##$SF= 200.129724274929
##$SI= 16384
##$SIGF1= 3
##$SIGF2= 2
##$SINO= 400
##$SIOLD= 16384
##$SREGLST= <1H.CDCl3>
##$SSB= 0
##$STSI= 0
##$STSR= 0
##$SW_p= 3205.1282051282
##$SYMM= 0
##$S_DEV= 0
##$TDeff= 0
##$TDoff= 0
##$TI= <>
##$TILT= no
##$TM1= 0
##$TM2= 0
##$TOPLEV= 0
##$USERP1= <user>
##$USERP2= <user>
##$USERP3= <user>
##$USERP4= <user>
##$USERP5= <user>
##$WDW= 1
##$XDIM= 8192
##$YMAX_p= 0
##$YMIN_p= 0
$$ End of Bruker specific parameters
$$ ---------------------------------
##NTUPLES= NMR FID
##VAR_NAME=  TIME,          FID/REAL,        FID/IMAG
##SYMBOL=    X,             R,               I
##VAR_TYPE=  INDEPENDENT,   DEPENDENT,       DEPENDENT
##VAR_FORM=  AFFN,          ASDF,            ASDF
##VAR_DIM=   8192,          8192,            8192
##UNITS=     SECONDS,       ARBITRARY UNITS, ARBITRARY UNITS
##FACTOR=    0.0002768,     1,               1
##FIRST=     0,             0,               0
##LAST=      2.2672688,     0,               0
##MIN=       0,             -234745,         0
##MAX=       2.2672688,     238375,          0
$$ Real data points
##PAGE= N=1
##DATA TABLE= (X++(R..R)), XYDATA
$$ [...]
1863h9Q6p0J26M3J73m23J48K02k30J26j84r5J73j73N02j75r7k05L47m12J72K92
1885B37k15RM8j90K0K71l0l19L64K5k28k44J24O7Q3j71J33M4K36l57j8J96P1m2
1909A14m80N91j32j71l1K26N3r1l02K56j90J56k01K08j6p9J28J2O7k36L01k42
1931e9R8m8j02R1l8J58K91k15j90p9L54j98mq9K51k19q9J39Lk90l4L84l95K09
1955g1K33k02J15k29J30L6mk51M70l08r2Q8J46j20J05j0j35j46J09K94k07J10
1977F1l08L52l28K87k51L04N7j87P2j08R4L5j74j09K73l60M48q9j75J50J42j54
1999C2lm17N65j29j85R6j15M21j31k07k49M09j11j64K46k01j66K62K06l72K0M19
2021B26l71o6J03N7L09k34P3o6j60J14k32J20J00k59M26q9J1J88j83j00J59o7
$$ plain form
1863 -89 -3 -73 53 96 269 -154 -6 196 -34 92 -92 -187 -14 -187 315 140 43 -162 185 -227 -55 237
1885 237 22 31 79 -111 -91 180 150 -169 195 220 -8 -252 -128 -61 22 -149 -16 28 264 -93 -111 85 156 114
1909 114 -366 225 93 -78 -109 117 170 79 -223 33 -157 -1 -202 6 -10 -89 39 51 118 -118 183 -59
1931 -59 39 -9 -111 -20 -58 100 391 176 -14 -93 261 63 59 -30 221 2 -87 52 55 -235 -269 115 -280 -71
1955 -71 162 -40 75 -154 -24 12 8 -243 227 -81 -173 -85 61 -59 46 36 -99 -245 -136 158 -49 61
1977 61 -247 105 -223 64 -187 117 174 -13 59 -49 45 80 -94 -203 70 -290 158 69 -106 44 186 32
1999 32 29 -388 177 48 -137 -41 -156 265 134 -73 -322 87 -24 -188 58 -143 -309 -47 159 -213 -193 226
2021 226 -145 -211 -108 -51 258 24 97 31 -129 -15 -247 -127 -27 -286 140 51 62 250 67 -33 126 59
2043E9j81K56j51j23O3P6P8q3J68n9k01J94j68J0j52N21o01K02M6K81j86l44M44
2066A49L9k06j6p7K19l06K13K47l28M23j33l50K57l8j11N7n2J4j37kJ12j2J81
2089A43j23J12K3j34K70m23R8k83L99M3M0l55J67J53k4l87L04J63O3k52J46o9
2111G4j16L57l79j1R9j41J49j8j12K22q7l14N36n19M17k87j2L9j89L42j87J31
2133fn7J32L8j1J33k59M7j81Q1K13j25Q5j58NR6j69L77q8k29L19l46q9M5K38k8
2158F3j15J52j75M49l71j53K6J74k42J51K8r7L06m07mK73O4k63L53m06K09J33
2180A48j70k5K31l61j43O21l72J45J09J06n30R4J65j31J18J07n8o8J41k02J00
2201B5p7M6J48j03J52j85k43L99q3J60j55k76N34l53j81M58m26pK24p8j35k10
$$ plain form
2043 59 -122 134 -17 -140 -77 -1 77 -6 162 103 -98 96 -72 -62 -214 307 -294 -92 -46 235 49 -295 149
2066 149 188 -18 -34 -111 108 -198 15 262 -66 357 224 -126 131 93 -18 39 -13 1 -136 -138 -26 -38 143
2089 143 20 132 155 21 291 -132 -34 -317 82 125 165 -190 -23 130 106 -281 23 186 249 -3 143 74
2111 74 -42 315 -64 -75 24 -117 32 14 -98 124 37 -277 259 -260 157 -130 -142 -103 -292 50 -137 -6
2133 -6 -63 69 107 96 229 -30 17 -164 -83 130 5 90 -68 -63 33 -136 241 153 -76 243 -103 -192 -147 91 63
2158 63 -52 100 -75 374 3 -150 -124 50 -192 -41 -13 -110 196 -211 -215 58 122 -141 212 -194 15 148
2180 148 -22 -47 184 -177 -320 301 -71 74 183 289 -241 -147 18 -113 5 112 54 -14 127 -75 25
2201 25 -52 -6 142 39 191 6 -237 162 79 239 84 -192 342 -11 -192 266 -160 -167 57 -21 -156 -366
2223c66J94K28M6o9j91j18M34k50o3K97K6J24m54l1R3j50J67K82n8k28O0K84m34
2246a77R3J29r5J69Jr8k02Rj5K82K6l29M20l01P7j02J08J38j80J2L17k60q0L0
2270b8K58j49L7J31k79J2j64L01k26K27m64M19q5l2k65J60M78L12r57k77N80O3
2292E2m9k38L33Q8j61J7l36L10R3l50L96l60J99J06l62K93j81J9J88N5k23M3N
2315f3K0Q3J1Q5l73j12M37n9j22j6L6J39m4J92k14j12J17L4P7k50J24m2n3k45
2339c50M49k50j09J17J23K15j58k34J58k57K10k65K88k26M58k04n2ok79L83q3
2360g2j02J81k11L44j67l4L61l16l0M41m62p8k0L84J7l55J41J7jj64L58l06L6
2383c8K94l29n1P6j90M30L4k29J12k84J27n9J90k05J50j71L0M07l85n3J24L09
$$ plain form
2223 -366 -172 56 102 33 -158 -276 158 -92 -155 142 168 292 -162 -193 -100 -250 -83 199 141 -87 -27 257 -177
2246 -177 -84 45 -50 119 120 22 -180 -171 -186 96 122 -207 213 -88 -11 -113 -5 133 -47 -35 282 22 -58 -28
2270 -28 230 81 118 249 -30 -18 -182 119 -107 120 -344 75 -10 -42 -307 -147 331 643 -314 -591 -11 52
2292 52 3 -235 98 186 25 42 -294 16 109 -241 155 -205 -6 100 -262 31 -150 -131 57 112 -111 -68 -63
2315 -63 -43 40 51 136 -237 -349 88 29 -93 -109 -73 66 22 214 0 -112 5 39 116 -134 -10 -52 -105 -350
2339 -350 99 -151 -260 -143 -20 195 37 -197 -39 -296 -86 -351 -63 -289 169 -35 -87 -93 -372 11 -72
2360 -72 -174 7 -204 140 -27 -61 300 -16 -46 395 -67 -145 -165 219 236 -119 22 39 38 -126 232 -74 -38
2383 -38 256 -73 -124 -48 -238 192 226 -3 109 -175 -48 -107 83 -122 28 -143 -113 294 -91 -144 -20 289
2405B89m68m1M70k43p9q6L07k58J51l23K57j42j27M46k69J60J32k60N8J4k10j22
2427c44K22p7J66KJ34l45L59o6o1J40j18LQ1N8P3m38P2M10l59O1j89L34k61K19
2451G6j09J33k11M64j44o1n45K11J44L3k0K88k3k97j00J37r8J77m1q9r7N29m95
2474a38J2L08j50J9Q6j21J62j13M0o8p2k54M28l24K3M33j76K89l84L8k04N39l58
2497A5j06O6N0J76m4o8l65M67q3j34J49j70M9l86K40J69J13J5j97J23J50k86J07
2520E0n5k33L74j19J33j62j26R3K04j77K41j01J53m64J79k03K49j00j24L32q7
2541E7L3o3n8RL84m34J12j66M3R3j2K63l30K15j29J38j78M6rJ24m7P1k96K30j16
2566b0K31j51J41O1j34j09j5n3K27L5j53k36j94L80o6k63Q2J56M7QJ37J85m54
$$ plain form
2405 289 -179 -220 250 7 -72 -158 149 -109 42 -281 -24 -166 -293 153 -116 44 176 -84 -26 -12 -222 -344
2427 -344 -122 -199 -33 -31 103 -242 117 51 -10 130 12 15 96 154 227 -211 -139 271 -88 -27 -216 118 -143 76
2451 76 -33 100 -111 353 209 148 -397 -186 -42 -9 -29 259 236 -61 -161 -24 -122 55 14 -75 -172 357 -138
2474 -138 -126 182 32 51 137 16 178 65 105 37 -35 -289 139 -185 -162 271 95 384 0 38 -166 373 15
2497 15 -91 -25 25 201 157 89 -276 191 108 -26 123 -47 2 -384 -144 25 138 153 -44 79 229 -57 50
2520 50 -5 -238 136 17 150 -12 -138 -45 159 -18 223 122 275 -189 -10 -213 36 -64 -188 144 57
2541 57 90 27 -31 -22 362 -72 40 -126 -83 10 -2 261 -69 146 17 155 -23 23 14 138 91 162 -134 96 -20
2566 -20 211 60 201 262 128 19 4 -49 178 213 60 -176 -370 10 -56 -319 -237 -81 -34 -26 111 296 -158
2589a58Q3K39m2O5k13J76j51o2J77J13j23J65m24K93J11l17r1o4L76k44J37o0
2611a4J5l5Q3p3N6pR7o6n6J41l31R4L5L76l65q4K12k52J47n8N2j0L3j95J27J01
2637B3l4L26l45k03K19k67L55k61J09q8J35n2q2L97j62j11J12R9l28J73k20O4
2659a41P3Q0p2q0K86j53o2j95M78l87O11q1O58p50k89P4l05N14k36K1k52K11J8
2682B1M3Pk15J72j6OOl3r2j20K12L01l78N6J53j66K03j05J17l0j38O2l14J47L0
2707g1L21n20J28j22M08k88J66j38j30O72l04k34K99j11N4l74J90q2M7K20j14
2728A7kJ5K05j88j25J99m5rP2j17k32K69j97J55j44j58J81j1M5J74n7k00L36r8
2752H5l49K37K6J43O7k45n9L97J7k30J74j67k33kJ60J13l48J92J66j04k49K53
$$ plain form
2589 -158 -75 164 122 187 -26 150 -1 -63 114 227 104 269 -155 138 249 -68 -159 -223 153 -91 46 -14
2611 -14 1 -34 49 -24 32 25 122 56 0 141 -190 -96 -61 315 -50 -134 78 -174 -27 -85 -33 -43 -10 -205 -78 23
2637 23 -11 315 -30 -233 -14 -281 74 -187 -78 -166 -31 -83 -165 232 70 -41 71 170 -158 15 -205 -141
2659 -141 -68 12 -60 -140 146 -7 -69 -264 214 -173 438 357 1015 265 -24 50 -255 259 23 44 -208 3 21
2682 21 64 71 -144 28 12 18 24 -9 -101 -221 -9 292 -86 -30 123 -43 160 55 172 142 4 66 -248 -101 -71
2707 -71 250 -270 -142 -264 144 -144 22 -116 -246 426 122 -112 187 76 130 -244 -54 -136 -89 131 17
2728 17 15 30 235 47 -78 121 76 67 139 22 -210 59 -138 17 -127 -285 -104 -115 -70 104 47 -153 183 85
2752 85 -264 -27 -1 142 209 -36 -95 302 319 89 263 96 -137 -139 21 134 -214 -22 144 40 -209 44
2774D4l1K11p1k32N6R3R1n5j62k52K50k1L66m43kj9K33r6J24J28j60j59J47j40
2798a00K63j61j88l6L12j47k9P1R7K0p2K13k59J50k03K50K8l42J5M36k1j77j97
2821g7K28j69j38P2k1K69k0k79P3J20j49K35j17J93m52L34k06K49j84j75j72K28
2843a58L88j55r4j18K83m5k63L95k40q8K55j7p3k02K95j60l0M09l13q2L29m84
2865a68M02k59O6J94k18P8j91M5k59O3J25j14m1L90j33R3k26M4L3J54j93K51m51
2888c15M25J8r9P6p9J9l34K25K05k78N9j0K51j39j44L82l94K21l16L53j24QK43
2911B53n39K28J43k58P8N9j53J06n4N5Q8K08j8l01J55n4J17j71K2L15j70l26L04
2934H7j12K50l81Q3j4R8K25l24j1p6K51j84K71l67K42o9R4k33J88K0q6J17k05
$$ plain form
2774 44 13 224 153 -79 -23 70 161 106 -56 -308 -58 -79 287 -156 -158 -177 56 -40 84 212 52 -107 40 -100
2798 -100 163 2 -186 -222 90 -57 -86 -15 82 102 30 243 -16 134 -69 181 209 -133 -118 318 297 120 -77
2821 -77 151 -18 -156 -84 -105 164 144 -135 -62 58 -91 144 27 220 -232 102 -104 145 -39 -214 -386 -158
2843 -158 230 75 -19 -137 146 101 -162 233 -7 -95 160 143 70 -132 163 3 -27 382 69 -13 316 -168
2865 -168 234 -25 41 235 17 95 -96 -51 -310 -247 -122 -236 -277 113 -20 73 -153 -109 -76 78 -115 136 -315
2888 -315 110 128 29 105 26 45 -289 -64 141 -137 -78 -88 163 24 -120 262 -132 89 -227 126 2 10 253
2911 253 -286 -58 85 -173 -95 -36 -189 -83 -137 -82 6 214 196 -105 50 -4 113 -58 -36 279 109 -217 87
2934 87 -25 225 -156 -73 -87 11 236 -88 -99 -175 76 -108 163 -204 38 -31 63 -170 18 38 -48 69 -136
2957a36j7p4J07J97k61J96K30m29J82R4l3r9P7l9L5m34J10L53l16M22R9j63p0
2980C1j6Q8l8k91J80o2M9O9j83J38J4N3l3l2k61K31K17j71j72J25K04j77j08j53
3004b98M35j07l82M44L2l4j31O7JJ15m31M02L4r1J64m23J79J66j57M09l10p8k7
3027b1R7j1j92L95r5r8k13K44k07J67q6pP5l1k63J73O9P6j17k21K21m2j88O68
3051C93m23J48j03j02M27l42j54RJ63m9%o1j71K18J80k70q0J39r7J13J12j00J63
3074A13K9k70K96R1l38M7M8j84L06J62l12l52L15r9J65P3k80K0L15J4k61J60j16
3097e8K56j89r3K0Q9p0%K10r7M0m04M79k30l6j85M38j3j13k43j27M98M0k26m9
3121f3k01L9O1L6L8P6L9j33K92k52K24j39j84J78j28R0Jk3J44m7m31O16l35J92
$$ plain form
2957 -136 -153 -227 -120 77 -184 12 242 -187 -5 89 56 -43 34 -5 30 -404 -294 59 -257 165 264 101 31
2980 31 15 103 65 -226 -46 -108 -59 10 -173 -35 -21 32 -1 -33 -294 -63 154 -17 -189 -64 140 -37 -145 -298
3004 -298 137 30 -352 92 124 90 -41 26 27 142 -289 113 147 56 220 -203 -24 142 -15 394 84 6 -21
3027 -21 76 65 -127 268 173 75 -138 106 -101 66 -20 -27 48 17 -246 -73 -4 72 -45 -266 -45 -87 -275 393
3051 393 -30 118 15 -87 340 -2 -156 -147 16 -33 -33 -94 -265 -47 133 -137 -217 -78 -175 -62 50 -50 113
3074 113 142 -128 168 259 -79 -32 16 -168 138 300 -12 -364 -49 -148 17 90 -190 -170 145 159 -102 58 -58
3097 -58 198 9 -84 -64 25 -45 -45 165 68 108 -296 183 -47 -83 -268 170 157 44 -199 -326 172 212 -14 -63
3121 -63 -264 -225 -164 -128 -90 -14 25 -108 184 -68 156 17 -167 11 -117 -27 -26 -49 95 48 -383 233 -102 90
3145I0K2k03Q2J19j66K30j76J53m2j24m7M7J69L6m89K97j4l9NN8O9J56j65k27
3169a59J76k23L18j45j67K79L7K0j05K05l94K26r3q0J4O6lR7n2J22r9K33k85J94
3193A82m20J99K75j67r3kJ95Q3nm5l33N6J74k61K22M6k28J45J57j60l4j83K09
3216A2j83O7J84j22o1N4K11k22K95n31K84k17L14j21j05K48J5J22j28j44l1J87
3238A28j71Q7k19p6L20l48J4L60J27j1j72J5m23K70Q8q2j52K19N6k8j16m0J06
3261d8p5K9j8J05n7M3k27J73j1J13m1LJ27P5k24j19K96j50j15J29j56Q8P6Q7Q8
3286A91k77J04R3j84P5K02p7j64K2O2j3K63k19j21M7m0n0J21q6k26L75n7j11j10
3310a80J34j23pK28M6k61K87jl1j76J4R1K01m20L52j5l88R5L17k53J02M3k19J95
$$ plain form
3145 90 112 -91 -9 110 -56 174 -2 151 109 -15 -62 -15 154 190 -299 -2 -16 -55 -50 8 77 233 68 -159
3169 -159 17 -206 112 -33 -200 79 116 136 31 236 -158 68 -25 -105 -91 -25 -28 69 17 139 40 273 -12 182
3193 182 -238 -39 236 69 -24 -26 169 252 247 202 -131 -75 99 -162 60 106 -122 23 180 20 -14 -197 12
3216 12 -171 -104 80 -42 -103 -49 162 -60 235 -296 -12 -229 85 -36 -141 107 122 244 116 -28 -59 128
3238 128 -43 44 -175 -251 69 -279 -265 95 222 211 39 54 -369 -99 -11 -93 -245 -26 30 2 -114 -154 -48
3261 -48 -123 -94 -112 -7 -64 -21 -248 -75 -86 27 -14 -11 116 191 -33 -152 144 -6 -121 8 -148 -60 16 103 191
3286 191 -86 18 111 -73 2 204 127 -37 -15 47 34 297 78 -43 4 -36 -86 35 -51 -277 98 41 -70 -180
3310 -180 -46 -169 -176 52 98 -163 124 123 92 -84 -70 21 222 -198 154 139 -249 -154 163 -90 12 55 -164 31
3334C1J42r6j03l26K53j43J67q0J11O9l8l03K85k3K23j63q2J73j09mk28o9N32
3357B19k71R1L6%j76O1K46k55j29J91K42k00K34m63J61q9K26k7j05J74j29k09
3379a72M25l33j56J20J80n7j32J78J3j10j71J96J15k2j59L04k08K8M7Q8l02k5
3401a53j17M19j70j5J36j69J36M3k59L61l18n2O1P0K08k44Q2M7j59O5j3Jr2J50
3425A8l9L25L6j79j88n4K22r9m2l9J35j24P3P7J12k70K5l4j2M5q1K17m96M36j11
3450d7MnL0Q4n1n1j67R7J33q1j4K14r0J86m37J08K37k41J94j74R3j75j30K59j2
3475c6J34n9J07p7n3m4L8L3J3R7l9P6K5k59k0n8J33Qo9l8J54N2k68K25J06j13
3501F8K5k29L7K25o5L0k83K23j50K28k6p2j54J99J05Jl3PJ5l97K40N8J3q0j2L2
$$ plain form
3334 31 173 77 -26 -352 -99 -242 -75 -155 -44 25 -13 -316 -31 -54 169 6 -76 97 -12 -16 -244 -313 219
3357 219 -52 39 75 75 -101 -40 206 -49 -178 13 255 55 289 -174 -13 -102 124 97 -8 166 37 -172
3379 -172 253 -80 -236 -116 64 7 -125 53 66 -44 -215 -19 96 74 -85 219 11 39 86 174 -128 -153
3401 -153 -270 149 -21 -36 100 -69 67 110 -149 212 -106 -158 -97 -27 181 -63 19 66 -93 -28 -41 -40 -132 18
3425 18 -21 304 340 161 -27 -81 141 42 0 -39 96 -28 45 122 234 -36 -11 -45 -57 -12 -93 124 -372 64 -47
3450 -47 -43 -48 -18 66 15 -36 -203 -106 27 -54 -68 146 56 242 -195 -87 150 -91 103 -71 22 -153 -283 -24 -36
3475 -36 98 39 146 69 16 -28 10 43 56 153 114 190 215 -44 -64 -122 11 19 -50 -88 66 118 -150 75 181 68
3501 68 93 -136 -99 126 61 91 -192 31 -119 109 83 11 -143 56 161 162 129 136 151 -246 -6 52 65 -15 -27 5
3527ElJ32j09M4J0k59K07J58j50J42k45M6J93n20L26J98k84J69k58J48J87k10
3549g3R9L1R4j64K08j71J58k22J78Rk20J73J91k77j85K33k8Nl62M76k35J36K12
3572B66n17L20o1K25j05l33J30J01J00j50J22k74n9L40k33K18J86k30M9J41k34
3593Bk22J57L6N8j29m0k03L58j9l9N3j10J91q7o3J65j05J52k22m9K20k72K88j96
3617g6K47Jm24M45j12k76K83k86P6P7J70k36n1J75R8p9j46r9K05J45k14K59j51
3640C1L7j01k03K63j22J57M8j85M42l99m1L21k34O5m08L66J51k26L33k08J53n88
3662c48J52L58l45M0K21r2J90O2k44P1K04l19Q1j31J87r7K00k35K9K67m65L89
3684A75k37p4J86P4k75K05R0j84N9L0j9j23N4J40o0l29K37P3j63J93q3M5J80n6
$$ plain form
3527 5 2 134 25 69 79 -180 27 185 35 177 -68 -22 171 -349 -23 175 -109 60 -198 -50 137 -73
3549 -73 26 57 151 -13 195 24 182 -40 138 147 -73 100 291 14 -171 62 34 39 -323 153 -82 54 266
3572 266 -251 69 8 233 128 -205 -75 26 126 -24 98 -176 -235 105 -128 90 276 46 95 236 2
3593 2 -220 -63 -27 31 -98 -138 -341 17 -2 -41 12 -98 93 6 -57 108 3 155 -67 -116 104 -168 120 -76
3617 -76 171 172 -252 193 81 -195 88 -198 -122 -45 125 -111 -162 13 111 32 -114 -213 -8 137 -77 182 31
3640 31 68 -33 -236 27 -95 62 110 -75 367 -32 -73 248 14 79 -329 37 188 -38 295 87 240 -348
3662 -348 -196 162 -183 -143 78 -14 176 238 -6 65 269 -50 31 -100 87 -10 190 -45 -16 251 -214 175
3684 175 -62 -136 50 124 -151 54 144 -40 19 49 30 -93 -39 101 41 -288 -51 22 -141 52 -31 14 194 138
3708A38J2M1k04J48m68M57J2j06j52J51j95K3R2k8q0K30j12n8K01l80M20k46J18
3731A4j15j24J73J9j12K16r4j16j90N23M1j97j70K07rJ78m7k19k14K46Q2QQ4n17
3755c33M18k6j31OJ98m5p4j89J12N9j23K7N6k53R5Q4L09k78j02M5J01K86k67J20
3779I5k7k5j3j59K83J41j32k89n2L42N8m56L14l43K48o2j31L26m20K92P5j6J1
3802F0k16M33j97K16r7j10Q6j46J00r7m8KR0L04k35n9j38j83L52J06q0k83L86
3825B46l90K87j0j86l05K02K02q7O0K5J72k25K01l75N64k79OJ07j97R8o1Q9j4
3848A30k54J13R7j74K80k19K5l2Q0J33j82N0L0k80J64R3Ll1k1q1J23j35K39J81
3872C32k71j62j26K21qn9J04J08L6J16k98k06K32P7l65J33M5R9O5L6P0k38K38
$$ plain form
3708 138 150 191 -13 135 -333 124 136 30 -122 29 -166 -143 -51 -79 -159 71 -41 -99 102 -278 142 -104 14
3731 14 -101 -225 -52 -33 -145 71 -23 -139 -329 194 235 38 -132 75 66 244 197 -22 -236 10 92 100 184 -333
3755 -333 85 59 -72 -66 132 87 13 -176 -64 -5 -128 -101 -45 -298 -203 -119 190 -88 -190 -145 -44 242 -25 95
3779 95 68 43 30 -129 154 295 163 -126 -178 164 222 -234 80 -263 -15 -77 -208 118 -302 -10 65 49 60
3802 60 -156 277 80 296 199 89 175 29 129 32 -16 -14 76 380 145 86 -52 -235 117 223 143 -140 246
3825 246 -144 143 133 -53 -358 -156 46 -41 19 44 216 -9 192 -183 381 102 108 215 18 116 55 144 130
3848 130 -124 -11 86 -88 192 -27 -2 -34 46 179 -3 47 77 -203 -39 54 57 26 5 -76 47 -88 151 332
3872 332 61 -101 -227 -6 -14 -73 31 139 175 291 -7 -213 19 96 -269 -136 -91 8 73 109 179 -59 179
3895A79j33k0J00O9k27l0J12K25k54j87R6O4j6p8J09O4l39K45P4q0l86M00p5R9
3919A1p4J42q8J23m88J96M9q5J95j4J45j8N6N0r1k49L21j83J36j40n1K8M5l7J31
3944A10j89K73j35o5j42K90k31K06Lk12j14K14K39k32K49m71K49o7j00L24j64
3965C5n3Q6l17j19L75j85K34m7j88M0J87l6j96K3N9JL0mN5O1k06K83j14K0j15
3990i1r8J88l3o3L76j95j11n7K40k69J37k18K10o1J32J79j83j55K56l3p7j11q6
4013a23J49j43K08r4K56o8k48K6j51J56J68j78L6J92j99j08q4L80l80L22j09q2
4035g4p6p6K98KL1j45NK29m5k82nK96j49r9Q7Q3k27J90n7J17j75j38J49o2J83
4060F0N0j02j38J35Q5j22j10n3J37J64mJ03k04j05J90J65p8Q8l26P8k45K52J01
$$ plain form
3895 179 46 26 126 195 -32 -62 50 275 21 -166 -70 -6 -22 -100 9 73 -266 -21 53 -27 -413 -13 -88 11
3919 11 -63 79 -9 114 -374 -178 -129 -214 -19 -33 112 94 150 200 109 -140 181 -2 134 -6 -57 -29 16 -21 110
3944 110 -79 194 59 -6 -148 142 -89 117 120 -92 -206 8 247 15 264 -207 42 -25 -125 199 35
3965 35 -18 68 -249 -368 7 -178 56 9 -179 -139 48 12 -184 -161 -102 -101 -71 -75 -20 41 -165 118 4 24 -91
3990 -91 -189 -1 -34 -97 279 84 -27 -84 156 -113 24 -194 16 -45 87 266 83 -72 184 151 74 -37 -123
4013 -123 26 -117 91 -3 253 185 -63 -37 -188 -32 136 -42 -6 186 -13 -121 -205 175 -205 117 8 -74
4035 -74 -150 -226 72 74 105 -40 -35 194 149 -133 -138 158 9 -90 -3 80 -147 43 -14 103 -72 -210 -61 -123 60
4060 60 110 8 -130 5 90 -32 -142 -195 -58 106 102 205 1 -104 86 251 173 261 -65 13 -232 20 121
4083A21j68J39k16R5k4m2K19q5j19L47l29K35o9j76k3L19j5k36K15l19P5j22M12
4106B34k91j35K20j30N7K32l28k29K16J69L8k90pK36J03l78J67R8J52k01Q7j06
4128h6J43R3N3k60k27K46L31j11R7Oq1l31L00j20q3M6L8n7n4K06j9Qj00j41J24
4153B1Nj73K40k38K13j76Q2J79J98k53R0k34J15P0k05L81m24M62k24m35K81k17
4175b42N74n37L09j70K11k21M03l43j10J26J80j01l16M33m7l9l22J16K0J56L3
4196A13l01Qo6K22j56m7J50k58N28k66P5j91K86j23j35L02k09n3J74q9J28k26
4218a34K42k34L70j88p6k2J24p0QN8k20n3K02K25l74J73J01p4N5K0l79L56l5k02
4242a27J88l05L59m2j91J45p6K0J51j65K34l72J29j63Q2M33k22j87J22n4Pp3L0
$$ plain form
4083 121 -47 92 -124 -29 -53 -95 124 39 -80 267 -62 173 104 -72 -95 224 209 -27 188 -131 -56 -178 234
4106 234 -57 -192 28 -102 -45 187 -141 -370 -154 15 53 -237 -244 -8 95 -283 -116 -18 134 -67 20 -86
4128 -86 57 150 203 -57 -284 -38 293 182 279 285 204 -127 173 53 -30 16 54 -3 -57 149 130 138 38 -103 21
4153 21 26 -147 93 -145 68 -108 -26 153 351 98 188 -46 69 139 -66 315 -109 353 129 -306 -25 -242
4175 -242 332 -205 104 -66 145 -76 327 -16 -126 0 180 79 -237 196 149 110 -212 -96 -76 80 113
4196 113 -188 -180 -246 -24 -180 -227 -77 -335 193 -73 2 -189 97 -26 -161 141 -68 -121 53 -36 92 -134
4218 -134 108 -126 244 56 -20 -42 82 12 20 78 -142 -195 7 232 -142 31 132 58 113 133 -246 110 75 -127
4242 -127 61 -244 115 73 -118 27 -49 -29 122 -43 191 -181 -52 -215 -133 300 78 -109 13 -41 -34 -107 -77
4265g7jK19j7j63o6k7P9j87L72K5l42K76m6j16K8J43j15j7J44j75k3K32%q5m6
4290A5J13j49j01k5M56l73MR4j04j25K84k07L63j96m2O2M9j07j68J57J8K76l12
4313a8m7L00j92M4R1m32O5K82O6j46J83l9N5j57k5l2r6J96k1o9nO1m5n1mrJ96
4340A51k12J10J95r9R2m53K49ok04j67L71K88l57j4Q3O4R4m4j72L40l25j9L57
4363C22k25k23qJ69P5O4j99J4K84n64O04j15k44k72K10J33o7K44k99m4J11L50
4385C20n6j63M8k09j7L05k93K47j48m0K6J13j74Nk06Q9j19O5M83k29L0j20M8m5
4409d0J33m5j51J27k20J55J5J52Lj42J44k02m2M0K98k88J19k37J82j37J89J09
4431A62k6j09J95k87J52J4j72j50J64J05o3J26j48k1N1p5K04j46r8P6r8K2O0Q8
$$ plain form
4265 -77 -78 141 124 -39 -105 -132 -53 -240 132 157 -185 91 45 -71 -43 100 -15 -32 112 -63 -86 146 146 61 15
4290 15 128 -21 -122 -147 309 -64 -60 34 -70 -195 89 -118 245 49 7 69 118 11 -157 0 18 294 -18
4313 -18 -65 235 43 87 178 -254 -189 93 159 13 196 157 212 55 30 -2 -98 98 77 8 3 64 19 -32 -36 -45 151
4340 151 -61 49 244 145 237 -216 33 27 -177 -344 27 315 -42 -56 27 91 185 141 -31 309 -16 -35 322
4363 322 97 -126 -134 35 110 174 -25 -11 273 -291 313 198 -46 -318 -108 25 -42 202 -97 -141 -30 320
4385 320 264 101 149 -60 -77 228 -65 182 34 -6 20 133 -41 -36 -242 -153 -272 -207 276 47 77 -43 5 -40
4409 -40 93 48 -103 24 -196 -41 -26 126 129 -13 131 -71 -113 -73 225 -63 56 -181 1 -136 53 162
4431 162 136 27 222 -65 87 101 -71 -221 -57 48 -15 111 -37 -58 -7 -82 122 -24 -122 -46 -144 -122 -62 26
4455B6K35k95OJ60K0k02K2j13K01k58L39Kk09J04n4k0J57k74J73j2l33K21j94
4478b98M30j67J53L1n2k51J08K8J57j62K33l22K32M8j30n6K07m6k04p2J12j40
4500a61N0j52L07R0m2l6j07J46M5J91n23L81j96K7l26K31J91J29j94q8J15R3j97
4523b6K67j51k10O1L05k2m17L83k02j82L54j75j89K05n5K48l21K18Q5l20J71O9
4545I6k94J44kM9j14K01j14M6J03n5j05J14n4k83K98q2j39K0J67J2j12M30j17
4568B09k61K20k33J70j42N9j33j0J35J3j02J91j77m7L91k95M7p0q7J59Oo8RN0
4592C4m5P0m00K96j26k2L23m88L19r7L11l15L10Lj60j9k31L92k94J52K21l46J21
4615IL5J88r2Q5o3k13P5P2o0J96l53m1K92k08J76j88J27M2m2PL01j80l45J31J34
$$ plain form
4455 26 261 -34 -28 132 152 -50 -28 -141 60 -198 141 143 -66 38 -16 -36 121 -153 20 8 -325 -104 -298
4478 -298 132 -35 118 149 97 -154 -46 -18 139 -23 210 -112 120 168 38 -18 189 143 -61 -133 -21 -161
4500 -161 -111 -263 44 134 92 56 -51 95 140 331 -192 189 -7 20 -306 -75 116 245 51 -37 78 171 -26
4523 -26 241 90 -120 -59 246 224 -193 190 -12 -194 160 -15 -204 1 -54 194 -127 91 176 -144 27 96
4545 96 -198 -54 -56 -7 -121 80 -34 12 115 60 -45 69 15 -268 30 -52 -191 -171 -4 8 -104 326 209
4568 209 -52 168 -65 105 -37 22 -111 -121 14 27 -75 116 -61 -108 283 -12 35 -35 -122 37 43 -25 -16 34
4592 34 -11 59 -341 -45 -171 -193 130 -358 -39 -136 175 -140 170 173 13 -6 -237 155 -139 13 234 -112 9
4615 9 44 232 140 225 162 -51 24 96 36 232 -121 -162 130 -78 98 -90 37 79 37 44 345 165 -180 -49 85
4640H5k40J0L8L59k37M9J75q0l67M08j99m4K86m76K92K6j11j41J92jj8J86k97
4663a05J92L6J17k64j38M17J2k17Q3j96K43k24P7m4J90m08j6J83K05n2Q3m57n1
4686c34L34L11o4m51K75n17O06k24P7o2N6LJ46m4k92L78l97K05LM8m6k3L48l83
4710d7p3N0O9j55J43j78O0J73l12K77j30J16J6K1q8j07M7L87l27k22M36o4o8k37
4734b13MJ51J16l8j54M02k68j66J51K02k47J72N0l47N3K98k06m6N8P1Q8J43l29
4757e5K95k59q3Q7N2j36j51K33K0J06l7r8l2p5J39Q8p9l4K51l70K08j58R1p5J52
4782H0j20K3j58J72Lk23L91k17K8j16K48R7q7j25K04k84K44k28N9J48J03k01R3
4805A34k01j06L53k48L7lm3M5n9J91j44O7k5j8l9P0L3J3k16k11M77l3Q4p8j13
$$ plain form
4640 85 -155 -145 -107 252 15 64 239 159 -208 200 1 -43 243 -233 59 85 -26 -167 25 24 6 192 -105
4663 -105 87 123 240 -24 -162 255 267 50 133 -63 180 -44 33 -11 179 -229 -245 -62 143 91 174 -283 -334
4686 -334 0 311 247 -204 71 -446 160 -64 13 -49 7 10 156 112 -180 198 -199 6 9 57 11 -12 336 -47
4710 -47 -120 -70 -1 -156 -13 -191 -131 42 -270 7 -123 -7 9 30 -58 -165 -118 269 -58 -280 156 92 24 -213
4734 -213 -209 -58 58 20 -134 268 0 -166 -15 187 -60 112 162 -185 -132 166 -40 -86 -28 43 131 274 -55
4757 -55 240 -19 -102 -15 37 -99 -250 -17 3 109 72 -26 -58 -133 6 94 15 -19 232 -138 70 -88 3 -72 80
4782 80 -40 -17 -175 -3 0 -223 168 -49 -21 -137 111 208 121 -4 200 -84 160 -68 -9 139 242 41 134
4805 134 -67 -173 180 -68 -31 -34 -77 -32 -91 100 -44 23 -2 -20 -59 11 44 57 -159 -370 107 74 158 80 -33
4830c3J12K84m15kJ45r3l1Q2j25J07j30J87J11j94j56k23M05K8J16k52J51j92
4852a18J72J13j78q8K62j15J3n0J92k41j04M13k24j5j8J38j5l88K85J49m8m5l28
4875b38L87j48r9L7R6J30l09L05P7J82l00j27L8N0J77l97pK91k17J95j27j12R3
4898b3L7j0J15j10j91L55J19l87J00m7r0J78J26j85k29Q8R3J70k30K40j70J27
4920G6k53Q0J94j54j38J81J37j10nO6O1Mj78K14L7j12j68L8K6j38K24L7j01N8
4944G6r6rk54L2M8L62j69L9j0j08j48K1M06k0l42J19j37J22J48l50M76n34K73
4967e5p0O7O4o3P6K04m2R5k09j83L75l11l1K19o0Q4j22j02k43M35P3j43o2J19
4991A15j97j12L5M5K01j97o0L03k64J34P2k7n1j46K57k16K98r7J39l52mL32l39
$$ plain form
4830 -33 79 363 -52 -54 91 -2 -33 49 -76 31 -99 88 199 5 -151 -374 31 59 175 -77 74 -118
4852 -118 54 167 -11 -99 163 48 61 11 203 -38 -142 271 47 32 14 152 137 -251 34 183 135 90 -238
4875 -238 149 1 -98 -61 35 165 -144 161 238 420 120 -7 31 81 258 -139 -146 145 -72 123 -4 -116 -23
4898 -23 14 4 119 9 -182 173 292 -95 5 -42 -132 46 172 -13 -242 -154 -61 109 -121 119 -51 76
4920 76 -177 -97 97 -57 -195 -14 123 13 8 74 135 139 -39 175 212 100 -68 -30 -4 -142 82 119 18 76
4944 76 -20 -29 -283 -251 -203 159 -10 29 19 -89 -237 -216 190 170 -172 -53 -190 -68 80 -270 206 -328 -55
4967 -55 -125 -58 6 -57 19 223 181 276 67 -116 259 -52 -83 136 76 160 38 -64 -307 128 201 58 -4 115
4991 115 -82 -194 -159 -114 87 -110 -170 133 -131 3 75 48 -3 -149 108 -108 190 93 232 -120 -124 208 -131
5014a31j03J77O5j15O2M53m09k15K10k74M06k70L96l82J11J4j46K6M66R1k29j60
5036D3Nk26J77l9J52P2j35j99J47P8j04O6q5K76j06K24k17j92J03Q8Q9k78j13
5059a74O9K99k29K38j63J2N5j8M2n3N8m79M20j66O8L14o73O78l98N6k9k3J51j00
5083d5l22M35l07K27J1j38J82k89J0k19M52l80j9K37k0j20L22K60l41k76N48K67
5105D75o08M65k59r6J51k04O8k14J79m6N7M7J05k66K13L5j7q0n9J58j86n7q5J82
5129d2K36m22K1K56q4J50j57J43rj63K83j25j19o2K33l32M02k51J21J65j47J7
5151A14q4PJ70j11J56j35O6m1Qo9j22J96o2j03L7m2k02L46l02O8n2L2P4l82M21
5176a2L7J7J13p5l47K00K16kn4o6J1P2Q7k54J9J50j80m0m3K20l04K59J64pk07
$$ plain form
5014 -131 -234 -57 8 -107 -45 408 -1 -216 -6 -280 126 -144 252 -130 -19 -5 -151 -125 341 432 203 43
5036 43 48 -178 -1 -40 112 184 49 -150 -3 75 -29 37 -48 228 122 346 129 -63 40 128 217 -61 -174
5059 -174 -105 194 -35 203 40 52 107 89 131 78 136 -343 77 -89 -21 293 -380 298 -100 -44 -73 -96 55 -45
5083 -45 -367 68 -239 -12 -1 -139 43 -246 -236 -455 -3 -383 -402 -165 -185 -305 17 277 -64 -340 208 475
5105 475 -133 332 73 -23 128 -76 -8 -222 -43 -89 -32 15 120 -146 67 102 85 5 -54 104 -82 -139 -224 -42
5129 -42 194 -228 -207 49 -35 115 -42 101 92 -71 212 87 -32 -94 139 -193 209 -42 79 244 97 114
5151 114 30 37 207 96 252 117 183 142 150 81 -41 155 93 -10 27 -15 -217 129 -173 -105 -157 -125 -51 -433 -12
5176 -12 25 42 155 80 -267 -67 149 147 93 27 38 110 197 -57 -38 112 -68 -108 -151 69 -235 24 188 181 -26
5201b6J5J35l83J50J05J4j76L65j53N0k29K26J00p8o7J4P3n4O7j00j49k27K55
5224g3K32j30J42m6j40l3j71P4N3J39k72R4L0k6K36q2o1N6K92k65NJ45n44K08
5248a37J05K48l05j2K75k00J08o7k42L06Pk26J35l69K81K74j38j9j10L90J3k49
5270F8l4j02k4L21k47J21J3j30J5L2n9Q2m3J00P8k74r2P6J51k85K14N2K26k08
5294E1L23m68K4J9J45M1j88o7J59J58n7j07P9J00j76L1j69J78LM07p41J17NN7
5318g6j4k10K95J14j9j38P9l37K27J84l9J13j92J87k18J41N6j32J27k26J22l56
5340c12L27j2K33k55K7P8np0P2k3l1R5k27L02j97J78k79J6L85l62N5j00J52j85
5364a38J51j17O4K09p8j77O5K35k98l2J04N1J9O6j22k21K37J61j32j8j95J21J43
$$ plain form
5201 -26 -11 124 -259 -109 -4 10 -166 199 46 96 -133 93 193 115 48 62 135 81 148 48 -101 -328 -73
5224 -73 159 29 171 125 -15 -48 -219 -145 -92 47 -225 -131 -101 -127 109 27 -34 22 314 49 54 199 -345 -137
5248 -137 -32 216 -89 -101 174 -26 82 15 -227 79 86 -140 -5 -374 -93 181 43 24 -86 304 317 68
5270 68 34 -68 -92 229 -18 103 116 -14 1 33 -26 56 13 113 191 -83 -175 -99 52 -233 -19 33 259 51
5294 51 374 -94 -70 -51 94 135 -53 -120 39 197 140 33 112 212 36 67 -102 76 79 486 -255 -138 -133 -76
5318 -76 -90 -300 -5 109 90 -48 31 -306 -79 105 66 179 -13 174 -44 97 153 21 148 -78 44 -312
5340 -312 15 3 236 -19 8 86 81 11 83 60 29 124 -103 199 2 180 -99 -83 302 -60 -5 -105 47 -138
5364 -138 13 -104 -40 169 91 -86 -21 214 -84 -116 -12 39 58 124 2 -219 18 179 47 29 -166 -45 98
5387I8l12L96j23J38k97q6L23k4j23q4K82j49N7L4n5J14j11k60P5J0Q9n1q8K96
5411A49j00n3j96O1J18J85k50J98l3k80J65K31j84l5J0l55L28L94k96k75M17m31
5433b32L99j31l6K29j21k95J30O8j72L45k74K16j36J5r7j32K89j25l0L48k89M3
5455A2j31K94m40K32j02K05k5j49N6J55k52J70m1K05lj39j55J42j94J26J28p2
5477B2p0rp2K27m28J21L46j52J19k00N6J15p2j84K73j40k8lJ1K22j64P3l20N40
5501B83k97J5k07K21J3K8n14M70j80J16nj43J35N7j06R2j22L26k38O1K24j38p3
5524A8k25J09q4K81q8P8n5k52L84j38j19Q7mK73l27K8j95K06k76J22J44M3J10
5547A20k80R7k3K36j20l9J80k03k76K91J9m4J5p0J23j89K12K42k13K36l97J5R7
$$ plain form
5387 98 -214 182 59 197 -100 -186 137 113 -10 -94 188 39 96 130 75 189 78 -182 -107 -97 -8 -59 -147 149
5411 149 49 -4 -200 -139 -21 164 -86 112 79 -201 -36 195 11 -24 -14 -369 -41 353 57 -218 199 -232
5433 -232 167 36 0 229 108 -187 -57 11 -161 184 -90 126 -10 5 -92 -224 65 -60 -90 258 -31 12
5455 12 -119 175 -265 -33 -135 70 45 -104 -48 107 -145 25 -16 189 186 47 -108 34 -160 -34 94 22
5477 22 -48 -57 -129 98 -330 -209 137 -15 104 -96 -40 75 3 -181 92 -48 -76 -79 -68 154 -10 63 -257 283
5501 283 -14 1 -206 15 28 56 -458 12 -168 -52 -57 -200 -65 -8 -114 -22 -144 182 -56 5 229 91 18
5524 18 -207 -98 -182 99 11 89 34 -218 166 28 -91 -4 -8 265 -62 -34 -229 -23 -299 -177 -33 10 120
5547 120 -160 -63 -86 150 30 -9 171 -32 -308 -17 2 -42 -27 -97 26 -163 49 291 78 314 -83 -68 29
5570B9m2l3N5J03m13K76k97L18M7J47l17K24pj29J02j64J66N0l3K4n8l32J16L36
5594A68k70L0J99q7l2J13j63J37j30j36k9J75j64J29J31k56K80PK04m80Q2k21
5616c13J32L09m5p7k30O7J24J00r4p1J93K9k89L10k36J39j06n8Q2J31r9q9R6Q1
5640H6K9j07K0l4j17J69k9J90j98k9k10K21k9O1k11K49J91k25R3p4L6K69j05m10
5664a64K08k38M29n4k46J05K06l24J29k57K01j78K93J4j39K5k85J73k4J57J65
5685A96M1l33%M5J45j67J58R3o7n5K48l80P8J90k54qj86J31M60l17j52K1O3Q8
5709C8k09K26n0j22K45L9o0k25K69J0j08n2RJ90k44R0j09K25N6j72k36K3J12j3
5733f8L0J63k2K9j29kk72L44j14m1J45J73l81K45k17K37j82J06l43K58R3j76J25
$$ plain form
5570 29 -13 -46 9 112 -301 -25 -322 -4 43 190 -127 97 90 -39 63 -101 65 115 82 106 48 -284 -168 168
5594 168 -102 -72 127 40 8 121 -42 95 -35 -171 -200 -25 -189 -60 71 -185 95 102 306 -174 -92 -313
5616 -313 -181 128 83 6 -224 -157 -33 67 -27 -98 95 124 -165 145 -91 48 -58 -116 -34 97 -2 -91 5 86
5640 86 115 8 28 -6 -123 46 17 207 9 -20 -230 -9 -38 23 -188 61 252 27 120 46 82 351 246 -164
5664 -164 44 -194 235 181 -65 40 246 -78 51 -206 -5 -183 110 124 -15 10 -275 -102 -126 31 196
5685 196 237 -96 -96 -51 94 -73 85 178 111 56 304 -76 2 192 -62 -70 -256 -125 335 18 -134 -113 -50 38
5709 38 -171 55 5 -117 128 167 107 -118 151 161 53 1 10 200 -44 46 -63 162 218 46 -190 -167 -55 -68
5733 -68 -38 125 103 132 3 1 -271 73 -41 -82 63 236 -145 100 -117 120 -62 44 -299 -41 52 -124 1
5756Aj54L39j09j38l06N60O2j74l49J87jL49j26J5o6p8j46PL33j04J5j7q1J00
5780A19r5o2K77r8l37K66k93J35J54l98M48p2k66R7k12M02l2J02k33O9K95l22
5802e6J67o9k81K71p7J0J73j40k0L5j16L26l9L0k26j17K03J28J7j17j35q1K52
5825A38k04L04l03N2K01j07r%l18N12j79K5O5k94J80n9n0L33j75n3P8k36R4oj57
5850a68L41l64J59j94J55L2L62j05k02L7L3k79P3n1j17L36k00O2L30k61K31m41
5872b31K35K98j49k26l5L23k56J1m3J18k21L05K4l0j15m9J08q5J01k44K08K75
5894C22m31K4j23P7N22m05K2o8j41Q2L02k29J27o6Oj17K67l57L25rk64L34m61
5917b61M08k8J60o6j59r1j9L26j48j21q3J85Ol8l03J81J55j97R4j23J10K88k15
$$ plain form
5756 1 -153 186 77 -61 -367 193 255 81 -268 -81 -82 267 141 156 90 12 -134 -127 206 102 117 100 19 119
5780 119 24 -38 239 141 -196 70 -223 -88 66 -332 116 44 -222 -125 -337 65 33 135 -98 -29 266 -56
5802 -56 111 42 -239 32 -45 -35 138 -2 -22 13 -103 223 184 214 -12 -129 74 202 219 102 -33 -114 138
5825 138 -66 238 -65 -13 188 81 72 72 -246 266 87 112 177 -117 63 4 -46 287 112 59 137 -99 -5 -11 -168
5850 -168 173 -191 -32 -226 -71 -39 323 218 16 53 86 -193 -120 -171 -288 48 -152 -90 240 -21 210 -231
5872 -231 4 302 153 -73 -108 215 -41 -30 -73 45 -176 129 153 123 8 -41 67 -18 83 -161 47 322
5894 322 -109 -85 -208 -131 391 -14 8 -60 -201 -119 183 -46 81 15 21 -96 171 -186 139 130 -134 200 -261
5917 -261 147 119 279 213 54 -37 -56 270 122 1 -82 103 109 71 -232 -51 104 -93 1 -122 -12 276 61
5940F1l6j72K80q66N87J83J45k29J6Q7j90J67J74r0l10Q9o4J83L4O6l10K28K02
5963B35l05j70L82m21L46l0n6K85j48j56m2K91k06m85L12L03l01MN9K81m45M72
5985B05pJ24l08JJ8j39L20j72j73L23j00l73K38J44p3J60k81J21K53r3n1j86J51
6008A02j17P5r8K41j81N2j45J20P2j27j4L6K7K8q3j87K08J34J0j40P2j92jK7P6
6033en0P5l50M36R5l02J31K7j41J03k10K72j48L5J53J45j20k19j30L09l0m11L94
6056E9j3j0K9o5p9J31Mk24J72P2K39k99l0J6j80P4K48k07J65k94Q2R6N1K78n23
6081b08j17N68J3j29o6L5j83J11n3L8j9j82K06L9J2K46k02j40l7r0Q3M8L34k21
6105H6l01Q2l5K47K13j60k88K18j1j29j88L83k32K49J1m86O24j33r3k73L94k72
$$ plain form
5940 61 25 -147 133 -733 -146 37 182 -47 -31 56 -134 33 207 117 -193 -104 -168 15 49 115 -195 33 235
5963 235 -70 -240 142 -279 67 37 -19 266 118 -38 -80 211 5 -480 -168 135 -166 -162 -103 178 -267 205
5985 205 198 322 14 15 33 -106 214 42 -131 192 92 -281 -43 101 28 188 -93 28 281 188 137 -49 102
6008 102 -15 60 -38 203 22 74 -71 49 121 -6 -20 16 43 71 -12 -199 9 143 153 13 85 -107 -108 -81 -5
6033 -5 -55 20 -330 106 201 -101 30 57 -84 19 -191 81 -67 -32 121 266 146 -73 -203 106 76 -335 59
6056 59 46 36 65 0 -79 52 56 -168 4 76 315 16 -14 2 -178 -104 144 -63 102 -192 -110 -14 37 315 -208
6081 -208 -325 243 256 127 61 96 -87 24 -29 9 -10 -192 14 53 65 311 109 -31 -68 -158 -75 -27 307 86
6105 86 -215 -133 -168 79 292 132 -156 62 51 -78 -266 117 -115 134 145 -341 283 150 57 -216 178 -94
6127i4p8J18J53j75j92P23n36q8J22K12l94K33QQk9J76m71j34J79M38m39N99j73
6150A66Q9l71K45o2M72n40o2k06j84M21J98m5j28P7P1j93k29K20L76J59o94M23
6172B03l80P82p90L34q37M12M53K74n82K92J63j09K00o25P05p38L28Q4o97J84
6192c44M96K44m32l23M79J20m58J41M93n35P06l79o0j46L0n06N12J42N26o88K
6213B0Mn9k35n5K09K51M58m44Pl44Q9n56O13r6J77K4R1kj94J01l25L5K69k90L19
6238F7k88J24j2J41j58J11K9pk17K50k32J64j27J05n7J60j46J20O6q0k9n4p6J83
6262C7M7j22L04k68LP4k75R0J54k27l7K22P4q8J41J83j04l43J9k35J94J3J42O4
6286F2k1j71pK66m10K14J85j17q9K90l12K71k47K5M06l59K3j34K05j42L82n55
$$ plain form
6127 -94 -172 -54 99 -76 -268 455 -81 -169 -47 165 -229 4 12 20 -9 167 -304 -438 -259 179 -260 339 166
6150 166 255 -116 129 67 539 -1 -63 -269 -453 -32 166 121 -7 70 141 -52 -281 -61 315 474 -220 203
6172 203 -177 605 -185 149 -688 -276 177 451 -131 161 324 215 415 -210 495 -243 85 169 -528 -344
6192 -344 152 396 -36 -359 120 240 -218 -77 416 -119 587 208 148 2 32 -474 38 180 706 18 20
6213 20 24 -35 -270 -325 -116 135 593 149 156 -188 -99 -655 -42 -138 39 63 154 152 -42 59 -266 -231 38 -252 67
6238 67 -221 -97 -109 32 -126 -15 14 7 -210 40 -192 -28 -155 -50 -107 53 -93 27 93 13 -16 -70 -146 37
6262 37 84 -38 266 -2 1 75 -200 -110 44 -183 -220 2 76 -12 129 312 208 -135 -116 -351 -157 -144 -2 62
6286 62 41 -130 -137 129 -281 -67 118 1 -88 202 -110 161 -86 -61 345 -14 9 -125 80 -62 320 -235
6308b35M15m0o0j05R6J70j89j3k1j87j00M83l79L3J39k62K41K42k54j0J54r9p4
6331e5J10n2o4o9j32J87k2j1J74O3l34L13k0k96L53j12j31o6M28l26J88j43k6
6354d3k16J72L41k95O6K11o6j58p6J18J09l70K94j40l3p7J66Q3J1j14o3q8M20
6377B52k80J4QN1O4j78J44r3N7Q0r5N0J17J57l73J91jk75N9j2j58K91Qj12k51
6402b85K83J46l14L72n73M2M74j0l9K1n1j37L94l05j71K68j19J76k50k2M5nK53
6425A93k31J05K21j05j95j47L00M7l85K73K24l14J21K06l74m4K41j95J44L9k36
6446a12p4K04n4k59K46M8Q5k94J91K34n1l70L34l54K47j07P5K13l66K52J49m13
6468a76J83j09J13N0k12J71Q8j44p0J81J30k20j47M20r9l61K73l3Nk38j89P31
$$ plain form
6308 -235 180 140 80 -25 71 241 52 39 18 -169 -269 214 -165 -132 7 -255 -14 228 -26 -36 118 19 -55
6331 -55 55 3 -61 -130 -262 -75 -97 -108 66 129 -205 108 88 -208 145 33 -98 -164 264 -62 126 -17 -43
6354 -43 -259 -87 254 -41 25 236 170 12 -64 54 163 -207 87 -53 -86 -163 3 86 97 -17 -80 -168 252
6377 252 -28 -14 -6 45 109 -69 75 -18 39 119 24 74 191 348 -25 166 165 -110 -51 -63 -221 70 78 -34 -285
6402 -285 -2 144 -170 202 -371 -329 145 135 96 117 66 -71 323 18 -153 115 -4 172 -78 -100 -55 -60 193
6425 193 -38 67 288 183 -12 -159 141 188 -197 76 300 -14 107 313 -61 -105 136 -59 85 124 -112
6446 -112 -186 18 -36 -295 -49 -1 84 -210 -19 215 164 -206 128 -226 21 -86 -11 202 -164 88 237 -176
6468 -176 7 -102 11 61 -151 20 108 -36 -106 75 205 -15 -162 258 159 -202 71 38 43 -195 -384 347
6490C47m40J21k33J42J19o4J08j04o7J8j24K46j48N4r3q6J88q2J84j25J96k73
6512a16q2J83n5P4O0K03k32o6j65K44J35j40k28L40l45N9M6k7K39k25K12l01Q6
6535a01L00k71P6Nj51P4%R2o8L59k51l8L9k57K21q1n1j64K55J8M1k10K52k87J82
6560a6J72jk27m53N83o7R7Pq2k0j87K28R7k82J08R3j71K7m3M09j77j47K0K86l00
6585d6L2n9o0q5M43k10l76L73J5k14L02j73K72k31m3m1J59J01k63J45N3k53J79
6608B0q7j13J2J42O6j93J76J19j68J79l86K38K03k81j9K29k10L97n32L34j31L8
6630C3Q3p9j03p7L10j00k38M54n15J99J12k71J98L3m03L05J01J6k07M0R0K91j22
6653A50j67J55n8m6J32j94m4j05L93l27J77K06m38J88Q3K71l73n8Nl03K15N30
$$ plain form
6490 347 -93 28 -205 -63 56 -8 100 -4 -71 -53 -177 69 -79 -25 -118 -204 -16 -98 86 -39 157 -116
6512 -116 -198 -15 -70 4 64 267 35 -31 -196 48 183 43 -185 155 -190 -131 -85 -112 127 -98 114 -187 -101
6535 -101 199 -72 4 9 -142 -68 -68 24 -44 315 64 26 65 -192 29 -52 -103 -267 -12 6 47 -163 89 -198 -16
6560 -16 156 155 -72 -525 58 -9 88 95 13 -7 -194 34 131 -151 -43 50 -121 -94 -137 272 95 -52 -32 254 -46
6585 -46 -14 -73 -133 -218 225 15 -361 12 27 -187 115 -58 214 -17 -60 -101 58 159 -104 41 94 -159 20
6608 20 -67 -180 -168 -26 40 -153 23 142 -26 153 -233 5 208 -73 -92 137 -73 324 -208 126 -5 33
6630 33 116 37 -66 -143 167 67 -171 283 -232 -33 79 -192 6 39 -364 -59 42 58 -149 -109 -19 272 150
6653 150 -17 138 80 34 166 -28 -72 -177 216 -111 66 272 -166 22 105 376 3 -55 -50 -353 -138 392
6675C92k66j34m6j07J49L2j47J71j91J00qk94L77j14J34J5J58l0l38k68M88jn8
6698A4m7N1J6J96k26J69j22l6J93k50l9K60j55J96j87L99n60K5J5K08j1o3kP5
6722A19j10K70K5o25J27K58j83L0Q3oJ46k07M51n43R6K72k45lJ16j61L34j81j43
6745h0J00J98N4k06m9N0q5J70k3l2j00K4j43M3K86l33L71k67o2j16O2N5r5Q8J18
6770B8m3l28M51j35L7Oj28K61K16l43p5K00j29kj6J22j19r8j65L30o9j89J65P3
6794E0Lj98K0m3K75m6l10L24Q5k13J15j77P5PJ83q5j73O3J19j6m6k8Q1k38O4O3
6820d6L44m60J89J8Jk49K66J73k34J0N6P5m63L94j30n1J85r3K81k81j33K95l36
6843a89L18R3k05l4j59R1N2J5J96k5Kk71J84J10j71K39n8j82R4j38kL3j84K03
$$ plain form
6675 392 126 -8 -54 -161 -12 20 -127 44 -147 -47 -55 -349 28 -86 48 63 221 191 -147 -415 73 72 14
6698 14 -33 18 34 230 4 173 51 15 208 -42 -81 179 24 220 33 432 -128 -103 -88 120 109 46 44 119
6722 119 9 279 304 -321 -194 64 -119 -89 -6 -12 134 -73 378 -165 -69 203 -42 -45 71 -90 244 63 -80
6745 -80 20 218 272 66 17 67 -18 152 129 97 -3 21 -122 -79 207 -126 245 -22 -84 -200 -138 -83 -178 -90 28
6770 28 -15 -343 108 -27 10 16 -112 149 365 22 -53 147 18 16 0 122 3 -95 -260 70 1 -188 -23 50
6794 50 53 -145 -125 -168 107 61 -249 75 160 -53 62 -115 -40 -33 150 65 -108 -45 74 58 12 -16 65 -173 -109 -46
6820 -46 298 -162 27 45 46 -203 63 236 2 12 68 143 -320 74 -56 -107 78 -15 266 -15 -148 147 -189
6843 -189 129 222 17 -17 -176 -85 -33 -18 178 153 155 -116 68 178 7 246 188 6 100 -38 -40 -7 -191 12
6867A2l14L33J99l75J41Rr0oJ66J2k13N0k33R9o0L63j03J63k59L62j68K4k60J65
6891A7J07m09K83l5m5J67k41K42k10M7J07J34k03nL2J16J52l32K33l60o2M34k32
6914f3J33L1L8Q6l66J55k19J37N1m1k29K50rL06k34Qk7K14r4k82L42j6k54m3Q4
6939d2K0K28O9l19jl9J36j08r5J01L44k58J00K3k34L12l28R1j96K84J08k93PJ32
6963D2k59J48N9J29j54o5K64o7l07P3N7r0j4K01l64K77J93jk66K39K7j22J36J4
6987A50k7j65JJ7q1o1j93L70j16L60j27j12j34K5P4j46K87k9m4J02R6M7j18r3
7011H3r0K45q6l34M74l03M5j18p7L22k80K89J2l0m4nJ11K5l05O0j94K1K62l66
7035b83L20r8j39M14p2n4j39j57J27J37R1K95n84K54j36j94J91J07M1n9J8Rm5
$$ plain form
6867 12 -302 31 230 -145 -4 5 -85 -91 75 87 -126 -76 -309 -210 -270 93 -10 153 -106 256 88 112 -148 17
6891 17 124 -285 -2 -37 -82 85 -156 86 -124 -77 30 164 -39 -44 -12 104 256 -76 157 -203 -265 169 -63
6914 -63 70 101 139 225 -141 14 -205 -68 -17 -58 -287 -37 -46 260 26 34 7 221 127 -155 187 171 -83 -126 -42
6939 -42 -22 206 275 -44 -45 -84 52 -56 -151 -50 294 36 136 159 -75 237 -91 0 -196 88 196 -97 -90 42
6963 42 -217 -69 -10 119 -35 -100 164 97 -210 -137 -80 -170 -184 17 -347 -70 123 122 -144 95 122 0 136 150
6987 150 123 -42 -41 -24 -105 -166 -359 11 -105 255 128 16 -118 -93 -19 -165 122 93 49 151 247 294 176 83
7011 83 -7 238 152 -182 292 -11 34 -84 -161 161 -119 170 182 152 108 103 214 239 -66 -6 -200 -179 83 -283
7035 -283 37 -61 -200 214 142 88 -51 -208 -81 56 147 442 -142 112 -24 -218 -27 80 121 62 80 89 44
7058D4j53L86n7q3m46J27L84j68K63m05R7j06p5Q1j91N20l83P3P8l2j3K22k28
7081f5K17j73k13K11j77J01J17j14L1K43k22J38L4j03k61M20k26j41J84j18j52
7102b69J41j38J44K60j82N1j5J80Q7l08J1P8M4o2l1j78K28l37J34K44j24o7J60
7125E1k00q0K19M3K1%J07L9m98L52k2L3N4p8j41Q2m1R1K31l59k0J8k38L62m8L33
7151C11l50J18j02o7j3N6K95k90L15m22Q9J88J37l75L68j91j72M5R7j04J18L8
7173H9j55J80k31k7N0J61n8P2r7Q8k67J51K30m33K30k45J9L90j97L7J74m3k36
7196a18R7K7J57m28L28j02K41k57o5K96l99L39p8j07K36l23P9K04k10j15M03j37
7218F8l62M24o3k49K20k90L67q1J94m94J68K91k76j36J12J04J05ro0k89PM06M7
$$ plain form
7058 44 -109 277 220 137 -309 -182 202 34 297 -108 -11 -117 -192 -111 -302 218 -165 -92 -14 -46 -59 163 -65
7081 -65 152 -21 -234 -23 -200 -99 18 -96 -65 178 -44 94 128 25 -236 184 -42 -183 1 -117 -269
7102 -269 -128 -266 -122 138 -44 7 -8 172 259 -49 -38 40 84 22 -9 -187 41 -296 -162 82 -42 -109 51
7125 51 -149 -229 -10 33 54 54 161 200 -298 54 32 65 119 41 -100 -18 -59 32 263 -96 -116 -98 -336 26 -22 311
7151 311 -39 79 -23 -90 -103 -47 248 -42 273 -149 -60 128 265 -110 258 67 -105 -60 37 -67 51 89
7173 89 -66 114 -117 -144 -94 67 9 81 -16 72 -195 -44 186 -247 -17 -262 -243 147 -50 -13 161 118 -118
7196 -118 -21 6 163 -265 63 -39 202 -55 -120 176 -223 116 38 -69 167 -156 -77 127 -83 -198 205 68
7218 68 -294 130 67 -182 38 -252 115 34 228 -266 -98 193 -83 -219 -107 -3 102 93 33 -256 -249 157 204
7241B04j28j41P4m0L0j30o7J69J02k00J92k00j9P0J46j51p1l5m1J87n7J00J63
7264A57k93J60R3m38L06K26Q4m15K74o2k4K7p2m3J67l2j23K48k22j75K70l8j8
7287E7j81K79j60J10K09l51K04k72K73j70J53pl31L66k91j41L82l55P9J95l51
7308c03J78J76l2k89L09j39j26J90Po2k11M01j78Qj25R7K5P9j84L3J31L9j34J27
7332A7M1J54n8Q2p7p0q7P6j68o2J68K1K31r9j85m7O8j32Q2j85K58J75l26L80p1
7357A86k1j27J01j10J74j19n8K4k14J42j52K91JJ24k67j67J48k0j88J72J5k1L48
7380B62m02J23l1j34O0J20K0J6J01k23J36r8J29M1k02O4k17J18M46j83k49M38
7402C35n89J95q2J48K4rJ48j01J92j25K28k06j36l8R1K7m95j4K17j5K26J01n7
$$ plain form
7241 204 76 -65 9 -31 -1 -131 -198 -29 73 -127 65 -135 -154 -84 62 -89 -160 -195 -236 -49 -106 -6 157
7264 157 -136 24 117 -321 -15 211 295 -120 154 92 68 95 23 -20 147 115 -8 240 18 -157 113 75 57
7287 57 -124 155 -5 105 314 -37 167 -105 168 -2 151 144 -187 179 -112 -253 129 -226 -147 48 -303
7308 -303 -125 51 19 -270 39 -100 -226 -36 -29 -91 -302 99 -79 -71 -196 -99 -74 5 -179 -146 -15 24 -110 17
7332 17 58 212 154 236 159 89 2 78 -90 -152 16 37 268 169 -16 -63 5 -127 -45 -230 28 203 -123 257 186
7357 186 165 38 139 29 203 84 26 50 -164 -22 -174 117 118 242 -25 -192 -44 -64 -252 -80 -65 -86 262
7380 262 -140 -17 -48 -182 -122 -2 18 34 135 -88 48 -50 79 120 -82 -18 -235 -117 329 146 -103 335
7402 335 -254 -59 -141 7 31 22 170 69 261 136 364 158 22 -16 75 102 -393 -407 -190 -205 21 122 65
7425F5k3j09m4L16j12k18J31J9J5k6J05k77RJ25P8j67J24O1K4k32L23j92l1J7
7449a9j27K01KJ36k15p6K51j46L83l66k7L19n64L96k36Q2J56J4l99J70K67k26
7471b4j42Q2L17n2k58m0j99J69K31j24J47j4R9l27L29j86K10j53LJ7k0k62J24
7494g3Q6J57O4j84K5j79K77q4Jj39P7N1k52N4K1J12J53k45Q8k03L00j19N7K91
7518C36l74J73l73J76q2J32P9l12K09l6m2N0O2K9K04k15r3o4L91k66n4j04K25
7541E1K2m20M19J3k01j0J14j9P3rl3k62L22K05l57j53K95j98q7o5J16M10l11J56
7565G1j52L8L7Q0l46J49J70j03L27l45L5m1P8J67r4m8o7J45l3P0l4m1j89K67m33
7590b92M69j93M6N0J20k38j98J17J69K56k9j07p8r3k3L60l67j9K78j6j6n23J39
$$ plain form
7425 65 42 -67 -111 205 93 -125 6 25 40 14 119 -158 -149 -24 54 -113 11 72 96 -136 187 -5 -36 -19
7449 -19 -146 55 57 193 -22 -98 153 7 390 24 -3 316 -248 148 -88 -6 150 164 -235 -65 202 -24
7471 -24 -166 -84 233 181 -77 -117 -316 -147 84 -40 107 93 192 -135 194 8 218 65 68 85 65 -197 -73
7494 -73 13 170 234 50 75 -104 173 89 90 -49 28 79 -173 -119 -98 14 167 -78 10 -193 107 -12 45 336
7518 336 -38 135 -238 -62 -144 -12 67 -245 -36 -72 -114 -64 -2 27 231 16 -77 -141 250 -16 -70 -174 51
7541 51 73 -347 72 85 -116 -126 -12 -31 42 33 0 -262 60 265 -92 -245 50 -148 -235 -300 -184 226 -85 71
7565 71 -81 -43 -6 74 -272 -123 47 -56 271 -74 -39 -80 -2 165 71 23 -44 101 68 138 104 63 -126 141 -292
7590 -292 177 -16 30 80 200 -38 -236 -119 50 306 277 170 92 -1 -24 336 -31 -50 228 212 196 -327 -188
7613a88J06J96j55N27m53k6K21o04M42j85J16m1L6j35r3pL56j93q9J48j11q8M32
7636B12j18k12R2k6J52M1j44p3r9O9p0p5L97j52K06O3l94J12J49n4J59o3m30K58
7660@O7j47J66j14K7j07L1kJ98k84P3J23O1j35m1N8J72k27j7RJ62j35M8n4k4n
7686i7R4r2L0J13j43J71k64K37k06M42n45L37j76j0K75Oj91k34M8J74J82k20J59
7709I0o6n0M3O4j34N9l09M32l29K06l23N19j66m4j99J31p2J39k53L41J53n12N69
7732B89l57K27K7l47K44j97K16Kk47L02lk79J01K47k87J70j73L8j95n7L14j74
7754a39K22J4j54m0J33r5j2K99r1j5n7l22K51L8j01J73l01M11j82j40P2j8j52
7777b06K41Q5p7r1N8R8j70J55k86M07l15K49n1o1l14L45Pj29L43j55l1k10L0K78
$$ plain form
7613 -188 -82 114 -41 486 33 7 228 -376 66 -119 -3 -44 -8 -143 -236 -243 113 -80 -169 -21 -132 -220 212
7636 212 94 -118 -26 -52 100 141 -3 -76 -175 -106 -176 -251 146 -6 200 263 -131 -19 130 76 235 172 -258 0
7660 0 67 -80 86 -28 -1 -108 -77 -79 119 -165 -92 31 92 -43 -84 -26 146 -81 -98 -89 73 -62 -14 -68 -92 -97
7686 -97 -3 -95 -65 48 -95 76 -188 49 -157 285 -260 77 -99 -109 166 172 -19 -253 -205 -31 151 -69 90
7709 90 24 -26 17 81 -53 6 -303 129 -200 6 -317 202 36 -8 -207 -76 -148 -9 -262 79 232 -280 289
7732 289 -68 159 186 -161 83 -114 102 104 -143 159 156 -123 -22 225 -62 108 -65 -27 -222 -279 35 -139
7754 -139 83 97 -57 -97 36 -59 -71 228 137 122 65 -257 -6 32 -69 104 -197 214 32 -108 -36 -54 -206
7777 -206 35 120 43 -48 10 108 -62 93 -193 214 -101 148 97 36 -278 67 74 -55 288 133 102 -108 -78 200
7801B00j95j83K50l72K73Q3J07j06M1L6q7l17J20K93p4j98J44j34l7K24k41M6
7823a27n1j1K45q1k2J31k43K62j2m17L09k31M17j11p6P6j63J00K1oj08k4R8P9
7847E5r0P5j65K82k60J38k51L29r3J00o3k67L44k09K93o8K2ml65p3L45k33M20
7870B62k95l2R2k15L60j91j82K12j5K05l90J46k32J84k1l64J82K24%LJ73l21J15
7893a00j13j44L21jn1K05j42N1l8p6J58J0r7j43o5K80k19j1M39j81o8j16P3j75
7917b03L66K9j84j58K63%J7j85j87R9K90k04pM52l16j79K1O7J1j82K27p1J40p
7941I9j77P3j90J42J13P0J48j71k35QN12k74q9J37r1J23k43L52j38l10J07r9J52
7964A9j2L6J05k09J55R5M8r2m9J46o2m23L60k87K71r9K73l96J19q4J02j99J09
$$ plain form
7801 200 5 -178 72 -300 -27 56 163 57 98 134 47 -270 -150 143 69 -129 15 -119 -156 68 -173 -127
7823 -127 -178 -189 56 -25 -47 84 -159 103 91 -326 -17 -248 169 58 -18 58 -105 -5 16 10 -98 -122 -24 55
7847 55 -35 40 -125 157 -103 35 -216 113 20 120 57 -210 134 -75 218 150 172 168 -197 -270 75 -158 262
7870 262 -33 -65 27 -188 172 -19 -201 11 -4 201 -189 -43 -275 -91 -112 -476 -294 -70 -70 -67 106 -215 -100
7893 -100 -213 -357 -36 -37 -88 117 -25 26 -12 -88 70 80 -17 -160 -225 55 -164 -175 264 83 15 -101 -28 -203
7917 -203 163 192 8 -150 113 113 130 -55 -242 -143 147 -57 -64 388 72 -107 -86 -19 -8 -190 37 -34 106 99
7941 99 -78 -5 -195 -53 60 130 278 107 -128 -120 392 118 29 166 75 198 -45 307 169 -141 -34 -133 19
7964 19 7 43 148 -61 94 189 237 145 96 242 180 -243 117 -170 101 2 275 -121 -2 -86 16 -183 -74
7987g4J85k25o0K29r7K5J22k97P2k01O39m27J02J21k19P1K14l0k39J08q6O6J5
8010A4J85l22L12j18r9j98K29J86l86K4L94j00j29k24K59N2k4k55N3M53m41K48
8032A13j92m9N10l99J96k56k40J26K9j80L15j37K6J15rK24k49O8l72L14R2Pj83
8055a31k6K40r6l05L36J47n4q9n3k7j99K54n1L02j84k60L82l08J08J55l28M45
8077B58l89J81L4L6L3m16R6J88QK2r5n0K70J77l17r0L01k29j69K84j18Q8J35k01
8101C7k03K16j53P4J54j17J16P0p7j35o9L0K6O0m3l07L14l2M09m76O4p4K1K11
8125A16J05m16K12P0r9j75L9P9L46ln39J79L77o0l27K90k74J82k23K04p0m16N78
8148A75j70j9J30q6l42M20J41k57oK16n87N38j76k09J37l5L95l12J75l17J11p4
$$ plain form
7987 -74 111 -114 -174 55 -42 -17 105 -192 -120 -321 318 -109 -7 114 -105 -34 180 150 -89 19 -67 -1 14
8010 14 199 -123 189 71 -28 -226 3 189 -197 -173 221 121 -8 -232 27 79 55 -200 -147 306 -135 113
8032 113 -79 -128 382 -17 179 -77 -317 -191 -162 -342 -27 -164 -138 -23 -32 192 -57 11 -361 -47 45 52 -131
8055 -131 -157 83 -13 -318 18 165 111 22 -31 -58 -257 -3 -54 248 64 -196 186 -122 -14 141 -187 258
8077 258 -131 50 84 120 153 -263 -167 21 29 51 -44 -94 176 353 36 -54 247 18 -151 133 15 103 238 37
8101 37 -166 50 -103 -29 125 8 124 194 117 -18 -87 -57 -31 29 -14 -321 -7 -39 370 -106 -42 -116 -95 116
8125 116 221 -195 17 87 -12 -187 -148 -69 277 274 -265 -86 291 231 -96 194 -80 102 -121 83 13 -403 175
8148 175 5 -14 116 30 -312 108 249 -8 -14 202 -385 153 -23 -232 -95 -130 265 -47 128 -189 -78 -152
8170a52M74j00j88P3j20K21j43j88J56o3J60k65J20O7J4J82k20n3J18N8k97
$$ plain form
8170 -152 322 222 34 107 -13 208 65 -123 33 -30 130 -135 -15 52 66 248 28 -25 93 151 -146
8191a46
$$ Imaginary data points
##PAGE= N=2
##DATA TABLE= (X++(I..I)), XYDATA
0@%%%%%%%%%%%Qj6J6k4L2l2M0m8N6p2Q8j04J22j46J75k01K33k71L09l55M06m59
33b43N18n87O64p46Q36r34J041j161J293j435J590j760J946k148K366k608K875
50A507l168L491l847M242m686N186n748O393p142Q018r063J0336j1924J3969j6718
65i154K0632k6688L7401o1982K24208N3958l49109L7646l4248o1507J01950J74261
77A07368k4554k0757k5397j27525j04024R3538O3056J9764J16202O5391j08310
88E4752n3543k2804q0537N573J18552O2194K4859J4123o2327j14241m5339o159
100a04897j2060O1183J12684J1788m1839j3308l9588l8563K0730L1933M8489N7487
112I4039m954m4528l1554m0433l7446J6234N2227K7420J5280J2060m9934o8260
$$ plain form
0 0 0 0 0 0 0 0 0 0 0 0 0 8 -8 8 -16 16 -16 24 -24 32 -40 48 -56 66 -80 95 -106 127 -144 165 -190 216 -243
33 -243 275 -312 352 -394 442 -492 549 -612 681 -754 836 -924 1022 -1126 1240 -1368 1507
50 1507 -1661 1830 -2017 2225 -2461 2725 -3023 3370 -3772 4246 -4817 5519 -6405 7564 -9154
65 -9154 11478 -15210 22191 -39791 184417 238375 -110734 -73088 -107336 -168843 -66893 107368
77 107368 82814 62057 36660 -90865 -194889 -101351 -38295 -18531 97671 163062 54752
88 54752 1209 -21595 -102132 -96559 21993 84187 109046 123169 60842 -53399 -98738 -104897
100 -104897 -116957 -55774 56910 68698 26859 13551 -26037 -64600 -43870 -11937 36552 94039
112 94039 89085 44557 13003 -27430 -64876 -48642 3585 31005 46285 58345 8411 -59849
124e9849n805n709n818P2240O2244j8634q540N680m0680l4802K2339K9224Q844
137B0734K3116J0286m2175k9650k162k7223j102M9566J8526l823J2734j7433m3785
150c2391r574J6818Q075J8004L7100J1328k2214j0376j6029k9063Q039K4400o14
163C503O173J1155j5985k3293j0722R6Q076J6790J8971M041m870l809j5324j4355
177a9553O048R719J3385J5942k572q460o966j7688j1473N657Q899Q338O009J106
191H391o612j1121l942J795M094J3966Q391k194K884o806j6755k151M764K33P039
206A976R610J62q072o580n049p785J524J1899L896L107N591p450q012L490j091
221b784j136R572N821k549m663k997o154n374L790M390j054P531N400q792n519
$$ plain form
124 -59849 -65654 -71363 -77181 -4941 57303 38669 30129 35809 -4871 -39673 -17334 11890 20734
137 20734 43850 54136 11961 -17689 -19851 -47074 -48176 1390 19916 16093 28827 11394 -32391
150 -32391 -41965 -25147 -17072 932 38032 49360 27146 16770 741 -28322 -20283 4117 3503
163 3503 9676 20831 4846 -18447 -29169 -29073 -20997 -4207 14764 18805 13935 10126 -5198 -19553
177 -19553 -13505 -3786 9599 25541 22969 14509 7543 -10145 -21618 -15961 -7062 1276 7285 8391
191 8391 1779 -9342 -13284 -11489 -7395 6571 14962 12768 15652 8846 -7909 -10060 -5296 -5063 1976
206 1976 11586 11748 3676 -2904 -7953 -15738 -14214 -2315 1581 4688 10279 2829 -5183 -1693 -2784
221 -2784 -3920 5652 11473 8924 4261 1264 -4890 -10264 -6474 -2084 -3138 4393 9793 1001 -4518
236d518j43k548J340N013L795L904J503m265n178k150L046m2M08M878j210m385
252e52l21l230l409L328K514K733L146J50j727k384k738q42l16L785N043q74j140
269C166l2l215k077m94j29L886P37k439L34o31k079l8Q84K903J329L2J491j325
287B303l043k22j539n43L610J100M03J18j602j343j706r24K047J398L86j08m69
304a34L41k70j152J314J792p61J070K58k056j059j094j76J093J4J534J411j162
321I63n47j495j088J405L37n53J794O49k35p43j836J420J055r78J00N88m08l80
339D8r61j71J34m19J225J400n93Oj41p10o07n92R19J381k86M54j67o32l17R6m00
360c33L14J02k86N93q07m33K97l14M84K83L10P80m87l82J5p85m5O42K5M60K42
$$ plain form
236 -4518 -4661 -7209 -5869 -856 2939 6843 8346 4081 -1097 -3247 -201 -243 165 5043 3833 -552
252 -552 -873 -4103 -7512 -4184 -1670 1063 4209 4359 2632 248 -2490 -3332 -3648 137 5180 4306 3166
269 3166 3134 -81 -2158 -2652 -2781 1105 1842 -597 -263 -894 -2973 -3011 -2127 776 2105 2137 3628 2303
287 2303 -740 -962 -2501 -3044 566 1666 2069 2187 585 -758 -2464 -3388 -1341 57 443 335 -134
304 -134 207 -63 -1215 99 1891 1130 2200 2458 402 -657 -1751 -1927 -834 -820 714 2125 963
321 963 416 -1079 -2167 -762 -425 -978 816 1465 1230 487 -1349 71 1126 148 248 836 428 48
339 48 -913 -1084 -950 -1369 -144 1256 663 669 528 -182 -789 -1381 -462 919 633 1087 920 288 -29 67 -333
360 -333 -19 83 -203 390 -417 -850 -553 -867 -383 -100 210 990 503 121 136 -649 -694 -52 -27 433 675
381F75k46J03m97l78K12j94K25N63r68J03O34n72k07J15O90M07J37o29N57q55
401a25k53j91J9N28M14K18l6p21m47M62k79j35M17j27O5J67k35M17L9j52J60O9
423B74j71M08m60o68J33J6M91M50m64K82K73m12k8l47M7K20j24r1K83j64J53j51
445e0P6J40j98k3M38j63l64N5l21J86l1K6P50ok70J47p06K99m9l06L04K33k62
468i5N48j45l46L17j15j79L6k56J91L1J08j69p9j14N03j30J29k91k03L61l93J03
490a88J25K29k45K48j10L7Q9j05j59NK03J0l31LM80l38j23L61m7j36L70l74j8
513a4J35m84M20N8L7r1l2J30N7l95L82M3l83K35j66q7J63J59l04k2M6M7q2L26
537A78L0k10k0n5R6m17J66L06J69k53j82K12K81m29J67j23j25K49j02L05j4j81
$$ plain form
381 675 429 532 35 -343 -131 -325 -100 463 -505 -402 232 -340 -547 -432 258 665 802 173 730 -125
401 -125 -378 -569 -550 -22 392 610 574 -147 -594 -132 -411 -546 -129 -256 -191 -24 -259 158 197 45 205 274
423 274 103 511 51 -617 -484 -468 23 473 9 291 564 152 124 -223 -176 44 -80 -171 112 -52 101 -50
445 -50 26 166 -32 -55 383 220 -144 -89 -410 -224 -255 -229 521 515 245 392 -314 -15 -64 -370 -66 167 -95
468 -95 453 308 -38 279 164 -15 21 -235 -44 -13 95 -74 -153 -267 236 106 235 -56 -259 102 -291 -188
490 -188 -63 166 -79 169 59 96 185 80 -79 -74 129 139 -192 -189 291 -47 -170 191 144 8 378 4 -14
513 -14 121 -363 57 115 152 61 29 159 216 -179 203 246 -137 98 -68 -155 8 167 -137 -159 -113 -66 -148 178
537 178 208 -2 -22 -77 19 -398 -232 74 243 -10 -192 20 301 -128 39 -84 -209 40 -62 243 229 48
559D8l5O6J25j92J73k21j83K12p1J5J7l04L88J10r9j6q3M7k48O8J55j24K57J83
583B88l21J51k79K97j20p6L22m28K5K36j80j12p2L17K53j40j5k75M9q3J09j07
605a61K64j33O5J9Q1L1j49q9Q6l2K07k38K7k29K3M57j81n9K29Rl23m1l8k9R9J11
631FK70n82P2M43j28o0O6Jk20l4J39L0J65q3j31j07K17Q8j11Q9j78J33J84r4j59
656A6j43K44l93L77p5k01J71k6K2j45J24j17J57j25J02j22J26l4j33m2J42K83
678B08K8m4o16M86k70J89Q6k94P7O6K72j33r7J93J67m44J90j4o8J80k89J37K83
701B93k78j29q8M05k98r8K58m8prn0n7j41L25j54Oj56K8L18L1j52QK20j57j89
726a19O7P0l7K52m08m7R7p0J29L34l33m1K31m9l41M26j93J38j51j41J51q1P0Q1
$$ plain form
559 48 13 79 204 12 185 -36 -219 -7 -78 -63 -46 -350 38 148 49 33 -50 -3 -251 -183 -28 -152 105 288
583 288 -33 118 -161 136 16 -60 262 -166 -141 95 -85 -197 -269 48 301 161 146 -129 -80 -163 -54 -161
605 -161 103 -30 35 54 135 166 17 -72 14 -18 189 -49 -22 -251 -228 229 48 -11 218 227 -96 -137 -175 -204 -105 6
631 6 276 -306 -234 209 81 21 87 88 -132 -166 -27 3 168 85 -46 -153 64 152 41 130 -48 85 269 175 16
656 16 -127 117 -276 101 26 -175 -4 -30 -8 -153 -29 -146 11 -114 -12 -134 -8 -42 -175 -217 -75 208
678 208 236 192 -424 62 -208 -19 67 -227 -150 -84 188 55 -42 151 318 -126 64 50 -18 162 -127 10 293
701 293 15 -114 -202 203 -95 -193 65 17 10 1 -49 -106 -247 78 -76 -70 -226 -198 120 151 -1 7 227 70 -119
726 -119 -52 18 -19 233 -175 -222 -125 -195 -66 268 -65 -106 125 76 -265 161 -32 106 -45 -186 -35 -116 -46 35
750C5J1k91M02j54O0j59P4J95k64K22J81k81j04K31j13J08k57N73p47J98k6J40
772C4J12l42L86J37l32j07K58q1q4Q8j27J57j22j16J99J93n5k45K28q4l27K43
794A3J82k78l25L76K74k53kJ6r3k00L79q0J50k32nJ20l42J28KJ88j96K68P3k22
818e9K8J01o4j02J87R5j36j65J93k39L67j81J18k47K42k53M98o53J48P1j05L0
840a26n0L05q3j33M5K44l23L40k51L03k80J37p2J31j02j25l96M56Q9j18j22J17
862a4k09Q9O9K52j19L6J36j62m6L4m00M03Q48q01j60Q8o1M9n3k0r7J14o8j81k1
887b94L92k53L47pj32Km6K60k55M9j13k33L08n5M8J85k64J42j82R7r6L26k41Q0
911F5L14m78KR5R4K7l9j68j10J74J40l56K56J0k28J35k5J70j35m4J81r2j25K09
$$ plain form
750 35 46 -245 157 3 63 -96 -22 173 -91 131 312 31 -73 158 45 153 -104 469 -278 -80 -106 34
772 34 146 -196 190 327 -5 -112 146 65 -19 69 -58 99 -23 -139 60 253 198 -47 181 97 -230 13
794 13 195 -83 -408 -32 242 -11 -13 3 -90 -290 89 9 159 -73 -78 42 -300 -172 -170 18 -178 90 163 -59
818 -59 -31 70 6 -96 91 186 50 -115 78 -161 206 25 143 -104 138 -115 383 -270 -122 -51 -156 -126
840 -126 -176 129 46 -87 -42 202 -121 219 -32 271 -9 128 56 187 85 -40 -436 20 109 -9 -131 -14
862 -14 -223 -134 -65 187 68 104 240 78 32 66 -334 69 917 116 -44 44 -17 32 -21 -41 -138 -24 -92 -273 -294
887 -294 98 -155 192 185 53 55 9 269 14 63 -50 -283 25 -30 18 203 -61 81 -101 -4 -100 226 -15 65
911 65 379 -99 -97 -2 92 119 80 -88 -198 -24 116 -240 16 26 -202 -67 -92 78 -57 -101 80 -12 -137 72
935G2J22m5n0O7k73j13O3J97l04M00Q0l32j28M79l75K80Q6j05p6l13K19j38n0
958b37L85j46j30J7K45l9k16J8j9J85L1o0j51L5j06J33pJ24N8l66K79j5k16L20
982A22O5k44J5J09Mj21M3q7O7J76k96j9O4K45k29k6mn0K64J44o0n6p5n5J41j99
1008f2J49j58kQ7mqM6Qj9J89j25j38J5O0J10l85M60L0m18k03M29l0j12J19n7J20
1034A01q3l9N9L04j56k97K14j24r0Q0J34j26k1j26J82r0K3J54O7k24Q8J5k41J25
1058g1j31M2J71k69K72Rp2J92j30q6j6M6K15l4r3R9q8k03K5K52j81J03n9N3q9
1083d3PM5J01M5K1K6n85L36k2oJ11J40j47j52J33K40m05N10m90J31o8l11N37m10
1107b56L96j91j84L05j17J16ljq6J23l48J29K36J43m67J80N2j51K85n7j41j81
$$ plain form
935 72 194 149 99 166 -107 -220 -157 40 -264 136 216 -116 -244 235 -140 140 226 121 45 -268 -49 -187 -237
958 -237 148 2 -128 -111 134 95 -121 -103 -122 63 94 34 -117 -82 -188 -55 -62 62 120 -246 33 18 -198 122
982 122 187 -57 -42 67 71 -50 -7 -94 -27 149 -147 -166 -102 143 -86 -112 -116 -166 98 242 182 126 51 -4 137 -62
1008 -62 87 -71 -73 14 10 2 48 56 37 226 101 -37 -22 38 148 -237 223 253 -165 -368 61 31 -81 38 -19 101
1034 101 18 -21 38 342 186 -111 103 -21 -111 -31 103 -23 -44 -170 12 -78 -55 99 166 -58 30 45 -196 -71
1058 -71 -202 -160 11 -258 14 23 -49 143 13 -73 -89 -43 172 138 45 144 56 -147 -122 130 -51 52 -7 46 -43
1083 -43 -36 9 110 155 176 202 -383 -47 -69 -75 36 176 29 -123 10 250 -155 355 -135 -4 -72 -383 154 -256
1107 -256 140 -51 -235 70 -47 69 66 65 -21 102 -246 -117 119 262 -205 -25 27 -124 161 104 -37 -218
1129b18KN64j98l66K95j81J18P7K0m81N25n0j94Q3M6J92q6j33P8j89L28j08k0
1152A04m1j15j1j1mJ21l6N9k04N5P3J2jo7J43J48k45J24l18J08M9j05J61O3j38
1177g6j44L20k38L7J45J85k29k42J08J88P2j04k09K67q5o5L93j86k21Q8j72M18
1199B50k44j18O9J36j91R4l08J97L31k57%k67J99K11k7j51rl7L05j23o1O6j22
1222e7M1k54L89Nk01L0J95j60J8j6L5j15J56r8J71n2P0k94j9J72l87L10P8j15
1246i8J63N6O3r5k19M20j18q8j00K0j50J52p8n2o2p1J11J25j53L08m2k1j7j01
1270d7Q0Q3l01K46P4j53p4J19q3J8m6j18J35J58J82N2l61R7o7k76M91r5j32J32
1294A14o6r5n1MR2O3N7j62N2k3mJ4J87k33j6K85j58j42K1K8K0N4j92J13J87p1
$$ plain form
1129 -218 -216 348 150 -216 79 -102 16 93 113 -368 157 107 -87 -4 42 234 148 15 93 -96 232 124 104
1152 104 63 -52 -63 -74 -78 43 7 66 -138 -83 -10 2 1 -66 77 225 -20 104 -214 -106 -57 -162 -1 62 -76
1177 -76 -220 100 -138 -101 44 229 0 -242 -134 54 126 22 -187 80 -5 -70 323 137 -84 4 -168 250
1199 250 6 -112 -43 93 -98 -4 -312 -115 216 -41 -41 -308 -109 102 75 -76 -85 -122 183 60 -1 65 -57
1222 -57 -16 -270 119 124 -77 -47 148 -12 6 -10 25 -90 66 -32 139 87 157 -137 -156 16 -371 -61 17 -98
1246 -98 65 121 184 89 -130 290 172 84 -16 4 -146 6 -72 -124 -186 -257 -146 -21 -174 134 92 71 54 -47
1270 -47 33 116 -185 61 135 -18 -92 27 -56 -38 -84 -202 -67 91 273 325 -36 61 -6 -282 209 114 -18 114
1294 114 48 -47 -98 -94 -2 61 118 -44 8 -15 -19 -5 182 -51 -67 218 60 -82 -61 -33 -13 41 -151 -38 149 78
1320G8l35M47k48J4J51j84L7k96N51km19L55m00L80K37k21j59k03L35l2k78R9
1342i3K03j69J4M4K5o6L20m97J37K40K8m14J24j00K57k08KnJ84r2p7K7O6k9K2
1367e7K25l38k0K89N1K30k20K97n74J7J83k67K48r4K59k19J03J81k83L7K0j31
1389f3N92o60K39j65p6L87k51J1k03L40p6j18n5o9J19K14j48J17j84K02K6l3q7
1412E9j0P0jk39K17j84j53L20k64K84n9j82J09L20p5k31k0K40j22l12j23L40j7
1435c3K17j52Rj12M15n08M02l93QL56j91k03J97J08o8l7R3j8j25n5J01J8L99m12
1459A6J60J15l32J21j87M2J29j32j27K24k6K07j74O6k72K13j70K8J15o2j42O3
1481a25N31l3j68j53j12J99o7Q3m0j00k43q6N29l06q2p5J43j08K16j01r5K95m0
$$ plain form
1320 78 -257 190 -58 -44 107 -77 -40 -336 215 213 -206 149 -251 129 366 145 -14 -217 118 86 -192 -93
1342 -93 110 -59 -45 -1 24 -42 278 -219 -82 158 186 -228 -104 -204 53 -155 -153 -158 26 -66 -143 -116 -50 -79 -57
1367 -57 168 -170 -190 99 150 380 160 457 -117 -100 83 -184 64 -30 229 10 113 294 11 48 68 -63
1389 -63 529 -131 108 -57 -133 254 3 14 -189 151 75 -43 -98 -167 -48 166 18 135 -49 153 179 146 59
1412 59 49 119 118 -121 96 -88 -241 79 -185 99 40 -142 -33 287 212 -19 -39 201 79 -233 -356 -16 -33
1435 -33 184 32 41 -71 344 -164 238 -155 -147 209 18 -185 12 120 52 15 108 90 -35 -90 11 29 428 16
1459 16 176 291 -41 80 -107 -65 64 -68 -195 29 3 210 36 102 -170 43 -127 -99 16 -46 -188 -125
1481 -125 406 373 205 52 -60 139 72 155 115 15 -228 -314 215 -91 -173 -248 -105 -213 3 -98 -193 102 62
1504F2J12j26k24K36j13L1P1M0j09O3M3k48K33n6L14l20K24j67P1j38q1R9mJ83
1528A96l56J72J64m17m4K67Q3r7K92l97P2J4J77m8k77M41k92m5K56j64O4j45j59
1551b43K06J27m7l4N0M0j08J14J8k38m4R9R4k63K60k10L61l54K82j68k0j30J97
1574a1O2j0J5j62N9J27k95K88p3P3R7l98M38k14J9K59m70L04K37m36K31j56M1
1597B5M2o9j92Q0J40L1l0p5L6J60k42L36R2k41k81K79j05Q6P3k13qJ07J16k70
1621a23K29j33J46M6p5l05K13K30k47j04q9J59J55j37j82PR0K46M9O7j98j72N9
1644f9j11L35n5l0l9l52J35J29k2N2J12j09K44k64l8J33J86k51k51L35k3P1J3
1667A31L7o33M55N2j02k12N21rl85J82j26J60k1J18j59K96l51K11l54J3J51J53
$$ plain form
1504 62 174 48 -176 60 -53 -22 49 89 -20 43 86 -162 71 15 329 9 233 66 137 -1 -82 17 13 196
1528 196 -160 12 176 -241 -285 -18 65 -32 260 -137 -65 -51 126 78 -199 242 -50 -95 161 -3 61 -84 -243
1551 -243 -37 90 43 9 59 99 -9 105 123 -115 -159 -60 34 -229 31 -179 182 -172 110 -58 -78 -208 -11
1574 -11 51 41 56 -106 -47 80 -215 73 0 73 170 -228 210 -4 15 274 -196 108 345 -91 140 -16 25
1597 25 67 -2 -194 -114 26 57 27 -48 -12 148 -94 242 334 93 -188 91 -14 72 145 -68 -76 31 147 -123
1621 -123 106 -27 119 165 90 -215 -2 228 -19 -123 -212 -53 102 -35 -217 -210 -120 126 175 242 44 -128 -69
1644 -69 -180 155 100 70 31 -321 -186 -57 -79 -27 85 -24 220 -44 -82 51 237 -14 -265 70 47 118 131
1667 131 168 -465 -10 42 -60 -272 249 240 -145 37 -89 71 50 168 9 305 -46 165 -189 -176 -25 128
1689A28K02l75M1k8N7k50K42k51J02J54M1L0J20l44J46l8k51L90J75n04J22O2
1711b9m12N00N7J35m62J47J09m17L50P0l4J47k54j82L20l1m2K61k15j63j9P9P5
1734a0k37K77L2Q4j46k74J25J3j62L78M4n5rj21J41j68N7k8O2K5j81K59r0j07
1758i1j9J57J26K5j33J74k05Q6j56M7R1q1q9L7k9J63N5M7j70k55L29j16K12l15
1782a10J72q2N4K9j92P3p1k0p1Q5L18l03K24j44%J01l52L38q4N9K0j91K02K9p7
1807Go6q8L39j43J45l01M6J73O1j88P1L8j59J10p3k7q9J85m5J28k81l2N9J2P1
1832d7L92Q5m85K07k4j75N7J29l35K95K04j3j88J8j09o1q2P0K58l06J22q1J36
1855F7J16k83N2J49j47k0J24J58j05k1p4K99m45JK58k00j19J61Q3j31lk1kJ28
$$ plain form
1689 128 330 -45 -4 -32 25 -225 17 -234 -132 22 63 93 213 -131 15 -23 -274 116 291 -213 -91 -29
1711 -29 -441 59 116 251 -211 -64 45 -372 -22 48 14 161 -93 -275 45 14 -28 233 18 -145 -164 -85 -10
1734 -10 -247 30 62 146 0 -274 -149 -136 -298 80 124 69 60 -61 80 -88 -31 -59 3 28 -153 106 16 -91
1758 -91 -110 47 173 198 65 239 34 120 -36 11 102 21 -68 -31 -60 103 158 205 35 -220 109 -7 205 -110
1782 -110 62 -20 34 63 -129 -56 -127 -147 -218 -133 185 -118 106 -38 -38 63 -289 49 -35 24 44 -147 55 84 7
1807 7 -59 -147 192 49 194 -107 -61 112 173 -15 56 94 -65 45 -28 -55 -144 41 -4 124 -157 -189 -130 -118 -47
1832 -47 345 430 -55 152 128 -47 10 139 -196 99 303 290 102 120 11 -50 -132 -62 196 -110 12 -69 67
1855 67 183 -100 -48 101 -46 -66 58 216 111 90 16 315 -130 -129 129 -71 -190 -29 54 -77 -80 -101 -103 25
1879B5j7j1P9j75R4Q1n5K69m1m93J88K49q0O2l4j73l71K88K52k2R6m6j28P2L2
1904A41k37r3M16l98J44j40L31j32j50J58R0J3j4j5j54kl94L43K64J3l9k87O73
1927E31o99J44j89K55k84K25j05P1R5j64M6J43Q7Pk65J5j09K41j09J71j9k53N00
1950C35j67l1l51M68qk14J42k22K08j57k82M50k67o0J65P0J42l78K86j87L46o2
1972B26m72L08k13K44J67j44j70J28j11j10J77o5K16k30K81mn52L84j40J65k7
1993E8k02P8J62N0k63j3Q9j22j53J68J58R7pk03J83n2J60k80K45r6j35j0N0J39
2017A01k24L05m22J37K58j18K08m11p6L27j27J03L4n4J5j37K4J24j17J07j18L67
2039C06n25P3R8j35K6J45k0K73m45Q9pK66j06r3q1P8J63l36K93j10J08o7O6k02
$$ plain form
1879 25 8 -3 76 -99 -5 76 21 290 249 -244 -56 193 113 175 141 -32 -403 -115 137 115 211 165 37 109 141
1904 141 -96 -189 227 -171 -27 -167 164 32 -118 40 130 143 129 114 -40 -42 -436 -93 171 184 145 -142 531
1927 531 -168 -24 -213 42 -242 -17 -122 -51 44 -120 -74 69 156 163 -102 -87 -196 45 -64 107 88 -165 335
1950 335 168 137 -214 254 246 32 174 -48 160 3 -279 171 -96 -156 9 79 221 -157 129 -58 288 226
1972 226 -246 62 -151 93 260 116 -54 74 -37 -147 30 -35 181 -49 232 228 -324 60 -80 85 58
1993 58 -144 -66 96 146 -117 -130 -41 -163 -316 -148 10 107 100 -103 80 28 188 -92 153 57 -78 -88 -38 101
2017 101 -123 182 -240 -103 155 37 245 -166 -242 85 -42 61 95 41 56 -81 -57 67 -50 57 -61 306
2039 306 -219 -146 -48 -183 -157 -12 -32 241 -204 -115 -122 144 38 -55 -136 -58 105 -231 62 -48 60 -7 59 -143
2063a43jJ4oJ14J77k20Q1l0p9K37m2k2K48k40k61K66O1k55M83l31qM3j17j47J27
2088e1J53q7R6j68L0J39p5K04k94J98q2J94m38K09k5k6k61K42K67m96L11J35l0
2111A45l30J16K96m77J53Q9J58kk53K3j71J25K60o2J25k55q9k36P23k82m40M24
2133D0j12L14m79L27NJ2K66l49q5K19OL1k01P0oo7J89l71J22L64k67j4j8J40j02
2158C4J35j49n7M3N9K6k55L21pk11K21q4j40K4K14l18J31J36j51r0J28r8J31j53
2182a10J05N8k32R7K36p1N3k53L24j97K58k54N2j09J58k6l52K55J66m8j1K37o72
2205c36K59j94K20k3L7n3K04kK41m27M6Q3k1o1J36j8N0R4k81P0k23K30p7k23O2
2230b07N73m20Q1k33M42J8k11L57m14k2J35K02j91K5N7K08k50j45Q0J75n91L47
$$ plain form
2063 -143 -144 -130 -136 -22 155 -65 16 -14 -93 144 102 80 328 88 -173 93 154 -101 382 51 43 86 -31 -178 -51
2088 -51 102 15 111 -57 -27 112 37 241 -53 145 63 257 -181 28 3 -23 -284 -42 225 -271 40 175 145
2111 145 -185 -69 227 -250 -97 -8 150 148 -105 -82 -253 -128 132 70 195 -60 -149 -385 338 56 -384 40
2133 40 -72 242 -237 90 95 107 373 24 -61 158 164 195 -6 64 58 -9 180 -191 -69 295 28 14 -4 136 34
2158 34 169 20 -37 6 65 91 -164 157 150 -61 160 76 -64 -40 174 -144 -13 123 -28 -118 10 -88 43 -110
2182 -110 -5 53 -179 -82 154 83 136 -117 207 10 268 14 66 -43 115 89 -263 -8 158 110 99 336 -336
2205 -336 -77 -271 -51 -74 -37 -90 114 112 353 -74 -28 55 34 -27 109 91 141 235 -46 24 -199 31 -46 -269 -207
2230 -207 366 -54 27 -206 236 254 43 400 -14 -36 99 301 110 135 192 400 150 5 85 260 -331 16
2252A6j50M3M4n1P0j04K86k85J47j00J14P2N1k09j42L88l33L59l65J67l44PK55
2275f4K2PM59m70P3j38J26j07p0p22M48L72j10k33O02k3l04n3L31k57M4J32m6
2298A9J3r1K54j4k49K82J27n92K95k50p7j5O10j58j64Q7n9o9M72n88M28m98R92
2321G55k26p44L46J05j32k08L27l52K24k30J19j26L28j39j04r7J76M7l1o2J47
2342A23l4p8j96Q1K5J85j04mQ4j84j01L82p3l03K44j1m0kJ26pj49J1J85P2k51
2367a9j47J16P0M8p3JR0j77r9j41L01o1R9j37O4j66J00L6Qk7O4M21n80j2K96j56
2393h1kK08j80N1P5N1p4J46j70J97m35J54K23Q3j64N8j52O6j11m3K50j57k2J04
2417G5Qj60n7K14j15r7L16j06m2P2k4j54R8j86J00O5P7k80N2K7Q7k2N6q8J82N
$$ plain form
2252 16 -134 -91 -47 -98 -28 -132 154 -131 16 -84 30 102 153 -56 -198 190 -143 216 -149 18 -326 -319 -64
2275 -64 -42 -35 424 -46 27 -111 15 -92 -162 -884 -436 -64 -174 -407 195 172 -132 -185 146 -111 -67 65 19
2298 19 32 -59 195 181 -68 214 341 -251 44 -206 -283 -298 312 154 -10 77 18 -51 421 -167 261 -237 755
2321 755 529 -215 131 236 104 -104 223 -129 95 -135 -16 -142 186 47 -57 -154 22 69 38 -24 123
2342 123 89 11 -185 -104 -79 106 2 -2 82 -102 -203 179 106 -197 47 36 -4 -6 120 113 -36 -25 160 232 -19
2367 -19 -166 -50 20 68 -5 -4 86 -91 -190 -331 -30 -91 8 -129 -65 -231 -131 -95 -87 -114 -50 371 -209 -221 75 -81
2393 -81 -83 125 -55 -4 71 122 48 194 24 221 -214 -60 163 246 82 140 -12 54 -57 -100 150 -7 -29 75
2417 75 83 -77 -134 80 -35 -132 184 78 36 108 84 -70 28 -158 -58 7 84 -196 -144 -117 -30 -52 4 -84 98 103
2443A03j88L3p4kO0R2K19j64L9j30j29J40L92l15j11k16L46o5j28J43q0J45j13
2466cj15k86M40k32M80l83J97l5l7K50j75q7J3k00J81J96k93M4j91J35L25k25
2488ao6K04j8j42K98k32J00k55m9L5L03k37M2k86K39J41l3K94l68%O4K5L2m1l3
2513A6p6P8L5k0k21NK5K66q2nk71L58j48k59J59M67k75l72J70O7j60J21j69M58
2537A67k47J56j40K84k93K06o3k18K50m6p7ko1j50L47R8k94N0j08J41J5J62kj64
2561A1L13n51L19l40L59j05M4k01P7q4k0J07J96m4j84r4K87q0M3R1j87J1j49K15
2585C4R6j7M7k69q4K98p0l01N96l37J19j04P7j49J02k4j38J78J42j61p2J60j66
2608d3L75l60L28n17j0J99o7K06r8l12J10J50l40N46L1j55J9Kk8j2j31K91k12
$$ plain form
2443 103 -85 -52 -126 -128 -68 24 243 79 118 -12 -141 -1 391 76 -35 -251 95 30 -98 45 -35 110 -3
2466 -3 -118 -404 36 -196 284 -99 98 63 26 276 101 14 27 -173 8 204 -89 -45 -236 -101 224 -1
2488 -1 -67 137 119 -23 275 43 143 -112 -161 -126 177 -60 -18 -304 -65 76 43 337 -31 -31 33 58 90 49 16
2513 16 -60 18 53 33 -188 -183 -158 108 26 21 -250 108 -40 -299 -140 327 52 -320 -150 -83 -243 -122 -291 167
2537 167 -80 76 -64 220 -73 133 70 -148 102 56 -21 -23 -84 -234 113 211 -83 -33 -141 0 15 177 175 11
2561 11 324 -227 92 -248 111 6 50 -151 -74 -158 -178 -71 125 81 -103 -197 90 10 53 144 -43 -32 -181 34
2585 34 130 113 160 -109 -193 105 35 -266 330 -7 112 8 85 -64 38 14 -124 54 196 35 -37 123 -43
2608 -43 332 -28 300 -217 -227 -28 -95 111 13 -299 -189 -39 -379 167 198 43 62 64 36 24 -107 184 -28
2631b8j2K30j21K5l38J93k19L59pm0j59O1N2Q9L7j09K07k26J7Mm1J9N7P9l4l65
2657b70JL21j92L05No5l15N04l18j44K62o0m00M60K43n3m46J1J57j36L2r5K45
2680E2k28L80j66k03P2m8J22M94m99K27k14j28j85N80k53NK78k53j2m1J93O4l54
2703a17l2J98j6o2k72K62PJ37j90M3J04k6Lq5r5L83l70j47L03K5j71J35K7m12
2727c68J78K12K3J13L4j34K9l2oK41m27K67k19Q7P0P1R2k10L88l93r9K92j88k0
2751Aj07J08Qk36K2K13n4J00k29M1m5K16l0m1Q3n6J28n4j38j43L50j09k28L44
2775A44r0r5P6j06L20j96j82J19q3L09j95o6K4J53l68J76j31J51%J41N1k38K26
2798A40K7m64J26K01o2j90J86l4P0j1j57r1M75k24OJ00r5j80N3K25m1o5J06m5
$$ plain form
2631 -28 -40 190 69 94 -244 -51 -270 89 82 42 -117 -56 -4 85 122 13 220 -6 11 15 -26 -7 50 129 95 -270
2657 -270 -269 52 -140 165 170 105 -210 294 -24 -168 94 34 -366 94 337 284 -162 -151 6 -130 -98 -193 52
2680 52 -176 204 38 -165 -93 -141 -19 475 -24 203 -11 -139 -324 256 3 8 286 33 21 -20 173 237 -117
2703 -117 -149 49 33 -29 -301 -39 -32 105 -85 -42 62 36 39 -46 -141 242 -128 -275 28 53 -118 17 44 -368
2727 -368 -190 22 45 158 192 58 87 55 49 290 -137 130 -89 -2 68 139 231 21 409 16 -83 209 21 1
2751 1 -106 2 10 -226 -204 9 -45 55 -174 -133 -178 38 8 -33 50 -6 122 68 -70 -213 137 28 -200 144
2775 144 54 -41 35 -71 249 53 -129 -10 -93 216 21 -45 -21 132 -236 -60 -191 -40 -40 101 152 -86 140
2798 140 167 -297 -171 30 -32 -222 -36 -70 0 -11 -168 -259 216 -8 -2 98 3 -177 -124 101 60 -5 101 56
2822E6j65J05r5J79r7J00l41M72k57K5J94j23Mk44L92k35q7J96j0n0KL1q1Qk6
2847d7L80l01q4J15j46k05N4M76k30l33L48k1j59R0P8j52l4J11K2L32k99j31J40
2870DJ96k1j94L7j88P3J25K09k51J60j99R1mP3o9k0O3p0j20K38m20J59j23P1j25
2895c05M10K2k74J81j18K81l9j36R4l59L54J02k84K04O0j34l2k37K61P8l29K20
2917B0l14J81jK49k41R9j53K6K81M6j53j60J67j7k32J55Mr2j35L33J65j46J8j06
2941fm1J6J50J21k59j86L45q3j16l96M85k15P8J77R2l78N84j73k76J92k6j43p6
2964a34J64R7k11P8j37J50J03j77L3r0L03j67j21O5m8o0K64j07l8M9K96l18j73
2987a79J57J72k25O7j0J18j72J19j83K04N2l87J57J86O2j70J25N2NJ21j33j88
$$ plain form
2822 56 -109 -4 -99 80 -17 83 -258 214 -43 -18 176 53 57 -187 205 -30 -117 79 69 19 21 52 -29 -21 -47
2847 -47 333 32 -52 63 -83 -288 -234 242 12 -321 27 6 -153 -63 15 -137 -171 -60 -38 294 -5 -136 4
2870 4 200 179 -15 22 -166 -93 32 241 -10 150 -49 42 38 111 42 22 85 15 -105 133 -287 -128 -251 -180 -305
2895 -305 105 127 -147 34 -84 197 158 22 116 -243 111 213 -71 133 193 59 27 -210 51 129 -200 20
2917 20 -294 -113 -114 135 -106 -7 -160 -134 147 193 40 -120 47 30 -202 -47 -43 -135 -270 63 228 82 100 -6
2941 -6 -47 -31 119 240 -19 -205 140 57 -59 -455 30 -185 -107 70 162 -216 368 195 -81 111 85 -58 -134
2964 -134 30 127 -84 -6 -143 7 110 -67 -34 -124 179 12 -109 -44 -92 -152 112 5 -33 16 312 -6 -179
2987 -179 -22 150 -75 -8 -18 100 -72 47 -136 68 120 -267 -110 76 138 -32 93 145 150 271 138 -50
3009e0r0N7J10j21j3K03J6J5j90J82k62J88J93m10K30K56j49P7m77M19K9l84K84
3032A13j33M0j52k09L83k05P6J49P6o0M7j95L07j70k81K46J77l46K4J78j02P6
3054C9q2M9q3J83k8k05j51O9L6K82j31k64J84K86l48K30nJ27k19Q7J47l68K05
3077D0j24l7l5N8J08K16m11J62K25p5k34n4j64L98l61N11J81l90n8K43k72k2K00
3100A05l1k15K73k55R8q0j92K61L7j26j44M78k14k9O8rK3k9j7k0k77K56j35q8
3124b62J32M8J7j27R6K6L59J84l50m2q1J9j3j52O6K10j78L3JO9K2P9j05O4M0j38
3150A7k25O7J05P1k84J67J39j41j62M44k36k5J04q9R2Q9J32k76J2N8l2J7L4l4
3174D4q6qJ39j58J80k64R4r2K33M1P3q3K2k32J98k07J56j02J84l08r1L13k49N81
$$ plain form
3009 -50 -140 -83 27 -94 -107 96 112 127 -63 119 -143 45 238 -172 58 314 165 242 -235 184 213 -171 113
3032 113 -20 20 -132 -341 42 -163 -87 62 138 78 125 -70 237 67 -214 32 209 -137 -113 65 -37 39
3054 39 -43 6 -77 106 78 -127 -278 -209 -173 109 -22 -286 -102 184 -164 66 61 188 -31 56 203 -165 40
3077 40 -84 -121 -156 -98 10 226 -185 -23 202 127 -107 -161 -325 73 -288 223 404 14 -44 199 -73 -95 105
3100 105 74 -141 132 -123 -25 -105 -297 -36 1 -125 -269 209 -5 -34 34 25 48 19 2 -18 -295 -39 -174 -262
3124 -262 -130 -82 -65 -192 -96 -70 289 473 123 81 0 19 6 -146 -80 130 -48 -15 -14 55 77 156 51 115 155 17
3150 17 -208 -141 -36 35 -249 -82 57 -84 -246 198 -38 -63 41 -48 44 133 265 -11 1 59 27 44 78 44
3174 44 -42 -50 89 -69 111 -153 -59 -151 82 123 196 113 135 -97 101 -106 50 -52 132 -176 -267 46 -203 378
3198C78l98K1j57j1K40k05J58j52J95l19J65O9j14L80k51K40q7m16K61J54M1j06
3220H6J27k35J79j70j63L9N8l2jl8j0nL46m27J28J01k0J33j25n8K5M7k73K08k4
3245a04J1Q1K63k16R1j69J83j00k44J20J34J22l54J79j95L22j00nj73J97j00q
3267f5Q3r3j74J49k7N3L4R1j44l27N05p1n9RJ04j83l3J98k8N2k37J23J95K28m92
3292a09PL5Q6L5o6j50j28K23J24J11k1J1n63N46k3RqJ46k85J93j06j16MN6m6M
3318c1J11Nj48M2j70J87J0M0J21j66J42j95L74m12J19l5j8r4M5p6J50J56j97k71
3342c11N3J7K38J0j44J24N7o9J58N8r1pR8l58J08K21m8l18J48J28N8j06q2K99
3366B41j69k02J47K2P4k57J18JO1m6J02n1N8k45L11q5R5k8m3l16J6j2K66J45j33
$$ plain form
3198 378 -20 1 -156 -167 73 -132 26 -126 69 -250 -85 -16 -130 250 -1 239 152 -264 -3 151 192 86
3220 86 213 -22 157 -13 -176 -137 -79 -111 -112 -150 -160 -165 181 -246 -118 -17 -37 96 -29 -87 -62 -15 -288 -80 -104
3245 -104 -93 -12 251 35 126 -43 140 40 -204 -84 50 172 -182 -3 -198 124 24 19 -154 43 -57 -65
3267 -65 18 -75 -249 -100 -127 -74 -40 51 -93 -420 85 14 -45 -36 68 -115 -148 50 22 74 -163 -40 155 383 -109
3292 -109 -102 -67 19 54 -12 -162 -290 -67 57 168 147 158 -405 141 118 127 119 265 -20 173 67 -49 -45 11 -35 -31
3318 -31 80 85 -63 -21 -191 -4 6 46 167 1 143 -52 322 -90 29 -6 -24 -118 -73 -149 1 157 -40 -311
3342 -311 -258 -241 -3 7 -137 -13 44 -25 133 191 100 93 191 -167 -59 162 114 -204 -56 72 130 24 -58 241
3366 241 72 -130 17 39 113 -144 -26 -25 36 -10 92 41 99 -146 165 80 175 147 104 -212 -196 -208 58 203 70
3391G0r5k06N80k61j55qK63k34J29J58j54j44N9J6J0J92j43j11j69M0K23l27J51
3414a16K69J9k92n3m9L42j75J10j84P7J70m27K84NJ35p3j78J74J38p4p7K3J19
3437A67m03L27J14n4p7PQ9j8j21j8J05p1K1j06K81j99J48k06N5K7k3j94L78j50
3461G9j45J0q4o1K85J6L3l07K18n4P0k85K58m5j50J63k2J06r4J64j79J86q9p5
3485bk16L69k05K21j84O3O7k66J06n4Q8J29j27l84K84l8K54K42m41Q9Q9k00Q5
3508c1L0j61L01k65l3o1K2L35k84K44K3j33k3m9n6Mp6K08P4M2o1l17N10l38J6
3533g9p9k60N31k12k66K78RK52j72j58J02o1K08o0n1J40q3J29Qj46r3K4M7j84
3557a76J85j66R2O1n0j17M33k32J77l13J22J62o7q5k07Q4j7M18m07K44M0l22J66
$$ plain form
3391 70 -25 -231 349 88 -67 -75 188 -46 83 241 87 -57 2 18 28 220 77 -34 -203 -163 60 -267 -116
3414 -116 153 172 -120 -173 -222 120 -55 55 -129 -52 118 -309 -25 -20 115 42 -136 38 176 102 25 48 167
3437 167 -236 91 205 151 74 81 170 152 31 13 118 47 68 -38 243 44 192 -14 41 68 45 -149 229 79
3461 79 -66 -56 -140 -201 84 100 133 -174 44 -10 60 -225 33 -12 -162 1 -21 85 -9 155 -24 162 73 -2
3485 -2 -218 151 -54 167 -17 46 113 -153 -47 -101 -13 116 -11 -395 -111 -149 105 347 -94 -5 84 -116 -31
3508 -31 -1 -162 139 -126 -159 -220 -198 137 -147 97 120 -13 -36 -85 -141 -137 -213 -5 69 111 50 -267 243 -95 -79
3533 -79 -158 -418 113 -99 -365 -87 -78 174 2 -156 -54 -115 93 33 -18 122 39 168 176 30 -63 -39 8 -176
3557 -176 9 -157 -65 -4 -54 -171 262 30 207 -106 16 178 111 26 -181 -97 -114 304 -103 141 181 -141 25
3580B5L6J11k72J1q2J06K56k22L39j83j50J79q2k43J88J82l10k13M24p6K53m07
3602a30J93k77J18J32R1J06r1k99J32j56J20k0j98K69n6J60L0m09L13J97m18K54
3624F1k30K34J38k06J76l59J92K52k67J33k47l8K88l13M4R5K43j69n7j85M8M92
3646C25j83j10j31J89j13j39K65j48K45qj54J81l59p4J27Q1K11j91j7L1K8k17
3668a61Q2K20j31J69j16K18n75N98j46J29j44k50Q0q3RJ66j62K61k03k9L3J3J39
3691A17j75m3J23Q8m3j14j04K86j05j26J60j46M8j10Q4J59j58k8RM9K42j23n7
3714C3Q6j04j76kK86k88K59j24K5j69J71j60oJ61M4q7O6j03o0J62q9J01k6k53
3738b53J91J24p6NJ93n1k83J60l5o6l03M47O3pk14K57j35l3J1k3j57p3K12k82
$$ plain form
3580 25 61 172 -100 -89 -171 -65 191 -31 308 125 -25 154 72 -171 17 199 -111 -324 100 24 277 -130
3602 -130 63 -214 -96 36 127 233 142 -157 -25 -181 -61 -81 -279 -10 -66 94 124 -285 28 225 -193 61
3624 61 -169 65 203 -3 173 -186 6 258 -9 124 -123 -161 127 -186 -142 -47 196 27 -30 -215 -167 325
3646 325 142 32 -99 90 -23 -162 103 -45 200 192 38 219 -140 -214 -87 -6 205 14 -3 28 56 -161
3668 -161 -79 141 10 179 63 281 -294 304 158 287 143 -107 -27 -110 -101 65 -97 164 -39 -68 -35 -22 117
3691 117 -58 -101 22 110 67 -47 -151 135 30 -96 64 -82 -34 -144 -60 99 -59 -87 -78 -29 213 90 33
3714 33 119 15 -161 -163 123 -165 94 -30 -5 -174 -3 -163 -169 -8 36 -51 15 -88 -148 14 -75 26 0 -253
3738 -253 -62 62 -14 -9 184 133 -150 10 -25 -91 -394 53 116 109 -105 152 17 -16 -5 -28 -185 -258 -46 -328
3762c28K60J20J03j08k33K14J66l22J54Q4j09j08m7K7K25k37J76j62J99m0nj9
3784A0jN9j08L24m44L24J36k04k9p8q0J65J96l52p1K08k15J07Q3k94J49R9J93
3807A77R3j78l49J19J35J74j89Q8j00J34N3q6j07n2J16J98r5J5k07j2R8j38k00
3830c13K21K32J03k67j1L06j31j24J22j34J21J2m15L31K02j42l33M77k26M5m58
3851c82K13K56J73m57J14j3LJ52P5j86l6q5M07Q5k09k25J19J60o0k72J51J5J38
3874A36J6j19j21J42o8L52n16M7L7m9r9J72J38k31K41J45m70M85l08K4p0K83L7
3897B04k69J14j29L7J40n8j60L22l17M8rQ6j78k0K22K22j69j03q6J15P0j2J61
3920B31j18J2K31o01J03M56k56j09l3j55Q2L00l21K32J07j60kj70J34R7j2J52
$$ plain form
3762 -328 -68 52 155 47 -186 28 194 -128 26 110 1 -107 -154 -127 98 -139 37 -125 74 34 29 10
3784 10 9 68 -40 284 -160 164 300 96 67 -11 -91 74 270 -82 -153 55 -160 -53 30 -264 -115 -16 177
3807 177 270 92 -257 -138 -3 171 -18 70 -30 104 157 71 -36 -88 28 226 131 146 -61 -73 25 -113 -313
3830 -313 -92 140 243 -24 -35 271 140 16 138 4 125 137 -278 53 255 113 -220 257 31 76 -382
3851 -382 -169 87 260 -197 -83 -96 -93 59 134 -52 -88 -173 234 319 110 -115 4 164 104 -168 -17 -2 136
3874 136 152 33 -88 54 -14 338 -178 -131 -94 -143 -242 -70 68 -163 78 223 -247 238 -70 -46 -116 167 204
3897 204 -65 49 -80 -43 97 39 -121 201 -116 -68 -77 9 -169 -189 33 255 86 -17 -103 12 82 70 231
3920 231 113 125 356 -245 -142 314 58 -51 -84 -239 -157 143 -178 54 161 1 -1 -171 -37 60 48 200
3942B00j81k74R0M23j41l74J14oL5K7N0K97j88K57l07k57K22N7j53k4K29k01J10
3965EQ9j20p2R2K03j43p1M9P3l7m4j04K04r0j63jk54J78O13m85K25k69J26K3K36
3990B63l35j2j00R9J4Q4Jq5J12j82L48k99J84%j35N7j0J49q4j78J75j27j29N2
4014a38L84j87J00l27K51j61M4k56K87K25k33J1J96k07q7L39k68Q4j31n7K60n6
4036G3o6J5J43J28k95J15j66L6M5J03%k72K31M1j46l1J21p2K41K3k32L28j47j47
4060F9l2O5L7k65L62M4k45l31M81j53j50O5j21J74K66k04j23p6R1K94l36j34M81
4083B59k55q0j3j04j05L29j1r6L94l06K2k11L36l10j00K14k73M40l21n4Q8j9K59
4106H3k20J22J23j00l0j07M04l17J70N0r4Rj1k74L1J89m9M7j49j44J85J49k4j33
$$ plain form
3942 200 19 -255 -165 258 117 -257 -143 -149 -114 -87 -37 260 72 329 22 -235 -13 44 -109 -133 96 -105 5
3965 5 94 -26 -98 -6 197 54 -17 32 105 68 24 -80 124 34 -129 -130 -384 -206 407 -78 147 -122 4 27 263
3990 263 -72 -84 -184 -85 -71 13 14 -71 41 -141 207 -92 92 92 -43 14 4 153 69 -109 66 -61 -190 -138
4014 -138 246 59 159 -168 83 -78 -34 -290 -3 222 -11 0 196 -11 -98 241 -27 57 -74 -131 129 73
4036 73 7 22 165 293 -2 113 -53 -17 28 131 131 -141 90 131 -15 -46 75 3 244 267 35 363 216 69
4060 69 37 102 139 -126 236 280 35 -296 185 32 -118 -53 -174 0 266 62 -61 -137 -46 248 -88 -222 259
4083 259 4 -76 -89 -193 -298 31 20 -76 318 12 34 -177 159 -151 -251 -37 -310 130 -191 -245 -157 -176 83
4106 83 -137 -15 108 8 -22 -129 275 -42 128 178 84 93 82 -192 -161 28 -21 26 -123 -267 -82 67 43 -90
4130i0L6p1K38j83k7J90j88K34k45K89j84N8n3P5j37p5K56j58K28l23L12k9j25
4153B8mP7k27J7Q4N8j4j5q7M2q0J76m46O54l22k77P3L31M7L7k50m5O5K6O4R7j57
4180d8J5j27K2M37k67R0l00K68lJ56m85O4L31j48j54K34k1n9k3k44l8N33j98r2
4204e7J59K21l69k10K94k34K94J26l00K74m30K91j36k06K93j03R4q4M3J00k29
4225a69M6K70j40J97j95l17P52m60R3k40J60J45j85J59o3k59J87o6L2o6L41O8
4247B90j78j24r4O5%k51K26l91M11q6J70k81K48J43p0j27J92l09M2K69M6p3j33
4270a5m5j04K60j13J57l31L1N24k60k62J79k9l7j01O8j70K64k5o3O2J36j26o8
4293f8p2J65J12l09n2R9J44J52l81K53j13o2K19n6k99M53k09P4n0m9j4N05l29
$$ plain form
4130 -90 -54 -125 113 -70 -97 93 -95 139 -106 183 -1 57 4 79 -58 -133 123 -35 193 -130 182 153 28
4153 28 24 101 -126 -109 -25 33 19 4 -83 -41 -121 55 -391 263 -59 -336 -263 68 115 152 -98 -143 -78 -52 12 109 -48
4180 -48 -33 -160 -138 299 32 122 -178 90 87 243 -242 -178 153 5 -149 85 64 5 -18 -262 -300 233 35 -57
4204 -57 102 323 -46 -256 38 -196 98 224 -76 198 -232 59 -77 -283 10 -93 1 -83 -40 60 -169
4225 -169 -123 147 7 204 9 -308 444 -16 77 -163 -3 142 -43 116 53 -206 -19 -85 -53 -119 222 290
4247 290 112 -12 -106 -41 -41 -292 -66 -457 -46 -132 38 -243 5 148 78 -49 143 -166 -124 145 191 118 -15
4270 -15 -60 -164 96 -17 140 -191 -160 364 104 -158 21 -8 -45 -146 -78 -248 16 -9 -72 -10 126 0 -68
4293 -68 -140 25 137 -172 -224 -125 19 171 -210 43 -70 -132 87 31 -268 185 -24 50 0 -49 -63 442 113
4316A13J15l52p4L40m0l0L3l85K51K12j63j16K4M6j7k1o8K23j16j06J99MO5k87
4340a50j1K0M27j86K3J2m20J82k4J91j13l4K06q4l6p7n1M8j10L96k80O9j8j03
4364a23K62j33j99J94MM0J69j57p8j22K36j80L10k94o6J31j16l9K71j24L8m8J27
4387A03k06J88Q9l27K89j26O3J9j67J15q3L1J49j33k62J45L50k43M5k14K67m6
4409D6k26J42J44k3R8k6n7k15K38N5j84m0l47O35j2l77J00K42l37K43l83K93r9
4432i0K19j67J9l6j9K83l24L15k52N7P5k3j34p7K61l55M14j94k00M17J9j13J06
4455B01j23r3l08J15R5K06k54J52%k14L16k80J82K4K89m07R2R3l7p9j18M6j04
4478b06K22%J08r9L8K41j99N5M8l21j58L24O4j95M5j03L84n29K93j81J41k60L31
$$ plain form
4316 113 228 -124 -198 142 102 72 105 -280 -29 183 20 -96 -72 -26 -43 -64 -132 91 -25 -131 68 72 137 -150
4340 -150 -161 -141 286 100 123 135 -285 -103 -127 64 -49 -83 123 39 3 -74 -125 -77 -187 209 -71 -2 -20 -123
4364 -123 139 6 -193 1 5 45 214 57 -21 -143 93 -87 223 -71 -137 -6 -122 -161 110 -14 24 -24 103
4387 103 -103 85 174 -153 136 10 73 92 -75 40 -43 -12 137 4 -258 -113 237 -6 39 -175 92 46
4409 46 -180 -38 106 83 181 155 98 -117 121 176 -8 -48 -395 240 228 -149 -49 193 -144 99 -284 9 -90
4432 -90 129 -38 -19 -55 -74 209 -115 200 -52 5 80 57 -77 -154 107 -248 166 -28 -228 189 208 95 201
4455 201 78 -15 -323 -208 -113 93 -161 -9 -9 -223 93 -187 -5 19 308 -99 -7 86 49 -30 -148 -102 -206
4478 -206 16 16 124 25 63 304 105 160 208 -113 -271 53 117 -78 -33 -136 248 -281 12 -169 -28 -288 43
4501D3j29K04J8k17K29r5j28m3J45m7oK97j86J81m05k51K76m4J18J75j02n3k4
4524d4k70K48J71rk38J68p5l53L76o0K01l56K79J21j7j38l39M31k65K94m57L91
4546E9P6m2n2J0o1nJ02j53K86k31J28O0k27r9J77J4k73L10mQ6k3k23K57k07J34
4571I9q6L9n7n0O2j64K46j08K8O8L4o7P2j89J70Q5j15k83L6k7R2K7J83J10l33
4596a28J01J72j81r6K51M7r4J43l67K26n42K38M41r5k0j27K51j58j70k9J74k76
4618b39L34o9J69j59j06j90K30m4M3j36K98k89K43r5J04l55J67J45K1J35l37K64
4640A34j27K45j16J21k90O4L4O7m36P13m41J11o4O2j42o3J79j10J06j01k57L10
4662aJ1RO3k76J77PK76m60J07J53j74K3R3L47l66J71k62K91k97J06j83QJ52J40
$$ plain form
4501 43 -86 118 136 -81 148 53 -75 -118 27 -20 -26 271 85 266 -139 -390 -114 -158 -40 135 33 -20 -44
4524 -44 -314 -66 105 96 -142 26 -49 -402 -26 -86 115 -241 38 159 142 4 -335 96 -169 125 -332 59
4546 59 135 93 41 51 -10 -15 87 -66 220 -11 117 177 -50 -149 28 42 -231 79 75 161 138 -85 172 -35 99
4571 99 13 52 -5 -55 7 -157 89 -19 9 77 111 44 116 -73 97 182 67 -216 -180 -207 -115 -88 95 205 -128
4596 -128 -27 145 -36 -132 119 166 72 215 -152 74 -468 -230 211 116 96 -31 220 62 -108 -137 37 -239
4618 -239 95 26 195 36 -70 -260 -30 -74 -31 -167 131 -158 85 -10 94 -261 -94 51 72 207 -130 134
4640 134 7 252 136 257 -33 31 65 132 -304 409 -32 79 15 77 -65 -128 51 -59 47 -54 -311 -1
4662 -1 10 19 82 -194 -17 -10 266 -194 -87 66 -108 -85 8 355 -11 160 -102 189 -108 -2 -185 -177 -25 115
4686A15k02L04l83J70m0Nl00K66J20K46j14l33O6N6K82l88oK31j97J70k00J29
4708ck0j93M57j04k03r8L04k24K4j52m7K6K15r9M0J86l02J50K58j08j68K11l09
4731a59L69k97Q4rK02o5j58K01M9l6oj26j90L18j89Q6P0m62L5K60k5L56m22L0
4755h4k81K26O2K29m6q2O7j55j25J34K30j10q6K39k77K03k37K48j62K8J21j62
4777b0m0q5J74m4K14K8j27k33J47j57J70p5j15J72J5j0L18k90J16o5k5k51K62
4800G9J78j04j6l02l7L80J66k50j05J13J15k53J83k30%m8J01L7P6M7j03Q3j91
4823h1QK5j82L77o6j73j15MJ48K42K3k81J62J74l60J30J11m2k33K09k06L57m10
4846a79P3J15r0J54j79K58l62K70j68m4R5l9j2j00R1K37rM0k90J05J05m7K98l49
$$ plain form
4686 115 -87 217 -166 4 -36 -31 -331 -65 55 301 187 -146 -80 -24 258 -130 -136 95 -102 68 -132 -3
4708 -3 -23 -216 241 137 -66 -164 140 -84 -60 -212 -259 -233 -18 -117 -77 109 -193 -43 215 107 -61 150 -159
4731 -159 210 -87 -3 -12 190 125 -33 168 217 181 175 49 -141 177 -12 74 144 -318 -283 -23 -48 308 -114 -84
4755 -84 -365 -139 -77 152 106 24 91 -64 -189 -55 175 65 -21 218 -59 144 -93 155 -7 21 142 -20
4777 -20 -60 -145 29 -15 199 227 100 -133 14 -143 27 -48 -163 9 24 14 332 42 158 93 68 -183 79
4800 79 257 153 137 -165 -202 178 344 94 -11 102 217 -36 147 -83 -83 -131 -30 7 83 130 27 110 -81
4823 -81 -73 -48 -230 147 81 -92 -207 -203 -55 187 210 -71 91 265 -95 35 146 104 -129 80 -126 231 -179
4846 -179 -106 9 -81 73 -106 152 -210 60 -108 -152 -57 -96 -108 -208 -117 120 111 151 -139 -34 71 24 322 -27
4870b7J77p5r2J35j57R1M8k54K52j28m2J06j10O9K14k53K40j64o9R3l94K36J53
4893D9L6l8k29K01j23j70K91l1P1j02Q3J49j52J7J11k51J33j53mL4L13k37OK02
4917B06j22j87Q6j07K1k3mJ74J3j03K56n84L51Q2j66K28K3j2k94J96j34K00k19
4940a19k9M33l55J07Ol58O62m89J22R7k45J78j76J09K00k95L0J99N6k23j2k33
4962c35J60L38k76K42n7L8kj14k23M36j62n9k77J30J73J45j4k02J59K0l3k08Q0
4985d1j86K58p6O1r7J18j55J35p8j0J04j80K91j21J16K1j67P9k2j59J3P6j66K11
5009B5J8j34J84J7m4k14L57k32J7q4j47N11k42K05l09L0j75J37J12rJ4K7j79k76
5033c91K13J75j61j21O8K33M9R0j2k94N0K64j94J08J09k13R1j70K92K4k72J22
$$ plain form
4870 -27 150 75 -17 118 -39 52 100 -154 98 -30 -72 34 -76 -7 207 -46 194 30 -39 54 -340 -104 49
4893 49 85 47 -182 19 -104 -274 17 -14 57 -45 38 187 35 52 163 -88 45 -108 -112 -78 235 -2 4 206
4917 206 84 -103 -17 -124 -103 -126 -130 44 57 -46 210 -374 -23 59 -107 121 144 132 -162 34 -100 100 -119
4940 -119 -148 285 -70 37 43 -315 347 -142 -20 77 -168 10 -166 -57 143 -152 -122 77 133 -90 -102 -335
4962 -335 -175 163 -113 129 72 110 108 -6 -229 207 45 -14 -291 -161 12 157 143 -59 100 120 87 -121 -41
4985 -41 -227 31 -45 16 -81 37 -118 17 -61 -71 33 -147 144 23 139 160 -7 72 50 -109 -96 -20 -186 25
5009 25 43 -91 93 110 66 -148 209 -23 -6 -90 -237 274 32 237 -72 -42 -217 -80 32 23 37 64 -115 -391
5033 -391 -178 -3 -164 -285 -217 16 65 155 143 -151 -101 163 -31 77 186 -27 64 -106 186 210 -62 60
5055F0O4l06P7l9J42j16M7K58r5k31r0m8o7O38l81K53k5k52N9J8r8L56k24Q2j50
5080f8M7K9q2N2O8K39j8M8j85k06J80k1q8o12O77J36m50L56J3o04m40J022J52
5103B45k30L73l04o0Q81j109J55N6M3J9m6k74J14M1J69P6r3K3k7n13M82j89K73
5126A05p9J44q2k3J07jk49p5K68P7j32r2N9J66j9q6p2j12J03j78L37l71J35k4
5150i4L22K47n00O4J07N8J5k71N6p6K51K0q8p7m5m7j02J42r5J68j10J03j70P5
5174d7J83l1l1%n0Q2M7o7L0j41J2j29L31j34k8K29j77J9O2k07qr0J96L4k52K67
5200A00j17K1j1j07K44j42k5NK83l34M0j48K93k77K00j38M00l92J66K27j72j41
5222b5M0j56j12L61j00K5l4o3k03nK42p4l0K64m2M9K5k39O7m7j62Q5J54k19J93
$$ plain form
5055 60 124 -182 -105 -144 -2 -118 -71 187 92 -139 -229 -277 -344 294 -87 166 141 -111 -52 -34 -132 224 0 82 -68
5080 -68 -21 8 -74 -22 46 285 267 315 130 -76 104 83 -5 -617 60 196 -254 102 115 -489 -929 93 245
5103 245 15 388 84 24 905 -204 -49 7 50 69 23 -251 -137 -96 73 149 56 79 52 -461 21 -168 105
5126 105 26 170 88 65 172 171 -78 -153 115 192 60 -32 27 193 174 88 16 -96 7 -171 166 -205 -70 -94
5150 -94 228 475 -25 39 146 204 219 -52 4 -72 179 199 111 34 -11 -58 -160 -18 -113 55 -55 48 -122 -47
5174 -47 136 105 74 74 24 106 153 86 116 -25 -13 -142 189 55 27 256 79 98 160 -47 -55 -145 51 85 -167 100
5200 100 -17 4 -7 -114 130 -12 -37 -32 251 -83 -43 -191 102 -175 25 -113 287 -105 61 288 116 -25
5222 -25 15 -141 -253 108 8 33 -1 -64 -267 -272 -30 -104 -134 130 88 137 162 -77 -10 -57 -219 -134 20 -199 -6
5247fK35m33K68Q1J06k08j6M11k92q0K10k30n1k28M98k04k81M51m44M26k59K15
5269A69k61o8R0K0N9j79J34M6j28O4J53j75K2K89l28O8J8l4J55j94Q3j20m3l3
5293a93K10M0k40J76J83j14O9j38k55L58j73p6k0RL16K4k79J15Q3j19L02Kk27
5316E3j42j2L4K95l23j7p7K34j70L52M62o74l3J9k62L15J94k22k41Q1K7J30j1
5339A2j53L16k06q0K82L8l27J05j4R4jj0J57l94K51k58K42k83L46L1j13J21J24
5362B80k63O3R5k21J09J20k31J8R7j57L6j29L48j49j28J32M1J45o10N04P7l01
5384a24K15j22JL42j94l6K75o85K47j52K17J18m31L85KK60l69j65L21r9%N9k28
5407a63n2P8K82j30k46J59J94p9k21K11q0JK78l3j31r9k15K70qj77J98n0m2L6
$$ plain form
5247 -6 229 -204 64 145 251 43 27 438 146 66 276 46 -5 -233 265 61 -220 231 -213 213 -46 169
5269 169 -92 -160 -70 -50 9 -170 -36 10 -118 -54 99 -76 -54 235 -93 -25 -7 -41 114 -80 3 -117 -160 -193
5293 -193 17 57 -183 -7 176 62 131 -7 -262 96 -77 -153 -173 -164 152 176 -103 12 95 -24 278 280 53
5316 53 -89 -101 -67 228 -95 -112 -189 45 -125 227 689 15 -18 1 -261 54 248 26 -215 -134 -107 23 12
5339 12 -141 175 -31 -111 171 209 -118 -13 -27 67 66 56 213 -181 70 -188 54 -229 117 148 35 156 280
5362 280 17 80 175 -46 63 183 -48 -30 67 -90 -54 -183 165 16 -112 20 61 206 -404 100 177 -124
5384 -124 91 -31 -30 312 118 82 357 -328 -81 -233 -16 102 -329 56 58 318 -51 -216 105 6 6 65 -163
5407 -163 -215 -137 145 15 -231 -72 122 43 -178 33 -47 -46 232 199 68 -31 -246 24 16 -161 37 -13 -55 -19
5431a9J45J6j59r2J36l0N9j42p1J14R4k73K05q2j83Q8L93MJ18k95j26j31M85k79
5455b5J9N6j04P4j03K54l96J98J86k48J7nl6r5K64o2q6K45k19j52J59j59J77j90
5479b31j39M54j27L6qP0k77L98k48Q7k33K09N3j36j31K0mQ9J29L5J01j81L7k08
5503b05M2K05k95J49L09k44Q5L7n6l2J30o4j91P3k09J30%L02P9k03k32L76j11
5526G5j83L74j89J43p7k34M5m1J62N2r2PN6J08l35nK58k83K03J19o0P3n3j26J81
5551A78r8R9l75L62Q9k14n5K71l82Qn6K33M0k15M6lJ70o6k02l4L24l58J86J09
5575E7j15J78p2L21n13K41N0k63J00L7Qj9k7j11K43J33k44r4J8Q6Oo9j03K49q
5600H9L3k09j34Q2K05J2K16j53J9j63k63L31J36n20L51j7j02J10n3J48k86K46
$$ plain form
5431 -19 126 142 -17 -109 27 -3 56 -86 -157 -43 51 -222 -17 -99 -282 -194 199 203 321 26 -100 -231 254 -25
5455 -25 -6 50 -54 20 -83 171 -225 -27 159 -89 -72 -77 -113 -208 56 -6 -92 153 -66 -218 -59 -218 -41 -231
5479 -231 -370 84 -43 -7 -15 55 -222 176 -72 15 -218 -9 44 -92 -223 -203 -207 -118 11 46 147 -34 3 -205
5503 -205 -163 42 -253 -104 205 -39 46 83 27 -5 125 61 -130 -57 -266 -136 -136 166 245 42 -190 186 75
5526 75 -108 266 77 220 143 -91 -46 -87 75 127 35 42 98 206 -129 -134 124 -159 44 163 103 176 123 -3 178
5551 178 80 179 -196 166 255 41 -14 257 -125 -117 -173 60 100 -115 -69 -72 98 32 -170 -204 120 -238 -52 57
5575 57 -58 120 48 369 -144 97 147 -116 -16 21 29 10 -17 -128 115 248 4 -90 -72 14 20 -49 -152 97 89
5600 89 122 -87 -221 -139 66 78 294 141 160 -3 -266 65 201 -319 32 15 -87 23 -30 118 -168 78
5622G8oJ03j94j67l9M29k22n1M8J93m16L85j42JJ67q0k8m5J50r1M4j95J41j2k49
5647a98K20j60j05K07J74n8q0K8l6Q3r0J04j39m0N0n7M61m64L04l7k96L3J35k05
5671a66O0J33k2n0K74k51J06p2JQ3qJ06l9J6j33p0k7n5j44K52K54l77L6LK08l35
5697b17J96K18j41n2k38J81J54k24J91O7Qk39J42o4j99K97q2R9j4j64J73K3N9
5720A74k30R2j00q3J65j76J23PL83k87l43K22J15N6r0r8J55l29K89M3j40J87j45
5743a0M5j83l4J46j7J36j98J73j05M0kJ7K7l56K66N3K7j94J0N4L04k53Q7j86K44
5768I1n3R2J8k55qK85Ll41L11j55r2K16k85L23m3j41M4n9J45j30R6j48J13j42
5792a15J62l7k60PJ17Q6L5K13k43P8j54M0j27K40k58J56J10p9L66m68k9J57o9
$$ plain form
5622 78 72 175 -19 -186 -225 204 -18 -69 -21 172 -244 141 -1 0 167 87 59 14 164 73 117 -78 63 51 -198
5647 -198 22 -138 -243 -36 138 80 0 28 -8 75 -15 89 -50 -90 -40 -97 364 -100 204 167 -129 -96 39 -166
5671 -166 -106 27 5 -45 229 -22 84 12 13 96 88 194 155 171 38 -32 -59 -114 -258 -6 248 -129 -93 -90 118 -217
5697 -217 -21 197 56 4 -234 -53 101 -123 68 135 143 -96 46 -18 -217 80 -2 97 83 -81 92 115 174
5720 174 -56 36 -64 -147 18 -158 -35 -28 355 68 -275 -53 62 118 28 -70 85 -244 45 88 -52 135 -10
5743 -10 35 -148 -182 -36 -53 83 -115 58 -47 -7 -9 8 35 -321 -55 -2 25 -169 -159 -105 199 -54 33 -153 91
5768 91 38 130 148 -107 -115 170 173 -168 143 -12 -104 112 -173 150 107 -34 10 -49 96 -34 62 -86 27 -115
5792 -115 47 10 -250 -243 -126 -40 -5 208 -35 43 -111 -71 -198 42 -216 -60 50 -29 337 -131 -160 -3 -72
5815g2P5J66j84M0J81l7k23q5J47K75l91J38m3lp5J75n8j94P6J12l46J77l2L48
5839A67l86Q6J02J40k43M15m21K56M9j28p3QK1J34k2j63J58k46J69J6Oj59J18
5862DM5q4J01J50j43J85J81l95k83J08K42j90J56K05l72J33K38k29n6J3m8L8K04
5885B03k08m0K92j25j15J99j19l1j44J87J5l76K63J57M8j10J63k38J17nj57j50
5907a74K98K17m60Q6l0K18l19K01k21N4K77m30K33K78l97M20j40l12L42k30M18
5928C29m22J08M1Nj50j34M44j05l6j62K17l80O6K92k8m8M0k69L54j71j73K15j18
5951h5p1P9L03m65J09K30p6r4k6K06o8N9l55L97j25J24m48J27K88p6M0j95O6l20
5975c76M94m23K02j45l7L00J78r7k73K3K61j74L5r0Ll3K23j31K8l21L10qj52J33
$$ plain form
5815 -72 3 169 -15 25 206 169 -54 -139 8 283 -108 30 -13 -16 -91 84 26 -168 -92 20 -326 -149 -181 167
5839 167 -219 -133 -31 109 -134 281 -140 116 165 37 -36 -28 -7 127 105 -58 100 -146 23 39 45 -114 4
5862 4 49 -35 66 216 73 258 439 44 -239 -131 111 -79 77 282 -90 43 281 52 -4 9 -39 -1 203
5885 203 -5 -45 247 122 7 206 87 56 -88 99 114 -262 1 158 206 96 259 21 138 133 -24 -174
5907 -174 124 341 -119 -33 -63 155 -164 37 -184 -130 147 -283 -50 228 -169 251 111 -201 141 -89 329
5928 329 -93 15 56 61 -89 -223 221 116 80 -82 135 -245 -179 113 85 37 77 -192 162 -9 -182 33 -85
5951 -85 -156 -77 226 -239 -130 100 24 -70 -96 110 42 101 -254 143 18 142 -306 -179 109 33 73 -122 -56 -376
5975 -376 118 -305 -103 -248 -285 15 193 96 -177 -154 107 -67 -32 -122 -119 -152 71 -60 -32 -353 -43 -51 -203 -70
5999g0Q6j17Rj04K01q1J73p2K11j01L4j4m8L2j60j03R7J19m8l77M69n8l44K57
6023ij43J19j2Jj63L74q3j15K05m30J47l5N4J16OJ04M0k55k07K02P9M4Q2l20n7
6048b56R8J51l6k2jJ38n2m3o2L86l30r0K53q3k31QL29k22j1J83N7k01L0j6k2n
6074e0r7P1k09K99K26j41J74m37K73j9l74L08J01k17M9j54k7L90j97J83p9j22
6096d9J1k6K1l32K12P8J01m6J04j35J34j82R1j39K98m9q5k4r8K14J06k74Q9J13
6120A33j60j09K38n2J3l21K61j31K09J69m82Q1K97j47L18k73l63k8M09K10J57
6141D29l56j11M4n43R36m07k60O06J79k29l29J43J52k50K98n55K37P3j5q1J13
6162G4K3k7l81L90M7m30K2J88L30n24J70P5l54P16Rk27o2q0J2K84k16kNJ59N73
$$ plain form
5999 -70 16 -101 -92 -196 5 -76 97 25 236 135 169 155 107 139 -21 -124 -27 92 44 -333 136 78 -266 -9
6023 -9 -152 -33 -45 -44 -207 167 84 -31 174 -256 -109 -144 -90 26 32 136 176 -79 -286 -84 -5 39 121 -199 -256
6048 -256 -158 -7 -43 -65 -66 72 20 -23 -85 301 -29 -119 134 51 -180 -172 157 -65 -76 107 164 -37 -7 -23 -45 -50
6074 -50 -147 -76 -285 14 240 99 273 -164 109 90 -284 24 125 -92 -43 -197 -224 166 -31 152 73 -49
6096 -49 -38 -64 -43 -375 -163 -85 16 -30 74 -61 73 -109 -18 -157 141 92 7 -17 -115 99 205 -69 20 133
6120 133 -27 -136 102 50 63 -258 3 -128 81 250 -232 -151 146 -1 317 44 -319 -347 62 272 429
6141 429 73 -38 6 -537 399 -8 -268 338 517 288 -41 102 254 4 302 -253 -16 57 42 -39 74
6162 74 97 70 -311 79 126 -304 -282 -94 236 -288 -118 -43 -397 319 328 101 39 -41 -29 255 39 37 42 201 774
6187G74o17J12L9j086J18J177n25K50k40R66r82L61J3k43mL8p5o26K89M32l56
6208a85O62m31K89l12J33j87j24j14K49l98O42K37L2n85L03j45%J89K60p55O0
6229a80j01L30J16j70mJ21j63J83J4m36N37k45J44j08r5j81J75r0Q9jJ43l45K38
6252b9j70Q7J55k7J9P1k38J65k2K3j98Q0q4L2r1L08j04n7k5J79K91j69l9j96L02
6277B63j85k34j4K98R7l34l8R3k43J61J42j19M3O7J06l9qj24l22J64O7L66k74
6300f7j84J71L34k25R4j46j5L4R1k18J46k8J05j64J70k73J32p8O8k6K13j37j36
6323a39q5p6K59k35K06k63L76R7j95n4k5N9q4N1K28k76K60j85Q4j56K02j04R3
6346C8j03O5j53K49j67Q8k5o4l0O6J04Kk72J23K54%J61j07l53k01N12J04m22o8
$$ plain form
6187 774 157 269 308 -778 -660 517 -8 242 2 968 -14 347 360 117 113 151 76 -550 -261 171 -185
6208 -185 477 46 335 23 156 -31 -155 -269 -20 -418 224 461 493 -92 211 66 66 255 515 -240 -180
6229 -180 -281 49 165 -5 -9 112 -51 132 146 -290 247 2 146 38 -57 -238 -63 -153 -64 -65 78 -267 -29
6252 -29 -199 -112 43 16 35 106 -132 33 11 34 -164 -84 -168 -136 -227 81 -23 -80 -105 74 365 196 157 -39 263
6277 263 78 -156 -170 128 225 -109 -147 -54 -297 -136 6 -113 -70 -3 103 64 56 -68 -390 -226 -159 207 -67
6300 -67 -251 -80 254 29 123 -23 -38 -4 87 -131 15 -13 92 -72 98 -175 -43 -121 -53 -79 134 -3 -139
6323 -139 -224 -300 -41 -276 -70 -333 43 140 -55 -109 -134 -75 -159 -108 120 -156 104 -81 3 -153 49 -55 38
6346 38 -65 0 -153 96 -71 17 -8 -72 -102 -36 68 70 -202 -79 175 175 336 229 -124 -325 187 291 -131 -199
6370a99K63J43m88J88j72P6L9J13J66q6PJ02j28K8j67K47Mj81j07pm6K93O5k95
6394a42NO5J18j6j03K16j9j58L29k41m09K31O38m76k9Qj43J91k36o0N35j60O3
6417B07j96K5K23k66P2n4J81j87Rk22K47N8k63L07o2J0k65M54j72l30L85lj45
6440A3L79l24O5K70k80p0PL3k1k28J27q5K85l71K43o4l4%K07j72J27J22k15J62
6464A76m68M11m3n7K39k50J6J07m2m0J11k88rK96k93J93j9K0RN1j15j29J63N4
6488I3j32J06M0n3r2R1p6j00J97k8k8o9p2J10J10r4P8p7j00M24l36l8l01M11J49
$$ plain form
6370 -199 64 207 -281 -93 -265 -189 -150 -37 129 43 50 152 24 52 -115 132 136 -45 -152 -159 -205 88 153 -142
6394 -142 -137 -72 46 30 -73 143 124 -34 295 54 -355 -124 514 38 9 17 -126 65 -171 -231 304 144 207
6417 207 11 36 259 -7 65 11 192 5 14 -208 39 97 -166 141 79 89 -176 278 106 -224 161 158 13
6440 13 392 68 133 403 123 53 60 93 72 -156 -29 -114 171 -200 43 -21 -55 -55 152 -20 107 229 14 176
6464 176 -292 119 76 19 258 8 24 131 89 49 160 -128 -137 159 -134 59 40 60 69 120 5 -124 39 93
6488 93 -39 67 107 54 -38 53 -23 -123 74 46 18 -51 -123 -13 97 3 81 4 -96 328 -8 -46 -347 64 213
$$ [...]
8191i
##END NTUPLES=NMR FID
##END=
