##TITLE=1H_DE-145_TFA
 200.13Hz, CCl4.
 8 sc
 
 29.4.2026
##JCAMPDX= 6.0         $$ Bruker NMR JCAMP-DX V2.0
##DATA TYPE= NMR FID
##DATA CLASS= NTUPLES
##ORIGIN= UXNMR, Bruker Analytische Messtechnik GmbH
##OWNER= pz
$$ XWIN-NMR		Version 3.5
$$ Wed Apr 29 14:19:51 2026 Russian Standard Time (UT+4h)  she@DPX200
##.OBSERVE FREQUENCY= 200.131
##.OBSERVE NUCLEUS= ^1H
##.DELAY= (6, 6)
##.ACQUISITION MODE= SIMULTANEOUS
##.ACQUISITION SCHEME= undefined
##.AVERAGES= 8
##.DIGITISER RES= 18
##SPECTROMETER/DATA SYSTEM= spect
##.PULSE SEQUENCE= zg30
##.SOLVENT NAME= CDCl3
##.SHIFT REFERENCE= (INTERNAL, CDCl3, 0, 14.3821)
##AUDIT TRAIL= $$ (NUMBER, WHEN, WHO, WHERE, WHAT)
$$ ##TITLE= Audit trail, XWIN-NMR		Version 3.5
$$ ##JCAMPDX= 5.01
$$ ##ORIGIN= Bruker BioSpin GmbH
$$ ##OWNER= she
$$ F:/spectra/data/she/nmr/H-C/1/audita.txt
$$ ##AUDIT TRAIL=  $$ (NUMBER, WHEN, WHO, WHERE, WHAT)
(   1,<2026-04-29 14:18:21.73 +0400>,<she>,<DPX200>,
      <created by zg, POWCHK disabled, PULCHK disabled
       configuration hash MD5:
       00 E9 B6 7A A2 85 ED C7 34 08 36 98 17 FE 4E 26
       data hash MD5: 16K
       2E E0 C3 32 85 EA F2 2B B8 9A EF C5 5D 0D 8D D6>)
$$ ##END=
$$ 
$$ hash MD5
$$ 89 D1 D3 3C 12 E6 68 8B E6 D7 70 41 D7 E3 B7 DB
##$RELAX= 
##$RELAX= 
##$RELAX= 
##$RELAX= 
##$RELAX= 
##$RELAX= 
$$ Bruker specific parameters
$$ --------------------------
##$DU= <F:/spectra>
##$EXPNO= 1
##$NAME= <H-C>
##$PROCNO= 1
##$TYPE= <nmr>
##$USER= <she>
##$AMP= (0..31)
100 100 100 100 100 100 100 100 100 100 100 100 100 100 100 100 100 100 
100 100 100 100 100 100 100 100 100 100 100 100 100 100 
##$AQSEQ= 0
##$AQ_mod= 1
##$AUNM= <au_zg>
##$AUTOPOS= <>
##$BF1= 200.13
##$BF2= 200.13
##$BF3= 200.13
##$BF4= 200.13
##$BF5= 200.13
##$BF6= 200.13
##$BF7= 200.13
##$BF8= 200.13
##$BYTORDA= 1
##$CFDGTYP= 0
##$CFRGTYP= 5
##$CHEMSTR= <none>
##$CNST= (0..31)
1 1 145 1 1 1 1 1 1 1 1 1 1 1 1 1 1 1 1 1 1 1 1 1 1 1 1 1 1 1 1 1 
##$CPDPRG= <>
##$CPDPRG1= <>
##$CPDPRG2= <>
##$CPDPRG3= <>
##$CPDPRG4= <mlev>
##$CPDPRG5= <mlev>
##$CPDPRG6= <mlev>
##$CPDPRG7= <mlev>
##$CPDPRG8= <mlev>
##$CPDPRGB= <>
##$CPDPRGT= <>
##$D= (0..31)
0 0.7 0 0 0 0 0 0 0 0 0 0.03 0 0 0 0 0 0 0 0 0 0 0 0 0 0 0 0 0 0 0 0 
##$DATE= 1777457900
##$DBL= (0..7)
120 120 120 120 120 120 120 120 
##$DBP= (0..7)
150 150 150 150 150 150 150 150 
##$DBP07= 0
##$DBPNAM0= <>
##$DBPNAM1= <>
##$DBPNAM2= <>
##$DBPNAM3= <>
##$DBPNAM4= <>
##$DBPNAM5= <>
##$DBPNAM6= <>
##$DBPNAM7= <>
##$DBPOAL= (0..7)
0.5 0.5 0.5 0.5 0.5 0.5 0.5 0.5 
##$DBPOFFS= (0..7)
0 0 0 0 0 0 0 0 
##$DE= 6
##$DECBNUC= <off>
##$DECIM= 32
##$DECNUC= <off>
##$DECSTAT= 4
##$DIGMOD= 1
##$DIGTYP= 9
##$DL= (0..7)
0 120 120 120 120 120 120 120 
##$DP= (0..7)
150 150 150 150 150 150 150 150 
##$DP07= 0
##$DPNAME0= <>
##$DPNAME1= <>
##$DPNAME2= <>
##$DPNAME3= <>
##$DPNAME4= <>
##$DPNAME5= <>
##$DPNAME6= <>
##$DPNAME7= <>
##$DPOAL= (0..7)
0.5 0.5 0.5 0.5 0.5 0.5 0.5 0.5 
##$DPOFFS= (0..7)
0 0 0 0 0 0 0 0 
##$DQDMODE= 0
##$DR= 18
##$DS= 0
##$DSLIST= <SSSSSSSSSSSSSSS>
$$ [...]
##$SUBNAM0= <"">
##$SUBNAM1= <"">
##$SUBNAM2= <"">
##$SUBNAM3= <"">
##$SUBNAM4= <"">
##$SUBNAM5= <"">
##$SUBNAM6= <"">
##$SUBNAM7= <"">
##$SUBNAM8= <"">
##$SUBNAM9= <"">
##$SW= 18.0517599122864
##$SWIBOX= (0..15)
0 0 2 0 0 0 0 0 0 0 0 0 0 0 0 0 
##$SW_h= 3612.71676300578
##$TD= 16384
##$TD0= 1
##$TE= 0
##$TE2= 300
##$TE3= 300
##$TEG= 300
##$TL= (0..7)
0 120 120 120 120 120 120 120 
##$TP= (0..7)
150 150 150 150 150 150 150 150 
##$TP07= 0
##$TPNAME0= <>
##$TPNAME1= <>
##$TPNAME2= <>
##$TPNAME3= <>
##$TPNAME4= <>
##$TPNAME5= <>
##$TPNAME6= <>
##$TPNAME7= <>
##$TPOAL= (0..7)
0.5 0.5 0.5 0.5 0.5 0.5 0.5 0.5 
##$TPOFFS= (0..7)
0 0 0 0 0 0 0 0 
##$TUNHIN= 0
##$TUNHOUT= 0
##$TUNXOUT= 0
##$USERA1= <user>
##$USERA2= <user>
##$USERA3= <user>
##$USERA4= <user>
##$USERA5= <user>
##$V9= 5
##$VALIST= <valist>
##$VCLIST= <CCCCCCCCCCCCCCC>
##$VD= 0
##$VDLIST= <DDDDDDDDDDDDDDD>
##$VPLIST= <PPPPPPPPPPPPPPP>
##$VTLIST= <TTTTTTTTTTTTTTT>
##$WBST= 1024
##$WBSW= 4
##$XGAIN= (0..3)
0 0 0 0 
##$XL= 0
##$YL= 0
##$YMAX_a= 129252
##$YMIN_a= -163904
##$ZGOPTNS= <>
##$ZL1= 120
##$ZL2= 120
##$ZL3= 120
##$ZL4= 120
##$ABSF1= 10
##$ABSF2= 0
##$ABSG= 5
##$ABSL= 3
##$ALPHA= 0
##$AQORDER= 0
##$ASSFAC= 0
##$ASSFACI= 0
##$ASSFACX= 0
##$ASSWID= 0
##$AUNMP= <proc_1d>
##$AZFE= 0.1
##$AZFW= 0.1
##$BCFW= 1
##$BC_mod= 2
##$BYTORDP= 1
##$COROFFS= 0
##$CY= -3
##$DATMOD= 1
##$DC= 2
##$DFILT= <>
##$DTYPP= 0
##$F1P= 0
##$F2P= 0
##$FCOR= 0.5
##$FTSIZE= 0
##$FT_mod= 4
##$GAMMA= 1
##$GB= 0.15
##$INTBC= 1
##$INTSCL= 1
##$ISEN= 128
##$LB= 0.25
##$LEV0= 0
##$LPBIN= 0
##$MAXI= 10000
##$MC2= 0
##$MEAN= 0
##$ME_mod= 0
##$MI= 1.114404
##$NCOEF= 0
##$NC_proc= 0
##$NLEV= 6
##$NOISF1= 3.799351
##$NOISF2= 2.8
##$NSP= 1
##$NTH_PI= 0
##$NZP= 0
##$OFFSET= 14.38212
##$PC= 1
##$PHC0= -4062.532
##$PHC1= 16.99229
##$PH_mod= 1
##$PKNL= yes
##$PPARMOD= 0
##$PSCAL= 0
##$PSIGN= 0
##$REVERSE= no
##$SF= 200.129724274929
##$SI= 16384
##$SIGF1= 3
##$SIGF2= 2
##$SINO= 400
##$SIOLD= 16384
##$SREGLST= <1H.CDCl3>
##$SSB= 0
##$STSI= 0
##$STSR= 0
##$SW_p= 3205.1282051282
##$SYMM= 0
##$S_DEV= 0
##$TDeff= 0
##$TDoff= 0
##$TI= <>
##$TILT= no
##$TM1= 0
##$TM2= 0
##$TOPLEV= 0
##$USERP1= <user>
##$USERP2= <user>
##$USERP3= <user>
##$USERP4= <user>
##$USERP5= <user>
##$WDW= 1
##$XDIM= 8192
##$YMAX_p= 0
##$YMIN_p= 0
$$ End of Bruker specific parameters
$$ ---------------------------------
##NTUPLES= NMR FID
##VAR_NAME=  TIME,          FID/REAL,        FID/IMAG
##SYMBOL=    X,             R,               I
##VAR_TYPE=  INDEPENDENT,   DEPENDENT,       DEPENDENT
##VAR_FORM=  AFFN,          ASDF,            ASDF
##VAR_DIM=   8192,          8192,            8192
##UNITS=     SECONDS,       ARBITRARY UNITS, ARBITRARY UNITS
##FACTOR=    0.0002768,     1,               1
##FIRST=     0,             0,               0
##LAST=      2.2672688,     0,               0
##MIN=       0,             -163904,         0
##MAX=       2.2672688,     129252,          0
$$ Real data points
##PAGE= N=1
##DATA TABLE= (X++(R..R)), XYDATA
$$ [...]
$$ plain form
1830 23 -112 -22 198 58 -83 -75 376 47 37 30 53 -104 -190 150 -18 -2 -151 -303 17 28 205 -313 -144 -147
1854 -147 -170 9 -24 183 -62 188 0 184 -206 133 -192 -105 -18 58 72 -38 177 18 140 64 -25 -99 60
1877 60 80 128 46 -90 46 208 383 -106 -6 228 -230 34 -18 -92 84 -81 33 -57 -335 216 -30 -207
1899 -207 -57 -82 272 -85 -176 232 150 43 -228 -42 346 -149 340 21 0 -105 7 -3 23 69 7 -97 36
1922 36 -134 170 114 -238 -47 49 133 7 -209 -108 -4 150 -100 -26 -112 121 154 -128 -175 -70 76 4 95
1945 95 43 -110 31 12 11 -106 -9 -125 -74 201 11 -35 55 -150 -50 28 -32 54 -223 178 62 0 -84 164 -33
1970 -33 -410 94 -62 -2 -62 258 -107 -108 -49 280 89 -428 145 -218 -159 -4 235 -152 -9 -165 -23 117
1992 117 -16 11 -148 51 -31 -98 27 -144 -163 67 18 -230 67 161 -102 -20 296 150 109 70 -165 -22 98
$$ packed form
1830B3j35R0K20j40j41QM51l29j0pK3j57q6L40j68J6j49j52L20J1J77n18J69l
1854a47k3J79l3K07k45K50j88J84l90L39l25Q7Q7P6J4j10K15j59J22p6q9p4J59
1877F0K0M8q2j36J36J62J75m89J00K34m58K64n2p4J76j65J14r0k78N51k46j77
1899b07J50k5L54l57r1M08q2j07k71J86L88m95M89l19k1j05J12j0K6M6o2j04J33
1922C6j70L04n6l52J91R6Q4j26k16J01J04J54k50P4q6K33L3k82m7J05J46p2R1
1945I5n2j53J41j9jj17R7j16N1K75j90m6R0k05J00P8o0Q6k77M01j16o2q4K48j97
1970c3l77N04j56O0o0L20l65jN9L29j91n17N73l63N9J55K39l87J43j56J42J40
1992A17j33K7j59J99q2o7J25j71j9K30m9k48K97R4k63Q2L16j46m1l9k35J43J20
$$ plain form
2015 98 -99 -111 -21 -490 -217 -108 -188 -194 -160 139 9 -164 95 243 -61 -171 -281 -85 -103 -100 -67 43 -57 -143
2039 -143 61 176 187 -97 116 317 135 -106 4 -99 64 -121 152 -245 22 156 6 -165 84 -181
2059 -181 -118 180 -237 -108 -154 440 292 -191 -54 252 150 -122 -285 -33 -48 32 -258 -109 -42 207 -13 74
2081 74 2 11 4 78 -4 7 -112 36 1 2 -192 -26 -32 -53 -12 -228 57 18 -164 161 207 -27 -159 -104 -211 43
2107 43 -105 31 -54 -15 -14 -120 31 -123 -30 -72 -101 289 -133 -19 -8 188 42 80 268 -183 -30 28 -33 -151
2131 -151 -34 -110 240 -12 59 180 -51 56 -79 -12 -10 -96 -68 -209 -103 -12 -4 21 18 120 -153 -31 32 -80 97
2156 97 -197 26 75 87 50 42 -9 -75 -20 110 -2 116 -18 279 -133 1 -103 142 -3 56 121 3 123 70
2180 70 -20 105 97 -108 98 -195 -120 152 -75 -42 328 159 33 121 109 23 48 -217 -96 261 -332 74 58 -101
$$ packed form
2015I8j97j2R0m69K73J09q0oL4K99j30j73K59J48l04j10j10J96j8LL3J10j00q6
2039a43K04J15J1k84K13K01j82k41J10j03J63j85K73l97K67J34j50j71K49k65
2059a81O3K98m17J29m6N94j48m83J37L06j02k72j63K52j5Q0k90J49O7K49k20Q7
2081G4p2RpP4q2J1j19J48l5Jj94J66ok1M1k16K85l9j82L25M6k34j32N5j07K54
2107D3j48J36q5L9Jj06J51j54R3m2k9L90m22J14J1J96j46L8J88m51J53N8o1j18
2131a51J17p6L50k52P1J21k31J07j35O7Kq6K8j41J06R1QK5lJ02k73J22O3j12J77
2156I7k94K23M9J2l7qn1o6N5J30j12J18j34K97m12J34j04K45j45N9O5j18J20n3
2180G0r0J25qk05K06k93P5K72k27L3L70j69j26Q8j2q6K5k65J21L57n93M06j6j59
$$ plain form
2204 -101 17 -61 65 141 -4 -246 137 270 64 -43 121 20 -50 131 77 210 -231 -48 230 -2 124
2225 124 95 76 18 58 60 58 -202 -83 225 -52 -371 169 -52 -25 -127 8 76 -383 27 84 113 118 -139 224 120
2250 120 -73 115 -5 -37 -102 97 -144 -295 136 62 -239 -134 150 -242 8 169 300 -102 -6 47 73 -92
2272 -92 35 -194 -65 106 -105 -140 -23 -13 49 168 -32 7 -152 -17 46 180 -180 -169 -152 -54 162 160 -118 -52
2296 -52 44 -17 11 -379 -38 315 92 105 178 -23 108 1 139 62 172 -59 -65 149 25 -6 99 268 45
2319 45 -52 -67 -213 -207 130 36 19 -184 -211 -123 -2 299 208 -100 -215 -145 -36 70 -1 138 -18 34 -160 -20
2343 -20 -55 11 13 -9 -160 18 -54 78 193 -158 -119 -111 124 59 -24 320 -51 -1 -67 -98 43 324 -219 187 267
2368 267 -225 -91 2 238 149 91 60 104 -8 -178 308 140 -300 11 -7 -118 146 232 -54 -53 -81 181 -136
$$ packed form
2204a01J18p8J26P6j45k42L83J33k06j07J64j01p0J81n4J33m41J83K78k32J26
2225A24k9j9n8M0Kkk60J19L08k77l19N40k21K7j02J35O8m59M10N7K9Nk57L63j04
2250A20j93J88j20l2o5J99k41j51M31p4l01J05K84l92K50J61J31m02R6N3K6j65
2272i2J27k29J29J71k11l5J17J0O2J19k00L9j59J35O3J34l60J1J7R8K16kk78O6
2296e2R6o1K8l90L41L53k23J3P3k01J31j07J38p7J10k31oK14j24l1J05J69k23
2319D5r7j5j46OL37r4j7k03k7Q8J21L01r1l08j15P0J09J06p1J39j56N2j94J40
2343b0l5O6Kk2j51J78p2J32J15l51L9QK35o5q3L44l71N0o6l1J41K81n43M06Q0
2368B67m92J34R3K36q9n8l1M4j12j70M86j68m40L11j8j11K64Q6k86Jk8K62l17
$$ plain form
2391 -136 139 -131 34 -110 246 242 -112 -371 -112 10 74 28 59 54 217 -156 -149 -52 -37 205 -104 -165 -29 -16
2415 -16 -199 -80 -183 -121 282 26 144 -152 -182 -107 -86 88 -94 62 119 120 -20 -22 119 79 -179 62 156 -89
2439 -89 6 56 -195 116 -298 -305 -110 59 -47 -171 256 -37 58 72 -24 -78 -2 49 -120 191 -184 45 -89 -99
2463 -99 149 -155 58 29 268 154 28 -112 -52 -55 -11 247 -204 -200 -151 -42 28 -35 62 -177 29 173 57 309
2487 309 104 -227 328 -449 11 -181 55 176 -217 142 63 -256 266 -110 -107 -263 -190 266 25 317 -231
2508 -231 -37 -59 -99 35 -10 -156 -28 123 -305 178 65 -281 -166 229 13 -118 -96 -347 358 39 -177
2529 -177 -155 201 -71 69 -5 -158 115 -45 -65 -172 -202 0 307 -158 156 135 -122 -125 -69 -32 -74 117 38 250
2553 250 183 -116 16 29 -160 -247 -344 -182 -170 155 -44 28 -83 -46 -110 -17 -182 -56 -117 151 -157 85 77 -91
$$ packed form
2391a36K75k70J65j44L56ml54k59K59J22O4m6L1nJ63l73PR7J5K42l09o1J36J3
2415a6j83J19j03O2M03k56J18k96l0P5K1J74j82J56N7Jj40kJ41m0k58K41R4k45
2439h9R5N0k51L11m14pJ95J69j06j24M27k93R5J4r6n4P6N1j69L11l75K29j34j0
2463i9K48l04K13k9K39j14j26j40O0lM4K58m51MM9J09P0o3R7k39K06J44j16K52
2487C09k05l31N55p77M60j92K36J21l93L59p9l19N22l76Lj56P3M56k41K92n48
2508b31J94k2m0J34m5j46J28J51m28M83j13l46J15L95k16j31K2k51P05l19k16
2529a77K2L56k72J40p4j53K73j60k0j07l0K02L07m65L14k1k57lN6L7m2J91p9K12
2553B50o7k99J32J3j89q7r7J62J2L25j99P2j11L7o4R3j65J26o1K68l08K42qj68
$$ plain form
2577 -91 -26 -127 32 144 148 -81 94 117 114 -141 160 -152 183 -82 -246 208 169 8 152 -135 -21 -197 -114
2600 -114 161 40 146 47 76 74 271 -164 -99 -133 111 -135 116 -143 -117 143 177 -212 35 -30 -75 -48 156 -4
2624 -4 -8 197 -95 -359 -212 -95 6 -199 36 7 102 31 -17 252 58 247 57 -270 -21 69 -40 -37 -140 255
2648 255 147 90 -39 -39 60 -116 -94 -6 199 220 14 80 92 4 333 11 58 145 176 227 36 -159 -131 141 294
2673 294 122 179 -12 -140 90 -47 213 130 40 384 -143 90 41 -69 18 -2 -156 -108 89 -67 117 80 89
2696 89 -23 -68 41 279 -92 -178 157 -9 28 -45 -165 -233 31 0 -90 -167 -76 -24 -102 -51 -250 -69 8 35 322
2721 322 10 -95 -315 3 49 100 -49 -120 166 197 78 -71 -171 -304 -100 -133 -194 69 -26 -287 260 162 49
2744 49 -89 74 -185 -122 71 -250 79 99 39 23 24 173 -25 -6 -184 -41 179 247 337 63 -32 -124 115 0
$$ packed form
2577i1O5j01J59J12Mk29J75K3lk55L01l12L35k65j64M54l9j61J44k87J14j76Q3
2600a14K75j21J06r9K9kJ97m35O5l4K44k46K51k59K6K60L4l89K47o5m5K7K04j60
2624dmK05k92k64J47J17J01k05K35k9R5p1m8K69j94J89j90l27K49R0j09Lj03L95
2648B55j08n7j29%R9j76K2Q8K05K1k06O6J2q8L29l22M7Q7L1N1j91j95K8K72J53
2673B94j72N7j91j28K30j37K60q3r0L44n27K33m9j10Q7k0j54M8J97j56J84l7R
2696H9j12m5J09K38l71q6L35j66L7p3j20o8K64l1r0p7R1N2p8N1j99J81P7K7K87
2721C22l12j05k20L18M6N1j49p1K86L1j19j49j00j33K04l3o1K63r5k61N47r8j13
2744D9j38J63k59O3J93l21L29K0o0j6JJ49j98J9j78J43K20O8R0k74r5r2K39j15
$$ plain form
2768 0 5 37 23 218 179 79 -6 -16 -20 -232 -111 -328 118 147 93 -168 219 24 235 -34 -111 -293 177 98 -191
2793 -191 -109 -176 -44 -135 -23 -118 -152 101 10 431 -142 -136 73 62 143 178 -140 -139 -50 -144 -322 -131 -261 -6 -3 -24
2819 -24 -143 -259 -68 46 74 278 -69 7 179 -450 -33 176 102 35 -88 -80 17 296 97 73 -43 258 108
2842 108 64 -83 -185 17 304 165 -70 -257 -28 -147 -20 -18 -156 281 -73 23 -183 45 -123 -108 -30 -145
2864 -145 -38 48 -13 -35 -12 -216 310 63 -29 -409 49 18 -109 -183 211 83 47 -46 22 -54 -235 -323 250 56
2888 56 -35 -169 -48 -106 25 -13 -73 -15 41 135 -4 -49 -21 57 129 53 -130 218 64 -106 199 161 35 124 184
2913 184 325 -117 -220 5 11 78 -108 182 -435 -249 58 -29 10 98 19 283 -115 70 156 -3 26 -147 -279
2936 -279 -136 -259 -25 -64 45 -208 -50 187 -20 91 4 51 -178 -147 -39 141 -49 84 109 -127 21 1
$$ packed form
2768@NL2j4J95l9j00q5j0mk12J21k17M46K9n4k61L87j95K11k69p7j82M70p9k89
2793a91Q2o7J32r1J12r5l4K53r1M21n73OK09j1Q1L5l18JQ9r4j78J91j30K55Lk1
2819b4j19j16J91J14K8K04l47P6J72o29M17K09p4o7j23QR7K79j99k4j16L01j50
2842A08m4j47j02K02K87j39k35j87K29j19J27Kj38M37l54R6k06K28j68J5P8j15
2864a45J07Q6o1k2K3k04N26k47r2l80M58l1j27p4L94j28l6r3O8p6j81q8N73j94
2888E6r1j34J21n8J31l8o0N8N6R4j39m5K8P8P2p6j83L48j54j70L05l8j26Q9O0
2913A84J41m42j03K25OO7j86K90o17J86L07q7L9Q8p9K64l98J85Q6j59K9j73j32
2936b79J43j23K34l9J09k53J58K37k07J11q7M7k29L1J08J80j90J33K5k36J48k0
$$ plain form
2958 1 -7 61 -224 -140 185 112 -4 88 -40 11 -33 -7 -87 -105 -37 273 -6 -196 110 -51 -82 48 -57 42 99 42
2984 42 156 106 65 -422 -230 103 -259 108 -102 129 229 -410 -110 266 -52 -202 -48 -173 18 -142 23
3005 23 82 270 -83 -68 -247 -64 46 -150 -103 82 -69 199 -108 155 200 132 147 -120 -144 39 32 244 -80
3028 -80 -96 -321 -114 382 41 69 -95 34 135 86 -256 -55 -73 215 -201 -61 0 -65 103 -12 14 -138 83
3051 83 -47 -241 -94 -23 -113 -191 43 -6 65 -13 -167 -83 -26 -65 53 -145 -32 -144 22 -76 -53 139 152 49
3075 49 69 -193 -87 -231 186 23 -69 -270 -92 -8 -208 -11 50 22 212 -90 185 97 -131 -254 -270 6 84
3098 84 -204 46 101 -173 -80 103 307 -64 -6 -34 304 -17 -226 -213 -83 -141 168 -273 300 -20 -73 -221 166
3121 166 15 64 -209 -21 -114 -299 63 -226 -188 -232 147 -110 -196 63 -139 63 -107 145 100 178 -35 -165
$$ packed form
2958AqO8k85Q4L25p3j16R2j28N1m4K6q0j8O8L10k79j90L06j61l1J30j05R9N7n7
2984D2J14n0m1m87J92L33l62L67k10K31J00o39L00L76l18j50J54j25J91j60J65
3005B3N9J88l53J5j79J83J10j96M7J85j51K68l07K63M5o8J5k67k4J83pK12l24
3028h0j6k25K07M96l41K8j64J29J01m9l42K01j8K88m16J40O1o5J68j15K6j52K21
3051H3j30j94J47P1r0p8K34m9P1p8j54Q4N7l9J18j98J13j12J66r8K3J92J3j03
3075D9K0k62J06j44M17j63r2k01J78Q4k00J97O1k8J90l02K75q8k28j23j6K76P8
3098H4k88K50N5k74R3J83K04l71N8k8L38l21k09J3J30n8L09m41N73l20n3j48L87
3121A66j51M9k73J88r3j85L62k89L8m4L79k57q6K59k02K02j70K52m5P8k13j30
$$ plain form
3143 -165 108 16 -134 97 -55 -51 -133 293 144 -150 157 146 214 115 269 -82 274 -7 -49 128 232 -168 -77
3166 -77 -72 -102 0 29 -131 -70 31 20 -102 26 77 -65 -17 151 283 -196 -29 144 -100 53 57 12 -84 57
3190 57 -37 45 -35 -142 -154 -44 -22 151 -101 -231 -96 34 14 -213 -159 -59 -33 69 108 -83 36 58 -95 149
3214 149 92 83 80 75 -87 -147 220 -109 113 24 -134 -249 105 35 152 -145 155 14 -68 -224 -190 -90 -126 2
3238 2 -120 -53 -310 147 -73 -98 52 -41 -180 -66 -18 139 55 44 -65 66 163 -22 -204 -121 231 -119 50
3261 50 -148 -28 131 159 175 46 -207 -416 -218 79 -4 -58 6 -39 -84 66 221 21 -78 259 -242 112 113 -200
3285 -200 8 87 197 127 -43 64 203 213 -49 -129 204 -49 307 39 43 -2 101 211 129 148 54 4 -96 -49
3309 -49 94 208 -39 -37 -392 162 -262 -43 380 -96 125 -141 243 -46 -73 82 -74 37 -57 106 62 26
$$ packed form
3143a65K73r2j50K31j52Mq2M26j49k94L07j1O8r9J54l51L56k81m2J77J04m00R1
3166g7Nl0J02K9j60O1J01j1j22J28N1j42M8J68J32m79J67J73k44J53Mm5r6J41
3190E7r4Q2q0j07j2J10K2J73k52j30J35J30k0k27N4J00K6J02L9j91J19K2j53K44
3214A49n7rlnj62o0L67l29K22q9j58j15L54p0J17k97L00j41q2j56L4J00l6J28
3238Bj22O7k57M57k20k5J50r3j39J14M8J57q4j1j09J31R7j85j82Q3L52l50J69
3261E0j98J20J59K8J6j29k53k09J98K97q3n4O4m5m5J50J55k00r9L37n01L54Jl13
3285b00K08P9J10p0j70J07J39J0k62q0L33k53L56k68Mm5J03J10q2J9r4n0j00M7
3309d9J43J14k47Kl55N54m24K19M23m76K21k66L84k89k7J55j56J11r4J63m4l6
$$ plain form
3331 26 95 9 -1 -51 -33 233 -169 -225 -29 181 6 -4 -313 157 -340 -35 -37 137 -31 53 8 123 -23 151
3355 151 -40 223 141 2 -57 -158 130 254 -250 303 -85 54 -16 79 142 -28 -60 -28 -35 92 -7 -223 -116
3378 -116 -44 76 -124 200 -91 36 -6 -20 9 -328 -220 -427 100 9 101 -119 -105 227 36 -45 69 -34 -264
3401 -264 -5 -56 92 -30 48 162 97 66 -40 -106 21 183 -19 145 91 55 138 -171 -74 -249 178 8 28
3424 28 -125 -26 -168 42 -20 -340 -283 -143 -254 -116 -109 -172 65 184 -118 30 -211 -1 47 -118 156 75 132
3447 132 206 160 -91 0 -93 -38 65 -218 -363 -28 15 258 -52 -144 -84 92 10 48 -151 212 -266 -146 -36
3470 -36 -108 -317 -23 -94 -103 -179 -187 -8 79 -94 -107 -66 81 298 -26 26 -130 269 -220 350 -362 8 23 52 -196
3495 -196 -112 221 0 -73 132 -21 -183 7 -81 -6 -267 -74 -243 -9 98 35 59 -50 -53 -47 -10 -177 -27 10
$$ packed form
3331B6O9q6j0n0J8K66m02n6J96K10j75j0l09M70m97L05kJ74j68Q4m5J15j46J74
3355A51j91K63q2j39n9j01K88J24n04N53l88J39p0R5O3j70l2L2pJ27r9k16J07
3378a16P2J20k00L24k91J27m2j4K9l37J08k07N27r1R2k20J4L32j91q1J14j03k30
3401b64K59n1J48j22P8J14o5l1j06o6J27J62k02J64n4l6Q3l09R7j75M27j70K0
3424B8j53R9j42K10o2l20N7J40j11J38Po3K37J19l02J48k41K10M8j65K74q1N7
3447A32P4m6k51R1r3N5J03k83j45L35M3K43l10r2O0J76q2L8j99L63m78J20J10
3470c6p2k09K94p1rp6qJ79Q7j73j3M1J47K17l24N2j56L99m89N70p12L70J5K9k48
3495a96Q4L33k21p3K05j53j62J90q8P5k61J93j69K34J07o3K4j09lOL7j67J50L7
$$ plain form
3519 10 186 193 19 27 9 -193 112 227 -130 -111 -301 -89 47 221 -30 65 237 234 -190 19 122 -212 -44
3542 -44 -165 117 -90 131 154 -9 -25 -134 122 198 62 -100 -104 104 -150 -68 -41 168 62 12 -196 -178 25
3565 25 -203 118 -155 174 64 -250 443 34 -102 6 -17 134 -150 -55 193 72 125 119 -110 -105 -108 -185 73 -200
3589 -200 90 -3 -131 -32 -139 57 -65 35 -73 -330 -42 21 161 79 73 -157 -28 -82 -88 196 199 93 22 -107
3613 -107 -32 -17 101 -95 -55 62 258 -354 -169 -51 14 66 -265 200 -81 116 4 106 215 129 -2 -118
3635 -118 59 -6 166 127 -105 40 -26 -14 -176 42 47 -37 132 5 -310 159 -138 -149 251 48 124 110 -122
3658 -122 109 11 -153 201 -58 3 -60 262 -108 -62 -207 -81 -23 -68 85 21 334 -49 -177 -130 -61 53 18
3681 18 -42 4 78 -41 12 -237 29 -135 -159 -99 -160 136 -124 203 243 -19 -85 -93 53 208 -17 -131 25 -111
$$ packed form
3519A0J76Pj74Qj8k02L05J15l57J9j90K12J36J74k51R5J72lm24K09J03l34J68
3542d4j21K82k07K21K3j63j6j09K56P6j36j62mK08k54Q2K7K09j06n0k08J8K03
3565B5k28L21k73L29j10l14O93m09j36J08k3J51k84R5K48j21N3ok29Nlp7K58k73
3589b00K90r3j28R9j07J96j22J00j08k57K88O3J40q2ok30J29n4oK84Lj06p1j29
3613a07P5J5J18j96M0J17J96o12J85J18O5N2l31M65k81J97j12J02J09q6j31j16
3635a18J77o5J72l9k32J45o6J2j62K18Nq4J69j27l15M69k97j1M00k03P6j4k32
3658a22K31r8j64L54k59O1o3L22l70M6j45J26N8m5J53o4L13l83j28M7O9J14l5
3681A8o0M6P4j19N3k49K66j64k4O0o1K96k60L27M0k62o6qJ46J55k25j14J56j36
$$ plain form
3705 -111 -108 -47 -26 -4 -202 -1 266 239 157 -136 36 -83 -55 -237 32 175 -88 169 50 56 150 -220 -110 47
3729 47 -58 -228 -12 146 5 -27 27 -60 -4 -35 35 150 -145 68 147 -109 327 215 37 -7 27 56 -30 -84
3753 -84 -247 185 104 75 -65 -219 -174 78 194 153 4 80 3 83 47 -213 -102 -295 27 -276 20 308 -66
3776 -66 73 -111 -120 61 -120 -309 61 -326 52 278 -16 16 76 -69 175 152 -140 103 -16 -234 -160 50
3798 50 -10 -52 52 25 150 -42 -42 -285 -38 81 -91 10 42 113 -99 115 71 -88 231 -146 -82 -65 189 48
3822 48 116 20 147 46 -105 -229 -367 300 -67 -101 29 -122 -204 -56 -38 -120 122 -122 349 217 -320 -144
3844 -144 -289 53 -202 -12 106 41 -224 -188 24 -86 -14 1 -30 -17 -188 -73 -173 -63 -56 46 -192 81 46
3867 46 217 68 367 149 -150 122 -143 -26 -74 -56 11 -98 282 148 92 -73 -57 44 108 118 107 -63 -32
$$ packed form
3705a11LO1K1K2j98K01K67k7q2k93J72j19K8j82K69J43k63K57j19OR4l70J10J57
3729D7j05j70K16J58j41l2N4q7N6l1P0J15k95K13P9k56M36j12j78m4L4K9q6n4
3753h4j63M32q1k9j40j54M5K52J16m1j49P6p7Q0l6k60J11j93L22l03K96K88l74
3776f6J39j84rJ81j81j89L70l87L78K26k94L2O0j45K44k3k92K43j19k18P4K10
3798E0o0m2J04k7J25j92%k43K47J19j72J01L2P1k12K14m4j59L19l77O4J7K54j41
3822D8O8r6J27j01j51j24j38O67l67l4J30j51q2J48J8q2K42k44M71j32n37J76
3844a44j45L42k55J90J18o5k65L6K12j10P2J5l1J3j71J15j00J10PJ02k38K73l5
3867D6J71j49K99k18k99K72k65J17m8J8O7j09L80j34n6j65J6J01O4J0j1j70L1
$$ plain form
3890 -32 244 72 254 77 -70 -53 -131 -49 -21 126 149 81 111 -96 -159 -205 107 56 -20 72 67 -133 -121 102 11 199
3916 199 17 -78 -46 68 47 54 -230 -84 12 348 137 -33 -111 -143 -60 -21 35 131 -145 14 -247 218 308 105
3940 105 -99 -163 -268 -235 138 -178 -139 -7 -24 -218 -139 -189 12 -345 185 305 123 70 -1 66 69 -26 -327 -55
3964 -55 -119 -11 -62 -112 -4 44 -16 -106 221 -177 67 -64 -11 -131 -194 -264 34 -53 -281 -315 -127 167 -11 141
3988 141 28 119 -522 -85 133 17 -167 -10 -59 210 59 -33 50 -192 -10 252 -117 63 -183 -184 252 47
4010 47 -5 222 -50 -90 -64 261 -157 77 34 -103 -84 324 -14 -7 -141 31 64 274 118 -167 -132 36 -11 97
4034 97 -245 42 -166 95 163 -22 104 190 208 -27 20 -75 -137 -199 397 -194 171 219 15 27 -2 271 -56 102
4058 102 260 53 -95 -46 -35 -265 -97 -185 -133 -41 -19 -55 -120 -133 231 -17 84 18 -9 82 68 283 -52 94
$$ packed form
3890c2K76j72J82j77j47J7p8Q2K8J47K3o8L0k07o3m6L12n1p6R2nk00J2K23r1J88
3916A99j82r5L2J14k1Pk84J46R6L36k11j70p8l2Q3L9N6R6k76J59k61M65R0k03
3940A05k04o4j05L3L73l16L9J32j7j94P9n0K01l57N30J20j82n3p1O7Lr5l01K72
3964e5o4J08n1n0J08M8o0r0L27l98K44j31N3j20o3p0K98q7k28l4J88K94j78J52
3988A41j13R1o41M37K18j16j84J57m9K69j51r2Q3k42J82K62l69J80k46jM36k05
4010D7n2K27k72m0K6L25m18K34m3j37J9M08l38Pj34J72L3K10j56k85L5J68m7J08
4034I7l42K87k08K61O8j85J26Q6J8k35M7r5o2o2N96n91L65M8k04J2k9K73l27J58
4058A02J58k07j48M9J1k30J68q8N2R2K2l6o5j3L64k48J01o6k7R1j4K15l35J46
$$ plain form
4082 94 16 -88 109 189 -118 0 -315 -26 -30 -262 55 -8 -130 -51 255 -93 -104 -131 28 -142 188 309 -364
4105 -364 -133 -122 -68 -157 123 -20 22 122 -166 -27 19 -26 -96 -179 -110 -35 56 -10 84 80 16 333 59 -34 -216 80
4131 80 109 -139 41 89 -25 176 -77 -3 -181 187 150 -280 -144 216 62 55 44 77 146 44 -242 79 90 -2
4155 -2 -47 13 -122 73 -351 -164 104 -264 60 49 139 -150 -135 116 104 -203 242 79 220 -74 -159 -84 155
4178 155 -153 -186 -7 -308 62 -175 84 -308 8 -34 -155 61 -297 18 18 32 348 -116 219 64 -75 -254
4200 -254 26 98 84 -27 -39 -205 35 -150 -52 156 99 -239 24 -20 63 -138 -407 249 -13 -147 -82 -140 156
4223 156 -51 -39 20 -435 -76 -179 25 78 -150 112 128 84 172 -115 124 -146 -61 179 118 -4 -114 -254 -106
4246 -106 -182 -82 146 4 -2 -259 -91 -86 85 223 -61 243 -218 9 105 119 6 -106 41 -250 10 367
$$ packed form
4082I4p8j04J97Q0l07J18l15K89mk32L17o3j22P9L06l48j1k7J59j70L30J21o73
4105c64K31J1N4q9K80j43M2J00k88J39M6m5p0q3O9P5R1o6R4mo4L17k74r3j82K96
4131H0K9k48J80M8j14K01k53P4j78L68l7m30J36L60j54pj1L3O9j02k86L21J1r2
4155bm5O0j35J95m24J87K68l68L24j1R0k89J5K51j2l07M45j63J41k94q5P5K39
4178A55l08l3J79l01L70k37K59l92L16m2j21K16l58L15%J4L16m64L35j55j39j79
4200b54K80P2j4j11j2j66K40j85R8K08n7l38K63m4Q3k01k69O56k62j34O5n8K96
4223A56k07J2N9m55L59j03K04N3k28K62J6m4Q8k87K39k70Q5K40o1j22j10j40J48
4246a06p6J00K28j42ok57J68NJ71J38k84L04m61K27R6J4j13j12J47k91K60L57
$$ plain form
4268 367 10 17 18 -198 -225 -126 343 -228 32 -53 -127 -140 59 108 72 -357 255 -96 -11 55 267 -10 -205 -93
4292 -93 -295 378 -51 -104 11 -3 75 142 52 105 -93 7 24 -154 87 -138 55 186 -168 65 -58 344 -281
4315 -281 -42 -53 154 -130 180 23 -88 -255 -97 168 93 132 174 -34 -74 110 226 106 150 -42 -139 131
4337 131 40 -49 87 106 56 3 -218 -13 -59 -207 44 152 -248 -159 -66 -104 -189 -60 -178 85 23 -15 147 348
4361 348 17 -246 -25 99 10 -124 215 170 -40 -42 92 337 -173 -22 42 33 35 207 -54 14 249 15 -76 159
4385 159 73 -138 -76 21 -165 274 -75 75 -97 18 29 81 -130 -274 -1 -281 -168 -173 239 112 63 51 -191
4408 -191 -148 -76 -108 -59 105 158 -130 116 152 190 15 -75 -115 135 180 -51 4 11 140 131 -108 60 -244 459 -69
4433 -69 -118 91 -5 2 -184 -156 34 89 93 -82 -277 121 143 119 -112 136 124 45 31 159 366 -54 -66 -411 -251
$$ packed form
4268C67l57PJk16k7R9M69n71K60q5p4j3J99M9l6m29O12l51Q5O6K12k77j95J12
4292i3k02O73m29n3J15j4P8O7r0N3j98J00J7j78K41k25J93J31l54K33j23M02o25
4315b81K39j1K07k84L10j57j11j67J58K65p5L9M2k08m0J84J16j20M4j92r7K70
4337A31r1q9J36J9n0n3k21K05m6j48K51J08m00Q9R3l8q5J29j18K63o2l8J62K01
4361C48l31k63K21J24q9j34L39m5k10kJ34K45n10J51O4rKJ72k61O8K35k34r1K35
4385A59q6k11O2R7j86M39l49J50j72J15J1N2k11j44K73k80J13nM12j27m9j2k42
4408a91M3P2l2M9J64N3k88K46L6L8j75r0m0K50M5k31N5PJ29rk39J68l04P03n28
4433f9m9K09r6Pj86K8J90N5Mj75j95L98K2k4k31K48j2p9j4J28K07m20j2l45J60
$$ plain form
4458 -251 33 34 -106 41 76 50 -81 48 -313 10 113 88 10 183 6 -193 19 -233 9 -154 -42 -214
4480 -214 -51 116 109 39 -250 -170 279 114 42 -23 108 -173 199 161 92 -40 -61 -127 122 68 388 -86 -133 -90
4504 -90 -21 142 -73 120 239 179 -397 -133 -104 -35 -17 21 154 -43 78 -63 -12 9 -17 -85 294 -29 -94 73
4528 73 -334 90 190 179 1 289 156 -78 259 -107 34 -144 -164 -84 90 -118 -90 -137 3 60 -146 -184 37
4551 37 -349 -285 -76 53 -155 -261 142 217 -33 -48 -71 -236 -9 -261 73 -78 20 -104 -39 -88 -75 68 -42
4574 -42 42 -52 274 351 -180 94 27 318 -120 -104 -49 -16 -139 241 52 272 -79 -163 -75 72 -66 -272 -54
4597 -54 -100 81 150 55 -97 228 -24 228 -235 86 -279 -72 -159 149 -215 -119 158 178 -71 -58 -99 -13 1 -255
4621 -255 -15 58 -46 19 73 -15 -4 -155 -186 326 -155 186 163 -189 -70 -183 -52 117 86 211 130 37 -132
$$ packed form
4458b51K84Jj40J47L5k6j31J29l61L23J03k5p8J73j77j99K12k52K42j63J12j72
4480b14J63J67pp0k89Q0M49j65p2o5J31k81L72l8o9j32k1o6K49n4L20m74m7M3
4504i0O9J63k15J93J19o0n76K64K9O9J8L8J33j97J21j41N1K1k6o8L79l23o5J67
4528G3m07M24J00j1j78K88j33k34L37l66J41j78k0Q0J74k08K8m7J40N7k06l8K21
4551C7l86O4K09J29k08j06M03P5k50j5k3j65K27k52L34j51R8j24O5m9J3J43j10
4574d2Q4r4L26P7n31K74o7K91m38J6N5L3j23L80j89K20l51q4Q8J47j38k06K18
4597e4m6J81O9r5j52L25k52K52m63L21l65K07q7L08l64R6K77K0k49J3m1Q6J4k56
4621b55K40P3j04O5N4q8J1j51l1N12m81L41k3l52J19j13J31J69l1J25q1r3j69
$$ plain form
4644 -132 149 168 58 -54 95 -299 222 -14 -219 27 164 5 125 -95 113 28 6 -121 -63 -1 137 -62
4666 -62 -111 7 98 -35 16 -196 -141 51 139 -80 30 231 76 -82 85 -163 -126 95 -185 -49 262 53
4688 53 -199 110 22 14 92 -163 99 -51 188 -117 -163 128 -290 -131 -445 130 267 102 -55 250 41 -259
4710 -259 -228 -170 -51 198 -110 -102 129 2 39 332 -42 -33 54 21 294 244 271 -26 52 -130 50 -214 -116 -139 81
4735 81 203 183 111 89 296 4 101 -10 -174 -38 91 236 114 229 184 -25 117 329 71 95 39 79 -135
4758 -135 -98 133 75 -201 187 129 23 -185 -124 290 241 36 241 -168 -37 -71 0 73 -89 84 -71 142 0
4781 0 -103 15 -20 21 -96 127 100 -298 310 74 36 -154 -91 200 -137 156 -78 168 -95 -111 -178 125 311
4804 311 -8 -187 -89 -101 109 -26 54 71 -76 -4 -53 141 -58 17 77 -42 -72 -69 1 49 -188 128 -278 39
$$ packed form
4644a32K81J9j10j12J49l94N21k36k05K46J37j59J20k20K08q5k2j27N8O2J38j99
4666f2m9J18R1j33N1k12N5J92Q8k19J10K01j55j58J67k48L7K21k80J36L11k09
4688E3k52L09q8qP8k55K62j50K39l05m6K91m18J59l14N75J37j65j57L05k09l00
4710b59L1N8J19K49l08QK31j27L7K93l74RQ7l3K73n0K7k97P8j82J80k64R8k3K20
4735H1J22k0p2k2K07k92R7j11j64J36J29J45j22J15m5k09J42K12k58K4n6M0k14
4758a35L7K31n8k76L88n8j06k08O1M14m9k05K05m09J31l4P1P3j62J73j55K13j42
4781@j03J18l5M1j17K23k7l98O08k36l8j90O3K91l37K93k34K46k63j6o7L03J86
4804C11l19j79R8j2K10j35Q0J7j47P2m9J94j99P5O0j19l0LP0M8k37L16m06L17
$$ plain form
4828 39 -212 246 6 -174 92 -124 38 -68 35 179 295 -62 -21 -66 54 106 -160 -63 338 63 57 132 108
4851 108 271 -67 51 17 70 185 -259 321 -237 -6 43 171 227 71 172 -92 80 158 230 -45 -47 -2 159
4874 159 17 -35 74 136 72 -52 35 100 51 8 279 -48 198 32 39 57 -75 140 -165 -25 -43 -316 -97 42
4898 42 113 75 185 97 33 -195 198 -12 109 -141 151 228 -3 -70 63 -152 -124 -59 -76 172 169 98 -237 228
4922 228 -268 -171 -82 62 -124 -51 -329 59 -80 -48 -22 -58 68 -132 71 141 167 36 126 47 243 -126 1
4945 1 -40 81 -25 8 341 283 132 -41 31 287 244 -101 -23 4 -294 21 14 134 -126 -50 -18 34 31 -103 101
4970 101 387 -38 76 -120 -101 -74 -87 77 -115 -64 -105 -239 -50 -1 82 -26 184 263 -168 113 -71 -25 -133
4993 -133 -12 -142 -247 23 40 24 -50 -10 63 -18 -21 75 325 222 -39 -273 -23 -102 108 -41 -97 143 220 -339
$$ packed form
4828C9k51M58k40j80K66k16J62j06J03J44J16l57M1m5J20N2k66R7M01k75oP5k4
4851A08J63l38J18l4N3J15m44N80n58K31M9J28N6j56J01k64J72P8P2k75kM5J61
4874A59j42n2J09O2o4j24Q7O5m9m3K71l27K46j66PJ8j32K15l05J40j8k73K19J39
4898D2P1l8J10q8o4k28L93k10J21k50K92P7k31o7J33k15K8O5j7K48lp1l35M65
4922B28m96R7Q9J44j86P3k78L88j39L2K6l6J26k00K03P0K6j31R0p9J96l69J27
4945Am1J21j06L3L33n8j51j73P2K56m3l45P8K7k98L15pJ20k60P6L2N2lj34K04
4970A01K86m25J14j96J9K7j3J64j92N1m1j34J89M9Q3j08K10P9m31K81j84M6j08
4993a33J21j30j05K70J7j6p4M0P3q1lR6K50j03k61k34K50p9K10j49n6K40P7n59
$$ plain form
5017 -339 -37 225 175 227 -13 86 198 172 -113 82 -158 -124 -29 2 182 -117 -110 -31 -136 30 -32 -118 12 26
5041 26 105 60 25 72 -29 -63 6 -279 45 113 41 31 -117 109 -165 -211 51 -157 201 97 33 85 12 90 59
5066 59 96 117 88 -33 2 204 -95 116 -101 134 67 194 -14 -94 116 62 68 -49 45 106 153 -80 106 -178
5090 -178 208 -155 -106 285 -98 -6 -245 8 -114 115 -44 38 33 -88 -162 -82 279 213 11 11 -199 57 -31 -243
5114 -243 129 -52 127 141 79 227 78 32 -48 65 -43 -57 -100 -322 -69 -28 215 -40 -14 -150 -159 -214 -108 42
5138 42 -150 -76 -35 -177 298 73 -13 0 -23 -12 -210 165 -34 -48 -68 -37 -125 -12 -101 14 98 -153 99 -157
5162 -157 49 150 -57 -191 -104 49 -65 -47 -109 -24 -14 -169 -48 254 -92 44 -100 187 -59 249 92 45
5184 45 98 145 168 49 181 125 69 68 10 158 54 -158 59 224 375 37 51 -41 279 -102 42 141 -66 231
$$ packed form
5017c39L02K62n0N2k40R9J12k6k85J95k40L4R5L1J80k99PP9j05J66o2q6J30J4
5041B6P9m5l5M7j01l4O9k85L24O8p2j0j48K26k74m6K62k08L58j04o4N2p3P8l1
5066E9L7K1k9j21L5K02k99K11k17K35o7J27k08q0K10n4Oj17R4O1M7k33J86k84
5090a78L86l63M9L91l83R2k39K53j22K29j59Q2nj21p4Q0L61o6k02%k10K56q8k12
5114b43L72j81J79J4o2J48j49m6q0J13j08j4m3k22K53M1K43k55K6j36rn5J06J50
5138D2j92P4M1j42M75k25q6J3k3J1j98L75j99j4k0L1q8J13q9J15Q4k51K52k56
5162a57K06J01k07j34Q7J53j14J8o2Q5J0j55J21L02l46J36j44K87k46L08j57m7
5184D5N3M7K3j19J32n6n6jn8J48j04k12K17J65J51l38J4r2L20l81J44R9k07K97
$$ plain form
5208 231 -69 -13 91 -31 -106 33 -80 227 12 -407 149 9 44 -53 -50 -9 -136 -138 102 -57 3 -119 -170 -198
5232 -198 -88 125 147 17 105 178 301 -28 -107 34 10 -100 277 -51 -107 -4 196 -71 -141 13 328 148
5254 148 87 109 7 -94 -48 -204 -115 -61 -141 92 161 -14 -11 -13 43 13 -312 141 -132 165 102 56 -117 139 -29
5279 -29 241 -68 -244 126 134 -262 -230 -36 132 -282 -58 -56 11 211 -141 195 175 67 -332 52 136 43 -12 100
5303 100 -54 209 -176 -245 16 -7 115 -43 -170 236 -156 -114 -286 -192 -52 296 -163 -73 -28 -3 127 -78
5325 -78 165 -48 -101 -157 16 78 8 -50 -225 -40 156 138 -48 99 -77 48 161 169 -68 -1 12 -114 118 -154
5349 -154 203 -309 86 109 -169 33 -60 -215 -53 260 34 -120 2 -11 -27 139 -48 72 55 -57 111 -21
5371 -21 -12 -155 224 -9 -40 -103 97 8 302 226 56 158 -48 -29 156 84 -91 2 -53 -51 119 120 67 -262 217
$$ packed form
5208B31l00N6J04j22p5J39j13L07k15m19N56j40L5r7LM1j27kK40j59O0j22n1k8
5232a98J10K13K2j30Q8P3J23l29p9J41k4j10L77l28n6J03K00k67p0J54L15j80
5254A48o1K2j02j01M6j56Q9N4q0K33O9j75LkN6l0l25M53k73K97o3m6j73K56j68
5279b9K70l09j76L70Ql96L2J94J68m14K24KO7K00l52L36k0j08l99L84Q4r3n5J12
5303A00j54K63l85o9K61k3J22j58j27M06l92M2j72R4J40L48m59R0M5K5J30k05
5325g8K43k13n3n6J73O2p0n8j75J85J96j8j86J47j76J25J13Qk37O7J3j26K32k72
5349a54L57n12L95K3k78K02r3j55J62L13k26j54J22j3j6J66j87J20j7j12J68j32
5371b1Rj43L79k33l1o3K00q9K94p6j70J02k06J9J85p2j75R3n5KJ70Jn3l29M79
$$ plain form
5396 217 79 179 50 -78 -383 -108 213 -95 -153 -247 69 268 -75 251 -21 72 -8 58 131 -50 -28 -181
5418 -181 -30 14 133 185 49 -134 -59 -64 -30 -68 -275 -100 -84 -148 -159 149 -200 -92 124 -160 9 -397 -27
5441 -27 -19 -78 -36 -94 46 -50 9 29 226 1 99 16 231 73 -126 140 -27 213 -257 -55 0 190 -8 109
5465 109 292 -96 -85 -84 2 95 -227 50 192 188 -112 166 210 -79 85 -150 -43 36 296 248 -138 180 86 -136
5489 -136 -121 63 -42 6 120 -124 -177 8 -192 -117 186 -86 307 63 -14 70 -68 173 72 -121 -149 53
5511 53 127 123 67 91 142 -186 18 -287 -291 70 -91 -147 -126 99 -251 -74 179 -132 -75 -3 255 216 -174 40 -149
5536 -149 -292 -162 28 41 183 181 -115 10 13 71 -173 63 -110 5 137 -121 -197 38 -325 -39 272 -304
5558 -304 -45 -48 -123 113 -162 -167 -125 150 -204 -251 -21 -106 47 -103 145 -102 7 -41 -28 -69 72 -116 -112 186
$$ packed form
5396B17j38J00j29j28l05K75L21l08n8r4L16J99l43L26k72R3q0O6P3j81K2j53
5418a81J51M4J19N2j36j83P5nL4l8k07J75J6o4j1L08l49J08K16k84J69m06L70
5441b7Qn9M2n8J40r6N9K0J97k25R8q3K15j58j99K66j67K40m70K02N5J90j98J17
5465A09J83l88J1JQ6R3l22K77J42ml00K78M4k89J64k35J07P9K60m8l86L18r4k22
5489a36J5J84j05M8J14k44n3J85k00P5L03k72L93k44p7Q4j38K41j01j93k8K02
5511E3P4mn6K4N1l28K04l05mL61j61n6K1K25l50J77K53l11N7P2K58l9l90K14j89
5536a49j43J30J90J3J42kk96J25LN8k44K36j73J15J32k58p6K35l63K86L11n76
5558c04K59lp5K36k75nM2K75l54m7K30q5J53j50K48k47J09m8J3m1J41j88MK98
$$ plain form
5582 186 -137 82 34 230 179 -15 268 -21 211 -191 -164 -183 -9 -45 -48 5 125 146 -369 -54 77 -163 111
5605 111 -186 183 0 -173 144 88 -105 143 255 -3 103 11 -12 58 238 -12 314 -88 -180 44 -16 -82
5627 -82 61 25 111 -24 -67 63 -30 189 14 28 -47 72 45 106 -11 -1 -111 -173 -7 -234 93 -47 164 -243
5651 -243 -154 114 22 -20 28 -246 -70 -174 -38 90 -80 -98 408 -109 64 16 51 -124 69 212 57 183
5673 183 -56 39 -255 -4 -126 -26 -192 -119 65 7 76 -117 -60 91 -248 190 -55 217 -158 -4 -31 139
5695 139 101 125 245 -34 266 157 -1 64 -44 113 -5 50 -50 153 91 2 -95 -50 55 -59 -106 103 -20
5718 -20 110 -92 162 -116 243 96 -220 49 -372 -110 -119 -63 197 -32 -204 172 84 -224 229 -55 -244 171
5740 171 -82 -23 251 82 17 -30 -51 140 99 137 59 -236 -51 20 -19 -19 69 170 -173 -68 95 -4 80 67 146
$$ packed form
5582A86l23K19m8J96n1j94K83k89K32m02K7j9J74l6lN3J20K1n15L15J31k40K74
5605A11k97L69j83j73L17n6j93K48J12k58J06r2k3P0J80k50L26m02r2K24o0o6
5627h2J43l6Q6j35m3J30r3K19j75J4p5J19k7O1j17J0j10o2J66k27L27j40K11m07
5651b43Q9K68r2m2M8k74J76j04J36J28j70j8N06n17J73m8L5j75J93J43j55J26
5673A83k39R5k94K51j22J00j66P3J84n8O9j93N7J51l39M38k45K72l75J54k7J70
5695A39l8K4J20k79L00j09j58O5j08J57j18N5j00K03o2q9r7M5J05j14m7K09j23
5718b0J30k02K54k78L59j47l16K69m21K62rN6K60k29j72L76q8l08M53k84j89M15
5740A71k53N9K74j69o5m7k1J91m1L8p8k95J85P1l9%Q8J01l43J05J63r9Q4j3P9
$$ plain form
5765 146 -2 -318 -151 36 -65 114 -219 -143 -208 -44 -231 212 0 210 -110 -162 -90 86 109 -312 -150 78
5787 78 -185 -157 186 73 389 -20 -265 115 108 -65 -206 280 -195 -284 -132 -93 -6 150 74 -72 38 -61 -65 206
5811 206 -91 -94 91 208 -145 151 -126 -4 -17 -19 -125 -146 -466 -284 -172 73 -17 182 120 -29 61 -44 -36 49
5835 49 -265 63 -46 -46 20 107 41 266 82 112 113 -203 198 83 -118 -126 56 -73 133 117 146 -168 -251 -267 39
5860 39 116 -311 -56 -116 56 77 -263 55 0 -15 -90 115 373 79 54 -34 165 64 -146 42 -90 -49 7 25
5884 25 124 -52 237 194 -120 -55 47 5 -7 -155 7 -162 -128 -47 -94 -76 -33 96 45 63 -78 -22 -11 -234 126
5909 126 123 -27 53 241 -103 -66 -23 266 32 -80 6 19 8 -6 -49 81 -58 99 22 -56 -138 -70 -94 71 -93
5934 -93 186 81 252 -17 -104 -3 231 58 -329 -84 -47 0 13 5 -56 176 -210 50 171 -99 9 181 -71
$$ packed form
5765A46j48l16J67J87j01J79l33P6o5J64j87M43k12K10l20n2P2J76K3m21J62K28
5787G8k63K8L43j13L16m09k45L80pj73j41M86m75q9J52L9Q7J56p6j46J10r9mK71
5811B06k97lJ85J17l53K96k77J22j3kj06k1l20J82J12K45r0J99o2j49R0j05QQ5
5835D9l14L28j09%O6Q7o6K25j84L0Jl16M01j15k01qJ82j29K06j6K9l14q3j6L06
5860C9P7m27K55o0J72K1l40L18n5j5p5K05K58k94k5q8J99j01k10J88j32M1N6J8
5884B5R9j76K89m3l14O5J02m2j2j48J62j69L4Q1m7J8M3J29n1J8j41N6J1k23L60
5909A26lj50Q0J88l44L7M3K89k34j12Q6J3j1j4m3J30j39J57p7p8q2O8k4J65j64
5934i3K79j05J71k69q7J01K34j73l87K45L7M7J3qo1K32l86K60J21k70J08J72k52
$$ plain form
5957 -71 19 11 52 118 -40 -77 -115 357 -97 5 56 163 219 -47 -236 119 -198 60 -36 -117 228 -101 99 210
5981 210 -358 -96 22 -218 -26 150 82 -151 218 -2 -266 -136 -63 -147 -42 29 27 -50 -69 -14 121 26 -33 75
6005 75 165 -57 -308 -21 -222 -81 230 -55 312 -319 30 -129 -60 -84 112 96 -60 -160 37 240 83 -199
6027 -199 81 -120 66 16 36 -86 -177 195 22 45 233 112 192 -92 53 86 -9 -48 -2 -9 -264 65 160 78
6051 78 -205 69 -24 42 164 -224 149 -8 45 6 100 -37 -19 180 33 67 -102 84 -13 -56 -179 -11 -257
6074 -257 -110 -91 188 -15 -101 -175 502 19 45 47 -36 -120 -33 -63 -143 -121 0 -2 221 26 225 188 62 -160 75
6099 75 -29 26 5 107 -18 146 -155 -95 185 -167 -4 -167 -1 123 -129 55 -3 67 -194 -279 -73 -264
6121 -264 72 -182 -176 -292 25 124 91 221 22 -11 -157 140 81 -56 173 193 58 -4 47 -73 -26 133 228 22
$$ packed form
5957g1R0qM1O6j58l7l8M72m54J02N1J07N6k66j89L55l17K58r6q1L45l29K00J11
5981B10n68K62J18k40J92J76o8k33L69k20k64J30P3q4J05P1kp7j9N5J35r5n9J08
6005G5R0k22k51K87k01J41L11k85L67o31L49j59O9k4J96j6j56j00J97K03j57k82
6027a99K80k01J86n0K0j22r1L72j73K3J88j21Q0k84J45L3r5l9M6pk55L29R5q2
6051G8k83K74r3O6J22l88L73j57N3l9R4j37J8J99j47L4j69J86r7m3j23J68k46
6074b57J47J9K79k03q6p4O77m83K6Kq3q4Q7l0q0K2J21kK23j95J99l7j26k22K35
6099G5j04N5k1J02j25J64l01O0K80l52J63j63J66J24k52J84n8P0k61q5K06j91
6121b64L36k54Oj16L17R9l3J30j99l3j46K97n9j37K29K0j35o2N1j20M7J59R5k06
$$ plain form
6145 22 144 137 94 -44 97 -130 -31 89 -230 275 18 97 0 -69 15 -56 -123 -35 -52 -91 65 -61 -69 -109 57 -80
6171 -80 -163 155 49 36 111 -103 -66 155 -46 -59 103 -40 1 239 18 -36 133 150 39 133 119 86 116 -21
6195 -21 -19 -51 130 161 -104 -132 28 -250 -208 105 61 -119 191 -25 -276 227 120 -35 35 -137 4 -12 196
6218 196 373 291 -42 -39 136 4 38 83 44 117 -151 -69 -234 13 114 29 -76 -47 -308 -251 46 254 -325 -40
6242 -40 2 -69 71 -26 89 110 160 91 63 37 -214 -211 -14 182 140 187 -117 -78 -178 46 60 181 -245 139 39
6267 39 232 -153 22 101 180 117 -409 41 -258 -235 81 144 1 -281 21 148 65 -49 34 -130 -78 128 -29
6290 -29 -110 230 27 6 6 45 92 -83 -63 -39 108 -267 -158 -159 -93 -32 394 -153 -4 77 28 -62 -259 122 126 -9
6316 -9 93 0 86 49 -332 -86 -14 -128 -57 163 -39 -83 141 -274 410 309 48 -25 99 93 32 -102 -37 185
$$ packed form
6145B2J22pm3j38J41k27R9J20l19N05k57P9r7o9Q4p1o7Q8j7l9J56j26qm0J66j37
6171h0q3L18j06j3P5k14L7K21k01j3J62j43M1K38k21n4J69J7j11R4j4l3L0j37
6195b1Kl2J81L1k65k8J60k78M2L13m4j80L10k16k51N03j07j55P0j72J41j6K08
6218A96J77q2l33LJ75j32L4M5l9P3k68Q2j65K47J01q5j05K9k61N7K97K08n79K85
6242d0M2p1J40r7J15K1N0o9k8k6k51LJ97J96m2M7l04L9j00K24J4J21m26L84j00
6267C9J93l85J75P9P9o3n26M50k99K3L16O3j43k82L02J27q3j14Q3j64N2K06j57
6290b9q1L40k03k1%L9M7j75K0K4J47l75J09jO6O1M26n47J49Q1m9r0j97L81Mj35
6316iJ02r3Q6l7l81K46P2j14P1K20k02m4K24m15O84j01k61p3J24oo1j34O5K22
$$ plain form
6340 185 51 9 -94 -187 203 -49 232 135 -232 104 -11 214 122 30 -49 -129 -67 138 70 180 97 19 55 11
6364 11 -166 -46 320 129 -135 181 -58 -208 -133 -99 6 188 -124 -207 -131 65 -301 -8 182 -7 -172 25
6386 25 20 51 57 150 92 -9 -105 -165 35 64 -159 -19 -72 80 252 -115 28 164 -433 -204 -204 -209 -132 -443 -14 -35
6412 -35 -116 116 -63 58 7 222 -67 178 -42 -129 -47 29 128 -46 33 -78 -67 40 348 12 140 31 95
6435 95 -116 166 131 135 -26 223 106 179 112 100 -370 -140 32 81 -4 -74 -172 244 -332 -23 198 -166 -167 -215 -2
6460 -2 -94 50 -429 -131 118 65 112 -231 253 25 -130 46 -8 135 -135 -33 109 -130 -272 179 -27 -12
6482 -12 148 157 -37 51 125 -17 75 53 24 106 -206 -280 -380 -8 107 -35 41 12 -243 -29 96 -66 137 124
6506 124 -107 50 277 -7 119 287 104 18 52 54 -216 -97 65 224 22 136 -261 77 -118 -9 76 -28
$$ packed form
6340A85j34m2j03r3L90k52K81r7l67L36j15K25r2r2p9q0O2K05o8J10q3p8L6m4
6364A1j77J20L66j91k64L16k39j50P5L4J05J82l12q3P6J96l66K93J90j89j65J97
6386B5nL1OR3n8j01r6o0K00K9k23J40n3J52J72l67J43J36n97K29%nP7l11M29k1
6412c5q1K32j79J21n1K15k89K45k20q7Q2P6R9j74P9j11J1J07L08l36J28j09O4
6435I5k11K82l5Mj61K49j17P3o7j2m70K30J72M9q5p0r8M16n76L09K21l64jm8K13
6460br2J44m79K98K49n3M7l43M84k28j55J76n4J43k70J02J42k39j42M51k06J5
6482a2J60Rj94Q8P4j42R2k2k9Q2l12p4j00L72J15j42P6k9k55K14J25j62K03j3
6506A24k31J57K27k84J26J68j83q6L4Kk70J19J62J59k02J14l97L38j95J09Q5j04
$$ plain form
6528 -28 341 -193 58 -156 85 -290 99 -218 -206 -21 -75 -170 -224 -8 132 238 -272 167 18 88 -256 19
6550 19 67 79 -40 -221 -148 26 -159 82 27 -78 58 108 25 99 248 -212 60 -150 173 -242 136 6 49
6573 49 -19 -45 -77 -38 -26 -71 172 -65 -22 39 -78 -6 -276 55 159 -83 235 -53 305 4 97 5 -52 -80 332
6598 332 118 93 360 16 -46 180 8 -105 158 23 261 -204 -134 -264 -15 -64 119 -199 -48 -46 -34 100
6620 100 -129 104 -139 -198 -172 -171 -16 -56 -185 -74 -189 25 57 -7 -151 -82 -60 131 -165 -2 -278 -76 -274
6643 -274 -146 201 77 248 -168 11 157 63 -113 -99 274 69 150 92 28 45 -216 83 -317 7 -154 -129
6665 -129 -12 -124 -58 -3 296 -21 -9 -18 281 -241 -64 97 74 75 76 54 -14 29 261 -221 319 -112 -65 163 60
6690 60 -82 -187 112 -61 -29 -116 -64 -82 -112 22 116 82 -65 50 1 30 -80 -72 -32 147 170 -307 -77 -111 21
$$ packed form
6528b8L69n34K51k14K41l75L89l17J2J85n4r5n4K16J40J06n10M39j49P0l44K75
6550A9M8J2j19j81P3J74j85K41n5j05J36N0q3P4J49m60K72k10L23m15L78j30M3
6573D9o8k6l2L9J2m5K43k37M3O1j17P2k70L31J04k42L18k88L58l01R3r2n7k8M12
6598C32k14k5K67l44o2K26j72j13K63j35K38m65P0j30K49m9J83l18J51KJ2J34
6620A00k29K33k43n9K6JJ55m0j29J11j15K14L2o4j44O9K2J91k96J63k76K02j98
6643b74J28L47j24J71m16J79J46r4j76J4L73k05Q1n8o4J7k61K99m00L24j61K5
6665a29J17j12O6N5K99l17J2rK99n22J77J61k3JJk2o8M3K32m82N40m31M7K28j03
6690F0j42j05K99j73L2q7N2j8l0J34R4l4j47J15m9K9j10QM0J79K3m77K30l4J32
$$ plain form
6715 21 -311 -8 50 88 -43 190 1 -276 -78 -10 -43 -215 148 2 80 117 106 -4 125 -111 -223 313 135
6738 135 20 -199 174 -55 -231 -99 -26 147 -5 6 -147 -3 -2 189 -61 97 34 59 -37 -131 85 218 201
6761 201 -254 -82 153 -151 -16 192 5 70 -88 -97 -297 75 -81 -166 67 -17 62 -176 168 252 -120 -66 183
6784 183 -23 154 107 -29 -199 -21 -70 51 -171 -40 245 -240 171 -186 -84 295 -116 45 -207 156 -235
6805 -235 58 -229 218 -25 -224 -287 20 -219 18 126 179 -51 -269 320 71 -41 -292 27 36 11 -60 269
6827 269 0 59 260 83 -59 34 135 -152 -102 123 101 -77 203 198 -14 -29 -28 -37 -295 70 -10 -168 -79 125
6851 125 15 78 -150 -217 -231 187 -57 30 -88 -55 -114 124 120 51 129 58 -227 -73 178 140 320 -127 -29 91
6875 91 -296 240 -103 -59 185 -161 -154 -93 202 6 -86 -30 -141 -179 -237 23 67 -130 85 -82 -17 -63 -229 -123
$$ packed form
6715B1l32L03N8L8j31K33j89k77J98O8l3j72L63j46P8L7j1j10J29k36j12N36j78
6738A35j15k19L73k29j76J32P3J73j52J1j53J44JJ91k50J58o3K5r6r4K16J33j7
6761B01m55J72K35l04J35K08j87O5j58rk00L72j56q5K33q4P9k38L44Q4l72N4K49
6784A83k06J77m7j36j70J78m9J21k22J31K85m85M11l57J02L79m11J61k52L63l91
6805b35K93k87M47k43j99o3L07k39K37J08N3k30k18N89k49j12k51L19Rk5p1L29
6827B69k69N9K01j77j42R3J01k87N0K25k2j78K80nk12j5Jrk58L65q0j58Q9K04
6851A25j10O3k28o7j4M18k44Q7j18L3n9K38mo9P8p1k85J54K51l8J80m47R8J20
6875I1l87N36l43M4K44l46PO1K95j96r2N6j11l8n8K60M4j97K15j67O5m6j66J06
$$ plain form
6899 -123 100 -69 -70 -64 44 -52 108 106 28 255 39 137 -238 -103 102 -355 -9 -409 315 10 -208 -116 -32 -142
6923 -142 -145 -192 109 264 -144 -62 272 230 -156 323 -54 -334 -31 0 -21 8 129 57 -45 254 51 31 -179
6946 -179 23 268 130 94 -75 166 -235 44 134 -143 51 -270 16 35 -266 -22 38 73 -72 -83 258 -309
6968 -309 -28 -274 13 125 102 -25 -47 105 -146 -9 -64 336 93 -55 334 99 104 -223 -37 28 -231 -117
6990 -117 -67 -196 46 -96 102 24 -29 -24 177 -6 -78 -225 203 80 -267 -487 -38 -144 -129 182 72 57 -61
7013 -61 -309 234 175 -168 -118 -105 185 106 103 -337 54 -122 -176 82 -216 260 -12 117 -81 160 27 -198 -19
7036 -19 72 -325 -91 238 -99 206 76 37 120 -71 152 -142 51 16 -37 -330 -34 -69 -198 13 85 -106 -112
7059 -112 -157 -480 118 67 22 200 -80 -31 -317 -93 144 188 146 -237 -1 58 28 -155 56 -227 249 -123 36
$$ packed form
6899a23K23j69jOJ08r6J60kp8K27k16R8l75J35K05m57L46m00P24l05k18R2Q4j10
6923a42lm7L01J55m08Q2L34m2l86M79l77k80L03L1k1K9J21p2j02K99k03k0k10
6946a79K02K45j38l6j69K41m01K79R0k77J94l21K86J9l01K44O0L5j45j1L41n67
6968c09K81k46K87J12k3j27k2J52k51J37n5M00k43j48L89k35Nl27J86O5k59J14
6990a17N0j29K42j42J98p8n3NK01j83p2j47M28j23l47k20M49j06J5L11j10j5j18
7013f1k48N43n9l43N0J3K90p9lm40L91j76n4K58k98M76k72J29j98K41j33k25J79
7036a9R1l97K34L29l37L05j30l9Q3j91K23k94J93l5n3k93K96l5j29K11P2j91o
7059a12m5l23N98n1m5J78k80M9k86K24K37M4m2l83K36N9l0j83K11k83M76l72J59
$$ plain form
7082 36 297 -195 18 54 -1 97 -114 -31 145 -92 225 -126 -7 53 -179 -124 -318 -296 93 -36 69 -192 -34
7105 -34 -49 60 -3 49 -127 21 -17 -161 -118 85 -39 -190 135 -131 138 50 -254 67 -180 42 -296 17
7127 17 140 2 125 31 117 -220 -18 72 165 -185 2 -16 6 -218 -240 197 204 289 116 -9 90 99 19 -115 -225
7152 -225 -245 -410 213 -101 -97 -220 335 -172 -60 -174 32 263 91 -91 167 174 -68 -102 -124 -66 -82 35 -23
7175 -23 -82 -52 33 0 128 135 16 -238 44 180 -219 -23 -31 2 -264 38 75 11 160 -21 -130 -258 -23 199
7199 199 -35 -121 44 308 27 170 206 13 -302 -280 278 -170 -54 25 -249 128 151 106 -188 128 230 -86
7221 -86 -240 6 -171 -293 -24 125 -68 94 129 -52 -38 105 113 -103 16 -8 62 17 123 -49 204 -48 -173
7244 -173 -13 -42 96 -81 -271 -182 -30 106 -53 -52 -201 48 92 -105 -263 -187 161 73 -191 -130 163 401 27
$$ packed form
7082C6K61m92K13L6n5R8k11Q3J76k37L17l51J19O0k32N5j94K2L89j29J05k61J58
7105c4j5J09o3N2j76J48l8j44M3K03j24j51L25k66K69q8l04L21k47K22l38L13
7127A7J23j38J23r4Q6l37K02R0R3l50J87j8K2k24k2M37PQ5j73j25R9Rq0j34j10
7152b25k0j65O23l14Mj23N55n07J12j14K06K31j72j82K58Pk42l4k2N8j6J17n8
7175b3n9L0Q5l3J28Pj19k54K82J36l99J96qL3k66L02L7o4J49j81j09j28K35K22
7199A99k34q6J65K64k81J43L6j93l15K2N58m48J16P9k74L77K3m5k94L16J02l16
7221h6j54K46j77j22K69J49j93J62L5j81J4J43Qk16J19k4P0m5J06j72K53k52j25
7244a73J60k9J38j77j90Q9J52J36j59Jj49K49M4j97j58P6L48q8k64O1K93K38l74
$$ plain form
7267 27 -192 11 -231 -104 162 45 -99 -131 93 247 38 -31 200 118 190 -181 -227 -34 83 96 -82 232
7289 232 -94 129 143 92 -62 -103 31 -81 117 0 -122 33 -67 -216 -135 -195 -119 -213 57 127 -83 26 56
7312 56 142 41 192 100 33 56 11 243 93 116 156 -106 -302 57 8 -22 5 -23 8 -69 -180 105 -160 62 -120
7337 -120 69 163 -225 -70 3 -228 -4 -4 124 377 90 -11 -145 334 -49 -126 -51 274 363 168 244 -29 -22
7360 -22 102 200 297 201 -1 -198 -143 -115 -125 91 176 56 25 -144 155 -249 -82 61 18 203 118 -102 288 -164
7384 -164 107 68 -58 -126 -114 -40 -67 87 8 -64 122 -146 -136 -427 -97 66 138 201 -9 -89 -140 -59 42 -39 114
7409 114 191 372 -193 -168 74 73 48 -50 -54 38 -170 234 147 -23 -110 111 -191 -202 239 55 -200 -163 74 -74
7433 -74 104 -52 130 -28 143 178 -64 -94 73 137 144 231 -243 -8 -77 -81 36 219 232 -163 120 193 10 -38
$$ packed form
7267B7k19K03k42J27K66j17j44l2K24J54k09o9K31q2P2l71m6J93J17J3j78L14
7289B32l26K23J4n1j54m1J34j12J98j17j22J55j00j49Q1o0P6r4K70P0k10J09L0
7312E6Q6j01J51r2o7K3m5K32j50K3M0k62j96L59m9l0K7k8L1p7j11K85k65K22j82
7337a20J89R4l88J55P3k31K24%J28K53k87j01j34M79l83p7P5L25Q9j95P6k73P
7360b2J24R8R7r6k02j97N5K8j0K16Q5j20l1j69K99m04J67J43m3J85q5k20L90m52
7384a64K71l9j26o8J2P4k7J54p9p2J86k68J0k91L30J63P2O3k10q0n1Q1J01q1J53
7409A14P7J81n65K5K42jk5r8mR2k08M04q7j70q7K21l02j1M41j84k55L7K37j48
7433g4J78j56J82j58J71L5k42l0J67O4PQ7m74K35o9mJ17J83J3l95K83P3j83m8
$$ plain form
7457 -38 -149 -21 317 107 -154 151 -195 83 24 60 -201 199 192 -116 -161 -49 -48 310 -69 -22 8 -61 277 -1
7481 -1 58 262 -78 -239 -207 -115 340 -396 -71 -120 -17 -212 -150 190 -36 -103 96 283 -32 33 12 -206 -67
7504 -67 -167 -60 10 -96 202 20 160 9 48 42 -58 -69 -86 -53 -46 223 261 82 40 -117 -115 -101 -97 43 33 -18
7530 -18 -119 138 153 -189 -8 -100 84 -105 -155 -81 -90 -56 116 234 12 228 263 200 84 -204 66 15 -172 89
7554 89 -225 -22 -428 -265 22 231 -58 106 137 40 -29 69 167 57 130 -4 -224 143 -43 -13 68 116 40 -24
7578 -24 112 -106 -105 -25 -191 103 -18 100 186 -10 200 -194 -118 23 17 91 -192 -97 -70 92 14 -122 -36 -180
7602 -180 -103 327 119 -42 7 -191 109 -67 137 -145 113 -179 -55 -44 361 147 -161 -149 167 -44 195
7623 195 246 -173 -160 -73 4 175 62 -374 120 -73 45 -128 -138 53 8 40 25 -166 -231 28 -117 -178 99
$$ packed form
7457c8j11J28L38k10k61L05l46K78n9L6k61M00pl08m5J12JL58l79M7L0o9L38k78
7481aN9K04l40j61L2R2M55p36L25m9J03j95O2L40k26o7J99J87l15O5k1k18J39
7504f7j00J07P0j06K98j82J40j51L9oj00j1j7L3PK69L8j79m2j57KJ4MJ40j0n1
7530a8j01K57J5l42J81r2J84j89n0P4rL4J72J18k22K16L5o3j16k88K70n1j87K61
7554H9l14K03m06J63K87K09k89J64L1r7o9R8R8j10P3j34k20L67j86L0Q1M8p6o4
7578b4J36k18JQ0j66K94j21J18Q6j96K10l94P6J41oP4k83R5K7J62p8j36Q6j44
7602a80P7M30k08j61M9j98L00j76K04k82K58k92J24J1M05k14l08J2L16k11K39
7623A95N1m19J3Q7P7J71j13m36M94j93J18j73j0J91m5L2j5j91o5K59j45o1K77
$$ plain form
7646 99 2 -100 -375 88 77 -167 172 -152 137 -206 177 165 32 -174 -4 64 -33 -41 63 250 127 -94 156
7669 156 58 -32 -196 177 -256 40 114 -57 176 115 145 29 134 204 13 3 -52 -311 -48 -48 94 33 -26 121
7693 121 -54 -18 -121 16 -114 68 -36 -172 195 -357 7 200 138 158 152 122 85 5 -122 54 -12 36 57 -170
7717 -170 -76 132 66 -131 184 74 -261 -38 213 -266 126 36 -226 -2 -13 -24 -109 -302 -96 206 -200 13
7739 13 164 87 59 -87 -194 -22 32 52 45 -35 96 189 -77 17 55 1 94 127 118 -55 20 308 25 154 80 -102
7765 -102 100 364 -241 -281 -27 -245 99 88 25 26 103 -183 66 -123 90 -127 113 -14 103 163 35 -176
7787 -176 190 -51 94 369 -25 -45 236 -180 124 -169 93 -6 -166 170 -107 335 37 166 174 -17 16 29
7809 29 -86 188 15 16 -159 144 -163 99 -66 -97 -260 -64 35 59 131 -109 164 119 84 -181 346 -96 124
$$ packed form
7646I9r7j02k75M63j1k44L39l24K89l43L83j2j33k06J70O8r7qJ04J87j23k21K50
7669A56r8r0j64L73m33K96P4j71K33o1L0j16J05P0j91j0n5k59K63%J42o1n9J47
7693A21j75L6j03J37j30J82j04j36L67n52L64J93o2K0ol0l7q0j27J76o6M8K1k27
7717a70R4K08o6j97L15j10l35K23K51m79L92r0k62K24j1j1q5j93K06L02m06K13
7739A3J51p7k8j46j07J72N4K0pq0J31R3k66R4L8n4R3L3rj73P5K88k83J29p4j82
7765a02K02K64o05m0K54k18L44j1o3JP7k86K49j89K13k17K40j27J17O0j28k11
7787a76L66k41J45K75l94k0K81m16L04k93K62r9j60L36k77M42k98J29Qj91L3J3
7809B9j15K74j73Jj75L03l07K62j65l1j63J96R9K4P2k40K73m5l5k65N27m42K20
$$ plain form
7832 124 -143 219 8 -244 175 -148 -118 -269 251 -417 -344 123 -214 24 209 -153 26 215 63 -54 -170
7853 -170 -57 -107 -136 253 -16 -31 -88 -290 -121 -267 66 -20 -68 25 335 -29 -36 6 313 117 74 44 -85 -82 120
7878 120 136 -92 420 88 -209 -93 140 -1 73 -30 56 229 -37 122 -61 48 10 257 -70 102 -82
7899 -82 32 45 -133 122 35 69 202 -107 -120 20 260 107 111 128 -135 -79 -108 -109 -87 237 121 -140 110 27 42
7924 42 -193 -184 69 234 -158 -70 16 96 152 -45 118 15 79 -220 66 -59 -194 -185 82 286 55 -155 86
7947 86 -117 85 -141 -42 -41 -73 -194 -233 66 -50 276 32 182 17 35 158 318 -67 130 200 12 -225 16
7970 16 340 97 98 -15 41 -23 141 -56 -18 36 246 116 89 186 208 26 -62 -103 133 -6 36 -188 -6 -140
7994 -140 151 -181 -136 54 233 -63 -171 -29 210 111 -282 540 -129 352 1 -87 131 60 -172 35 148
$$ packed form
7832A24k67L62k11k52M19l23L0j51N20o68P3M67l37K38J85l62J79J89j52j17j16
7853a70J13n0k9L89k69j5n7k02J69j46L33q6m8R3L10l64pM2L07j96m3l0j29LK02
7878A20J6k28N12l32k97J16K33j41P4j03Q6J73k66J59j83J09l8K47l27J72j84
7899h2J14J3j78K55q7L4J33l09j3J40K40j53MJ7k63N6k9jK2L24j16k61K50q3J5
7924D2k35RK53J65l92Q8Q6Q0N6j97J63j03O4k99K86j25j35RK67K04k31k10K41
7947H6k03K02k26R9Jl2j21l9K99j16L26k44J50j65J8J23J60l85J97P0j88k37K41
7970A6L24k43Jj13N6o4J64j97L8N4K10j30k7R7K2j82q8m1K36j39M2k24J82j34
7994a40K91l32M5J90J79k96j08J42K39r9l93Q22o69M81l51q8K18p1k32K07J13
$$ plain form
8015 148 -114 -159 -78 -42 -176 -138 111 -26 87 92 87 101 -185 -49 203 50 243 59 -19 -17 19 120 -194 32
8039 32 85 -54 191 -76 -146 10 -109 24 -432 -91 32 -78 219 83 -114 -92 -185 114 133 121 69 133 165
8062 165 91 102 45 -72 85 -121 -59 28 88 -80 -111 110 -147 -292 -64 80 -192 77 160 204 4 134 96
8085 96 102 -34 164 -71 71 86 138 286 -56 244 -132 87 -64 26 264 296 -105 -34 13 -102 173 -36 -284
8108 -284 128 -123 13 -221 -109 -193 265 -165 -140 -52 -232 212 -141 -11 -57 -130 221 64 19 93 -143 -56 160
8131 160 68 170 -67 -68 -3 -294 84 132 129 -40 -8 90 102 -4 139 73 -134 237 -263 258 -10 14 -28 -206
8155 -206 43 -99 -194 224 -20 84 -97 -318 11 248 93 -164 225 -77 97 160 169 73 127 182 -47 -167
8177 -167 83 -1 11 -251 -15 -21 -161 -250 160 245 -81 198 -351 -50
$$ packed form
8015A48k62m5Q1L6j34L8K49j37J13NnJ4k86J36K52j53J93j84p8KL6J01l14K26
8039C2N3j39K45k67p0J56j19J33m56L41J23j10K97j36j97K2r3K99J9j2n2O4L2
8062A65p4J1n7j17J57k06O2Q7O0j68l1K21k57j45K28J44k72K69Q3M4k00J30l8
8085I6Oj36J98k35J42J5N2J48l42L00l76K19j51R0K38L2m01P1M7j15K75k09k48
8108b84M12k51J36k34J12q4M58m30K5Q8j80M44l53J30m6p3L51j57m5P4k36Q7K16
8131A60r2J02k37jO5k91L78M8lj69L2R8J2j06J43o6k07L71n00N21k68K4m2j78
8155b06K49j42r5M18k44J04j81k21L29K37j55k57L89l02J74O3Rr6N4N5k29j20
8177a67K50q4J2k62K36oj40q9M10Q5l26K79n49L01
8191e0
$$ Imaginary data points
##PAGE= N=2
##DATA TABLE= (X++(I..I)), XYDATA
$$ plain form
0 0 0 0 0 0 0 0 0 0 0 0 2 -8 8 -8 8 -16 16 -24 24 -32 40 -48 56 -64 72 -88 104 -118 136 -153 176 -201 229
33 229 -260 293 -329 371 -416 464 -518 577 -640 710 -788 870 -961 1061 -1170 1289 -1420
50 -1420 1564 -1723 1901 -2098 2316 -2564 2845 -3169 3545 -3987 4517 -5170 5987 -7051 8499
65 8499 -10592 13900 -19946 34597 -147440 -107069 98938 -61753 25868 -54007 -163904 -59585
77 -59585 14312 -9003 891 -123022 -127479 11374 19063 -15327 -21662 -124809 -101312 -15915
89 -15915 5952 16644 -46905 -98187 -49290 -32833 3834 5938 -82289 -87503 -16928 -11345 1617
102 1617 -1413 -79659 -87526 -32135 -5849 25878 -26784 -79558 -30304 -28469 -20454 21448 -38381
115 -38381 -77398 -21870 1982 -1365 -1092 -40808 -59345 -27915 -13703 10373 3936 -49603 -34522
$$ packed form
0@%%%%%%%%%%Kj0J6j6J6k4L2m0M8n6P2q8J04j20J36j60J92k22K54k89L29l77M30
33B29m89N53o22P00p87Q80r82J095j217J350j498J658j831K022k231K459k709
50a420K984l287L624l999M414m880N409o014O714p532Q504r687J1157j3038J5550
65H499j9091K4492l3846N4543j82037M0371K06007j60691Q7621p9875j09897J04319
77e9585P3897k3315R894j23913m457J38853P689l4390o335j03147K3497Q5397
89a5915K1867J0692o3549n1282M8897J6457L6667K104q8227n214P0575N583J2962
102A617l030p8246p867N5391K6286L1727n2662n2774M9254J835Q015M1902n9829
115c8381l9017N5528K3852l347K73l9716j8537L1430J4212K4076o437n3539J5081
$$ plain form
128 -34522 -7956 -16519 -2254 -7809 -34319 -36664 -12672 9848 -505 -24794 -32831 -24494 -16789
141 -16789 1099 12460 -20686 -32656 -11633 -3943 6137 -4094 -23468 -19965 -12366 3905 12516
154 12516 -8344 -27317 -16624 -2728 -3100 7856 -3276 -23978 -6550 1636 -177 1780 -10964
167 -10964 -12434 -7107 -809 7640 2082 -10650 -12249 -1466 -1647 529 6572 -7443 -11681 -2237
181 -2237 6224 8283 -8082 -5616 -20 -5946 7064 11670 -4341 -11278 -2246 6794 3899 549
195 549 -3501 -1931 192 1056 11445 527 -12937 862 3875 1451 4175 1699 -2427 -3524 2415
210 2415 3334 1635 525 -2196 2520 1171 2492 6470 -2958 -4089 297 1415 3187 2960 2171 -4858
226 -4858 -1935 6716 1137 -2216 -2085 -201 1947 2004 5629 -1060 -7078 -935 4546 3710 -3126 134
$$ packed form
128c4522K6566q563J4265n555k6510k345K3992K2520j0353k4289q037Q337P705
141a6789J7888J1361l3146j1970K1023P690J0080j0231j9374L503P599J6271Q611
154A2516k0860j8973J0693J3896l72J0956j1132k0702J7428Q186j813J957j2744
167a0964j470N327O298Q449n558j2732j599J0783j81K176O043j4015m238R444
181b237Q461K059j6365K466N596n926J3010M606j6011o937R032R040k895l350
195E49m050J570K123Q64J0389j0918j3464J3799L013k424K724k476m126j097N939
210B415R19j699j110k721M716j349J321L978r428j131M386J118J772k27p89p029
226d858K923Q651n579l353J31J884K148N7L625o689o018O143N481q36o836L260
$$ plain form
242 134 2888 -3573 196 3454 -2225 -5377 -528 5553 -1120 -1933 2223 -2148 -3809 -3519 2408 2401 -3480
259 -3480 1028 1044 -4122 -1844 1745 -1471 -5599 -486 1756 219 247 -4326 -2909 -3119 -2047 3908
275 3908 -2224 -3894 1094 -779 -1229 -1519 -3013 -4237 -817 3062 -1135 -1867 -2056 -2134 -2411 -4208 1063
292 1063 -238 -3539 1135 -289 -2940 -3324 -980 999 -4767 -1936 3458 -197 -2802 -1542 -795 -4773
308 -4773 -1248 3384 -691 -2170 -1925 1396 643 -5362 -398 844 -2390 995 2423 -1492 -3891 -297
324 -297 818 -1871 -335 153 1262 904 -623 1406 -1580 -1660 1886 573 259 667 1894 -37 -1849
341 -1849 786 -686 427 3209 1818 623 -215 2203 1874 -1098 1102 1661 1464 1788 3183 2194 -2334
358 -2334 910 3892 498 681 2500 3846 1534 1280 3887 880 586 2915 4046 2614 598 3935
$$ packed form
242A34K754o461L769L258n679l152M849O081o673q13M156m371j661K90N927pn881
259c480M508J6n166K278L589l216m128N113K242j537K8m573J417k10J072N955
275C908o132j670M988j873m50k90j494j224L420L879m197p32j89p8k77j797N271
292A063j301l301M674j424k651l84K344J979n766K831N394l655k605J260P47l978
308d773L525M632m075j479K45L321p53o005M964J242l234L385J428l915k399L594
324b97J115k689J536M88J109l58j527K029k986q0L546j313l14M08J227j931j812
341a849K635j472J113K782j391j195q38K418l29k972K200N59j97L24J395r89m528
358b334L244K982l394J83J819J346k312k54K607l007k94K329J131j432k016L337
$$ plain form
374 3935 4019 200 2047 2919 2994 2265 3774 4806 896 2708 4237 2526 1932 2375 4585 3745 3281 3909
392 3909 1729 2440 3170 4260 3544 2291 4674 3966 2749 4272 2649 2559 3481 5026 4145 2290 4499
409 4499 4349 2868 2939 3465 4800 2831 4482 6024 2395 2942 4545 3997 2797 2837 5271 4730 3377
426 3377 3999 4143 2799 1967 5728 4368 1289 4837 5226 3484 3473 2797 3622 3129 3768 4925 3815 2616
444 2616 2989 4682 2456 1772 4759 3409 3742 4200 3278 2945 2698 3821 2867 2212 4011 3478 3613 3140
462 3140 2530 2616 2035 3581 3455 2261 2440 3731 4147 1341 1939 3474 1072 2610 4543 2301 1360
479 1360 2675 3735 1853 1719 2211 2511 2931 1278 3182 3131 -204 2521 3131 915 1229 3045 2729
496 2729 977 1699 1979 899 1834 1754 2410 1728 962 2941 1560 578 1654 1715 1876 1598 2073 1186 453
$$ packed form
374C935Q4l819J847Q72P5p29J509J032l910J812J529j711n94M43K210q40m64O28
392C909k180P11P30J090p16j253K383p08j217J523j623r0R22J545q81j855K209
409D499j50j481P1N26J335j969J651J542l629N47J603n48j200M0K434n41j353
426C377O22J44j344q32L761j360l079L548L89j742j1o76Q25m93O39J157j110j199
444B616L73J693k226o84K987j350L33M58r22l33k47J123r54o55J799n33J35m73
462C140o10Q6n81J546j26j194J79J291M16k806N98J535k402J538J933k242r41
479A360J315J060j882j34M92L00M20j653J904n1l335K725O10k216L14J816l16
496B729j752P22K80j080R35q0O56o82p66J979j381r82J076O1J61k78M75q87p33
$$ plain form
515 453 1958 1651 462 804 1295 1459 1040 1849 739 255 1228 966 953 651 813 2044 273 419 1090
534 1090 425 524 924 1592 539 68 1726 1604 99 -85 1216 797 615 1598 587 25 1232 617
552 617 973 234 -166 1724 1204 329 947 740 -253 857 1489 -121 159 1329 566 948 292 505 1270
571 1270 283 821 1096 515 600 956 777 -171 396 824 493 1266 507 489 475 835 1537 -335 940 1381
591 1381 637 937 594 465 341 405 1159 821 496 501 1459 1168 -663 1126 1196 -113 940 1052 739 435
611 435 565 1094 143 442 1031 1322 910 624 1234 657 458 895 851 155 524 1454 1130 289 910 330 448
632 448 1036 973 925 609 723 1367 374 665 1014 810 852 597 743 274 417 1277 764 122 914 1250 758
653 758 324 1186 199 779 1252 634 672 489 912 1542 569 327 811 804 169 933 1160 -49 1009 1067 454
$$ packed form
515D53J505l07j189L42M91J64m19Q09j110m84R73k62j3l02J62J231j771J46O71
534A090o65R9M00O68j053m71J658j22j505j84J301m19j82R83j011n62J207o15
552F17L56p39m00J890n20q75O18k07r93J110O32j610K80J170p63L82o56K13P65
571A270r87N38K75n81Q5L56j79r48N67M28l31P73p59j8j4L60P02j872J275M41
591A381p44L00l43j29j24O4P54l38l25NR58k91j831J789P0j309J053J12l13l04
611D35J30N29r51K99N89K91m12k86O10n77j99M37m4o96L69R30l24q41O21n80J18
632D48N88o3m8l16J14O44r93K91L49k04M2k55J46m69J43Q60n13o42P92L36m92
653G58m34Q62r87N80M73o18L8j83M23O30r73k42M84po35P64K27j209J058N8o13
$$ plain form
674 454 450 495 1222 604 -53 994 707 495 841 663 560 465 1098 707 533 321 227 804 172 425 746 -242
696 -242 566 992 443 380 313 413 320 481 822 338 672 712 764 228 -101 875 351 -37 529 274 88 135
718 135 455 581 -175 257 882 -65 -244 380 277 -95 478 512 96 354 212 316 39 -555 464 319
738 319 -125 -15 69 -18 -149 246 -176 -444 26 94 -18 -100 59 -67 -24 -370 114 -434 20 -5 27 -117 -373
761 -373 106 -98 -296 83 -283 -305 -196 -20 -136 -811 -106 160 -219 -348 -125 -289 -640 -122 134 -187 -511
782 -511 -66 -224 -496 -667 -208 -558 -772 -311 -338 -381 -504 271 -316 -691 -214 -102 -223 -253 -492 5 -585
803 -585 -468 -425 -535 -532 -509 239 -643 -320 -494 -360 -187 -398 -722 -307 -381 -13 -178 -660 -344 -155 -267 -552
825 -552 -366 -253 -218 -116 -526 -392 -513 -256 104 -549 -27 -497 -401 -338 -311 -440 -585 -265 -75 -372 -227 -356
$$ packed form
674D54mM5P27o18o57J047k87k12L46j78j03r5O33l91j74k12r4N77o32K53L21r88
696b42Q08M26n49o3o7J00r3J61L41m84L34M0N2n36l29R76n24l88N66k55j86M7
718A35L20J26p56M32O25r47j79O24j03l72N73L4m16K58j42J04k77n94J019j45
738C19m44J10Q4q7j31L95m22k68M70O8j12q2J59j26M3l46M84n48M54k5L2j44k56
761c73M79k04j98L79l66k2J09J76j16o75P05K66l79j29K23j64l51N18K56l21l24
782e11M45j58k72j71M59l50k14M61k7m3j23P75n87l75M77J12j21l0k39M97n90
803e85J17M3j10LK3P48q82L23j74J34J73k11l24M15p4L68j65m82L16J89j12k85
825e52J86J13L5J02m10J34j21K57L60o53N22m70R6O3K7j29j45L20J90k97J45j29
$$ plain form
847 -356 -147 -261 -240 -201 -336 -425 -222 -360 -385 -556 -274 -118 33 -208 -257 -577 -153 -219 -142 -566 -174 -126 -374
870 -374 -421 -195 -171 -246 -425 -245 -381 -304 -114 -455 -313 -275 -88 6 -399 -323 -473 -306 -188 -112 -223 -385 -326
893 -326 7 -86 -147 195 -341 -164 30 51 -344 -362 -23 -62 -134 -340 -166 -226 -171 -295 -195 -149 47 -321 -113
916 -113 -284 -37 -75 -250 -102 8 -324 -323 156 264 -275 -212 -289 -282 -201 -162 226 -162 -10 92 -129 -173 -456 -106
940 -106 -374 -274 -285 -272 -3 -75 -205 -233 -284 22 132 -146 -175 -117 -83 -39 -228 -64 -186 -354 66 -517 -307
963 -307 -382 200 -376 -715 -9 -302 -434 -146 -140 -111 -3 -172 -90 -169 -312 -246 -177 -154 -296 -456 -293 -7 -42 -143
987 -143 -159 -90 -310 -272 -403 -147 -119 -328 -165 -63 216 -80 108 -81 -95 -294 -7 -360 -35 -247 23 -430
1009 -430 -266 -40 -208 -51 -377 55 -72 -172 25 -256 -182 -106 -287 -377 -271 -220 -273 -417 -353 -112 -9 -391
$$ packed form
847c56K09j14K1L9j35q9K03j38k5j71K82J56J51k41m9l20M24o6P7m24L92M8k48
870c74m7K26K4p5j79J80j36P7J90l41J42L8J87R4m05P6j50J67J18P6j11j62N9
893c26L33r3o1L42n36J77J94K1l95j8L39l9p2k06J74o0N5j24J00M6J96l68K08
916a13j71K47l8j75J48J10l32JM79J08n39O3p7PQ1L9L88l88J52J02k21m4k83L50
940a06k68J00j1J3K69p2j30k8n1L06J10k78k9N8L4M4j89J64j22j68M20n83K10
963c07p5N82n76l39P06k93j32K88OK9J08j69Q2p9j43O6O9K3j42j60J63K86l5j01
987a43j6O9k20L8j31K56K8k09J63J02K79k96J88j89j4j99K87l53L25k12K70m53
1009d30J64K26j68J57l26M32j27j00J97k81P4P6j81r0J06N1n3j44O4K41J03l82
$$ plain form
1031 -391 -418 82 -351 29 13 -289 -236 -330 -214 -143 -160 -274 -319 -229 192 66 -225 -360 -18 -57 29 -153 -269
1054 -269 -379 -190 -22 -203 -364 -33 -164 -166 -267 210 -226 -208 112 -662 -6 -143 -78 -238 61 -218 95
1075 95 119 -184 64 -394 -141 -150 173 -168 -197 -142 -222 178 5 -126 83 -74 29 -360 -187 -190 -322 -31 -82
1098 -82 -112 -24 7 -66 -228 -62 -11 -199 -45 -391 -216 68 -235 -203 -137 -307 -306 -127 106 60 -163 102 -65 -303
1122 -303 -117 8 97 -263 -23 311 -20 60 -191 -8 -248 -120 -32 -368 -99 -142 310 -124 -182 187 256 -123
1144 -123 -108 -156 8 -321 111 178 -95 -68 143 -15 53 354 183 -57 -15 294 205 -190 -222 -134 -412 -152 -129
1167 -129 142 -168 -30 -64 -2 19 -21 -190 -107 287 -346 166 -101 47 59 -1 165 310 35 66 -20 251 -160
1190 -160 117 217 -236 -167 43 136 -117 -169 -34 -10 -11 -205 251 -5 -184 -140 -8 -9 -157 63 173 -99 8
$$ packed form
1031c91k7N00m33L80j6l02N3r4J16P1j7j14m5R0M21j26k91j35L42l9Q6j82j16
1054b69j10J89J68j81j61L31j31kj01M77m36J8L20p74O56j37O5j60K99k79L13
1075I5K4l03K48m58K53rL23l41k9N5q0M00j73j31K09j57J03l89J73lj32K91n1
1098h2l0Q8L1p3j62J66N1j88J54l46J75K84l03L2O6j70JJ79K33m6k23K65j67k38
1122c03J86J25Q9l60K40L34l31Q0k51J83k40J28Q8l36K69m3M52m34n8L69O9l79
1144a23J5m8J64l29M32O7k73K7K11j58O8L01j71k40M2L09q9l95l2Q8k78K60K3
1167a29K71l10J38l4O2K1m0j69Q3L94o33N12k67J48J2o0J66J45k75L1q6K71m11
1190a60K77J00m53O9K10R3k53n2J35K4jj94M56k56j79M4J32jj48K20J10k72J07
$$ plain form
1213 8 37 75 -261 196 303 37 123 147 -75 27 -106 -31 60 -131 -39 -64 123 -93 100 15 127 -39 -214 240
1237 240 181 47 -127 49 -144 -41 160 -1 48 94 72 -314 29 -118 56 240 44 99 235 253 -554 -67
1259 -67 255 -20 126 -6 -40 -247 83 -22 39 416 74 67 43 -186 315 -190 -141 42 -42 224 -67 117 -23
1282 -23 -254 53 44 114 -111 73 64 22 -44 84 16 47 165 -181 61 -27 -42 184 -130 51 4 31 -163 1 149
1307 149 113 171 -4 216 -99 100 -226 136 67 167 307 -31 91 271 -180 -273 123 128 70 141 10 -34 92
1330 92 135 -140 192 -181 27 111 -73 256 -351 91 192 -64 -320 26 69 -281 56 57 66 -61 -235 149 94
1353 94 127 -50 -51 494 85 -184 105 -315 -49 18 325 58 121 -108 -93 -42 110 -85 -100 53 -156 -206 25
1376 25 117 113 -142 41 37 -235 114 252 151 -156 130 -166 -176 -89 127 -96 -8 33 130 84 16 -112 100 -25
$$ packed form
1213HK9L8l36M57J07k66Q6K4k22J02j33P5R1j91R2k5J87k16J93q5J12j66j75M54
1237B40n9j34j74J76j93J03K01j61M9M6k2l86L43j47J74J84j96N5J36J8q07M87
1259f7L22k75J46j32l4k07L30j05O1L77l42pk4k29N01n05M9J83q4K66k91J84j40
1282b3k31L07rP0k25J84rm2o6J28o8L1J18l46K42q8j5K26l14J81m7K7j94J64J48
1307A49l6N8j75K20l15J99l26L62o9J00J40l38J22J80m51r3L96Nn8P1j31m4J26
1330I2M3k75L32l73K08Q4j84L29o07M42J01k56k56L46M3l50L37JRj27j74L84n5
1353I4L3j77jN45m09k69K89m20K66O7L07k67O3k29J5N1J52j95j5J53k09n0K31
1376B5R2mk55J83mk72L49J38j01l07K86k96j0Q7K16k23Q8M1R7m6o8j28K12j25
$$ plain form
1400 -25 225 -138 -179 160 77 116 -14 100 190 -112 -150 -57 139 25 -227 -239 129 93 -45 59 139 -236 40
1423 40 -66 -140 244 -349 -73 187 60 -46 35 224 -55 -175 -36 31 -107 -155 254 3 -127 -5 -197 -138
1445 -138 202 197 -166 87 -6 180 -186 30 -119 -11 -99 43 29 250 141 90 48 190 144 166 -62 -54 48 -224
1469 -224 224 339 41 96 -285 -32 175 60 299 -184 -159 128 -67 -33 33 -184 -142 103 202 -38 40 270
1491 270 -335 -20 126 13 54 -6 -92 -94 70 -118 -8 94 149 -101 -217 48 -111 23 250 -82 -90 161 10
1514 10 142 63 -131 48 -356 36 -146 125 12 -155 70 129 -48 -130 -34 -33 -13 148 -169 78 64 -66 27
1537 27 39 34 173 -120 -206 100 10 428 237 8 64 60 161 -161 24 -124 -123 -2 -254 180 -104 -35 -80 -53 117
1562 117 61 192 78 -52 -44 12 159 -45 -24 71 -46 31 -11 107 0 -121 -90 87 -115 90 -60 8 -100
$$ packed form
1400b5K50l63m1L39q3L9j30J14R0l02l8R3J96j14k52j2L68l6j38J04Q0l75K76
1423D0j06p4L84n93K76K60j27j06Q1J89k79j20J39O7j38m8M09k51j30J22j92N9
1445a38L40nl63K53r3J86l66K16j49J08q8J42j4K21j09n1m2J42m6K2k28QJ02k72
1469b24M48J15k98N5l81K53K07j15K39m83K5K87j95L4O6k17M2K45R9k40P8K30
1491B70o05L15J46j13M1o0q6kJ64j88J10J02N5k50j16K65j59J34K27l32qK51j51
1514A0J32p9j94J79m04L92j82K71j13j67K25N9j77q2R6JK0J61l17K47j4j30R3
1537B7J2nJ39k93q6L06r0M18j91k29N6mJ01l22J85j48JJ21k52M34k84O9m5K7J70
1562A17n6J31j14j30QN6J47k04K1R5j17P7m2J18j07j21L1J77k02K05j50O8j08
$$ plain form
1585 -100 1 -103 -113 -30 -62 -126 -51 -183 -334 80 145 14 19 -35 189 74 -177 94 20 2 -2 69 4 -197 228
1610 228 -195 90 -100 70 -222 -24 -6 124 104 38 -86 226 -88 -88 221 12 27 -272 80 -35 85 -56
1632 -56 106 94 -18 -151 137 207 -25 -3 219 -197 142 -2 79 18 125 3 -67 -277 9 22 285 228 -32
1655 -32 -15 -131 170 -75 30 -137 47 4 57 -156 -13 -106 -109 -69 0 120 -88 -40 110 97 29 33 -10 -108 227
1680 227 -103 72 -73 107 29 -351 -23 47 65 127 100 230 -93 -80 -175 -72 -267 42 151 -49 -28 -125 -228
1703 -228 200 -20 -5 221 192 -3 -82 -91 335 -36 85 -113 93 -70 180 88 -103 375 51 209 105 -50
1725 -50 -77 -291 58 103 74 -145 38 -202 12 -37 -143 104 -329 -214 -24 -25 8 107 -237 -144 83 -331 61
1748 61 181 54 -142 152 -168 49 389 26 -151 71 -124 48 -21 -146 168 39 -199 -129 -417 75 -219
$$ packed form
1585a00J01j04j0Q3l2o4P5j32j51M14O5j31Nn4K24j15k51K71p4j8mP1o5k01M25
1610B28m23K85j90J70k92J98J8J30k0o6j24L12l14%L09k09J5k99L52j15J20j41
1632e6J62j2j12j33K88P0k32K2K22m16L39j44Q1o1J07j22p0k10K86J3K63n7k60
1655c2J7j16L01k45J05j67J84m3N3k13J43r3lM0O9J20k08M8J50j3o8Mm3r8L35
1680B27l30J75j45J80p8l80L28P0J8O2k7J30l23J3r5J03j95L09J09k00K1r7j03
1703b28M28k20J5K26k9j95p9rM26l71J21j98K06j63K50r2j91M78l24J58j04j55
1725e0k7k14L49M5k9k19J83k40K14m9j06K47m33J15J90jL3R9l44R3K27m14L92
1748F1J20j27j96K94l20K17L40l63j77K22j95J72o9j25L14j29k38P0k88M92k94
$$ plain form
1769 -219 278 -37 -71 132 -50 -18 9 162 -175 140 -125 21 -26 -71 -109 13 94 27 -87 -203 -43 -149 50
1792 50 -63 52 -154 59 -77 -149 258 -132 -108 -26 -67 -237 8 -252 -154 -162 -39 24 -206 -159 -4 18 184 -75
1816 -75 157 85 126 -144 142 95 74 -217 74 183 -70 54 -45 -110 -21 -213 -201 -70 -93 -139 -53 22 -116 -95 -15
1841 -15 -77 -427 311 35 48 76 -9 -232 -170 -64 47 33 -58 49 45 -196 77 151 132 80 -126 -37 218 18 35
1866 35 -87 -215 -87 13 188 102 231 -102 123 -240 -232 -90 -36 -134 283 10 113 -38 33 -57 -199 95 -81
1889 -81 -123 -194 33 247 -282 -50 51 9 -4 -247 -62 50 158 145 32 -153 -148 88 -18 -93 258 196 220 -102
1913 -102 127 267 -6 -232 10 72 -78 53 -269 -104 202 158 -197 45 5 -56 21 -36 -80 -71 -65 45 -18 205
1937 205 -24 -138 -240 65 35 25 242 -57 -155 -333 -81 57 163 112 30 -17 -86 -73 73 -104 24 -232 243
$$ packed form
1769b19M97l15l4K03j82L2K7J53l37L15k65J46m7m5l8J22Q1o7j14j16J60j06J99
1792E0j13J15k06K13j36p2M07l90K4Q2m1j70K45k60R8qJ23O3k30M7J55K2J66k59
1816g5K32p2M1k70K86m7k1k91K91J09k53J24r9o5Q9j92J2J31k3m6Q6P5j38K1Q0
1841a5o2l50P38k76J3K8q5k23O2J06J11j4r1J07mk41K73P4j9n2k06Q9K55k00J7
1866C5j22j28J28J00J75q6J29l33K25l63QJ42N4r8M17k73J03j51P1r0j42K94j76
1889h1m2p1K27K14n29K32J01m2j3k43J85J12J08j3j13j85NK36j06p5L51o2K4l22
1913a02K29J40k73k26K42O2j50J31l22J65L06m4l55K42m0o1P7n7m4ROJ10o3K23
1937B05k29j14j02L05l0j0K17k99r8j78K52J38J06n1q2m7o9J3J46j77J28k56M75
$$ plain form
1960 243 30 159 -56 -281 98 -244 19 -77 -195 -111 -24 78 -144 149 -179 62 -17 -153 -69 265 -22 132
1982 132 86 186 291 -74 61 101 -74 34 -37 -67 49 -144 164 104 33 135 -32 -112 -89 -161 344 -19 146
2005 146 197 107 45 310 105 26 -113 123 37 138 132 25 -86 77 -103 -21 -6 21 -23 -123 60 -138 284 -50
2029 -50 233 -14 21 -32 52 88 185 10 -109 -156 -83 -172 274 80 14 5 149 -99 190 -140 222 -96 205 -88
2053 -88 10 87 168 129 -67 134 36 -29 -16 20 -176 -79 29 26 132 -71 -24 174 -55 45 -2 170 -122 -58 -267
2078 -267 146 296 147 118 21 -72 -88 -100 14 -72 50 114 69 -180 -36 -64 -57 -76 24 -185 -102 -60 172 80 214
2103 214 251 1 73 -58 216 -79 -52 113 43 285 -60 65 -57 -15 -46 268 225 -44 154 -26 -30 -271 239
2126 239 -25 45 -329 265 -101 49 12 -31 26 208 88 -166 -135 -148 -162 -114 144 -128 -55 61 -39 -220 -38
$$ packed form
1960B43k13J29k15k25L79l42K63r6j18Q4Q7J02k22K93l28K41p9j36Q4L34k87J54
1982A32m6J00J05l65J35M0j75J08p1l0J16j93L08o0p1J02j67q0K3p2N05l63J65
2005A46N1r0o2K65k05p9j39K36q6J01oj07j11J63j80Q2J5K7m4j00J83j98M22l34
2029e0K83k47L5n3Q4L6R7j75j19m7P3q9M46j94o6rJ44k48K89l30L62l18L01k93
2053h8R8P7Q1l9j96K01r8o5J3L6j96R7J08lJ06k03M7J98k29J00m7J72k92O4k09
2078b67M13J50j49k9r7r3j6j2J14q6J22O4m5k49J44k8Pj9J00k09Q3M2K32r2J34
2103B14L7k50P2j31K74k95K7J65p0K42l45J25j22M2l1L14m3k69J98j80mk41N10
2126B39k64P0l74N94l66J50l7m3N7J82j20k54L1j3j4M8K58k72P3J16j00j81J82
$$ plain form
2149 -38 300 18 20 -166 166 312 -196 -68 -8 -4 -253 -94 -312 -4 70 132 232 -38 289 106 101 -37 262
2172 262 24 375 186 270 -48 -201 0 220 -8 -12 -78 -82 210 -143 -175 -77 23 64 154 -51 -46 19 189 18
2196 18 -50 -75 243 106 -29 -44 1 -230 276 12 -248 27 69 -3 55 -266 -5 -98 -30 444 244 -88 -169 67
2220 67 106 -107 122 -5 130 19 -242 262 -57 105 -78 -23 57 -100 -65 -159 12 -128 -110 121 -105 35
2242 35 -6 -21 -129 14 12 203 47 -27 142 213 -67 -241 403 55 68 -43 -174 -91 -80 -62 195 184 350 -240
2266 -240 -134 -91 -108 97 245 67 224 188 -175 -99 -179 28 -358 -88 82 -193 144 -324 -369 368 213 -66
2288 -66 -79 -109 -297 -248 150 35 -104 -10 -13 284 11 17 57 168 -195 114 -137 51 120 248 240 -228 103 164 267
2313 267 103 -62 -13 15 -221 -61 -121 109 20 34 6 -48 -108 -16 181 -19 -29 84 38 54 -88 -113 -62 -50 -17
$$ packed form
2149c8L38k82Kj86L32J46n08J28O0Mk49J59k18L08P4O2J00k70L27j83nj38K99
2172B62k38L51j89Q4l18j53K01K20k28mo6mK92l53l2R8J00M1R0k05NO5J70j71
2196A8o8k5L18j37j35j5M5k31N06k64k60K75M2p2N8l21K61r3O8M74k00l32q1K36
2220F7L9k13K29j27J35j11k61N04l19J62j83N5Q0j57L5r4J71j40J8K31k26J40
2242C5m1j5j08J43kJ91j56p4J69P1k80j74O44l48J3j11j31Q3J1J8K57j1J66n90
2266b40J06M3j7K05J48j78J57l6l63P6q0K07l86K70J70k75L37m68m5P37j55k79
2288f6j3l0j88M9L98j15j39R4lK97k73OM0J11l63L09k51J88O9J28qm68L31O1J03
2313B67j64j65M9K8k36J60o0K30q9J4k8n4o0R2J97k00j0J13m6J6j42k5N1J2L3
$$ plain form
2338 -17 361 -51 -97 -141 -192 -77 49 -14 -46 -46 149 94 -46 77 -40 0 125 22 185 122 -417 49 45 20 -59
2363 -59 -19 80 85 281 117 133 90 21 -31 -275 12 123 164 233 -93 -17 30 8 38 135 188 -111 139 17 -282 -200
2389 -200 233 -71 70 164 203 -181 -317 -8 41 -207 92 -41 -30 111 45 152 -327 91 76 -138 -227 -204 -41
2412 -41 214 -300 48 236 -213 150 126 -94 108 23 -105 137 112 227 288 -26 70 -161 -21 243 466 -106
2434 -106 73 37 -165 -111 70 98 214 -30 -129 -38 53 205 302 -239 -191 29 -137 24 22 -291 68 -159 101
2457 101 -2 -230 -40 -10 55 -17 73 97 74 133 -53 -44 316 -80 -169 -191 -372 -54 -259 -312 68 -24 -232 31
2481 31 63 -293 -42 -45 -19 -273 -205 121 -211 27 20 -109 -136 -85 188 56 6 -157 -89 29 62 -141 159 104 -54
2506 -54 -17 80 -245 177 108 149 28 90 171 125 82 -180 0 -169 -138 -159 -207 155 7 19 -172 -188 173 -214 -34
$$ packed form
2338a7L78m12m6m4n1J15J26o3l2%J95n5j40J23j17M0J25j03J63o3n39M66mk5p9
2363e9M0R9NJ96j64J6m3o9n2k44K87J11M1O9l26P6M7k2L0R7N3k99K50j22k99Q2
2389b00M33l04J41R4L9l84j36L09M9k48K99j33J1J41o6J07m79M18j5k14q9K3J63
2412d1K55n14L48J88m49L63k4k20K02q5j28K42k5J15O1l14R6k31J40K64K23n72
2434a06J79l6k02N4J81K8J16k44r9R1R1J52R7n41M8K20j66J61kl13L59k27K60
2457A01j03k28J90L0O5p2R0K4k3N9j86RL60l96q9k2j81L18k05n3L80r2k08K63
2481C1L2l56K51lK6k54O8L26l32K38pj29k7N1K73j32n0j63O8J18L3k03L00n5j58
2506e4L7R7l25M22o9M1j21O2Q1m6m3k62J80j69L1k1m8L62j48J2j91j6L61l87J80
$$ plain form
2531 -34 -54 27 208 258 61 -356 19 30 -18 -173 202 183 200 22 -30 -113 216 -149 -245 128 160 151 -52 -51 -86 20
2557 20 -202 38 15 -14 -105 -83 -5 -36 -119 -298 -29 -187 194 311 -153 232 118 118 -21 -223 56 48 165 -92
2581 -92 -133 -43 137 88 -180 81 -72 -255 257 130 -31 -122 24 -51 39 -49 -6 -330 -97 80 -247 245 -31
2604 -31 93 -140 348 110 -40 120 11 209 49 70 -94 -212 -75 -17 -91 -138 90 19 40 -131 9 132
2626 132 -50 -67 -199 240 -159 258 -227 97 72 -160 32 -58 93 108 -220 10 -238 -80 -65 34 45 93 -99
2649 -99 172 -141 -170 78 9 -313 -88 18 42 189 -51 131 227 -71 -107 -121 -124 13 -158 -180 -1 -6 -263 27
2673 27 -40 69 116 -154 138 139 25 -58 210 396 -163 -121 40 108 57 143 150 -81 -13 87 141 193 -162 -100 -170 414
2699 414 -57 12 -201 -259 181 222 248 -130 12 -113 -40 -71 -90 -7 39 -49 93 -114 78 380 174 -66 27 -16
$$ packed form
2531c4k0Q1J81N0j97m17L75J1m8j55L75j9J7j78n2q3L29l65r6L73L2rk03Jl5J06
2557B0k22K40k3k9r1K2P8l1q3j79K69j58L81J17m64L85j14%j39k02K79qJ17k57
2581i2m1R0J80m9k68K61j53j83N12j27j61r1J46p5R0q8M3l24K33J77l27M92k76
2604c1J24k33M88k38j50J60j09J98j60K1j64j18J37N8p4m7K28p1K1j71J40J23
2626A32j82j7j32M39l99M17m85L24k5k32J92r0J51J5l28K30k48J58J5R9J1M8j92
2649i9K71l13k9K48o9l22K25J06K4J47k40J82R6k98l6j4lJ37j71k2J79nk57K90
2673B7o7J09M7k70K92Jj14q3K68J86n59M2J61O8n1Q6Pk31O8J00N4N2l55O2p0N84
2699D14m71O9k13n8M40M1K6l78J42j25P3l1j9Q3M6q8J42k07J92L02k06k40R3m3
$$ plain form
2723 -16 112 50 -148 -70 -75 -98 -51 -37 76 191 -72 119 143 -51 92 148 -16 50 -92 189 -49 -170 -70 -162
2747 -162 -234 -121 113 40 -342 -287 -92 86 -25 96 -41 -67 -7 -144 129 45 -54 -31 144 -20 229 -229 68
2770 68 10 145 -226 66 -250 -12 -186 -105 -446 -172 24 88 -36 98 -20 -141 49 -346 -219 -152 146 8
2792 8 -106 151 -108 131 40 -91 48 7 -14 -77 86 264 101 -131 -269 -68 -77 118 219 -221 -205 -71 272
2815 272 -1 126 175 273 -18 25 45 20 72 82 39 -2 -138 -60 156 -158 147 -31 -76 -88 141 -91 -108 19
2839 19 -292 173 -12 91 87 243 158 -177 -15 -46 -35 -82 99 -45 57 -215 -122 -84 -50 -15 -65 -235 -230 -1 -87
2864 -87 -104 52 -41 -94 -169 -25 -8 -231 55 110 -113 245 96 -11 -172 -89 -146 -335 -45 -81 48 205 37
2887 37 -103 -207 40 26 77 -173 -38 87 -438 55 -150 3 -17 -145 99 263 91 -92 -45 2 -208 -178
$$ packed form
2723a6J28o2j98P8nk3M7J4J13J15k63J91K4j94J43N6j64O6j42K81k38j21J00r2
2747a62p2J13K34p3l82N5J95J78j11J21j37k6O0j37K73q4r9K3J75j64K49m58K97
2770F8n8J35l71K92l16K38j74Q1l41K74J96O4j24J34j18j21J90l95J27O7K98j38
2792Hj14K57k59K39r1j31J39m1k1o3J63J78j63k32j38K01rJ95J01m40J6J34L43
2815B72k73J27M9R8k91M3K0k5N2J0m3m1j36P8K16l14L05j78m5j2K29k32j7J27
2839A9l11M65j85J03mJ56q5l35J62l1J1m7J81j44J02k72R3L8L4L5n0j70NK29q6
2864h7j7J56r3n3p5J44J7k23K86N5k23L58j49j07j61Q3n7j89K90l6J29J57j68
2887C7j40j04K47j4N1k50J35J25n25M93k05J53k0j28K44J64j72j83M7M7k10L0
$$ plain form
2909 -178 45 -74 104 344 60 -269 35 -21 225 -120 -235 -24 81 71 126 100 19 73 -274 154 -144 -97
2931 -97 300 -272 -68 344 24 117 163 169 -20 -21 -34 -116 141 -111 -5 53 -65 47 -76 -153 -44 -21 -81 -60 46
2956 46 -51 40 -114 -5 -77 6 44 -216 -114 -402 9 154 409 -163 123 129 -135 71 -239 -117 -41 -70 -6 293
2980 293 91 -37 171 -187 -252 -146 360 -99 193 139 -184 -297 204 -141 -192 163 178 203 185 -46 269 50
3002 50 -53 -38 16 -164 18 244 16 230 39 20 127 90 -2 98 -339 37 4 31 74 -115 266 14 -51
3025 -51 -95 -96 -98 -101 47 -83 -6 297 6 -140 184 -286 -184 166 379 -29 168 -63 83 8 -103 -43 44 135
3049 135 30 -182 -126 -115 -46 130 195 201 3 187 231 242 -126 85 -24 -46 -229 -101 -291 185 -46 247 47
3072 47 180 40 -12 -45 -238 84 -12 -126 -364 203 149 156 -69 119 18 -5 11 -34 -14 35 183 99 109 106 -39
$$ packed form
2909a78K23j19J78K40k84l29L04n6K46l45j15K11J05j0N5k6q1N4l47M28k98M7
2931i7L97n72K04M12l20R3M6Oj89jj3q2K57k52J06N8j18J12j23p7J09K3o0K1J06
2956D6r7R1j54J09p2Q3L8k60J02k88M11J45K55n72K86Ok64K06l10J22P6k9O4K99
2980B93k02j28K08l58o5J06N06m59K92n4l23j13N01l45n1L55J5K5j8k31L15k19
3002E0j03J5N4j80J82K26k28K14j91j9J07l7r2J00m37L76l3K7M3j89L81k52o5
3025e1m4jklJ48j30P7L03k91j46L24m70J02L50K13m08J97k31J46p5j11O0Q7R1
3049A35j05k12N6J1O9J76O5Oj98J84M4J1l68K11j09k2j83J28j90M76k31K93k00
3072D7J33j40n2l3j93L22r6j14k38N67n4Pk25J88j01k3J6m5K0M9J48q4J0lj45
$$ plain form
3097 -39 32 -86 -184 -161 -71 27 121 81 -110 -64 141 -27 278 59 96 -138 89 304 -303 -79 114 257 -358
3120 -358 20 -169 27 -69 75 -228 -112 -144 -38 54 256 -62 259 -45 -360 204 -270 -211 -354 67 -63
3141 -63 -39 141 -27 -203 169 50 -48 -84 25 -110 62 147 249 12 -51 120 -87 -79 128 66 -94 -31 -140
3164 -140 -261 -99 -75 -80 16 -42 272 -74 29 152 -63 -36 177 -11 109 218 94 -116 43 49 121 -181 -57
3187 -57 71 -167 68 -125 -78 -19 218 -77 51 -71 -22 -107 49 16 80 278 195 -458 23 96 -156 54 -37
3210 -37 61 -420 -133 157 152 63 -109 -8 -82 107 -229 -16 146 -171 -173 -67 187 150 -77 -72 156 53 7 196
3234 196 127 43 -231 -107 24 -31 89 -32 -90 22 -110 -136 -35 235 17 219 -103 174 -35 -30 -78 -41 101
3257 101 -19 -206 187 -38 -143 -126 206 181 19 -61 -186 5 -79 -123 -168 51 -97 19 62 47 32 -341 100
$$ packed form
3097c9P1j18r8K3R0R8R4m0j91M6K05j68L05k19L7k34K27K15o07K24J93J43o15
3120c58L78j89J96r6J44l03J16l2J06R2K02l18L21l04l15N64m74N9j43M21j30
3141f3K4J80j68j76L72j19r8l6J09j35J72Q5J02k37o3J71k07QK07o2j60O3j09
3164a40j21J62K4nR6n8L14l46J03J23k15K7K13j88J20J09j24k10J59OP2l02J24
3187e7J28k38K35j93M7N9K37k95J28j22M9q5J56l3O4J98q3o53M81P3k52K10r1
3210c7R8m81K87K90nq9j72J01p4J89l36K13J62l17kJ06K54l7k27NK28j03m6J89
3234A96o9q4k74J24J31n5J20j21n8J12j32k6J01K70k18K02l22K77k09Nm8L7J42
3257A01j20j87L93k25j05J7L32k5j62q0j25J91q4m4m5K19j48J16M3j5j5l73M41
$$ plain form
3280 100 206 89 157 -145 -355 -70 136 -4 -147 -323 -128 206 -52 353 153 124 174 -97 4 163 53
3301 53 -112 -33 83 151 -313 166 17 167 126 171 -134 0 -211 27 132 145 85 -19 -116 64 -105 -106 7
3324 7 14 -124 -89 181 -112 -58 80 -99 -1 -195 172 108 -30 82 -2 49 -273 45 5 -5 -80 50 154 17
3348 17 -7 55 103 173 -64 -68 -9 -170 168 240 178 132 -131 -158 3 258 123 -89 -146 189 38 111 147 46 -33
3373 -33 204 4 1 125 -133 22 347 -105 54 -53 -74 39 -157 -147 -86 -18 187 204 60 -36 -102 -156 163 -38
3397 -38 61 52 115 248 -92 -145 106 180 111 -5 -64 22 10 36 -203 238 130 -137 308 -14 139 84 -33 92
3421 92 191 28 -150 -99 15 -56 176 195 13 -123 -18 176 105 -222 11 -38 -116 243 -9 -115 79 -45 227
3444 227 -180 -123 183 -125 120 35 45 12 48 -106 -7 -182 -141 -340 240 30 73 -54 -75 33 -47 -185 18
$$ packed form
3280A00J06j17O8l02k10K85K06j40j43j76J95L34k58M05k00k9N0k71J01J59j10
3301E3j65P9J16O8m64M79j49J50m1M5l05J34k11K38J05J3o0j04r7J80j69jJ13
3324GPj38L5K70k93N4J38j79R8j94L67o4j38J12q4N1l22L18m0j0p5J30J04j37
3348A7k4O2M8P0k37mN9j61L38P2o2m6k63k7J61K55j35k12n7L35j51P3L6j01p9
3373c3K37k00lJ24k58J55L25m52J59j07k1J13j96J0O1O8K05J7j44r6o6n4L19k01
3397c8R9rO3J33l40n3K51P4o9j16n9Q6j2K6k39M41j08k67M45l22J53n5j17J25
3421I2R9j63j78N1J14p1K32J9j82j36J05J94p1l27K33m9p8L59k52j06J94j24K72
3444B27m07N7L06l08K45q5J0l3L6j54R9j75M1j99N80k10M3j27k1J08q0j38K03
$$ plain form
3467 18 39 94 194 -19 -57 68 -43 193 54 -86 -247 31 -1 313 -177 -90 41 -161 126 -8 104 36
3489 36 -123 45 -190 -3 -71 90 -167 95 -88 43 -62 -202 -27 -52 -44 -89 164 78 106 37 -278 37 -214
3512 -214 -184 -28 -156 132 23 -133 -121 -259 46 -82 -190 44 -30 106 -59 -389 -165 -121 258 -129 84
3533 84 -164 30 -138 53 46 -208 -15 128 164 -31 23 350 -94 66 -83 -224 -153 -113 -121 218 -164 -222 -159 36
3557 36 -61 77 -105 -23 -89 253 -168 -31 22 107 165 -122 217 -146 -145 -110 21 69 -96 133 -30 -60 -208 3
3581 3 -88 -67 96 35 -169 -167 9 -360 -365 -204 -89 65 -6 -118 -173 -122 136 175 -178 179 -7 -168 -196 -1 142
3606 142 355 229 50 -66 90 105 181 -30 3 186 -26 -90 138 4 27 178 233 399 -148 272 96 -171
3628 -171 62 63 102 320 109 -251 5 13 -37 -15 298 97 -130 -15 84 -43 25 -60 -164 -59 35 67 101 194 -141
$$ packed form
3467A8K1N5J00k13l8J25j11K36j39j40j61K78l2L14m90Q7J31k02K87j34J12o8
3489C6j59J68k35J87o8J61k57K62j83J31j05j40J75k5Qm5K53q6K8o9l15L15k51
3512b14L0J56j28K88j09j56J2j38L05j28j08K34p4J36j65l30K24M4L79l87K13
3533H4k48J94j68J91pk54J93J43L6j95N4L27m44J60j49j41P1M0qL39l82n8O3J95
3557C6r7J38j82Q2o6L42m21J37N3Q5N8k87L39l63JL5J31M8j65K29j63l0j48K11
3581Cr1K1J63o1k04KJ76l69nJ61J15J54p1j12n5N1K58L9l53L57j86j61k8J95J43
3606A42K13j26j79j16J56J5P6k11L3J83k12o4K28j34K3J51N5J66n47M20j76k67
3628a71K33JL9K18k11l60K56Qn0K2L13k01k27J15R9j27O8q5j04J05R4L2L4R3l35
$$ plain form
3653 -141 109 -234 -168 10 -172 -147 -90 -8 -116 -120 171 -137 41 161 63 -113 -44 -15 -143 160 18 100 -140
3676 -140 415 20 -30 -79 160 178 -87 189 -266 -37 -139 131 24 -197 185 -154 225 -279 183 80 324
3697 324 -18 -181 -3 26 -21 -58 -110 33 -464 32 -195 -295 -279 -290 139 45 -17 62 -305 -32 -70 -31 205 31
3721 31 92 -72 26 -148 190 174 55 203 93 225 310 -27 -153 13 81 330 -224 139 50 23 -194 -147 -276
3744 -276 -184 214 6 -32 -201 44 -233 -189 -58 -21 -17 77 18 181 26 -185 24 173 -53 93 -148 368 138
3767 138 -136 -4 125 28 165 -4 119 140 177 102 140 27 121 267 -254 -252 -13 310 -16 -56 173 50 -213
3790 -213 61 -82 1 -187 89 -149 47 23 123 -162 -126 66 -89 -15 40 -55 -64 -313 96 -270 -28 -60 -154
3813 -154 -127 -192 -128 347 92 -56 93 -168 61 -43 -215 105 -71 -91 -259 -52 18 -274 18 -106 -34 63
$$ packed form
3653a41K50l43O6J78j82K5N7Q2j08mK91l08J78J20r8j76O9K9j28L03j42Q2k40
3676a40N55l95n0m9K39J8k65K76m55K29j02K70j07k21L82l39L79n04M62j03K44
3697C24l42j63J78K9m7l7n2J43m97M96k27j00J6j1M29r4o2P9l67K73l8L9K36j74
3721C1O1j64R8j74L38j6j19J48j10J32Q5l37j26J66O8K49n54L63q9k7k17M7j29
3744b76R2L98k08l8j69K45k77M4J31L7MR4n9J63j55k11K09J49k26J46k41N16k30
3767A38k74J32J29r7J37j69J23K1L7p5L8j13R4J46n21KK39L23l26m0K29j23k63
3790b13K74j43Q3j88K76k38J96k4J00k85L6J92j55P4N5r5rk49M09l66K42l2r4
3813a54K7o5O4M75k55j48J49k61K29j04j72L20j76k0j68K07P0k92K92j24P2R7
$$ plain form
3835 63 171 168 33 -164 -20 -86 -77 12 -211 40 55 -195 77 -67 127 -76 139 -62 122 46 124 59 -203 76
3859 76 51 -73 -14 25 -38 80 190 146 -279 -12 -120 -12 -65 176 -46 -423 306 103 -12 -177 -96 188 53
3882 53 73 39 92 -252 9 -150 -143 -135 -98 -52 176 -118 88 81 79 242 132 47 -137 253 325 102 -254 134 -47
3907 -47 -141 284 -12 21 194 -120 -42 -32 25 31 -10 -126 -8 29 153 -415 -46 250 -205 115 -293 36 215
3930 215 75 -93 36 -239 59 55 -208 -138 -71 -78 -161 -78 98 465 -11 74 -41 -323 -62 127 -74 165 364
3953 364 -45 -41 -44 -15 25 15 136 270 49 221 24 152 -196 -30 -33 184 -108 -67 202 -222 59 275 -308
3976 -308 -24 1 76 245 -162 10 81 23 -99 -60 -44 35 -140 -31 42 10 -290 -43 379 17 -134 78 -16
3999 -16 32 82 144 17 -6 82 -222 -276 63 -1 37 -14 157 97 -37 -247 -279 -21 -77 338 19 -37 -169 59 236
$$ packed form
3835F3J08lj35j97J44o6RQ9k23K51J5k50K72j44J94k03K15k01J84p6P8o5k62K79
3859G6k5j24N9L9o3J18J10m4m25K67j08J08n3K41k22l77P29k03j15j65Q1K84j35
3882E3K0l4N3l44K61j59PQL7M6K28k94K06pkJ63j10q5j84L90P2k23l56L88j81
3907d7r4M25k96L3J73l14P8J0N7Om1j16J18L7J24n68L69K96m55L20m08L29J79
3930B15j40j68J29k75K98mk63P0O7pq3Q3J76L67m76Q5j15k82K61J89k01K39J99
3953C64m09MlK9M0j0J21J34k21J72j97J28l48J66lK17k92M1K69m24K81K16n83
3976c08K84K5P5J69m07J72P1n8j22L9J6P9j75J09P3l2l00K47M22l62j51K12r4
3999a6M8N0O2j27k3Q8l04n4L39o4L8n1J71o0j34k10l2K58n6M15l19n6j32K28J77
$$ plain form
4024 236 72 -237 32 -76 249 -283 51 -111 -20 117 48 68 -347 -3 42 -163 -271 -37 69 214 158 171
4046 171 -464 -237 84 28 184 -224 -113 51 71 -46 -104 -106 2 18 -222 109 13 -112 -238 -12 -188 11
4068 11 -109 93 12 -72 8 179 -299 -107 150 -11 124 -188 11 -7 110 60 -11 -125 84 -258 165 -57
4090 -57 140 -5 -82 11 -13 26 -19 145 -10 -256 56 127 0 149 2 -191 260 -96 -144 41 -16 26 89 -80
4114 -80 -296 77 147 102 -162 135 -40 183 246 -25 124 274 -34 169 -15 -22 -176 109 -189 30 348 -224
4136 -224 -70 -8 -68 -273 -167 -36 -92 -106 -20 38 -217 -10 147 -122 73 -219 -202 -24 208 14 -51 -59 -89 -120
4160 -120 54 -252 -5 54 331 222 35 177 169 -23 -44 -241 -64 123 -51 -69 -126 37 -107 255 217 -25
4182 -25 -332 -50 145 110 59 -95 170 135 -189 -25 -213 -164 -62 -38 -52 -139 12 3 48 -13 -57 -323 -114 160
$$ packed form
4024B36j64l09K69j08L25n32L34j62R1J37o9K0m15L44M5k05j08K34J06J45n6J3
4046A71o35K27L21n6J56m08J11J64K0j17n8kJ08J6k40L31r6j25j26K26j76J99
4068A1j20K02q1q4Q0J71m78J92K57j61J35l12J99j8J17n0p1j14K09l42M23k22
4090e7J97j45p7R3k4L9m5J64j55k46L12P1j27J49j47j93M51l56m8J85n7M2O3j69
4114h0k16L73P0m5k64K97j75K23O3k71J49J50l08K03j84pj54K85k98K19L18n72
4136b24J54O2o0k05J06J31n6j4Q6N8k55K07J57k69J95k92J7J78K32j94o5ql0l1
4160a20J74l06K47N9K77j09j87J42qj92k1j97J77J87j74j8n7J63j44L62l8k42
4182b5l07K82J95l5n1j54K65l5l24J64j88M9J02K4j4q7J51rM5o1m4k66K09K74
$$ plain form
4206 160 57 -101 168 25 147 34 58 116 -178 -100 -165 -108 -141 -129 -30 44 6 -244 -17 170 -91 -116 247 -81
4230 -81 98 -165 -416 -289 -459 -247 -186 268 63 -208 23 -140 231 145 100 82 51 -44 -72 -90 -36 -103 -126 73
4254 73 -27 -133 -80 -192 -136 94 -21 -194 81 109 62 -196 181 256 -27 70 -47 -45 156 269 -38 47 167
4277 167 -16 -281 216 -108 110 -92 78 -117 411 111 52 133 -201 -207 -28 -207 -209 148 -219 72 -8 46 60
4300 60 13 -17 -34 79 105 241 -299 -44 -117 5 -25 204 -106 18 -130 -43 -17 22 -169 -10 -21 -10 -24 100
4324 100 78 -69 12 -24 -87 -19 -62 17 -58 117 196 125 -284 -20 -151 102 70 -13 205 159 77 -47 -97 12 108
4349 108 -143 -108 227 -73 58 90 34 -65 298 120 -115 -46 199 60 -145 9 278 71 165 77 36 -9 37
4372 37 47 182 221 -234 -121 200 -131 -102 -6 -56 67 110 -29 -93 -158 -53 -125 149 36 246 20 -240 112
$$ packed form
4206A60j03j58K69j43J22j13K4N8k94P8o5N7l3J2R9P4l8k50K27J87k61k5L63l28
4230h1J79k63k51J27j70K12O1M54k05k71K31j63L71q6m5j8l1r5k8j8N4o7k3J99
4254G3j00j06N3j12N6K30j15j73K75K8m7k58L77P5k83R7j17KK01J13l07Q5J20
4277A67j83k65M97l24K18k02J70j95N28l00n9Q1l34oJ79j79kL57l67K91q0N4J4
4300F0m7l0j7J13K6J36n40K55p3J22l0K29l10J24j48Q7K6L9j91J59j1J1j4J24
4324A00k2j47Q1l6o3O8m3P9p5J75P9p1m09K64j31K53l2q3K18m6q2j24n0J09R6
4349A08k51L5L35l00J31L2n6r9L63j78k35O9K45j39k05J54K69k07R4q8m1m5M6
4372C7J0J35L9m55J13L21l31K9R6n0J23M3j39o4o5J05p2K74j13K10k26k60L52
$$ plain form
4395 112 182 92 -158 -383 -11 215 144 -164 -12 -155 -131 40 138 -45 94 -69 119 80 146 35 80 54 -109
4418 -109 -96 -32 32 -89 302 10 103 204 144 -252 -63 63 -407 -7 112 163 8 -137 -4 110 4 137
4440 137 289 -84 309 -149 -20 52 -125 56 -82 -53 19 -139 71 -229 -143 10 296 57 -37 193 121 3
4462 3 126 -100 84 207 29 145 35 -48 -17 -14 -117 249 -19 -198 82 -143 -50 -87 -123 4 159 75 -16 -226
4486 -226 73 121 -37 123 60 48 69 -108 -128 -134 55 209 -192 -88 -83 -97 -23 72 18 42 91 45 13 -9 108 56
4512 56 276 24 -45 -195 -72 -168 -168 75 277 133 23 -49 -36 144 369 -16 36 -7 -75 30 -103 -45 -260 -77
4536 -77 -111 221 192 -237 12 -94 231 46 16 290 -34 -102 -208 -48 260 25 237 -109 -243 54 46 214
4558 214 61 -32 138 192 312 -21 -36 14 -206 121 43 -100 131 74 58 258 92 134 194 -220 -70 175 -154
$$ packed form
4395A12P0r0k50k25L72K26p1l08J52j43K4J71R8j83J39j63J88l9O6j11M5k6j63
4418a09J3O4O4j21L91k92R3J01o0l96J89J26m70M00J19N1j55j45J33J14j06J33
4440A37J52l73L93m58J29P2j77J81j38K9P2j58K10l00Q6J53K86k39r4K30p2j18
4462CJ23k26J84J23j78J16j10q3L1Lj03L66k68j79K80k25R3l7l6J27J55q4r1k10
4486b26K99M8j58J60o3j2K1j77k0oJ89J54m01J04Nj4P4R5n4K4M9m6l2k2J17n2
4512E6K20k52o9j50J23r6%K43K02j44j10p2J3J80K25l85N2m3o8J05j33N8k15J83
4536g7l4L32k9m29K49j06L25j85l0K74l24o8j06J60L08k35K12l46j34K97qJ68
4558B14j53r3J70N4J20l33j5N0k20L27p8j43K31n7j6K00j66M2O0m14J50K45l29
$$ plain form
4581 -154 142 8 -28 -65 266 128 -199 -33 -66 73 -43 36 -155 155 176 73 -234 203 127 129 -176 -84 -236
4604 -236 187 -74 -35 165 -329 190 -103 -24 129 -9 145 22 -21 -8 120 23 209 44 -1 127 -340 -178
4626 -178 -45 49 115 -30 99 -64 120 -76 -203 -105 30 141 -57 -177 -109 182 -35 -134 65 18 -75 122
4648 122 -139 112 177 221 -214 17 -1 -96 8 125 79 -412 -86 -15 -154 -130 -18 155 -63 208 -170 31
4670 31 190 -201 149 -20 89 172 69 -119 -96 174 -91 -145 -8 136 11 97 61 -30 282 -74 -85 3 -96
4693 -96 197 171 -76 286 80 -84 122 21 -90 106 27 284 -63 -138 -212 154 -8 114 138 -74 -107 -176 55
4716 55 71 -146 -4 87 92 29 -97 289 -27 37 -85 -32 -153 85 206 -155 202 -243 -159 -116 19 52 -226 56
4740 56 -105 -7 56 162 -241 -190 -74 40 128 15 -157 -127 -175 -68 199 -58 18 8 119 -85 55 -42 -241
$$ packed form
4581a54K96j34l6l7L31j38l27J66l3J39j16P9j91L10K1j03l07M37p6Kl05R2j52
4604b36M23k61L9K00m94N19k93P9J53j38J54j23m3J3J28r7J86j65m5J28m67J62
4626a78J33R4O6j45J29j63J84j96j27R8J35J11j98j20O8K91k17r9J99m7r3J97
4648A22k61K51O5M4m35K31j8r5J04J17m6m91L26P1j39K4J12J73k18K71l78K01
4670C1J59l91L50j69J09Q3j03j88K3K70k65n4J37J44j25Q6l6r1L12l56j1Q8r9
4693i6K93k6k47L62k06j64K06j01j11J96p9K57l47p5p4L66j62J22K4k12l3o9K31
4716E5J6k17J42R1No3j26L86l16O4j22N3j21K38J21l61L57m45Q4M3J35L3k78K82
4740E6j61R8O3J06m03N1J16J14Q8j13j72L0m8J07K67k57P6j0J11k04J40r7j99
$$ plain form
4763 -241 126 -167 -142 -171 -217 52 -150 123 -65 384 232 -58 -16 -98 260 103 -70 109 -90 63 325 50
4785 50 -125 19 -19 135 -15 -247 41 -36 228 56 -244 -113 7 -317 -297 -37 242 128 -42 -96 283 14
4807 14 -76 -144 132 162 16 -40 -44 126 74 -26 -9 9 -133 -135 102 55 -162 14 -216 154 -16 -195 -77 -50 -118
4832 -118 -173 -190 -60 62 -142 124 25 -113 121 315 82 152 290 -74 -58 36 0 -158 58 -307 43 -42 205
4855 205 7 -179 -4 182 346 -38 -165 -82 62 -35 -232 -92 40 132 106 -38 -37 -324 22 85 41 -58 -58 -47
4879 -47 -68 -13 -21 6 -155 68 9 140 -21 49 13 161 -103 84 208 127 81 45 -83 332 -41 -215 24 -67
4903 -67 189 194 -36 331 -2 -39 25 -1 51 36 -128 -170 -147 3 -172 -64 26 -13 108 -65 7 125 -48 -50 69
4928 69 -68 151 -4 -164 -137 -83 -34 1 -137 75 -107 -59 -251 -139 180 -436 4 -55 -82 -288 59 141 5
$$ packed form
4763b41L67k93K5k9m6K69k02K73j88M49j52k90M2q2L58j57j73J79j99J53K62k75
4785E0j75J44l8J54j50k32K88p7K64j72l00J31J20l24K0K60K79j14j70n4L79k69
4807A4r0o8K76L0j46n6mJ70n2j00J7J8j42kK37m7k17J76k30L70j70j79J18K7o8
4832a18n5j7J30J22k04K66r9j38K34J94k33P0J38l64J6R4l6j58K16l65L50q5K47
4855B05j98j86J75J86J64l84j27Q3J44r7j97J40J32R2k6j44Jk87L46O3m4r9%J1
4879d7k1N5qK7j61K23n9J31j61P0l6J48k64J87J24q1m6l6j28M15l73j74K39r1
4903f7K56Nk30L67l33l7O4k6N2j5j64m2K3J50j75J08R0l9J21j73P2J18j73kJ19
4928F9j37K19j55j60K7N4M9L5j38K12j82M8j92J12L19o16M40n9k7k06L47Q2j36
$$ plain form
4951 5 -146 20 19 -112 120 -47 -1 -31 -85 -71 -89 -121 98 -127 -95 4 16 -5 -22 -137 186 -93 -47 133 313
4976 313 -278 -22 30 -219 -119 -204 -1 -392 -141 -142 -8 48 -7 142 18 -63 -4 -8 -175 -99 237 -181 89 -54
5000 -54 7 261 124 -98 124 -150 -43 20 78 -37 -181 -40 -253 393 -14 165 -86 -163 193 5 124 281
5022 281 206 105 53 -195 129 81 323 -26 -85 63 -37 72 55 137 88 27 338 -17 -89 3 216 7 -17 -169
5046 -169 213 -19 191 -215 136 -366 -104 156 42 158 -33 -24 -397 152 156 -62 -26 2 -117 -118 108 -156 -27
5069 -27 215 -207 -73 106 6 -30 -181 84 -126 56 -36 189 44 65 -48 66 -64 -14 280 -363 -35 144
5091 144 4 -33 205 21 134 48 -136 88 34 5 218 167 11 -213 77 75 103 16 -98 71 226 -158 214
5114 214 25 -225 76 61 71 110 -129 -49 -37 -273 19 250 42 -43 -83 -180 123 120 -205 166 33 127 54 -130
$$ packed form
4951Ej51J66jj31K32j67M6l0n4J4j8l2K19k25L2R9J2k1j7j15L23k79M6J80J80
4976C13n91K56N2k49J00q5K03l91K51jJ34N6n5J49j24q1N9mj67P6L36m18K70j43
5000e4O1K54j37k22K22k74J07O3N8j15j44J41k13O46m07J79k51p7L56j88J19J57
5022B81p5j01n2k48L24m8K42l49n9J48j00J09j7Q2m9o1L11l55p2R2K13k09k4j52
5046a69L82k32K10m06L51n02K62K60j14J16j91Rl73N49Mk18L6K8j19jK26k64J29
5069b7K42m22J34J79j00l6j51K65k10J82r2K25j45K1j13J14j30N0K94o43L28J79
5091A44j40l7K38j84J13q6j84K24n4k9K13n1j56k24K90kK8q7j14J69J55l84L72
5114B14j89k50L01j5J0L9k39Q0J2k36K92K31k08q5m0r7L03ll25L71j33R4p3j84
$$ plain form
5138 -130 115 -439 40 53 -41 -30 -71 11 -63 -115 100 -270 74 34 253 112 -96 -81 -99 201 -189 37 -18 -36
5162 -36 39 -298 -244 105 -71 15 -46 35 4 -38 85 -4 108 -245 222 -100 99 -267 102 105 -186 -86 -104 119
5186 119 172 206 -165 79 29 143 191 -147 145 70 74 -36 63 -40 -90 62 -113 156 97 37 183 88 -174 154
5210 154 -139 20 1 108 0 -47 -155 -167 96 202 72 -57 153 151 47 171 -68 170 -316 -59 -256 -182
5232 -182 288 4 -188 -15 -37 35 -234 108 -121 -168 92 -15 316 -68 79 97 133 133 221 84 -153 249 47
5255 47 54 -111 -95 -232 159 1 172 -75 -80 16 -143 200 -27 -142 -359 -218 -195 -136 -116 4 -81 65 -257 -206
5279 -206 53 18 -247 -13 112 -149 -111 -87 186 -308 33 247 -33 11 -169 54 -107 -178 -111 49 233 -180
5301 -180 -24 -162 158 256 -32 -1 -22 28 48 142 -111 -56 -51 -137 36 -98 -30 -55 2 154 140 156 200 17 -78 50
$$ packed form
5138a30K45n54M79J3r4J1m1Q2p4n2K15l70L44m0K19j41k08J5j8L00l90K26n5j8
5162c6P5l37N4L49j76Q6o1Q1l1m2J23q9J12l53M67l22J99l66L69Lk91J00j8K23
5186A19N3L4l71K44n0J14M8l38K92p5Mj10R9j03n0J52j75K69n9o0J46r5k62L28
5210A54k93J59j9J07j08m7j08j2K63J06j30j29K10kj04J24k39K38m86K57j97P4
5232a82M70k84j92J73k2P2k69L42k29m7K60j07L31l84J47J8L6%Q8j37k37M02k02
5255D7Pj65J6j37L91j58J71k47nR6j59L43k27j15k17J41K3N9K0J20q5J46l22N1
5279b06K59l5k65K34J25k61L8K4K73m94L41K14k80M4j80K23j61p1O7J60J84m13
5301a80J56j38L20R8k88L1k1N0K0R4k53N5Nq6J73j34O8k5N7J52j4J6M4j83r5J28
$$ plain form
5327 50 -207 10 173 20 -194 182 -134 33 15 108 -25 -9 198 -280 -146 167 -151 167 166 -200 71 -261
5349 -261 -197 97 196 95 -104 -118 133 110 157 -116 -95 0 -82 -23 279 -174 -165 -22 17 158 -115 4 154 -8
5373 -8 219 161 -200 123 -123 -89 99 -111 -139 183 51 -208 33 125 -171 126 82 -39 2 274 -309 -44 -38
5396 -38 55 -68 148 177 -227 164 -127 -235 -108 -43 243 -76 72 -70 -172 54 142 498 108 -211 110 -62
5418 -62 62 -4 -98 233 21 -116 -144 -37 271 -76 -162 -38 -138 86 -32 -68 -56 86 -28 -85 -79 90 -242
5441 -242 22 155 -85 -58 -116 144 184 42 -73 -327 14 61 127 -10 -183 148 141 220 -104 8 76 60 -26 138
5465 138 -126 170 -27 59 124 176 -43 -202 96 131 121 -36 -32 -49 -319 -186 53 -14 40 14 22 158 37 -36 267
5490 267 -64 -67 258 -177 -4 184 -184 111 313 -124 114 -41 -47 51 153 -136 186 -431 -178 -244 -107 238
$$ packed form
5327E0k57K17J63j53k14L76l16J67j8R3j33J6K07m78J34L13l18L18jl66K71l32
5349b61O4K94R9j01j99j4K51k3M7k73K1R5q2N9L02m53RJ43L9J41k73J19J50j62
5373hK27n8l61L23k46L4J88k10k8L22j32k59K41R2k96K97m4j21M1K72n83K65O
5396c8R3j23K16K9m04L91k91j08J27O5K86l19J48j42j02K26Q8L56l90l19L21j72
5418f2J24o6r4L31k12j37k8J07L08l47q6J24j00K24j18l6J2J42j14n7OJ69l32
5441b42K64J33k40K7n8K60M0j42j15k54L41M7O6j37j73L31pP9l24J12O8j6q6J64
5465A38k64K96j97Q6O5N2k19j59K98L5j0j57Mj7k70J33K39o7N4k6QJ36j21p3L03
5490B67l31lL25m35J73J88l68K95K02m37K38j55oR8J02k89L22o17K53o6J37L45
$$ plain form
5512 238 -52 11 -28 -60 -231 143 -24 237 -6 321 24 182 46 -83 85 101 -54 -300 -81 130 -21
5533 -21 -62 -124 48 -16 78 148 -75 -77 -81 -232 -41 72 46 -78 40 47 209 224 -225 -37 15 -117 154 -150 -176
5558 -176 -115 61 -26 78 0 284 10 -124 -72 -20 456 38 -52 -114 -144 -18 -118 158 -102 72 -45 -132 7
5581 7 22 -124 250 174 104 -76 -124 -143 -299 -71 -223 170 80 -49 14 0 -123 76 30 -1 199 162 -198 -128 12
5606 12 12 252 -111 -84 88 -220 -107 276 -75 84 -21 -127 -125 70 -117 -177 -44 -87 -113 -300 167 -123 -185
5629 -185 107 -41 219 124 -197 -110 -49 -14 -227 -333 248 -176 130 80 -22 182 134 -79 304 -171 53 72
5651 72 215 -1 156 80 18 -120 181 1 178 14 -294 115 -107 98 8 45 167 122 -201 -13 -73 -54 -275
5674 -275 -97 126 201 -63 72 4 -164 -53 30 -40 -48 109 -66 -141 168 194 -180 -43 135 -95 125 -59 -3
$$ packed form
5512B38k90O3l9l2j71L74j67K61k43L27k97J58j36j29J68J6j55k46K19K11j51
5533b1m1o2J72o4R4P0k23kmj51J91J13k6j24J18PJ62J5m49J88N2j32K71l04k6
5558a76O1J76q7J04p8K84k74j34N2N2M76m18r0o2l0J26j00K76k60J74j17q7J39
5581GJ5j46L74p6p0j80m8j9j56K28j52L93r0j29O3j4j23J99m6l1K00l7l60P0J40
5606A2%K40l63K7J72l08J13L83l51J59j05j06KJ95j87o0J33m3k6j87M67k90o2
5629a85K92j48K60r5l21Q7O1L5k13j06N81m24L06n0j02K04m8k13L83m75K24J9
5651G2J43k16J57p6o2j38L01j80J77j64l08M09k22K05r0L7J22m5l23J88o0J9k21
5674b75J78K23P5k64J35o8j68J11Q3p0qJ57j75p5L09K6l74J37J78k30K20j84N6
$$ plain form
5697 -3 81 -329 -150 9 -96 -8 -3 -98 89 -172 -176 -15 -19 -318 107 36 -115 34 141 149 174 -13 197 44 -111
5722 -111 -337 57 -301 -38 130 25 -107 -136 -111 192 -19 -217 -7 15 27 -8 -163 -6 -118 -64 -18 22 140
5745 140 143 -46 -189 -127 -115 -126 -14 139 -153 155 6 -182 4 7 -163 1 -199 320 349 -45 -212 -28 299
5768 299 73 212 1 -219 229 101 199 150 -231 96 -66 47 -120 39 -80 304 -110 -84 -112 -127 -86 -253
5790 -253 -71 -267 -44 23 -87 1 34 -357 -66 -16 -46 -26 151 97 -117 266 305 56 16 -194 261 -119 -54
5813 -54 -93 68 33 9 71 -47 -117 -44 -118 4 89 -123 -183 47 -76 158 147 -3 34 218 60 -27 -58 -19 -155
5838 -155 -124 -68 -259 51 -24 -35 14 -29 -3 16 48 285 -113 86 0 -145 -160 97 24 155 83 -159 154 203 143
5863 143 37 -64 -354 -219 -248 -15 -33 95 219 -104 -128 121 -73 -290 -172 -53 43 31 -116 181 -145 32
$$ packed form
5697cQ4m10J79J59j05Q8Nr5J87k61mJ61mk99M25p1j51J49J07QK5j87K10j53j55
5722a11k26L94l58K63J68j05j32k9K5L03k11j98K10K2J2l5j55J57j12N4M6M0J18
5745A40Lj89j43O2J2j1J12J53k92L08j49j88J86Lj70J64k00N19K9l94j67J84L27
5768B99k26J39k11k20M48j28R8m9l81L27j62J13j67J59j19L84m14K6k8j5M1j67
5790b53J82j96K23O7j10Q8L3l91K91N0l0K0J77n4k14L83L9k49m0k10M55l80O5
5813e4l9J61l5k4O2j18p0P3p4J22Q5k12o0K30j23K34j1j50L7J84j58q7l1L9j36
5838a55L1N6j91L10p5j1M9m3K6J9L2K37l98J99q6j45j5K57p3J31p2k42L13M9o0
5863A43j06j01k90J35k9K33j8J28J24l23k4K49j94k17J18J19R6j2j47K97l26J77
$$ plain form
5885 32 73 -257 283 104 -139 156 55 151 -106 -50 -95 45 -197 -194 125 -110 -163 -13 -70 -116 -88 28 70 -68
5909 -68 5 19 -204 222 268 -158 40 -22 -24 -123 -184 196 104 210 70 1 172 96 -183 41 112 -29 322 -73
5933 -73 -195 198 -21 225 296 26 185 151 -35 -52 55 -71 -34 55 -10 213 54 83 48 -158 28 54 132 43
5957 43 -45 -242 16 -39 -49 -65 -148 142 -158 42 37 -108 99 73 -179 100 -91 111 -5 -108 123 -135 -73
5980 -73 -213 98 134 107 -255 124 -31 55 325 -257 24 -157 -56 -3 -52 -45 -77 40 18 112 -71 47 86 61
6004 61 -97 177 4 -57 -157 -162 40 -48 -155 -138 24 -276 364 93 55 92 117 88 38 129 -73 20 72 278 -131
6029 -131 -12 -162 77 354 -12 -114 -281 -147 -93 -67 16 233 117 -79 40 -99 -79 238 154 43 -167 -112
6051 -112 -52 124 -391 -133 16 314 -46 161 -49 49 176 -90 64 93 6 228 18 264 -50 266 89
$$ packed form
5885C2M1l30N40j79k43K95j01R6k57N6m5J40k42LL19k35n3J50n7m6K8J16M2j38
5909f8P3J4k23M26M6m26J98o2kr9o1L80r2J06j40o9J71p6k79K24P1j41L51l95
5933g3j22L93k19K46P1k70J59l4j86j7J07j26L7Q9o5K23j59K9l5k06J86K6P8q9
5957D3q8j97K58n5j0j6q3K90l00K00nj45K07k6k52K79j91K02j16j03K31k58O2
5980g3j40L11L6k7l62L79j55Q6K70n82K81j81J01N3m9Pl2J17k2R4j83J18L9k5
6004F1j58K74j73o1j00nK02q8j07J7J62l00O40k71l8L7K5k9n0R1k02R3N2K06m09
6029a31J19j50K39K77l66j02j67J34N4K6Q3K17j16j96J19j39K0L17q4j11k10N5
6051a12O0J76n15K58J49K98l60K07k10R8J27k66J54K9q7K22k10K46l14L16j77
$$ plain form
6072 89 205 1 -174 -9 255 78 67 155 109 130 -141 68 68 163 76 -122 -81 -203 -104 84 240 -160 88 -30
6096 -30 -97 -102 99 -103 -234 80 -134 167 249 32 -41 185 -174 40 -210 2 177 -105 -77 -114 18 -193 59
6119 59 -14 172 -117 -23 15 205 131 124 -225 -58 -99 88 144 253 -199 -29 204 -210 -57 -169 95 -7 -131
6142 -131 -180 -167 0 94 58 286 -111 -6 -112 4 -52 -9 125 49 -192 -1 36 -38 -70 41 -74 -29 36 18
6166 18 21 114 -254 -56 -147 141 171 -156 82 267 -25 132 219 240 7 54 40 -65 85 -169 -105 3 -192 30
6190 30 -294 -36 110 217 148 63 -352 5 139 307 134 107 299 27 -5 -84 52 146 -203 -106 23 207 135
6213 135 -165 -108 -226 120 -2 20 124 -158 383 21 -196 204 -232 136 -109 43 288 -215 -42 26 -101
6234 -101 -133 168 163 -38 84 29 22 86 19 -241 110 171 -179 32 -175 -190 167 -210 188 -42 124 51 -77 -16
$$ packed form
6072H9J16k04j75J65K64j77j1Q8m6K1k71K09%R5q7j98M1j22R9J88J56m00K48j18
6096c0o7nK01k02j31L14k14L01Q2k17p3K26l59K14k50K12J75k82K8l7J32k11K52
6119E9p3J86k89R4L8J90p4pl49J67m1J87N6J09m52J70K33m14J53j12K64j02j24
6142a31m9J3J67R4l6K28l97J05j06J16n6M3J34p6k41J91L7p4l2J11j15M5O5j8
6166A8LR3l68J98r1K88L0l27K38J85k92J57Q7K1k33M7j4j05J50k54O4J08j95K22
6190C0l24K58J46J07o9q5m15L57J34J68j73k7J92k72l2p9J36R4l49R7J29J84p2
6213A35l00N7j18L46j22K2J04k82N41l62k17M00m36L68k45J52K45n03J73O8j27
6234a01l2L01nk01J22n5pO4o7k60L51O1l50K11k07j5L57l77L98k30J66p3j28O1
$$ plain form
6258 -16 -116 -8 -165 -178 -1 122 -190 -26 -78 171 -305 -354 139 -17 73 19 -62 33 174 49 4 -33 203
6281 203 -26 47 43 -60 82 -121 -108 43 -7 105 -218 -249 147 128 -61 -87 29 -114 292 -53 -106 77 -45
6304 -45 212 -59 395 -19 28 -42 -50 64 -208 -104 -34 -218 -235 -202 126 107 -143 -44 192 -93 157 133 -188 -47
6328 -47 -100 -127 163 -102 164 -76 248 -281 -219 145 255 -128 79 -140 -67 3 -116 9 -57 -1 -119 168 -192
6351 -192 68 -297 265 162 -217 -233 31 206 114 73 22 31 -73 44 214 100 -115 -30 182 -259 58 -247
$$ packed form
6258a6j00J08j57j3J77J23l12J64n2K49m76m9M93j56R0n4q1R5J41j25m5l7K36
6281B03k29P3mj03J42k03J3J51n0J12l23l1L96j9j89k6J16j43M06l45n3J83j22
6304d5K57k71M54m14M7p0qJ14k72J04P0j84j7L3L28j9k50R9K36k85K50k4l21J41
6328d7n3k7K90k65K66k40L24n29O2L64J10l83K07k19P3P0j19J25o6N6j18K87l60
6351a92K60l65N62j03l79j6K64J75r2m1n1Rj04J17J70j14k15Q5K12m41L17l05
$$ [...]
8191b9
##END NTUPLES=NMR FID
##END=
