##TITLE=1H_DE-125
 200.13MHz,D2O.
 8 sc
 
 29.1.2026
##JCAMPDX= 6.0         $$ Bruker NMR JCAMP-DX V2.0
##DATA TYPE= NMR FID
##DATA CLASS= NTUPLES
##ORIGIN= UXNMR, Bruker Analytische Messtechnik GmbH
##OWNER= pz
$$ XWIN-NMR		Version 3.5
$$ Thu Jan 29 15:47:41 2026 Russian Standard Time (UT+4h)  she@DPX200
##.OBSERVE FREQUENCY= 200.1313
##.OBSERVE NUCLEUS= ^1H
##.DELAY= (6, 6)
##.ACQUISITION MODE= SIMULTANEOUS
##.ACQUISITION SCHEME= undefined
##.AVERAGES= 8
##.DIGITISER RES= 18
##SPECTROMETER/DATA SYSTEM= spect
##.PULSE SEQUENCE= zg30
##.SOLVENT NAME= DMSO
##.SHIFT REFERENCE= (INTERNAL, DMSO, 0, 14.3821)
##AUDIT TRAIL= $$ (NUMBER, WHEN, WHO, WHERE, WHAT)
$$ ##TITLE= Audit trail, XWIN-NMR		Version 3.5
$$ ##JCAMPDX= 5.01
$$ ##ORIGIN= Bruker BioSpin GmbH
$$ ##OWNER= she
$$ F:/spectra/data/she/nmr/H-C/1/audita.txt
$$ ##AUDIT TRAIL=  $$ (NUMBER, WHEN, WHO, WHERE, WHAT)
(   1,<2026-01-29 15:45:51.51 +0400>,<she>,<DPX200>,
      <created by zg, POWCHK disabled, PULCHK disabled
       configuration hash MD5:
       00 E9 B6 7A A2 85 ED C7 34 08 36 98 17 FE 4E 26
       data hash MD5: 16K
       05 03 93 56 D7 80 C6 E6 93 4C 5F D5 9E A5 BE 60>)
$$ ##END=
$$ 
$$ hash MD5
$$ F0 3B 72 8A B0 78 BF F8 BE CE AB 08 A5 6B FC 1B
##$RELAX= 
##$RELAX= 
##$RELAX= 
##$RELAX= 
##$RELAX= 
##$RELAX= 
$$ Bruker specific parameters
$$ --------------------------
##$DU= <F:/spectra>
##$EXPNO= 1
##$NAME= <H-C>
##$PROCNO= 1
##$TYPE= <nmr>
##$USER= <she>
##$AMP= (0..31)
100 100 100 100 100 100 100 100 100 100 100 100 100 100 100 100 100 100 
100 100 100 100 100 100 100 100 100 100 100 100 100 100 
##$AQSEQ= 0
##$AQ_mod= 1
##$AUNM= <au_zg>
##$AUTOPOS= <>
##$BF1= 200.13
##$BF2= 200.13
##$BF3= 200.13
##$BF4= 200.13
##$BF5= 200.13
##$BF6= 200.13
##$BF7= 200.13
##$BF8= 200.13
##$BYTORDA= 1
##$CFDGTYP= 0
##$CFRGTYP= 5
##$CHEMSTR= <none>
##$CNST= (0..31)
1 1 145 1 1 1 1 1 1 1 1 1 1 1 1 1 1 1 1 1 1 1 1 1 1 1 1 1 1 1 1 1 
##$CPDPRG= <>
##$CPDPRG1= <>
##$CPDPRG2= <>
##$CPDPRG3= <>
##$CPDPRG4= <mlev>
##$CPDPRG5= <mlev>
##$CPDPRG6= <mlev>
##$CPDPRG7= <mlev>
##$CPDPRG8= <mlev>
##$CPDPRGB= <>
##$CPDPRGT= <>
##$D= (0..31)
0 0.7 0 0 0 0 0 0 0 0 0 0.03 0 0 0 0 0 0 0 0 0 0 0 0 0 0 0 0 0 0 0 0 
##$DATE= 1769687150
##$DBL= (0..7)
120 120 120 120 120 120 120 120 
##$DBP= (0..7)
150 150 150 150 150 150 150 150 
##$DBP07= 0
##$DBPNAM0= <>
##$DBPNAM1= <>
##$DBPNAM2= <>
##$DBPNAM3= <>
##$DBPNAM4= <>
##$DBPNAM5= <>
##$DBPNAM6= <>
##$DBPNAM7= <>
##$DBPOAL= (0..7)
0.5 0.5 0.5 0.5 0.5 0.5 0.5 0.5 
##$DBPOFFS= (0..7)
0 0 0 0 0 0 0 0 
##$DE= 6
##$DECBNUC= <off>
##$DECIM= 32
##$DECNUC= <off>
##$DECSTAT= 4
##$DIGMOD= 1
##$DIGTYP= 9
##$DL= (0..7)
0 120 120 120 120 120 120 120 
##$DP= (0..7)
150 150 150 150 150 150 150 150 
##$DP07= 0
##$DPNAME0= <>
##$DPNAME1= <>
##$DPNAME2= <>
##$DPNAME3= <>
##$DPNAME4= <>
##$DPNAME5= <>
##$DPNAME6= <>
##$DPNAME7= <>
##$DPOAL= (0..7)
0.5 0.5 0.5 0.5 0.5 0.5 0.5 0.5 
##$DPOFFS= (0..7)
0 0 0 0 0 0 0 0 
##$DQDMODE= 0
##$DR= 18
##$DS= 0
##$DSLIST= <SSSSSSSSSSSSSSS>
##$DSPFIRM= 0
$$ [...]
##$SUBNAM0= <"">
##$SUBNAM1= <"">
##$SUBNAM2= <"">
##$SUBNAM3= <"">
##$SUBNAM4= <"">
##$SUBNAM5= <"">
##$SUBNAM6= <"">
##$SUBNAM7= <"">
##$SUBNAM8= <"">
##$SUBNAM9= <"">
##$SW= 18.0517328524113
##$SWIBOX= (0..15)
0 0 2 0 0 0 0 0 0 0 0 0 0 0 0 0 
##$SW_h= 3612.71676300578
##$TD= 16384
##$TD0= 1
##$TE= 0
##$TE2= 300
##$TE3= 300
##$TEG= 300
##$TL= (0..7)
0 120 120 120 120 120 120 120 
##$TP= (0..7)
150 150 150 150 150 150 150 150 
##$TP07= 0
##$TPNAME0= <>
##$TPNAME1= <>
##$TPNAME2= <>
##$TPNAME3= <>
##$TPNAME4= <>
##$TPNAME5= <>
##$TPNAME6= <>
##$TPNAME7= <>
##$TPOAL= (0..7)
0.5 0.5 0.5 0.5 0.5 0.5 0.5 0.5 
##$TPOFFS= (0..7)
0 0 0 0 0 0 0 0 
##$TUNHIN= 0
##$TUNHOUT= 0
##$TUNXOUT= 0
##$USERA1= <user>
##$USERA2= <user>
##$USERA3= <user>
##$USERA4= <user>
##$USERA5= <user>
##$V9= 5
##$VALIST= <valist>
##$VCLIST= <CCCCCCCCCCCCCCC>
##$VD= 0
##$VDLIST= <DDDDDDDDDDDDDDD>
##$VPLIST= <PPPPPPPPPPPPPPP>
##$VTLIST= <TTTTTTTTTTTTTTT>
##$WBST= 1024
##$WBSW= 4
##$XGAIN= (0..3)
0 0 0 0 
##$XL= 0
##$YL= 0
##$YMAX_a= 8813
##$YMIN_a= -11345
##$ZGOPTNS= <>
##$ZL1= 120
##$ZL2= 120
##$ZL3= 120
##$ZL4= 120
##$ABSF1= 10
##$ABSF2= 0
##$ABSG= 5
##$ABSL= 3
##$ALPHA= 0
##$AQORDER= 0
##$ASSFAC= 0
##$ASSFACI= 0
##$ASSFACX= 0
##$ASSWID= 0
##$AUNMP= <proc_1d>
##$AZFE= 0.1
##$AZFW= 0.1
##$BCFW= 1
##$BC_mod= 2
##$BYTORDP= 1
##$COROFFS= 0
##$CY= -3
##$DATMOD= 1
##$DC= 2
##$DFILT= <>
##$DTYPP= 0
##$F1P= 0
##$F2P= 0
##$FCOR= 0.5
##$FTSIZE= 0
##$FT_mod= 4
##$GAMMA= 1
##$GB= 0.15
##$INTBC= 1
##$INTSCL= 1
##$ISEN= 128
##$LB= 0.25
##$LEV0= 0
##$LPBIN= 0
##$MAXI= 10000
##$MC2= 0
##$MEAN= 0
##$ME_mod= 0
##$MI= 1.114404
##$NCOEF= 0
##$NC_proc= 0
##$NLEV= 6
##$NOISF1= 3.799351
##$NOISF2= 2.8
##$NSP= 1
##$NTH_PI= 0
##$NZP= 0
##$OFFSET= 14.38212
##$PC= 1
##$PHC0= -3620.065
##$PHC1= 15.39231
##$PH_mod= 1
##$PKNL= yes
##$PPARMOD= 0
##$PSCAL= 0
##$PSIGN= 0
##$REVERSE= no
##$SF= 200.129724274929
##$SI= 16384
##$SIGF1= 3
##$SIGF2= 2
##$SINO= 400
##$SIOLD= 16384
##$SREGLST= <1H.CDCl3>
##$SSB= 0
##$STSI= 0
##$STSR= 0
##$SW_p= 3205.1282051282
##$SYMM= 0
##$S_DEV= 0
##$TDeff= 0
##$TDoff= 0
##$TI= <>
##$TILT= no
##$TM1= 0
##$TM2= 0
##$TOPLEV= 0
##$USERP1= <user>
##$USERP2= <user>
##$USERP3= <user>
##$USERP4= <user>
##$USERP5= <user>
##$WDW= 1
##$XDIM= 8192
##$YMAX_p= 0
##$YMIN_p= 0
$$ End of Bruker specific parameters
$$ ---------------------------------
##NTUPLES= NMR FID
##VAR_NAME=  TIME,          FID/REAL,        FID/IMAG
##SYMBOL=    X,             R,               I
##VAR_TYPE=  INDEPENDENT,   DEPENDENT,       DEPENDENT
##VAR_FORM=  AFFN,          ASDF,            ASDF
##VAR_DIM=   8192,          8192,            8192
##UNITS=     SECONDS,       ARBITRARY UNITS, ARBITRARY UNITS
##FACTOR=    0.0002768,     1,               1
##FIRST=     0,             0,               0
##LAST=      2.2672688,     0,               0
##MIN=       0,             -11345,          0
##MAX=       2.2672688,     8813,            0
$$ Real data points
##PAGE= N=1
##DATA TABLE= (X++(R..R)), XYDATA
0@%%%%%%%%%%%%%%%%%%%%%%%%%JpJ4j6J6j6J6j6J7k2K9l2L3l5M2m9N1n6O3o8P6
$$ 0 0 0 0 0 0 0 0 0 0 0 0 0 0 0 0 0 0 0 0 0 0 0 0 0 0 1 -6 8 -8 8 -8 8 -8 9 -13 16 -16 17 -18 24 -25 26 -30 33 -35 41
46D1q5R4j04J13j26J40j53J68j86K06k29K55k83L19l61M10m72N51o59Q09j037
$$ 41 -44 50 -54 59 -67 73 -80 88 -98 108 -121 134 -149 170 -191 219 -253 298 -361 448 -589
67e89J441k349Q728j668j1490N282k004n601L325P686k50O46J276k982k017K062
$$ -589 852 -1497 7231 5563 -5927 -645 -2649 -8250 -4925 2761 2511 3157 4433 1451 -566 1496
83A496l748l448K845J575j541N651N073l591k558J012o831o007N563N113j644
$$ 1496 -2252 -5700 -2855 -1280 -2821 2830 7903 4312 1754 2766 -4065 -10072 -4509 604 -1040
98a040M210N643n123o149K043o58m219J880L535n98J823K919j543k36J621n429
$$ -1040 3170 8813 3690 -2459 -416 -1074 -5293 -3413 122 -476 1347 4266 2723 2487 4108 -1321
114a321o349K992L257j648L856O799j632m449q55l370l725L123L214j172K715
$$ -1321 -7670 -4678 -1421 -3069 787 7586 5954 1505 650 -2720 -6445 -3322 -108 -1280 1435
129A435M419k642l413J876j240m627K55J542q33L084N035n38j447P40l873n937
$$ 1435 5854 3212 -201 1675 435 -4192 -3937 -2395 -3228 -144 4891 4353 2906 3646 -227 -6164
145f164J123L402k50K371M951o35l406m39j688l163N79J366p09K280M146m51j253
$$ -6164 -5041 -1639 -1889 482 5433 4798 1392 953 -735 -3898 -3319 -1953 -2662 -382 3764 3313 2060
162B060J551j843n306j020J555j05K423M587N31j605k2k598m640M2K414j31J233
$$ 2060 3611 1768 -3538 -4558 -3003 -3108 -685 3902 4433 2828 2806 208 -4432 -4390 -1976 -2107 -874
179h74L873Q96j354j4j382l225q99J14p70J992M264Q71p99P42j595m544j601J181
$$ -874 2999 3895 2541 2527 1145 -2080 -2979 -2865 -3635 -1643 2621 3492 2693 3435 1840 -2704 -4305 -3124
197c124L11J494L677J450o64j64j560l325j234M91m00J025L237J729l7K76j179
$$ -3124 -2813 -1319 2358 3808 3144 2980 1420 -1905 -3139 -2648 -3048 -2023 1214 2943 2906 3182 2003
214B003l175j755k93l83J559L582J686j24L51j046l478k089M1j1R04K732J999
$$ 2003 -1172 -2927 -3220 -3603 -2044 1538 3224 3100 3451 2405 -1073 -3162 -3121 -3132 -2228 504 2503
231B503M75K86j047k691j825n57m83Q64K785K178O70L19r19k592k186j018m25
$$ 2503 2978 3264 2217 -474 -2299 -2856 -3339 -2475 310 2488 3158 3477 2558 -34 -2220 -3238 -3663
248c663J050K565J922R42O63p64k495k034r15n41N56K261K212J094N52n78k128
$$ -3663 -2613 -48 1874 2816 3479 2715 220 -1814 -2729 -3270 -2714 -453 1759 2853 3405 2827 699
265F99k286j329n94N71J910K252J589O82o02j795k020j615q85N91J852J874J515
$$ 699 -1587 -2916 -3510 -2939 -1029 1223 2812 3494 2892 1097 -923 -2538 -3423 -2832 -980 894 2409
282B409J056l84j909k067j575r60K07J650K204J723R57q7j432k144j843r76R9
$$ 2409 3465 3081 1172 -895 -2470 -3430 -3223 -1573 631 2354 3311 3224 1792 -352 -2195 -3171 -3072
299c072J204K100J937J004j57j129j934k059j264J62J258J739K017J514P8j255
$$ -3072 -1868 232 2169 3173 3016 1887 -47 -2106 -3370 -3208 -1950 -211 1806 3320 3398 2143
315B143j836j834j427m25J056J985J868J231M53p64j941k127j279l32P03J696
$$ 2143 307 -1527 -2954 -3379 -2323 -338 1530 2761 3214 2450 509 -1618 -2897 -3229 -2526 -830
331h30K248J583L51p73j510k047j796o12P60J593J829J681Q32n66j672j932j567
$$ -830 1418 3001 3352 2579 1069 -978 -2774 -3386 -2626 -1033 796 2477 3309 2743 1071 -861 -2428
348b428p99M01J480K109J745P87l70j382j943j910j022L73J363J821J770J187
$$ -2428 -3227 -2826 -1346 763 2508 3295 2925 1543 -400 -2310 -3332 -2959 -1596 225 1995 3182
364C182j97j342j817j779j173J14J256J803J878J224J8j220j802j892j337p0J012
$$ 3182 2985 1643 -174 -1953 -3126 -3012 -1756 47 1925 3149 3167 1947 145 -1747 -3084 -3154 -2142
381b142J654K030J488L3j022j457j871j627k77J055J606J804J544M25p80j671
$$ -2142 -488 1542 3030 3063 2041 584 -1287 -2914 -3191 -2136 -530 1274 2818 3243 2463 792
397G92k069j558l47O90J390K055J797M30p42j333j807j745o44N82J277J906J771
$$ 792 -1277 -2835 -3182 -2492 -1102 953 2750 3180 2438 1105 -702 -2447 -3091 -2509 -1232 674 2445
414B445O56n40j118j855k006r18N47J338J795J813J013k01j292k036j779o60J75
$$ 2445 3101 2561 1443 -412 -2418 -3336 -2789 -1451 344 2157 3170 2969 1677 -359 -2138 -2798 -2623
431b623Q36J766K067R02l34q98j409j953j376m4J010J761J931J297K05q23j834
$$ -2623 -1787 -21 2046 2948 2614 1716 307 -1646 -3022 -3066 -2056 -295 1636 2933 3138 2315 481
448D81k124j299nR11J619J804J245K57p90j637j776r90l33K33J232K188J608K91
$$ 481 -1643 -2942 -2947 -2036 -417 1387 2632 2889 2099 462 -1314 -2304 -2637 -2404 -1172 1016 2624 2915
466B915m91j040j866k165q34Q62J713J725J458Q61m07j883j985j119k97K57J024
$$ 2915 2424 1384 -482 -2647 -3481 -2619 -906 819 2277 3138 2731 848 -1137 -2256 -2553 -2296 -1272
483a272J716J520O79j39q52j609j686j103k29Q45J959K249J108l83j090j592k123
$$ -1272 444 1964 2643 2504 1652 43 -1643 -2746 -2975 -2130 -171 2078 3186 2803 1713 121 -2002
500b002j456O15J841J428R55J077L33j166j745j181n69m65q2J240K246J601R4
$$ -2002 -3458 -2843 -1002 426 1381 2458 2791 1625 -120 -1301 -1870 -2335 -2417 -1177 1069 2670 2764
517B764n00j011k135k232l31J303J702J801J560Q6j179j455j542j293j8R15Q65
$$ 2764 2264 1253 -882 -3114 -3445 -2142 -440 1361 2921 3007 1828 373 -1169 -2462 -2480 -1565 -700
534g00R86J326Q70j40q16j630j701q62j37O75K371K688M30j098r13j650k424o97
$$ -700 286 1612 2482 2342 1526 -104 -1805 -2667 -2804 -2129 242 2930 3360 2262 1349 -301 -2725 -3422
552c422J417J407J135J202M80k71n97j256j497m62p7k27J124K457J319j8l60j607
$$ -3422 -2005 -598 537 1739 2219 1948 1351 95 -1402 -1864 -1941 -2168 -1044 1413 2732 2714 2354 747
570G47k692j180K77O72J937K672N86j132n37q97k003q38O58L81N68J411R75M82
$$ 747 -1945 -3125 -2848 -2176 -239 2433 3019 1887 1350 453 -1550 -2388 -1730 -1349 -781 630 1605 2087
588B087M12j113k298j139l09o35J216L136J621l51k32j254k593j285M87M01J051
$$ 2087 2499 1386 -912 -2051 -2360 -2995 -1779 1357 2978 2627 2395 1141 -1452 -2737 -2250 -1849 -798
605g98K063O42m59L37k82j862j198j76o20L27K021J563P95Q14r66k871j470p4
$$ -798 1265 1907 1448 1785 1503 -359 -1557 -1733 -2353 -2026 -5 1558 2353 3167 2201 -670 -2140 -2214
623b214n71P25K889J592m17n2m54j909j179n4l90L68J721R24L27J194M5k152j589
$$ -2214 -2785 -2060 829 2421 2004 1952 1498 -411 -1590 -1644 -2034 -1666 55 979 1306 2500 2545 393 -1196
642a196n39j092J03K393J880N23P17m84k435j509p3n29J77J957J390J17N44J59
$$ -1196 -1735 -2827 -2724 -331 1549 2072 2789 2305 -130 -1639 -1712 -2241 -2064 -107 1283 1400 1944 2103
660B103j424j295o41j083j60J639J365P46J417K64k097j768n68r34k19J854J770
$$ 2103 679 -616 -1257 -2340 -2500 -861 504 1250 2667 2931 834 -934 -1502 -2436 -2655 -801 969
677I69O17O49J7j547j303m56j001l70J369J334N96J091O35j166j470r27j334m84
$$ 969 1586 2235 2252 705 -598 -1054 -2055 -2425 -1056 278 874 1965 2600 1434 -36 -963 -2297 -2781
695b781J424J516Q79J189M89j370j650p50r26m86J069J384Q66J013N05q75j163
$$ -2781 -1357 159 1038 2227 2716 1346 -304 -1054 -1980 -2466 -1397 -13 853 1866 2371 1496 333
712C33r14j247o96Q25J303R01J301Q33q20j405j059j116p85P28J344R86J163P65
$$ 333 -581 -1828 -2524 -1699 -396 505 1806 2639 1819 414 -645 -1761 -2546 -1818 -474 512 1675 2440
730B440o18j207j004j087q45M25J044J110J211Q44l88j011r98j370r41L54J111
$$ 2440 1822 615 -389 -1476 -2321 -1896 -852 258 1469 2313 1925 914 -84 -1454 -2395 -2041 -930
747i30J014J250J008k52j098j051j172r37Q9R32J079J211R47n0p72j050j275j024
$$ -930 84 1334 2342 2090 992 -59 -1231 -2168 -2079 -1147 -68 1143 2090 2040 1268 218 -1057 -2081
765b081j9P91R62J294J081R4p34j001j273j079j88O82J027J211J086K71n65j024
$$ -2081 -2100 -1309 -347 947 2028 2122 1388 387 -886 -1965 -2153 -1471 -444 767 1853 2124 1559 535
783E35j251j050l03M69R34J262J122L74m60q87j204j193m48L89R46J168J115N32
$$ 535 -716 -1766 -2069 -1600 -666 596 1718 2092 1632 745 -459 -1652 -2100 -1711 -765 403 1518 2050
801B050k62r05j219j132n42J73Q45J230J197N43j93p16j163j260o68J89O96J116
$$ 2050 1788 883 -336 -1468 -2010 -1837 -992 238 1435 1978 1785 1069 -94 -1354 -2022 -1833 -1137 -21
819b1J223P30k6p35j097j196p49m0O16J166J190P32J03n40j075j251q20j10N14
$$ -21 1202 1932 1906 1171 74 -1122 -1871 -1911 -1295 -129 1061 1793 1896 1356 281 -970 -1790 -1900 -1386
838a386J009J263Q54J74m54j010j225r18k19L60J019J242Q76K98k94r35j252r48
$$ -1386 -377 886 1740 1914 1460 450 -775 -1693 -1912 -1552 -533 709 1585 1883 1589 654 -598 -1546
856a546l23K46R11J206R74L84j44q42j301r96l99J36P77J229J035M58p8p35j221
$$ -1546 -1869 -1623 -712 494 1468 1852 1708 866 -435 -1431 -1830 -1694 -917 312 1347 1805 1727 992 -229
875b29j014m71p1O88J284J024M80O1n49j279j046n51j10N36J209J046N86K12m90
$$ -229 -1243 -1714 -1785 -1097 187 1211 1691 1752 1203 -76 -1122 -1673 -1783 -1247 -38 1008 1594 1806 1316
894A316j238j086m86l13L70J226J117N95K83l62j150j078o00m51L06J260J055
$$ 1316 78 -1008 -1494 -1807 -1437 -211 906 1501 1784 1422 272 -806 -1406 -1857 -1551 -291 764
911G64N23M87p8j234j185n41m66R1J101J107O33O05o3j221j081n23o15j04J137
$$ 764 1287 1774 1696 462 -723 -1264 -1730 -1639 -538 569 1202 1807 1744 523 -558 -1081 -1696 -1800 -663
930f63J138N70O50R1j115j008n75p75j84J097J103M47Q08L83j042j252n33p06
$$ -663 475 1045 1695 1786 671 -337 -912 -1687 -1871 -774 329 776 1584 1967 925 -327 -860 -1566
948a566l36R35J092O52Q17L28j063r79l77r43n63J006J110L48Q49O65q68j001
$$ -1566 -1902 -967 125 777 1594 1922 859 -120 -497 -1440 -2003 -997 113 461 1310 1975 1107 106
966A06m88r90p03R08J051M13R86Q36q59j183m30r17p33Q61R46L68J000Q11q95
$$ 106 -382 -1372 -2075 -1167 -116 297 1283 2119 1260 77 -353 -1270 -2003 -1142 -196 172 1172 1983 1088
985A088q83r3j021j151O69J078K49R67J108m76j042m40j099j004O47R87L21J029
$$ 1088 205 112 -909 -2060 -1391 -313 -64 903 2011 1535 493 53 -1046 -2050 -1403 -416 -95 934
1003I34J101p01j050j41q48j117M89Q35R5R66J285m56p67Mj087j552K95J013K93
$$ 934 2035 1334 284 143 -705 -1822 -1333 -498 -403 563 1848 1392 625 629 -458 -2010 -1715 -702 -409
1022d09R55J368k17r69l53j061j167N08Q08k1R54J347m08q08J86p26j510J0O64
$$ -409 546 1914 1697 728 375 -686 -1853 -1345 -537 -558 396 1743 1335 527 713 -13 -1523 -1513 -849
1041h49j7Q81J597P6o75j08j037j668M2Q93K10Q68J393j40p64jp61j324J74N34
$$ -849 -866 15 1612 1688 1013 905 -132 -1800 -1758 -865 -655 213 1606 1466 702 701 -60 -1384 -1210 -676
1061f76l57O64J620K08n75K31o21j691m97M83O1R19J620K25n31l5q97j553k8O85
$$ -676 -1033 -369 1251 1459 884 1115 494 -1197 -1694 -1211 -1150 -231 1389 1614 1083 1048 151 -1402 -1430 -745
1081g45j25N02J443R3m34L48m40j448l72J99l94N00J713N95k56J50o08j650n85
$$ -745 -870 -368 1075 1168 734 1082 642 -806 -1178 -979 -1373 -873 840 1435 1179 1329 721 -929 -1514
1100a514K89J6P48J422K44l01K51n57j386k70L71m33J40J369O11n6M34k78j422
$$ -1514 -1225 -1209 -461 961 1205 904 1155 598 -788 -1058 -687 -1120 -980 389 1000 944 1378 1100 -322
1119c22p86p6l47N09J566O86j20J95m73j360n63J74k04L18J140M31j7M56r6j155
$$ -322 -1108 -1184 -1531 -1022 544 1230 1110 1305 832 -528 -1091 -917 -1121 -803 337 768 751 1207 1111 -44
1139d4o95n8n19l1J224R39K50L83k38j231q18k17l53L53J170O94J8L42j56r51
$$ -44 -739 -797 -1316 -1347 -123 816 1066 1449 1211 -20 -838 -1055 -1408 -1055 115 809 827 1169 1013 62
1159F2o40j18m37m6Q41P48L30N27Q5r17q60m13n09j3R62Q95M05L85r1q86p31l22
$$ 62 -578 -696 -1133 -1179 -338 410 740 1267 1352 435 -425 -838 -1347 -1360 -398 497 902 1287 1196 310 -421 -743
1181g43m43K4Q18O59K50M96J94o56p49m61m89k25O14P55N88N71J28o47p74n55
$$ -743 -1186 -1162 -344 315 565 1061 1255 599 -150 -611 -1100 -1325 -711 44 632 1203 1331 684 -90 -645
1201f45n16j09O25P28M95M83J24m96o34m86n24k68M23O34N45N44L23l39o86o23
$$ -645 -1161 -1270 -645 83 578 1061 1185 689 55 -431 -955 -1223 -800 -166 379 923 1246 907 221 -402
1221d02n65l20L72O43O96N59K23l50n74o11n42l08K61N65N68N71L58j75n10n94
$$ -402 -967 -1287 -915 -272 424 983 1206 856 282 -329 -871 -1179 -918 -353 215 786 1144 969 459 -135
1241a35o18m10J44N54O06O01M23r8n35o63n86m10J11M58O00O33L70k5m12n55o30
$$ -135 -753 -1163 -1019 -465 141 742 1165 1067 532 -131 -717 -1127 -1016 -558 42 675 1045 1020 608 53 -577
1262e77m83K9M04N23O17N14M1l92n61o12m76j02L52N69O05N31P6l28n15n95n44
$$ -577 -1060 -1031 -627 -104 513 1027 1068 676 115 -497 -973 -1075 -723 -154 451 982 1058 730 215 -380 -924
1283i24j02K66M83O24N06J72k22m88o13n30k27J94N18N99N09K54j52l94o66n74
$$ -924 -1026 -760 -277 347 853 1025 803 315 -298 -828 -1055 -861 -343 256 765 1019 867 473 -193 -767
1303g67k42J22L97O17N72K55p0l84o14n78l05Q6L59N66O07L25ll66n75o10l32
$$ -767 -1009 -887 -490 127 699 954 884 500 -114 -692 -997 -911 -552 14 621 946 943 577 2 -608 -940
1324i40OL11N55N93L86M1k74n68o17l52o2K36N09O51L66J21k74m99n81m25j33
$$ -940 -934 -623 -68 525 911 952 678 110 -507 -859 -921 -685 -176 475 841 962 688 189 -392 -817 -950
1345i50K34M64O01M05J57j58m95n51m69j54J46M33N52N14J97j21m63n49m71k73
$$ -950 -716 -252 349 754 911 753 258 -293 -762 -916 -770 -337 215 729 926 805 342 -207 -678 -951
1365i51J44M00N59N09K43p7l91n32n05k73J7L72N64M96K71J3l45n38n22l46O3
$$ -951 -807 -407 152 661 904 827 436 -96 -601 -874 -857 -485 79 575 846 859 514 -24 -546 -892 -829
1386h29K85M95N11L78Nk90n01n10l38p4K70N00M95L73P8k08m71n52l89p6K31M05
$$ -829 -544 -49 462 840 845 555 54 -456 -794 -868 -598 -98 397 770 848 640 169 -383 -772 -848 -617 -212
1408b12N07M58J27k21l77n29m79r4J51L74N10M89J63j85l92m66m20k80J45L62
$$ -212 295 753 880 659 282 -247 -726 -820 -669 -295 215 704 867 682 290 -176 -596 -876 -731 -369
1428c69N42M08K23o1l24m84n29j91Q0K28M77N37K91r7k54m57n64k47M3K03M74
$$ -369 173 581 804 743 419 -65 -594 -785 -705 -477 0 537 828 731 477 20 -544 -791 -748 -545 -71
1449g1N53K99m3k56m10m95l17mK08L92N12L25L9j44m31n39k95m8R3L78N89L66
$$ -71 482 781 738 482 72 -423 -740 -744 -536 -144 368 693 732 588 157 -382 -677 -725 -632 -254 335 701
1471G01M7j21l43n77l41r8M1M02N75K95J04o4k51n58m23o3K1K66N40L80J49L7
$$ 701 748 627 284 -293 -634 -732 -691 -289 286 581 685 621 370 -188 -611 -674 -653 -387 153 533 682 719
1493G19k57n85m39j03m5K10N81M69R4O8k21n76l93r3r8J50N72M04N9J56o9n48
$$ 719 462 -123 -562 -665 -710 -500 81 550 644 712 491 -85 -478 -571 -669 -519 53 457 516 672 603 55
1515E5m79j33j67R0N18M69K00K10j08n94m76j33j25M8N45M46J30J28j8m80l95
$$ 55 -424 -557 -724 -634 -116 353 553 763 655 61 -415 -548 -673 -625 -80 366 496 624 606 126 -269
1536b69j13l07j9N15M23J01L42J22n17m77k16k64q3N06N18J59K41P4n28m25j14
$$ -269 -382 -689 -708 -193 230 331 673 795 278 -199 -415 -679 -762 -256 262 421 662 736 208 -217 -331
1557c31k59j18M53M07R4K92K27l87m32j60l50k68M13M66J42M11K58m27n59j95
$$ -331 -590 -708 -255 152 246 538 765 378 -54 -214 -564 -832 -419 47 189 600 858 431 -128 -323
1577c23k64j84M01M48J32L10J91l46l88k7l45l66K81M17J05L40M04k26m25k16
$$ -323 -587 -771 -370 78 210 520 711 365 -23 -50 -395 -761 -480 -63 42 382 786 560 135 -81
1597h1l76l75L07M51K03L22L14k84m51j15k95l13K22L55M9L31M10j81k97n7m03
$$ -81 -457 -832 -525 -74 129 451 765 481 30 -85 -380 -693 -471 -116 -67 264 674 493 196 139 -264
1618b64m86J65L19J86L79M63j25l80k00l66m25K11L51Q9L07M15j16l46k6k59m49
$$ -264 -750 -585 -266 -80 299 762 637 257 57 -309 -734 -523 -172 -83 224 639 523 177 151 -108 -557
1639e57j9K76R1L15M97J2k66j34l44n21JK75J74L46M90p3l04r5k58m54J4K36N3
$$ -557 -576 -300 -209 106 603 615 349 215 -129 -650 -649 -374 -200 146 636 563 259 164 -94 -548 -534 -298 -245
1662b45K22N19O2k26l4k35n48j23J93J09K77N00J42j57j53l12m52p9J82O7K43
$$ -245 -23 496 558 332 298 63 -485 -608 -415 -306 -29 471 613 456 303 -9 -461 -540 -358 -291 -48
1683d8M34J17j81Ok10m79j44J30K0J75M85K01q0l2k02n05k06P4P0K15M74J64q4
$$ -48 386 503 322 328 118 -361 -505 -375 -355 -180 305 506 426 394 192 -313 -519 -445 -375 -160 314 478 394
1706C94k9k12m21k03Q5j9J95M06K47lk1j38m55k39rj0J69M23K71mj6j82l57k72
$$ 394 365 153 -268 -471 -386 -405 -210 196 443 440 419 281 -174 -413 -422 -432 -263 160 431 427 411 229 -128 -400
1730d00l0lJ66L59K20P4L7j11l69k50q7m3J10L40K99O3N1j17l15k70j43j1J10
$$ -400 -430 -433 -267 92 312 386 423 312 -57 -307 -394 -437 -327 13 312 375 426 309 -6 -276 -419 -430 -320
1753c20L11K66J41M3r1l13k68j40o3P9K70K78J61L9m0k49k78j41j07M7K77K73
$$ -320 -9 257 398 441 350 37 -231 -371 -434 -355 -85 193 354 393 353 104 -174 -315 -422 -375 -98 175
1775A75J71P1m4k40k79j69j21N1K34K70J73J00Rk26k46k26j09J8J90K74J96J26
$$ 175 346 417 373 133 -146 -315 -436 -385 -151 119 292 392 401 175 -71 -297 -406 -388 -198 76 272 398
1797C98k9j90j86k41j64J6J59K56K13J41Jj43k25k25j38o1J38K73J97J81M1j28
$$ 398 369 179 -7 -248 -412 -396 -237 19 232 373 374 231 6 -219 -357 -418 -280 -7 190 371 412 284
1819B84k24k78j49m7J31K01K34J87N0r9k02k33j60q1O2J96K62J69Q3p9j81k05
$$ 284 60 -218 -367 -414 -283 -82 152 339 389 290 88 -145 -305 -386 -324 -128 134 303 386 307 126 -79
1841g9j95j39N7K08K05J89J53m4j93k01k14j32N1J38J92K26J35L3k18j83k30j00
$$ -79 -274 -413 -356 -148 57 246 399 355 162 -39 -253 -385 -334 -196 -4 222 357 390 172 -11 -241 -341
1863c41j6J56J86J77J92mj00k15k19j67j5J46J60K17J64K8j22j81j71k35pR5J61
$$ -341 -357 -201 -15 162 354 350 250 35 -184 -351 -366 -220 -60 157 321 349 227 46 -125 -360 -367 -272 -111
1886a11K37J96M6j06j51k10k23o3J40J33J86K14L5o1j44j60k56l3L3J49J85J99
$$ -111 126 322 368 262 111 -99 -322 -385 -245 -112 74 288 323 262 118 -42 -298 -331 -298 -149 36 235
1908B35R9m2j23k02k35p6O9O0K11K42J06n6q7j32k92p6PO4J71K47J29l0n8j63
$$ 235 334 292 169 -33 -268 -344 -275 -215 -4 238 344 288 201 69 -223 -299 -292 -228 -57 190 319 289 231 68
1932F8k46j30L2L0J53K59J19j1o2j24k23j42j0M6J29K13J76J9o4q4k47j94K6j8
$$ 68 -178 -308 -276 -246 -93 166 285 274 212 88 -135 -277 -287 -241 -112 101 277 296 232 148 -99 -293 -267 -285
1956b85J35K08J87J4np6k62j56k4k8Q2K76J83J7Pq7k04j97o5j1Q0K35K08KO3o2
$$ -285 -150 58 245 259 254 178 -84 -240 -264 -292 -210 66 249 266 273 186 -18 -215 -280 -291 -211 24 232 234 297 235
1982B35k47k01j5m8K9K21K14L8M8l0k07k06o7m4j5K60J97L9P5Qk40j70r2o0NK06
$$ 235 -12 -213 -228 -276 -247 -26 188 226 274 244 37 -169 -236 -280 -295 -35 162 201 276 284 44 -126 -218 -278 -273 -67
2008f7J61O9J14oj75j89p4q7k1J55J79J46M0P9j87j84r6j14o6J75K14P5R9Q3j84
$$ -67 94 163 277 271 96 -93 -167 -254 -275 -120 59 205 245 324 137 -47 -143 -257 -323 -148 66 141 240 323 139
2033A39j84r4p0j00J60J65P9J21O8j02j56j15j26o8J08J80M8J46J07j29j71q7
$$ 139 -45 -139 -209 -309 -149 16 95 216 284 182 26 -89 -215 -283 -175 5 53 199 306 177 6 -81
2055h1j09j18J09J88J03O2J07o6j37j31j02j07L9J64J02J44J35o4j55j17j03j65
$$ -81 -190 -308 -199 -11 92 154 261 195 58 -73 -175 -282 -243 -79 23 167 302 238 83 -34 -137 -302
2077c02L4K15Q7J24J24p8r8j38q2j23K8J09N8J36J36L3j19j01j65j22k2J42Q2
$$ -302 -268 -53 34 158 282 204 106 -32 -114 -237 -209 -100 -42 94 230 263 144 43 -122 -244 -266 -124 -42
2100d2J50J42Qj33j09j01j65J6J00J13R4J12M2o4j13j04j32n7Q4L9J26J76P7q3
$$ -42 108 250 258 125 16 -85 -250 -234 -134 -21 73 185 227 163 50 -54 -186 -243 -159 -120 6 182 259 176
2124A76j10j04j80l8R1R5J33J23N3q5o7p9j42p9M8O8R5J23R0j9o5q9j69q2oN5
$$ 176 66 -38 -218 -256 -165 -70 63 186 239 154 87 8 -134 -213 -165 -97 -2 121 211 192 127 38 -131 -213 -219 -164
2150a64J53J47R6m0k6j59j30j02kR6R4J42N4K4m2q0j24j11l5N7P8J33J26K2j9
$$ -164 -11 136 232 192 166 7 -123 -225 -227 -131 -37 105 159 183 141 61 -63 -174 -209 -152 -74 59 185 207 188
2175A88j06j54r1l6%J35J16R5O3n0p0j32j04l9K3N5J20R7P1J2q6j22j21o5J5M0
$$ 188 82 -72 -163 -199 -199 -64 52 147 210 160 90 -42 -146 -185 -162 -107 13 110 181 193 107 -15 -136 -201 -186 -146
2201a46J46J01R6l0m2j41j19n3MO9R7J03J09j5n3n2j32j02l7N6Q6J05J03O5m6
$$ -146 0 101 197 167 125 -16 -135 -188 -184 -115 -18 85 194 179 126 74 -58 -160 -197 -141 -55 50 153 218 172
2226A72j35j00j11j5L3R7R4J02N3k9r6r7j14l5J1J01P5J48L6k7p7j02q9o7JP1
$$ 172 37 -63 -174 -189 -156 -59 35 137 190 161 65 -32 -146 -181 -170 -69 6 154 190 163 86 -16 -105 -172 -171 -100
2252a00J02J29N7n1l2q7j38o9K8O6P1J28M9Lo8q7q8m9l3M4J23Q8R5j3n0o1j29
$$ -100 2 131 188 137 105 18 -120 -189 -161 -95 -24 104 153 156 88 1 -87 -136 -169 -125 -2 86 181 168 118 57 -72
2279g2r7LL5Q0Q9R3K0Pr8r1j24j0J1J03P7R8P5l5o5j29q2m2oO7J20R2O6m7j4j39
$$ -72 -169 -166 -131 -51 38 131 151 158 60 -31 -155 -165 -154 -51 26 124 199 164 99 -30 -112 -154 -160 -93 27 119 185 138 124 -15
2309a5p4o8j7J01N1J20N6L0q4r9o7q4oL7J04R0J05l4m3j10q5o4j4L8J13P2Q0K1
$$ -15 -89 -157 -174 -73 -22 98 154 184 100 1 -66 -150 -156 -119 -15 75 180 146 103 -7 -92 -156 -170 -132 -19 53 133 154
2337A54o2l1j28n7l0K3P0J23Q4Oj6p6p4p0p3M2P1Q2Q5J0J5o9p6j43n3L8Q1R7O7
$$ 154 92 61 -67 -124 -154 -131 -61 62 146 152 136 60 -14 -84 -157 -115 -44 38 123 133 148 79 3 -140 -193 -155 -74 23 90
2366I0Q3l7m3r3j14l7j1M8J02O1Q1M6p8p9r5n5k3L2J05R1O7km3r1p8p1l4M7Q0
$$ 90 173 136 93 0 -114 -151 -162 -114 -12 49 130 176 98 19 -76 -131 -154 -122 -17 74 141 139 96 5 -73 -144 -178 -131 -51
2395e1Q2R3J8Rr6q1r7rOQ6O2Q1L6k9o7o7n7n9J0O7O7J14K2J5r4q6n3n9K0M6O7
$$ -51 31 124 142 151 55 -26 -123 -132 -126 -40 22 103 139 110 43 -24 -81 -140 -130 -63 4 118 140 155 61 -25 -78 -137 -117 -71 -4
2426dP7P2k5o8o4l7q5kO3O5P3N3M8q6o8n4r9k9O3P3L4J28Oo7k3q4n6p7Q0K5R2
$$ -4 73 145 120 52 -12 -49 -134 -136 -73 -8 65 118 166 80 12 -42 -141 -170 -107 -34 0 128 134 67 44 -40 -96 -173 -93 -68 24
2457B4O8M5m3n2m9r7l5K4P6P5Q8J1qq7n1j10k4M1M1P3J22J0n0l4n5p9p7K6M6M7
$$ 24 92 137 94 42 -7 -104 -139 -115 -39 36 124 135 127 40 -11 -121 -145 -104 -63 10 132 142 92 58 3 -76 -153 -127 -81 -34
2487c4J05R6n2j5p2j04k2qL3K2J08O2J6l4k3j35n8J2J5K2J06P4j3ql2r7j02J3
$$ -34 71 167 115 100 28 -76 -98 -106 -73 -51 57 119 135 101 78 -57 -115 -103 -88 -66 40 114 101 93 61 -36 -138 -125
2515a25M5j2J19R3ol1Rq5j39L3J0NP8J35n1K6j5j09p8j1Rj6J11J13k4L6k6p8j22
$$ -125 -80 -92 27 120 114 83 92 7 -132 -99 -89 -84 -6 129 78 104 89 -20 -98 -109 -100 -116 -5 108 84 120 94 16 -106
2544a06j9K0J2J28N0L2k9J0r2o4l9j8j3J06J04K7j6K5o8j20j9k0qP4J12J2M6O
$$ -106 -125 -105 -93 35 85 117 88 98 6 -58 -97 -115 -128 -22 82 109 93 118 50 -70 -89 -109 -117 -43 69 81 127 133
2572A33q4j03l9l1oQ5J02K9J7J4n9r7m0l0m4R9J06qL6N1n0r6p1j3l6N1J41qN6
$$ 133 49 -54 -93 -124 -130 -45 57 86 103 117 58 -39 -79 -109 -153 -54 52 44 80 131 81 -15 -86 -99 -135 -84 57 49 105
2601A05J0m3q5l4o1l0P0Q2N1J4R0o4q4m1n5o5M0P8K6O4N7k3q6m7m3p6O2P6N3L6
$$ 105 115 72 -13 -47 -108 -138 -68 14 65 79 169 105 21 -20 -75 -140 -100 -22 4 68 125 102 16 -31 -74 -150 -88 -12 41 77
2631G7N8l7p9n1l0o2K9Q3PP6O5l2m4n3l9o4l1Q2L1O3Q1l9n5k9n2q7MO9N3N1O5
$$ 77 135 98 19 -32 -62 -124 -95 -12 -5 71 136 104 60 7 -32 -96 -127 -45 -14 49 130 91 36 7 -45 -132 -128 -59 -6 45 110
2662A10jn7k9m8o3j3N1K8P4K9J6k0m9m8q9oM6L1P4P3j8l1k5m4r2MK2L1K8Q2M3
$$ 110 109 52 23 -25 -88 -101 -50 -22 52 81 97 77 28 -20 -109 -115 -69 -38 36 109 91 60 35 -9 -101 -97 -75 -44 -16 66 109
2693A09n0k5k7j02l0N1J9O6N4N4j1n7l3r8l7O1%M4P8N4j0m0o6o9k4J4PL8J06K3
$$ 109 59 34 7 -95 -125 -74 -55 11 65 119 108 51 18 -80 -117 -56 -56 -12 66 120 110 70 4 -65 -89 -75 -68 -30 76 99
2723I9j6j2o6m3p7K0K1L4P4P5k5pm0p2m7j6K0L4P3N1L8k1l4q8l7l2J8MP6P0pL
$$ 99 83 71 5 -38 -115 -95 -74 -40 34 109 84 77 37 -35 -82 -98 -78 -44 29 80 118 97 63 -25 -62 -94 -76 -72 4 74 67 70
2755G0k8n6q8L2OK4K2Q3L0lm0k9q1j1KJ7O8M2N5k8%o6r4k0j7L4N6O2M8L1q2l0
$$ 70 42 -14 -102 -70 -64 -40 -18 65 95 92 52 23 -58 -69 -67 -50 18 60 115 87 87 21 -73 -93 -110 -76 -20 42 90 121 39 9
2787Im7l6m8J4O8P4N9Lrr4m6o0L7k9Q7L6K6N7k5l1p1m4k3%N6P3LO4Km1m8n9o0
$$ 9 -38 -74 -122 -108 -40 34 93 96 87 -7 -53 -113 -76 -105 -18 18 44 101 76 45 -26 -70 -93 -93 -37 36 39 103 105 64 16 -43 -103
2820a03PM2O3L5L6L1m6m1p1j9k1L9K4P9K1J8o4k7m8m7j2M8L7K6Q2nj4m6o9l0l3
$$ -103 -96 -54 9 44 80 111 65 24 -47 -66 -87 -48 -24 55 76 94 30 3 -45 -92 -104 -56 -19 7 89 84 70 24 -45 -75 -108
2851a08K6M5P5N1j1rk4p9j1m4J3N2N7J6M4jn4l5q8j2K7K2P2K8K9J1n1m2n3n3J2
$$ -108 -82 -37 38 89 78 69 45 -34 -45 -89 -76 -24 33 49 93 92 38 3 -85 -97 -70 -48 24 52 81 92 41 -1 -54 -107 -95
2882i5P4J9K6N6Nl1n6l6m9mL3M9N2O0oj4r4k4n2ML4N3J6L8L3Jo6p5l3j5N2K4L5
$$ -95 -21 -2 24 80 85 54 -2 -38 -87 -91 -58 -9 43 103 97 83 -11 -35 -87 -83 -49 4 20 58 91 92 26 -49 -82 -97 -45 -21 14
2915A4O4Oj9l4p4m3k5O4nO6L7K8lk6n6q1rKM4L5Q3L4l9on1n6j6oM1MO2N5J7n6
$$ 14 78 84 65 31 -43 -86 -111 -47 -52 14 51 79 76 50 -6 -87 -96 -94 -50 -15 68 102 63 57 6 -50 -66 -72 -31 -27 35 90 107 51
2949E1k1o3o7K2nN5O0L1K8j9m5p5n6M0nN7M1L9J1k2n7m1rm5RO9J8N0N8j4n0m9
$$ 51 30 -33 -100 -78 -83 -28 32 63 91 72 27 -48 -104 -64 -69 -12 29 68 79 57 0 -41 -50 -95 -86 -17 1 51 109 95 45 -4
2981dn4m4N2K8M2O1%K0m2n2n0l5j0O0N7L7PQl1l7o0j4k2J7N9N5J0N8n3m8n8n9
$$ -4 -58 -102 -50 -22 20 81 81 101 59 7 -43 -78 -88 -28 29 66 73 81 50 13 -47 -61 -83 -66 -7 48 58 116 63 15 -43 -102
3013a02N8l6O2O7K7J2k4m9m7l8J3l7N4L7O9K9l1k8m9o0l1M8kO3P2J9n2j7m0n5
$$ -102 -44 -80 -18 49 76 88 64 15 -32 -70 -57 -94 -40 -3 66 95 64 36 -13 -73 -104 -56 -58 5 77 96 44 27 -13 -68
3043f8j9rP1M9J8N7k0k6o9l3j7JMN6M2K2L6m2o7k9m7nM1N9L1N4j8j4p1n2Jj7J8
$$ -68 -87 -96 -25 24 42 99 79 53 -16 -49 -66 -65 -61 -5 37 59 95 53 -14 -43 -90 -95 -54 5 36 90 72 58 -13 -65 -64 -81 -63
3076f3M2O0N6k6J1m9o4m1Pj2N4M7N9Kom3o8l5%j1Q9lP2L2n5k9m2n2j9J5K5PQ5
$$ -63 -21 39 95 69 80 31 -33 -74 -67 -79 -25 22 81 83 77 34 -34 -69 -69 -80 9 6 78 110 55 26 -16 -68 -87 -72 -47 -40 45
3109D5K9oJ0q0n6k4J3K9P8L3L1j9No4r0mj6M8M5J1M1K1nn5m6l5k3L5K6M0L3K7
$$ 45 74 68 78 -2 -58 -82 -69 -40 38 71 102 83 88 24 -66 -70 -86 -38 7 18 59 80 75 20 -26 -61 -84 -49 -23 17 50 77
3141G7l3j8o3n4K2J7M3KQ6L2j0q8o6k5J0J4pO1N2K0nj6q0j4J6o0L6M3P2P%k3m9
$$ 77 44 26 -37 -91 -69 -52 -9 -7 79 111 101 13 -53 -78 -68 -54 -61 0 52 72 67 51 -29 -43 -27 -87 -51 -8 64 71 71 48 -1
3174ao4J1n1L9R1M0J0J9m6o4k3n2J3L7O6LP4m4J3n5m4n0j3kP7O5K1K9j7o6n8j6
$$ -1 -65 -54 -105 -66 25 65 75 94 48 -16 -39 -91 -78 -41 25 28 102 58 71 16 -28 -78 -91 -93 -16 49 70 99 82 16 -42 -58
3206e8j9K5M7N0j2N3jn8o1l2J1k2L6N6O1J3Po3n0n5nk0M5O7L7M6j4l8n6o8QPK3
$$ -58 -77 -52 -5 45 33 86 85 27 -34 -66 -55 -77 -41 15 76 89 96 33 -17 -72 -77 -97 -52 15 52 98 84 46 -10 -78 -70 -63 -40
3239d0K6M2M3Qm0k5o5nkj0Q0J4O0j8ko7j7n8j9J8Q4K3M0Qm0j5k8m7k6L7mP8L6
$$ -40 -14 28 71 79 39 14 -51 -56 -58 -68 12 26 86 68 66 -1 -18 -76 -95 -77 7 30 70 78 38 23 -5 -52 -78 -41 -45 33 69
3272F9L6k5p4m8l6k4M1J1O5M6J8J2l9p1m5l0KN7O0L1L6%k3n9o9n1L4PO3Q1LJ5
$$ 69 105 80 6 -42 -78 -102 -61 -50 15 61 79 91 52 -19 -64 -94 -92 -35 25 56 92 92 69 10 -59 -110 -76 -69 -6 75 78 93
3304I3l9p1l7k3JJ2N3N6jL5m6j4n5j6l8L0O0P9k4K1J7p6k9o3j1NL5R6L7K3m8l
$$ 93 54 -17 -54 -77 -76 -64 -11 45 44 79 33 19 -36 -52 -90 -60 0 79 55 76 93 17 -12 -75 -86 -81 -46 50 87 110 62 59
3336E9p5l5Kl7P2K4O1K2om7o7n2%J1M3O1L7L5m6ro7m0k6j4O6L3M8L6kj8n4n3l6
$$ 59 -16 -51 -49 -86 -14 10 71 93 87 40 -27 -79 -79 -68 -25 36 73 108 62 53 -14 -54 -80 -94 -28 5 53 89 87 69 15 -38 -74
3369g4k0L6O5M4N4k3j0n0o5k8pJ6N5L1M2J0L4o9q8m7J9J5K4O1M6K6l2k0p7k7l7
$$ -74 -94 -58 7 51 105 82 72 22 -43 -71 -78 -62 -7 24 66 76 110 41 -47 -94 -75 -60 -36 25 71 97 65 45 -32 -59 -96
3400i6K5K7O6O9j3Pn1l6m7j9j7P7M0J3N2j2n4l7o2Rj2J2Q1J5O7j8k9o9l4l9MK7
$$ -96 -71 -44 22 91 78 85 34 -2 -49 -68 -85 -8 32 45 97 85 31 -6 -68 -59 -71 -59 22 37 104 86 57 -12 -46 -85 -81 -54
3432e4M4N7K4K3m3m5k3o8k3M9L0Q5kJ8Pn0m3k0m6JM6Q4K2J0j0l3q6%o7K7O3O3
$$ -54 -10 47 71 94 51 6 -17 -85 -108 -59 -29 56 54 72 79 29 -14 -34 -80 -79 -33 51 73 83 73 40 -46 -46 -113 -86 -23 40
3464D0J1M3oq2k5m5K1m0L8O5L6M7j0p3l5k3n7J9M0K6O0M6Nm0n5l1n8lN4LP3L9
$$ 40 51 94 88 6 -19 -64 -43 -83 -45 20 56 103 93 20 -15 -38 -95 -76 -36 -10 50 96 101 61 6 -25 -83 -86 -32 -29 44 83
3496H3j9j5k9l7n9j0K2L8N0N4j5Ko8K2p7m4L0L8M8Q8kp4j5k8p6j1J9N6M2O4Qk2
$$ 83 64 49 20 -17 -76 -86 -64 -26 24 78 63 65 -3 19 -58 -102 -72 -34 14 102 100 26 11 -17 -93 -104 -85 -29 13 77 85 63
3528F3k7m8n2k5L0K8K6M7L8ol8l3p4k5J7K7M5N1L4Kn0m0m4o4M7L0J5N3P7n4Pl0
$$ 63 36 -12 -64 -89 -59 -31 -5 42 80 74 36 3 -71 -96 -79 -52 -7 44 78 80 30 -10 -54 -118 -71 -41 -26 27 104 50 57 27
3560B7q4k2PJ5N1K0N8J7l9p1oo6j5L3K8P8P8m2l1Jm3o0ljM4N6M3L5l0l7l8n3o1
$$ 27 -57 -79 -72 -57 -6 14 72 89 50 -21 -27 -93 -108 -75 -47 31 109 67 36 37 -6 -66 -69 -70 -26 30 73 108 78 41 3 -50 -111
3593a11N4J5Q6K5J0pl8l2q2K9j8M7M4N4nk7K4p7m6rk3N8L1N2N6l0j7o6o6j1Rj9
$$ -111 -57 -42 44 69 79 72 34 2 -80 -51 -69 -22 22 76 71 44 68 -9 -55 -64 -87 -29 2 54 110 80 63 -3 -69 -80 -71 -90
3625i0P7Q0K9j9j5l9r9J7J8k2N2N0K4J5k4j5p9k5j0OM9Q2Nj0L4l5j29PmK0J6N4
$$ -90 -13 67 96 77 62 23 -76 -59 -41 -63 -11 39 63 78 54 39 -40 -65 -75 -69 -20 62 67 57 91 56 -73 -66 -70 -50 -34 20
3657B0M6K5k7j9q3k6j2oL5N2N3RK5j5j02l0k1NmO8O5K1Nnp5q1J9k7N3L9O8pM6
$$ 20 66 91 64 45 -38 -64 -76 -82 -47 5 58 67 92 77 -25 -55 -76 -71 -75 -7 58 79 84 79 4 -77 -58 -85 -32 7 75 68 114
3690A14m5o8m0Nk4j9R2PN2J7Mp4n7k7l4L8K5N8L1N9j9j01mn1l5N5L2L9N2J4Mr0
$$ 114 69 1 -39 -34 -58 -77 15 22 74 91 95 21 -36 -63 -97 -59 -34 24 55 114 95 -6 -10 -61 -96 -41 -9 30 82 96 100 10
3722A0k6k1o2J3M9O1M2L5k4k5n3n6j1j3M0M3N0M0J4o1j2o2m8j9N1N8M3L2j7k9
$$ 10 -16 -37 -99 -86 -37 24 66 101 77 52 -1 -57 -68 -81 -41 2 52 92 106 45 33 -29 -77 -96 -45 13 56 88 71 42
3752D2l3k9m8j5N7L4M2LL8l2n7j6q5J6K1N9pP5J7l7Qp3n8J2j1M0P1M4K3k4l5p6
$$ 42 9 -20 -68 -83 -26 8 50 53 91 59 2 -14 -99 -83 -62 -3 -10 65 82 45 53 -20 -78 -66 -77 -37 34 78 101 77 42 -34
3784c4m1k2K2M8N7L8KKqq7m1k6L0K5M6L7M1Pl9o2m6k1QN2J5M8L8j5m5j9m3m4P
$$ -34 -75 -97 -75 -27 30 68 70 72 64 -23 -64 -90 -60 -35 11 48 89 96 57 -5 -51 -72 -64 -12 3 51 89 74 29 10 -33 -77 -70
3817g0L6K4M1M3J1l4j3o8kn8M7K3P6N4k3m7j3n0l6j9J5N1N4L2J0j5n0m8k7l2N9
$$ -70 -34 -10 31 74 85 51 38 -30 -32 -90 -43 -20 56 110 87 40 27 -23 -59 -78 -63 -12 42 74 84 69 19 -29 -56 -88 -29
3848b9NO8K4j2ok1j9n6k0J6QP0K9L3jrq8l4k6K3j7Q7K6K3J6l3k7o1l5%K6N2L4
$$ -29 -24 44 68 56 50 29 10 -46 -66 -50 -42 28 57 90 89 80 -8 -42 -68 -45 -62 25 51 74 90 57 30 -31 -66 -66 -40 12 46
3881D6J9L1l3p4m5k9K2RL2N3K9L1m6l6m1m8j7K1N8N0K3N7l8o0m0n1J1oL5M3N6
$$ 46 65 96 63 -11 -56 -85 -63 -54 -22 31 60 91 45 9 -32 -80 -97 -76 -18 32 55 112 74 14 -26 -77 -66 -72 -37 6 62
3912F2M1l9k3m7o6mNL6M3K6K4L3n6m8l7l9L8OM2M8N3j8lq3m8m4L0L1M6J2M5L2
$$ 62 103 64 41 -6 -72 -76 -71 -35 8 34 58 91 35 -13 -50 -89 -51 -45 -3 45 98 80 77 -6 -54 -98 -68 -37 9 21 66 98
3944I8k3q6m1rKJ7L4O7QJ7Mn4p0j1m3M2K9N1L7M7l9n4n2k9mj1O4oO1N7j9o3k5
$$ 98 75 -11 -52 -61 -59 -42 -8 59 67 84 88 34 -36 -47 -90 -48 -19 32 69 116 77 23 -29 -58 -62 -73 -9 -15 46 103 84 21 -4
3977do6k5L3K7M1M0N9m6j6n1q4K1MJ1O6L4M8j9k3o6l0kl1L9M4M8K2mk7l0m4j8
$$ -4 -70 -95 -62 -35 6 46 105 59 43 -8 -92 -71 -67 -56 10 44 92 73 50 -16 -46 -48 -79 -40 4 52 74 70 43 13 -31 -49
4009d9m0QO6L2M7L4m7k2o8n1RK0N8M4L7J7l5m8p0%rJL6N5K6L2Qn4m4p0JnK6M0
$$ -49 -89 -81 -15 17 64 98 51 29 -39 -90 -81 -61 -3 41 78 95 60 12 -58 -58 -67 -66 -30 25 51 83 91 37 -7 -77 -76 -81 -55 -15
4043a5Q1J4J1o9l9o0pK5qO9M6M2k5o3j0l8l1mM0L1M1M1k1Qo0m2j5k2K0O1O0L5
$$ -15 66 80 91 22 -17 -77 -84 -59 -67 2 48 90 65 2 -8 -46 -77 -81 -41 -10 31 72 51 59 -1 -43 -58 -80 -60 1 61 96
4075I6j7k6m5m4k7l1L8L5K6L7M2k2l3k6o4Nk0N2N2L0J2jl7o1k1m4OO9L7M8jkm8
$$ 96 79 53 8 -36 -63 -94 -56 -21 5 42 84 62 29 3 -61 -56 -76 -24 28 58 70 69 32 -29 -50 -94 -88 -19 18 66 65 63 15
4108A5k1l2o1K3L9O5K1L0k6lo3k9l2J2L2M7L4J9Ol5o4k8k1oJ9O4L9oK9J1j07J
$$ 15 -6 -38 -99 -76 -37 28 49 79 53 50 -13 -42 -74 -62 -30 17 51 70 76 41 -23 -51 -72 -78 -59 5 44 38 67 78 -29 -28
4140b8k7m6N9J6M2M5L0l1m1o9l1j0J5P9k1O1L6l4m8n7mJ8JK6K9N3J8k3n1m7k0
$$ -28 -55 -101 -42 -26 16 61 91 60 19 -50 -81 -91 -76 3 -18 43 79 45 -3 -60 -64 -46 -45 -19 10 63 81 58 7 -40 -60
4171f0j5J6M4M3L9J3j6k2n8k7m1J4N1K3N3K7k2k9k1m7k1k1N2K1J5P5k1l5k1m6
$$ -60 -75 -59 -15 28 67 80 64 42 -16 -43 -84 -70 -19 4 57 84 62 33 12 -35 -56 -77 -25 -4 11 86 65 30 9 -37
4201c7m4%K8M1N6K0%j3m1l2l2k5L5N1M0K3Ql4lo6k6k6M3pN0N9K6k7k8n4n3K3l3
$$ -37 -81 -81 -53 -12 44 64 64 51 10 -22 -54 -79 -44 7 47 70 78 44 41 -25 -51 -77 -34 -41 9 68 94 67 39 -15 -68 -45 -78
4234g8M3L4M0L6j6k2m4k7n6L6qO0L4M6nn6lo0l5J3L5L6M2K6J6nn8p3lK2KK4M3
$$ -78 -35 -1 39 75 59 37 -7 -34 -90 -54 -62 -2 32 78 73 17 14 -46 -81 -68 -33 3 45 71 87 82 24 -49 -52 -30 -28 -4 39
4267C9K4J1l2k7m9k5pj2Q3jL7M4j1l4n2l2l9K1J9N9K0M0Lm3m7nn2J8J5N5RM3k
$$ 39 63 74 42 15 -34 -59 -66 -78 5 4 41 85 74 40 -12 -44 -83 -62 -43 16 36 76 79 36 -11 -16 -68 -50 -35 20 29 72 70
4300G0m2m2kl3j7N4j8O3N3l1Op7qk6mqP9K2L7j5ln3l6j5k3M5mN7J6K8m0rk1n7
$$ 70 28 -14 -16 -49 -66 -12 -30 33 86 55 61 -16 -24 -50 -54 -62 17 39 76 61 58 5 -31 -46 -69 -24 -28 29 45 73 33 24 3 -54
4334e4k3K0N5L1K6J1om9k7j9l0L2J6K2N0K7l2j1o0k5J8m4N5J0O0J6j7kn7k7k3
$$ -54 -77 -57 -2 29 55 66 60 11 -16 -35 -65 -33 -17 5 55 82 50 39 -21 -46 -28 -72 -17 -7 53 69 52 50 -7 -34 -57
4365e7LK1M6L3L2J9p3J6p6m0K5J8L7M9N6l4l2l1l3m6kK9O1J0L9pl5l2nn5%j6Q2
$$ -57 -54 -33 13 46 78 97 24 40 -36 -76 -51 -33 4 53 109 75 43 12 -21 -67 -69 -40 21 31 70 63 28 -4 -9 -64 -64 -80 2
4398BM4K1Rk6j9n8k3kJ8J5J4N2K5l9Ln2m8jK8J7J9M7kJkn1m1k6pL6O5J8J2K0l7
$$ 2 46 67 76 50 31 -27 -50 -52 -34 -19 -5 47 72 33 36 -16 -64 -65 -37 -20 -1 46 44 45 43 -8 -49 -75 -82 -46 19 37 49 69 32
4433C2j2o2l1K0M3J5J2P9j7n5Jo1k9pL2K9M0L9Ll5k3n4ml2L1M1L6J4j0lQk4p0
$$ 32 20 -42 -73 -53 -10 5 17 96 79 24 25 -36 -65 -72 -40 -11 29 68 71 36 13 -41 -45 -77 -46 -5 31 45 35 32 40 16 -54
4466e4j1J1N6NO4Lrn8m0rMk7O7MN2j3J3j5p2j8j4K0K9L7OL5j1Lo2m9nJ8K2L2K4
$$ -54 -65 -54 2 7 71 74 65 7 -33 -42 -38 -65 2 6 58 45 58 43 -29 -47 -61 -41 -12 25 31 66 55 58 -4 -53 -58 -40 -18 14 38
4501C8J2mj1lo7j7qJ4J5L8M6l4L7k3n7m5QK4KO5J1L3k0m6k2m0k3J2N7L2K1jnk7
$$ 38 50 46 35 32 -35 -52 -60 -46 -31 7 53 19 56 33 -24 -69 -61 -37 -35 30 41 74 54 8 -14 -54 -77 -65 -8 24 45 44 39 12
4535A2j6n9kJ8J6L7M1J2%l2l5k4k2j2M6L7J3L6j2j9k2k8l4oJ2K0Q0L1qp1k2nl4
$$ 12 -4 -63 -65 -47 -31 6 47 59 59 27 -8 -32 -54 -66 -20 17 30 66 54 35 13 -15 -49 -55 -43 -23 57 88 80 9 -13 -18 -52
4568e2pkN3L8L4j3j3l2m5j3K4j5M3jM8jrpl0k4o3J4N9M3pL8Jm2m4rj9OO4l7L7
$$ -52 -59 -61 -8 30 64 51 38 6 -39 -52 -28 -43 0 -1 47 46 37 30 0 -24 -87 -73 -14 29 22 60 61 19 -25 -34 -53 -47 17 -20 17
4603A7L7J2m0m6l2j9J3L4K9K0QJ6k1j2n0j8lJ5J8N0J7%j1n8Qn4J2J8M1K3J0J7
$$ 17 54 66 26 -20 -52 -71 -58 -24 5 25 33 49 28 16 -34 -52 -55 -40 -22 28 45 45 34 -24 -16 -70 -58 -40 1 24 34 51
4635E1l2Ok5m2j9J4K2M4K6J5j7j7l5m6nN4oM7NJ4k4j0k9m4l7N2J5M1K1kJ3j4m7
$$ 51 19 25 0 -42 -61 -47 -25 19 45 60 43 26 -9 -55 -60 -6 -12 35 40 54 30 20 -9 -53 -90 -38 -23 18 39 37 50 36 -11
4668a1k0%j5K7O2LKp%l0m7rrL4K1M7PK4n9j7m9k1L2L6J0J0L5%l0l0nn7J5K0J6
$$ -11 -31 -31 -46 -19 43 46 48 41 41 11 -36 -45 -54 -20 1 48 55 79 20 3 -46 -67 -35 1 11 21 56 56 26 -4 -9 -66 -51 -31 -15
4703a5M5J3Lj2j6n3qj1K6K6M5j3L0ml7k9k8m9K4M8K9JM6lk5k8l7j9LJ0O7NK5k5
$$ -15 30 43 46 34 18 -35 -43 -54 -28 -2 43 30 60 56 19 -10 -38 -87 -63 -15 14 15 61 58 33 5 -32 -51 -48 -38 29 34 59 34
4737C4Jl1l5j2k0L7L3J1K2J2nl9n5oj4L2KO4J2kj1jm9l8J1K3J3K1J0M1k2k4j5
$$ 34 35 4 -31 -43 -63 -26 7 18 40 52 47 8 -47 -53 -67 -35 -33 31 43 41 30 29 -20 -58 -47 -24 -11 10 20 61 39 15 0
4770@j2m0K0J9M1K1J3%k6m4l7mL0nK7KM5Pl4k8k2Kj8j5R3qJ1K8l1mn5m6J4J6M8
$$ 0 -12 -52 -32 -13 28 49 62 62 36 -8 -45 -49 -19 -24 3 5 50 57 23 -5 -27 -25 -43 -58 35 27 38 66 35 31 -24 -70 -56 -40 8
4805HK4mJ8j5Jl9k6j0lN1J9K0Lkl2n3mj4nL7M3J0K9j4k8l9j8nkL4J0O1K4l0l5
$$ 8 32 28 46 31 32 -7 -33 -43 -46 5 24 44 47 45 13 -40 -44 -58 -63 -26 17 27 56 42 14 -25 -43 -48 -50 -16 -6 55 79 49 14
4840A4k3j6m5oM3M9K4L5l9j6j3o6mK7PK3L8K7j2mk3l6j8j3NM5L7JJ5j2k1n7j6
$$ 14 -9 -25 -70 -76 -33 16 40 75 36 20 7 -59 -63 -36 -29 -6 32 59 47 43 20 -16 -34 -47 -42 3 40 41 56 44 23 -34 -50
4873e0lJ0K6L4OM3j8o2mj7l7J7N0K7J3pJ1kl2o3KJ3K8K3K5L5kk0o2k5l8J5M0L3
$$ -50 -53 -43 -17 17 23 66 48 -14 -18 -35 -72 -55 -5 22 35 28 39 37 5 -58 -56 -43 -15 8 33 68 66 46 -16 -41 -79 -64 -24 9
4907IK6k6L9k8m9Kl1LO2RLK1jNn0l5j5J3nM8J7M0NKm6l3k1J6l7O1%RK5k3Loo1
$$ 9 35 9 48 20 -29 -27 -58 -55 7 16 19 40 39 44 -6 -41 -56 -43 -48 0 17 57 62 64 18 -15 -36 -20 -57 4 4 13 38 15 18 12 -49
4944d9qK5L6K9j8L8k0j5o2J4k5J3L0N2j7J2kj3l1j7l8nQ3kL5ljj8k5k8kl3N8J3
$$ -49 -57 -32 4 33 15 53 33 18 -44 -30 -55 -42 -12 40 23 35 33 20 -11 -28 -66 -71 12 10 45 42 41 23 -2 -30 -32 -65 -7 6
4978FK1J2J0Kl4n7J2j6L2J8j0K7K5on0j6l7j9O1J6N0qlj6j1k5l9K1qmO2j4K0N
$$ 6 27 39 49 51 17 -40 -28 -44 -12 6 -4 23 48 42 -8 -24 -61 -80 -19 -3 47 39 36 20 9 -16 -55 -34 -42 -46 16 2 22 27
5012B7jj6l9n5L1K0K4K6M4nm2j2m5j6OM7J2O1l0J3qj4o5JKoL1M5oK5Nn5j4m9M
$$ 27 26 10 -29 -84 -53 -33 -9 17 61 56 14 2 -43 -59 -53 -6 6 67 37 50 42 28 -37 -36 -34 -40 -9 36 30 55 60 5 -9 -58 -54
5047e4J6L9PL6j5Oj2n0kNQJ6K1ML6m1rkk8j3J0lJ9M7L3n0jj7m3o3N2K1QL0L0j
$$ -54 -38 1 8 44 29 35 23 -27 -29 -24 -16 0 21 25 61 20 11 9 -19 -32 -22 -25 -6 41 74 24 23 6 -37 -100 -48 -27 -19 11 41 40
5083D0j5k8ll4j8L9K6J2K5kj0k2m1k1klN0O2j8Qoj0o6j7KK8J4PM7l0L4l5J0l5
$$ 40 25 -3 -6 -40 -58 -19 7 19 44 42 32 10 -31 -52 -54 -57 -7 55 37 45 39 29 -37 -54 -52 -24 -10 -3 44 14 48 13 23 -12
5117a2l4M0rL4kL5k3ml9o0K7j6K9O4J8m%j3k4m8L3m7K6K6J7L5Ok1l7j1k4k1J9
$$ -12 -46 -6 -15 19 17 52 29 25 -14 -74 -47 -63 -34 30 48 44 44 31 7 -41 -8 -55 -29 -3 14 49 55 34 -3 -14 -38 -59 -40
5150d0O0MnM7k3j4p7jQPN9j3J7K3j7m3Jl9J1L9rJ6M0j4M1o0m1k5NoO1RJ0rK4l2
$$ -40 20 24 19 66 43 29 -48 -49 -41 -34 25 12 29 52 35 -8 -7 -46 -35 4 -5 11 51 37 78 18 -23 -48 -43 -49 12 21 31 22 46 14
5186A4k3j3k7oM7J4K1kK5m5j5l5J4pPL6K9%lNm1mj1n9M1K9K2J2K2m0j9l3kj9L7
$$ 14 -9 -22 -49 -55 -8 6 27 25 50 5 -10 -45 -31 -38 -31 5 34 34 31 36 -5 -9 -20 -79 -38 -9 13 25 47 7 -12 -45 -47 -66 -29
5221b9L5k8N1J7k0m3K1l5l4L3M5J9J1Oj2l4mk7j8J2N5Qj7K9Jm1jj8k5RRLO4K8
$$ -29 6 -22 29 46 26 -17 4 -31 -65 -32 13 32 43 49 37 3 -1 -28 -46 -34 21 29 12 41 42 1 0 -18 -43 -34 -25 -22 42 70
5255G0m7L4l8m7l2LJ3N4K6rJ2k2J6k7m1J7l9K6N4K2Pj6l8ql5kN4k2QK4K8k7k9
$$ 70 23 57 19 -28 -60 -57 -44 10 36 27 39 17 33 6 -35 -18 -57 -31 23 45 52 36 -2 -10 -45 -47 7 -15 -7 17 45 18 -11
5288a1Mk7PnM2NK9pk2K2o5j1J7k0N3j3PJ9J6kl6k0m1J8J7L7L3LJk9k2j8k7J2J7
$$ -11 -7 -34 -27 -32 10 15 44 37 15 37 -28 -39 -22 -42 11 -2 5 24 40 38 2 -18 -59 -41 -24 13 46 49 50 21 -1 -19 -46 -34 -17
5323a7jN0L1l2Nl8j4j9pL7mM7J6j8l1J5k9m3K8j4M0PM7j3j8ok2j9l4K2J5K3M7
$$ -17 -18 32 63 31 36 -2 -16 -35 -42 -5 -9 38 54 36 5 20 -9 -52 -24 -38 2 9 56 43 25 19 -3 -22 -56 -34 -19 4 51
5356E1L0n7Qm6rj0LL4J2PL5j5l6rrj8NoO0RoL8l6k1k3j2k8L3L0OL2j4mj1m4J9
$$ 51 81 24 32 -14 -23 -33 -30 4 16 23 58 43 7 -2 -11 -29 -24 -30 30 39 33 71 35 14 -9 -21 -49 -16 14 20 52 38 34 23 -21 -2
5392bk6J2K6jL2l5K6nk0n7QL3l0K5N6J8Mm8k5j1qj0J7M0K6nPl7Jj9rmj1L6RL7
$$ -2 -28 -16 10 9 41 6 32 27 7 -50 -42 -9 -39 -14 42 60 64 16 -9 -20 -28 -38 -21 19 45 40 47 10 11 -8 -17 -21 -32 4 13 50
5428E0k8Jnl2k6J1J0J1K4KM3n1Rm7ml3L2L3lJ9L1kk9k4l1J9qK5K8K4K2l3j7k9
$$ 50 22 23 18 -14 -40 -29 -19 -8 16 18 61 10 19 -28 -32 -65 -33 0 -3 16 47 45 16 -8 -39 -20 -28 -3 25 49 71 38 21 -8
5462hLn6J1O6MOK7m4J0j2pk0j1NO1L4j3k2j0m1Lkm3N0K8k5O5k6J7k7l0j0k6K0
$$ -8 -5 -61 -50 16 20 26 53 9 19 7 0 -20 -31 -26 35 69 56 34 24 -17 -14 -16 -59 -9 19 -6 59 33 50 23 -7 -17 -43 -23
5496b3qO0L7l7J1m2j3m3K4J4L5RJ0j8J2pq0N4j6j9N2MJ6K1j0k3j3l3k8P4n1N2
$$ -23 -31 29 66 29 40 -2 -15 -58 -34 -20 15 24 34 16 28 21 -59 -5 -21 -40 12 16 32 53 43 20 7 -26 -54 20 -31 21
5528B1L4j9kJ0n2j4j1J1kM0RJ2J2rj8k0l7K6pL0K7nrK0m1k5roK4K5j6K4J4ql1
$$ 21 55 36 34 44 -8 -22 -33 -22 -24 16 25 37 49 40 22 2 -35 -9 -16 14 41 36 27 47 6 -19 -28 -34 -10 15 -1 23 37 29 -2
5563boOm1J3J4O4j0j8k5M2m6k6J8j7oO5jM0%p1j6j1J8NLNM0Jmpj4n6J4%J4K3J8
$$ -2 -8 -2 -43 -30 -16 48 38 20 -5 37 -9 -35 -17 -34 -40 25 24 64 64 -7 -23 -34 -16 -11 -8 -3 37 38 34 27 13 -43 -29 -29 -15 8 26
5600B6J4j2j0l1lj7%rM1L8lJ5l1j9k9lL0j5K0K3MK9j1m9jk2rjK8M5j4r%Oj6k4
$$ 26 40 28 18 -13 -16 -33 -33 -42 -1 37 34 49 18 -1 -30 -33 -3 -18 2 25 29 58 47 -2 -3 -25 -34 -35 -7 38 24 15 15 21 5 -19
5636a9l2L6J1K4j4L2j0l3rLk4KL0M0oJmJ3m6k5j0J4LL2L7l7J2Mj3l0k9M%M7QK1
$$ -19 -51 -15 -4 20 6 38 28 -5 -14 -11 -35 -33 -3 37 31 32 28 41 -5 -30 -40 -26 -23 9 46 9 21 25 12 -18 -47 -43 -43 4 12 33
5672C3jj5ol5j0LK9j0K2K0K0k7j0m6j9J8LL1K2K1J0%m2J0o2L3rKL7L3k7J1j0m5
$$ 33 32 17 11 -24 -34 -31 -2 -12 10 30 50 23 13 -33 -52 -34 -31 0 22 43 53 53 11 21 -41 -8 -17 -15 22 55 28 39 29 -16
5706a6k9j5K7M0J4OK5j2nl8k6J6l0M0j4K8M7m3J9j2m9j7rK6J8N5k3Lj6l2j7K0
$$ -16 -45 -60 -33 7 21 27 52 40 35 -3 -29 -13 -43 -3 -17 11 58 15 34 22 -27 -44 -53 -27 -9 46 23 26 10 -22 -39 -19
5738a9mlK1K6nK5qm0k4J5l1L4J7PN2k2k0pnj4mj0kL9oM0K8o3k9Rok6J5J8M5j2
$$ -19 -23 -26 -5 21 16 41 33 -7 -31 -16 -47 -13 4 11 63 41 21 14 9 -5 -9 -19 -21 18 12 52 80 17 -12 -3 -9 -35 -20 -2 43 31
5774C1j3Ljl1pj6L6j0L9k6M9l6j7k3K4k7J7K1J3LL8l3l6k2nJ3j3QL0rO5m0J2l4
$$ 31 18 21 20 -11 -18 -34 2 -8 31 5 54 18 1 -22 2 -25 -8 13 26 29 67 34 -2 -24 -29 -16 -29 -21 9 0 65 25 37 3
5808Ck1l4K3J6PO7k9kj4j5j0k8lK2M1%nL6k1n1lJ1oj3M3J4J7j%k6n6j0K2J0pL7
$$ 3 -18 -52 -29 -13 -6 61 32 30 16 1 -9 -37 -40 -18 23 23 18 54 33 -18 -21 -10 -16 -29 14 28 45 44 44 18 -38 -48 -26 -16 -23 14
5844A4K8ll9L%k9k4K5O3k2K7J8Lp0qKl2L2LM6j3olqJ2o6K9j3L0J8M0Jj8qk8J3
$$ 14 42 39 0 3 3 -26 -50 -25 38 16 43 61 64 -6 -14 -12 -44 -12 -9 37 24 18 15 7 19 -47 -18 -31 -1 17 57 58 40 32 4 17
5880A7m5j6JN8M3k1L2j9k7n8j6L2j7K9kK9L7j0p7Rk7L3PJM2j6K0Jm2k1l2K3OP
$$ 17 -28 -44 -43 15 58 37 69 50 23 -35 -51 -19 -36 -7 -9 20 57 47 -30 -21 -48 -15 -8 -7 35 19 39 40 -2 -23 -55 -32 -26 -19
5914a9M8JqPpk6m9kL8k6P0j3L2J3o2Pj6l6L1NN9O%k5Knm1j4J2k0M5L3J2j4k6m
$$ -19 29 30 22 29 22 -4 -53 -55 -17 -43 27 14 46 59 -3 4 -12 -48 -17 -12 47 53 53 28 30 25 -16 -30 -18 -38 7 40 52 38 12 8
5950Hl5oL7k2OM3J3j6rj6k3j0KkK8J0L3J1k2Km4Lo0M7PM3j8O2l5j2l1l0J5j9K6
$$ 8 -27 -33 4 -18 -12 31 44 28 19 3 -20 -30 -28 -30 -2 8 41 52 30 32 -12 -9 -69 -22 -15 28 10 72 37 25 -6 -36 -21 -40 -14
5985a4J5L7L5m7j5km3Jj9L2L6K2j6L2k6n8kK2k7RL1OJ3J3rm0j5qk6J7O4K7k4K7
$$ -14 1 38 73 26 11 9 -34 -33 -52 -20 16 38 22 54 28 -30 -32 -10 -37 -28 3 9 22 35 26 -14 -29 -37 -63 -46 18 45 21 48
6019D8k4k7j4l0qJ6M5PK9j8K5k4l0j8k3j2N6J2M8j3j8J9n0ok1kPNN1PRl7j0k3
$$ 48 24 -3 -17 -47 -55 -39 6 13 42 24 49 25 -5 -23 -46 -58 -2 10 58 45 27 46 -4 -10 -31 -33 -26 -21 30 37 46 9 -1 -24
6053b4pl1P1j2M9k1J9k0l1j6Om6N2nM7J2j7K8p5J5qm5L1J8L9Qoj1ml2Kj2kL6J6
$$ -24 -31 -62 9 -3 46 25 44 24 -7 -23 -17 -63 -11 -16 31 43 26 54 -21 -6 -14 -59 -28 -10 29 37 31 20 16 -16 -14 -26 -28 8 24
6088B4L2pql3j9rrNJL6K1KLm4j2lk2J9ML1K9j1kNl0J7m6mO0k3K2RJj2l9rj1j7
$$ 24 56 49 41 8 -11 -20 -29 -24 -23 13 34 36 39 -5 -17 -20 -42 -23 -19 12 41 30 28 33 3 20 -26 -30 30 7 29 38 39 27 -12 -21 -32 -49
6126d9N8j1J8L7j1l2Jo1kQrM8J9K5Rj4j4j3j4l9mM0J9K0L5n2j0l6lnM1l6M5M0
$$ -49 9 -2 16 53 42 10 11 -50 -52 -44 -53 -5 14 39 48 34 20 7 -7 -46 -50 -10 9 29 64 12 2 -34 -37 -42 -1 -37 8 48
6160D8K0j3k3jn9%L1j3K2L8kJ3j2m8k9qj8L7J8K3J2Lk8Oj9k3pj2K7M6J8mNj9m5
$$ 48 68 55 32 31 -28 -28 3 -10 12 50 48 61 49 1 -28 -36 -54 -17 1 24 36 39 11 17 -2 -25 -32 -44 -17 29 47 43 48 29 -16
6195a6oj6lJ2L5M0J3k9j4j3l8k1ML4M2K1k4L5p7j8K2Mk7J2JM9J9Om5j7l1nNK4
$$ -16 -22 -38 -41 -29 6 46 59 30 16 3 -35 -56 -52 -18 24 45 21 56 -21 -39 -17 -13 -40 -28 -27 22 41 47 2 -15 -46 -51 -46 -22
6229b2RM2j1oj0Pm2PnRM4JPj1J3o4K4LMl2J1L4L0j8rj7j0j1k1NL9J3K9k5K6mo5
$$ -22 -13 29 18 12 2 9 -33 -26 -31 -22 22 23 30 19 32 -32 -8 -5 -1 -33 -22 12 42 24 15 -2 -12 -23 -44 -39 0 13 42 17 43 39 -26
6266b6j6MQL2J9K8j2j2Lm4Jm9M1j4N9J7pj0ook5k1L1rM9NJ2l2Qm2k7j7MK6L6l
$$ -26 -42 -38 -30 2 21 49 37 25 28 -16 -15 -64 -23 -37 22 39 32 22 16 10 -15 -36 -5 -14 35 40 52 20 28 -14 -41 -58 -54 -28 8 5
6302EL3Kkk5m7J9l9M3j4N7j0J2ml5jl8PJ1L0J1L5K7o0J8l0l0k3J3M2PL3j1k6j2
$$ 5 38 40 38 13 -34 -15 -54 -11 -25 32 22 34 30 -5 -6 -44 -37 -26 4 15 50 77 17 35 5 -25 -48 -35 7 14 47 36 10 -2
6336b%k8k1LL4J0N1Ol5J9m6l8K0j5J9L0QL2jk3nl8Lj0NK9JK4J7j7k6j3m1mL5M7
$$ -2 -2 -30 -51 -48 -14 -4 47 53 18 37 -9 -47 -27 -42 -23 7 15 47 46 23 18 -20 -17 -27 -22 7 8 32 49 32 6 -7 -48 -52 -17 30
6372C0J3OrNl2l3rnKM7LNpRJ1o7j0l0O4mJ9L2rJ6l0ol1j3j0L3JM6L8l7k0l5k5
$$ 30 43 49 40 45 13 -20 -29 -34 -32 15 18 23 16 25 36 -31 -41 -71 -7 -11 8 40 31 47 17 11 -20 -33 -43 -10 -9 37 75 38 18 -17 -42
6409d2Kk5P2J9MK0jmm4j0j9k6N6J2K6Jj9Pl2l8K0J6k5K9LK6M4l1j9jp0j6K9L1
$$ -42 -40 -65 7 26 30 50 49 45 1 -9 -28 -54 2 14 40 41 22 29 -3 -41 -21 -5 -30 -1 2 28 72 41 22 21 -49 -65 -36 -5
6443eJ8L1k0k4K6m0k3l0L1K6L9rnJ4J3m7m6J7MNK2M6nJm6J3l9JoQL3K5k7P7l6
$$ -5 13 44 24 0 26 -14 -37 -67 -36 -10 29 20 15 29 42 -5 -51 -34 -30 -25 -3 43 38 39 -7 6 -33 -32 -38 -30 3 28 1 78 42
6478D2l4k0Nj4J4K0K0LL0n5j8l0J2JKJ3K0L0K8l4k7lj8m9M1K2K6Jj0prjj8pk2
$$ 42 8 -12 -7 -21 -7 13 33 36 66 11 -7 -37 -25 -24 -22 -9 11 41 69 35 8 5 -13 -62 -21 1 27 28 18 11 2 1 -17 -24 -46
6513d6M8OM7ol0qj4j8k3pM4J7L6l6J8j0k4m1jJJ5M3K1J2j0jk9k2j1J2RJ3L1qN
$$ -46 2 8 55 49 19 11 -3 -21 -44 -51 -7 10 46 10 28 18 -6 -47 -48 -47 -32 11 32 44 34 33 4 -18 -29 -17 -8 5 36 28 33
6548C3Qn0j2k1J8KKM7Rk5J0j4k7j4j3QJ7M1J6K0k8j1k8rj6k1K3O1J6J0k0l7J7
$$ 33 41 -9 -21 -42 -24 -22 -20 27 36 11 21 7 -20 -34 -47 -39 -22 19 35 55 27 16 -12 -21 -37 -58 -35 26 42 52 32 -5 12
6581A2Mq0K0NN9j2J9Qln4jKk5J3J0M2K7Jl2k8j1J6j9j5M4l5N5M1k7n0j1jk8M3
$$ 12 16 -64 -44 -39 20 8 27 35 32 -22 -23 -21 -46 -33 -23 19 46 47 15 -13 -24 -8 -27 -42 2 -33 22 63 36 -14 -25 -26 -54 -11
6615a1KJ4M0Rl1j8j1m1LJ9K0qM0kJ0k1l2K1n6LL4OO5J8m9nl7Poj7NL2K3J7j2J0
$$ -11 -9 5 45 54 23 5 -6 -47 -44 -25 -5 -13 27 25 35 14 -18 3 -53 -50 -16 -10 55 73 24 19 -18 -11 -17 -34 -29 3 26 43 31 41
6651D1o5J3mk8N2j6K6PJ9%m4j7K0m5RM6OK0%kl3j1k8j1JL1O3JQo0L1m2k9Oj4N1
$$ 41 -24 -11 -15 -43 9 -7 19 26 45 45 1 -16 4 -41 -32 14 20 40 40 38 5 -6 -34 -45 -44 -13 50 51 59 -1 30 -12 -41 -35 -49 2
6687BM4NLj7l1k1k7oJ2RJ7O9kj3k1j8k1lLmN9j9J0%lk7l4Kk9M8NJ7L0ol4N%j3
$$ 2 46 51 54 37 6 -15 -42 -48 -36 -27 -10 59 57 44 23 5 -16 -19 -16 -20 39 20 30 30 27 0 -34 -32 -61 -13 -8 9 39 33 -1 4 4 -9
6725im6K5K7J8L0j4j2kqn4J0K4J2J8K1K4j8j6l1j8l0M3kJ8L9pk4j1j3k5nROL1
$$ -9 -55 -30 -3 15 45 31 19 17 9 -45 -35 -11 1 19 40 64 46 30 -1 -19 -49 -6 -8 10 49 42 18 7 -6 -31 -36 -27 -21 10
6759A0K5J3Nn1j8j0kK6j3J5K2PK4m4oj5ql0L0k1M0L6oMn0j7mOJ5JM6KKPk6j2l9
$$ 10 35 48 53 2 -16 -26 -28 -2 -15 0 22 29 53 9 3 -12 -20 -50 -20 -41 -1 35 29 33 -17 -34 -38 -32 -17 -16 30 32 34 41 15 3 -36
6796c6OmK1L1PK4rom8k3L1j3K6LK8J0Rn4j2Kl5RnM1RL7j6l5j9J4m6QL1N3k6N2
$$ -36 -30 -34 -13 18 25 49 40 34 -14 -37 -6 -19 7 10 38 48 57 3 -9 -7 -42 -33 -38 3 12 49 33 -2 -21 -7 -53 -45 -14 39 13 65
6832F5j2l8K7p0okKMM7RK6k0j3m6l1K0K0k0N7L2J6m2rk9l4ML3QM7M%kl4j3l7o
$$ 65 53 15 42 -28 -34 -36 -34 -30 17 26 52 32 19 -27 -58 -38 -18 -38 19 51 67 25 16 -13 -47 -43 -10 -2 45 49 49 47 13 0 -37 -43
6868d3L3rM9J4K1j7j9k2l3k0OOL7L3l3M2Jm2j0j1l4K7K5K7L8j9n1k1K5m0OM1q
$$ -43 -10 -19 30 44 65 48 29 7 -26 -46 -40 -34 3 36 3 45 46 4 -6 -17 -51 -24 1 28 66 47 -4 -25 0 -40 -34 7 -1
6901aM2Rk7J2l3j6Kl5M8pM4J8l9K9j4m5j7KlL5J5j9N4j6pm3Nk6PJ5K3K3J2rj0
$$ -1 41 50 23 35 2 -14 -12 -47 1 -6 38 56 17 46 32 -13 -30 -28 -31 4 19 0 54 38 31 -12 -7 -33 -26 -11 12 35 47 38 28
6936B8m7j3j8j0N2QK3KJ1qj7j8j3j7K6J3J7K1J2l7k9k9KL1m1M9PK2Nj6Ok8j2l6
$$ 28 -19 -32 -50 -60 -8 0 23 25 36 28 11 -7 -20 -37 -11 2 19 40 52 15 -14 -43 -41 -10 -51 -2 5 27 32 16 22 -6 -18 -54
6970e4K1mP2qNjJ3o3Npj2PL1O2n0J9j8l3j9j1LK0M4J2k4L6m2j0j5mJ2j0K4M5K
$$ -54 -33 -37 35 27 32 31 44 -19 -14 -21 -33 -26 5 67 17 36 18 -15 -34 -45 -42 -22 22 34 10 46 4 -6 -21 -25 -13 -23 1 46 48
7005D8ml1k0kpl3L7J5J7oJ1Jm1k1J0Nj2J4L2RL4m0Nm4k4oJ2L5J1L3J5j8k8Qk7
$$ 48 44 13 -7 -9 -16 -49 -12 3 20 14 25 26 -15 -36 -26 -21 -33 -19 13 22 56 16 21 -23 -47 -53 -41 -6 5 38 53 35 7 15 -12
7040a2j2j8K2OM1K5l4j3Ol1Jm2L4O1k3M9l0K3n2q%m4K5J1K8K2mPm6j0l5J5j1K4
$$ -12 -24 -42 -20 -14 27 52 18 5 11 -20 -19 -61 -27 34 11 60 30 53 1 -7 -7 -51 -26 -15 13 35 31 38 -8 -18 -53 -38 -49 -25
7074b5L2J4K4kk1k7l8J8mL6JJM8l4j8j2l5J3RK4OL2rj7J2m0l6J5j1K0L9j8M8k3
$$ -25 7 21 45 43 22 -5 -43 -25 -29 7 8 9 57 23 5 -7 -42 -29 -20 4 10 42 33 16 28 -12 -48 -33 -44 -24 15 -3 45 22
7108B2Rl6m4J5j3M7j9M1K8Qm6k7Ql3J6k9O6L1k5Qk0lj8k9J4M4KNJ2K0l3k0J9m6
$$ 22 31 -5 -49 -34 -47 0 -19 22 50 58 12 -15 -7 -40 -24 -53 13 44 19 27 7 4 -14 -43 -29 15 17 22 34 54 21 1 20 -26
7142b6K1l4L3L8Mjj0n6M8n7L0orM2j0K9k1J5q3K4k2K7Lj3M6N2l8k0K5m9k4J9Q
$$ -26 -5 -39 -6 32 36 35 25 -31 17 -40 -10 -16 -25 17 7 36 15 30 -53 -29 -51 -24 -21 -34 12 64 26 6 31 -18 -42 -23 -15
7175a5K5J1R%j8nl5oQj6N0NOL1j4n8Jj1MJ5K0K2NK4k6m0J1l3rK8K2KK3J8k9j7
$$ -15 10 21 30 30 12 7 -28 -34 -26 -42 8 13 19 50 36 -22 -21 -32 -28 -13 7 29 34 58 32 -8 3 -30 -39 -11 11 13 36 54 25 8
7211Hk9k4L1j4L2K7pLK0m4j8j4j7K9l5R5rNk0J5j6m4nOJ5oM5j7L8j6l2k1lonL8
$$ 8 -21 -45 -14 -28 4 31 24 27 47 3 -15 -29 -46 -17 -52 43 34 39 19 34 18 -26 -31 -25 -10 -16 29 12 50 34 2 -19 -22 -28 -33 5
7247EJ2%J7Mol7l2J7KqK3L5k2K2j1l5j2J4j6M5J8qL3j1m2l0Pn2P1l4O1LLmj9m
$$ 5 17 17 34 38 32 -5 -37 -20 -18 -26 -3 32 10 32 21 -14 -26 -12 -28 17 35 27 60 49 7 -23 -16 -68 3 -31 30 33 36 32 13 9
7283Im3RoK4LJ5OL2k0m1%l3J8J4j0O0JJ2n4pQk5pJ5J2j3M8K1J1n6l0knPL6J9k
$$ 9 -34 -25 -31 -7 -4 11 17 49 29 -12 -12 -45 -27 -13 -23 37 38 50 -4 -11 -3 -28 -35 -20 -8 -21 27 48 59 3 -27 -29 -34 -27 9 28 26
7320B6K3j0k9j5j4j1J0ML7L0J1l6l0J4l8rJ0M4nK4QJ4o4J2k6n4L6K2j0L9J2Mj7
$$ 26 49 39 10 -5 -19 -30 -20 -16 21 51 62 26 -4 10 -28 -37 -27 17 12 36 44 58 -6 6 -20 -74 -38 -16 -26 13 25 29 12
7353A2k5j6l6M8J0K7LJ1J3k0j0l7K1k9JK5J1J7J3j3J2o1OkoK6lJ5jK7k8pl5K0
$$ 12 -13 -29 -65 -17 -7 20 23 34 47 27 17 -20 1 -28 -27 -2 9 26 39 26 38 -23 -17 -19 -25 1 -2 13 12 39 11 4 -31 -11
7387a1l8K6J4K4KK6l5j4rl3kM2nJ1L1m0J3j8J6k8k1L1mN8Rj7Ok8k1j3j3J3J5K7
$$ -11 -49 -23 -9 15 17 43 8 -6 -15 -48 -50 -8 -13 -2 29 -11 2 -16 0 -28 -49 -18 -22 36 45 28 34 6 -15 -28 -41 -28 -13 14
7421A4K0%Jk3k3j8j1J7J1K8mPjj7pom6K9qN4M3m4J9k4Ll7%PkL6k5L4K6n0J3k3
$$ 14 34 34 35 12 -11 -29 -40 -23 -12 16 12 19 18 1 -6 -12 -58 -29 -37 17 60 16 35 11 14 -23 -23 -16 -18 18 -7 27 53 3 16 -7
7457gl5NjPP1j1K0m3Ppl7Rj7N7k3M0J3k2l4pk3MJ2J2L6K7j3m2NQk9j6J0J5L1M
$$ -7 -42 -37 -38 -31 40 29 49 6 13 6 -31 -22 -39 18 -5 35 48 26 -8 -15 -38 -34 -22 -10 26 53 40 -2 3 11 -18 -34 -24 -9 22 26
7493B6J1j0l1Rl7LK4j2JK6Pqj7Lk6J2NPRM8K3l3j0k6m3K4k1K2MN6m0J8Kk3nk2
$$ 26 37 27 -4 5 -32 -29 -5 -17 -16 10 17 9 -8 -5 -31 -19 -14 -7 2 50 73 40 30 4 -39 -15 -36 -14 -10 46 6 24 26 3 -2 -24
7529b4OLJ6nM3Pk7k0k7JLJ2M3k8PL3pk6Jl3k9K9PJ8J7L1k1j8j1l0l9M4PL1M4m8
$$ -24 -18 -15 1 -4 39 46 19 -1 -28 -27 -24 -12 31 3 10 43 36 10 11 -22 -51 -22 -15 3 20 51 30 12 1 -29 -68 -24 -17 14 58 10
7565A0J6K0n8l5kJ2PP6l5L7j0n1J5l8j1K7K2l4R0pk2j8l6kRpnJ8LO1k5oj3k1j
$$ 10 26 46 -12 -47 -49 -37 -30 46 11 48 38 -13 2 -36 -47 -20 2 -32 58 51 29 11 -25 -27 -18 -25 -30 -12 -9 52 27 21 8 -13 -14
7600a4k6O0l5L8OJ4k3j8K4q8M8k3M2J2MNPj5k9k6p%N2QK5j4%J4k5m7j2L3J5J9
$$ -14 -40 20 -15 23 29 43 20 2 26 -62 -14 -37 5 17 21 26 33 18 -11 -37 -44 -44 8 16 41 27 27 41 16 -31 -43 -10 5 24
7634B4Plj1J6k4jk6kkL8J5j0K5Ml4j9j2JlK4J1LN%j4Kl6J1k3M5Kj3K4j0j9Jj0
$$ 24 31 28 17 33 9 8 -18 -20 -22 16 31 21 46 50 16 -3 -15 -14 -17 7 18 21 26 26 12 14 -22 -11 -34 11 13 0 24 14 -5 -4 -14
7671a4qrJ7K4oK8J5m1J4j8k5QoM1Pj5M4k1l3l3jj6K9M0KK2jm9L0m8k1J5M4j3K3
$$ -14 -22 -31 -14 10 4 32 47 6 20 2 -23 -15 -21 20 27 12 56 35 2 -31 -32 -48 -19 21 23 45 44 -5 25 -23 -44 -29 15 2 25
7706B5J3Lj0j9n0KJ5j8L4J2K7j2K5m3j5l0pN3j5N0j6J0j3j4j3k5k5K3kK1M6k2
$$ 25 38 41 31 12 -38 -36 -21 -39 -5 7 34 22 47 4 -11 -41 -48 5 -10 40 24 34 21 7 -6 -31 -56 -33 -35 -14 32 10
7738A0K0l0j0Jm5N3j8K3K1Mj4j5j8Rj5lK4RJ7K9j1j7k1k2l4L9j2K6K0K6k3j9k
$$ 10 30 0 -10 -9 -54 -1 -19 4 25 29 15 0 -18 -9 -24 -27 -3 6 23 52 41 24 3 -19 -53 -14 -26 0 20 46 23 4 2
7771Bk5l2K4L0%K2J2j0N0m5m8J2j5OJ2M9k3J3j8j8Jj2l6L9lK1J5PJ6k3j7l1qr
$$ 2 -23 -55 -31 -1 -1 21 33 23 73 28 -20 -8 -23 -17 -5 44 21 34 16 -2 -1 -13 -49 -10 -13 8 23 30 46 23 6 -25 -33 -42
7805d2L9J6K4L6k6k0j5k0k7OL2jNL1J3n0J3k5k9MJ5J0L1LL8k8%k5k7j9ML0J0L3
$$ -42 -3 13 37 73 47 27 12 -8 -35 -29 3 2 7 38 51 1 14 -11 -40 -36 -21 -11 20 23 61 33 33 8 -19 -38 -34 -4 6 39
7839C9j2j4j6k6J2qj5J8M0K0Mrj9l7j3k1RM6l0N5J1K0m2%m7K1j8N1nj1K9k2lk1
$$ 39 27 13 -3 -29 -17 -25 -40 -22 18 38 42 33 14 -23 -36 -57 -48 -2 -32 23 34 54 12 12 -35 -14 -32 19 14 3 32 10 7 -14
7873a4J3l1kK2J1QJ8j8L8j8n2jJ2j2J2J4L6l0L5k2l6%loMM9lNJ9k3k3k0k0NK4
$$ -14 -1 -32 -34 -12 -1 7 25 7 45 27 -25 -26 -14 -26 -14 0 36 6 41 19 -17 -17 -20 -26 -22 27 24 29 48 25 2 -18 -38 -33 -9
7908iLK5ROk0j4m4K6jkj1O3j5J2j8k4Kl2j6O8PNKL0k2l5Nk2nJ5NPL9K%n2Mk4P
$$ -9 -6 19 28 34 14 0 -44 -18 -19 -21 -32 31 16 28 10 -14 -12 -44 -60 8 15 20 22 52 30 -5 0 -22 -27 -12 -7 0 39 41 41 -11 -7 -31 -24
7947b4jM5JJ7j4K9j3o9K0l4K1M0jQLrmk4oj5K1mJ3M8j2j9J2l8j4j3PL1j1N0k0
$$ -24 -25 20 21 38 24 53 40 -29 -9 -43 -22 18 17 25 28 19 15 -9 -15 -30 -9 -13 0 48 36 17 29 -9 -23 -36 -29 2 -9 41 21
7982B1Oql6j4j3kJ8J6N7lj9nk2j5J9l6L4j4L8LJ0n1kK3l3j6L2L9MmLOl6Lml0O
$$ 21 27 19 -17 -31 -44 -46 -28 -12 45 42 23 18 -4 -19 0 -36 -2 -16 22 25 35 -16 -18 5 -28 -44 -12 27 31 27 30 36 0 3 -1 -31 -25
8019b5N2mpJkj9j0k6J8j6M3nK3K5k4Pl5k9%JM0PL6j3l7qL9m8m4J4J1L7J0K8mj9
$$ -25 27 23 16 17 15 -4 -14 -40 -22 -38 5 0 23 48 24 31 -4 -33 -33 -32 8 15 51 38 1 -7 32 -16 -60 -46 -35 2 12 40 36 17
8055A7k8pRJ4l3N3Rqnnk1%l2J2JM1m1K0K1J5m2k4LmK0k0P1j3J6rJ2o8mJ0KRJ8
$$ 17 -11 -18 -9 5 -28 25 34 26 21 16 -5 -5 -37 -25 -24 17 -24 -4 17 32 -10 -34 -31 -35 -15 -35 36 23 39 30 42 -26 -30 -20 -18 -9 9
8092IKL0j2l0k6jj1J6PL1K5J5k3ol3k0KLJ0pJ6L7j4j5jkk1k9J1L4L0j8K7j1ol0
$$ 9 11 41 29 -1 -27 -28 -39 -23 -16 15 40 55 32 26 -7 -27 -25 -22 -12 -19 -3 34 20 5 4 2 -19 -48 -37 -3 27 9 36 25 19 -11
8128a1l4J1J3K7j9K1K3J1n2Mk5JJ8jJ8rL8j0n5QJ2qm4N9K2J7J8k0k3k2j6j8J6
$$ -11 -45 -34 -21 6 -13 8 31 42 -10 -6 -31 -30 -12 -13 5 -4 34 24 -31 -23 -11 -19 -63 -4 18 35 53 33 10 -12 -28 -46 -30
8161c0J2L5J3k4PK0m4l8J1LjM4NJ4J2l5Mk8k6L4OJ0QK1k8mlk3J8k7
$$ -30 -18 17 30 6 13 33 -11 -49 -38 -35 -36 8 13 27 39 4 8 -20 -46 -12 -6 4 12 33 5 1 -2 -25 -7 -34
8191c4
$$ Imaginary data points
##PAGE= N=2
##DATA TABLE= (X++(I..I)), XYDATA
0@%%%%%%%%%%%%%%%%%%%%%%%%%%%%%%%%%%%%%%%%%jKnRj2J4j5J6j6J6j6J7j8J9
$$ 0 0 0 0 0 0 0 0 0 0 0 0 0 0 0 0 0 0 0 0 0 0 0 0 0 0 0 0 0 0 0 0 0 0 0 0 0 0 0 0 0 0 -1 1 -4 5 -7 7 -8 8 -8 8 -8 9 -9 10
55A0k2K7l1L3l7M4n2O1p5R4j23J79k86N77k658r086O519M348l956L702P982j907
$$ 10 -12 15 -16 17 -20 24 -28 33 -42 52 -71 108 -178 399 -2259 -11345 -4826 -478 -4434 -732 7250 5343
77E343l738N5k713k526K411q61k329M060L496j698K088L238n752n005J133k249
$$ 5343 1605 1660 -1053 -3579 -1168 -2029 -4358 -298 3198 1500 3588 6826 1074 -3931 -2798 -5047
93e047l085P670P066k912n29L010o046p059L338K965k682K272M754r82q42J614
$$ -5047 -8132 -462 6604 3692 3163 6173 127 -6932 -3594 -629 -3311 -1039 3715 2733 1891 3505
109C505k460k617R10k895m022N181O153j418P62M013l837p100m53L59j060M454
$$ 3505 1045 -1572 -662 -3557 -7579 -2398 3755 2337 3099 7112 3275 -3825 -4278 -3919 -4979 -525
125e25M714j653k14K401l607m936J798P81l070J418M069K87J263L018k397m478
$$ -525 4189 2536 2322 4723 1116 -3820 -2022 -1241 -4311 -2893 1176 1463 2726 5744 3347 -1131
141a131l53j831l422L389O034K32q7K395k410n403p01N81j224J851L338J16Q90
$$ -1131 -1484 -3315 -6737 -3348 2686 2918 2831 5226 2816 -2587 -3288 -2707 -3931 -2080 1258 1374 2264
158B264K541j860l639J14r76l722Q53M434J517J169K558j474m216j380j193k384
$$ 2264 4805 2945 -694 -580 -1556 -5278 -4425 9 1526 2695 5253 3779 -437 -1817 -3010 -5394
174e394J925M637R47N6K102o52l565j392o81j953N26K512R84J744K958p50l394
$$ -5394 -3469 1168 2115 2171 4273 3621 56 -1336 -2017 -3970 -3444 -932 52 1796 4754 4004 610
191F10j108j260l077K59L833K055J039K065k89l064j890j312k037L25K641J382
$$ 610 -498 -1758 -4835 -4576 -743 1312 2351 4416 4127 1063 -827 -2139 -4176 -3851 -1210 172
207A72J167K360K86k245j668j520k312k70K094J630J945K635P2k527j695j484
$$ 172 1339 3699 3985 1740 72 -1448 -3760 -4030 -1936 -306 1639 4274 4346 1819 124 -1360
223a360k583n75K328K026J386K119O74j602j737j744k210n85J509J510J692K448
$$ -1360 -3943 -4518 -2190 -164 1222 3341 4015 2413 676 -1068 -3278 -3863 -2354 -844 848 3296
239C296Q54j425j790j876k353q36J128J677K107K391Q30j155j367j825k461j093
$$ 3296 4150 2725 935 -941 -3294 -4130 -3002 -1325 782 3173 4003 2848 1481 -344 -2805 -3898
255c898J049J448J708K265J256p49j501j863k250j333N12J496J940K255J381k09
$$ -3898 -2849 -1401 307 2572 3828 3079 1578 -285 -2535 -3868 -3356 -1860 80 2335 3716 3507
271C507j350k077k212j261M6J071K049K309J280j20r63j854k454j470P5J023J767
$$ 3507 2157 80 -2132 -3393 -3347 -2276 -227 2082 3362 3242 2279 425 -2029 -3499 -3424 -2401 -634
288f34K365J719J43j003j727k208j803m26R39J716K093J711O40q25j848k042j588
$$ -634 1731 3450 3593 2590 863 -1345 -3148 -3574 -2635 -919 1174 2885 3525 2700 852 -1190 -2778
305b778p91O17J855K253J626P21l44j619k401j847o58L23J300K223K067Q35m75
$$ -2778 -3569 -2952 -1097 1156 2782 3503 3159 1540 -861 -2708 -3366 -3043 -1743 480 2547 3382 2907
322B907j289j925k034j116L56J507J897J877J266m9j472k082j831j204j86J139
$$ 2907 1618 -307 -2341 -3457 -3101 -1594 303 2180 3446 3397 1925 -157 -1988 -3192 -3378 -2239
338b239K172J958J151J36r44j891k136j295q4R92J781K018J505K04r53j857k001
$$ -2239 -67 1891 3042 3178 2234 343 -1793 -3088 -3172 -2180 -399 1619 3124 3328 2375 518 -1483
355a483j430m64P27J851K118J433M87n57j692k122j507n26N58J609K035J560O52
$$ -1483 -2913 -3377 -2650 -799 1319 2752 3239 2682 990 -1132 -2639 -3165 -2607 -998 1037 2597 3249
372C249n06j585k093j614p66M32J524K005J654R18j79j548k074j527q38NJ243
$$ 3249 2743 1158 -935 -2549 -3315 -2883 -1359 646 2300 3218 3039 1491 -583 -2110 -2948 -2943 -1700
389a700K143J730P84l9j196j921j876j073M8J306J910J671J174K62j185k033j666
$$ -1700 443 2173 2957 2918 1722 -199 -2075 -3148 -3100 -1794 116 1787 2961 3223 2038 5 -1661
406a661j071k91R44J865J695J221M13r87j854j675j244n61P56J965J904J272M11
$$ -1661 -2732 -3023 -2079 -214 1481 2702 3115 2128 274 -1401 -2645 -3206 -2450 -485 1419 2691 3102
423C102o23j689j941j547m48R09J608J473J389Q63o01j821j638j108q10J79J458
$$ 3102 2479 790 -1151 -2698 -3146 -2237 -629 844 2233 3096 2495 674 -964 -2072 -2882 -2703 -1245
440a245K001J534P92l25j390j815j740j027L84J552J884J485P78k67j247j747
$$ -1245 756 2290 3082 2757 1367 -448 -2188 -3215 -2831 -1279 605 2090 2868 2601 1354 -393
456c93j580q57L80J129J300J457J408K31j370j711j372j233o35R40K177K065R12
$$ -393 -1973 -2830 -2450 -1321 -21 1436 2844 3075 1705 -6 -1378 -2611 -3246 -2306 -129 1936 2848
473B848p7q15j700k026j205L16J220J319J314J178L44p81j392j468j244o32L93
$$ 2848 2771 1956 256 -1770 -2975 -2659 -1439 -120 1194 2372 2716 1935 543 -925 -2169 -2801 -2408
490b408J349J753J666R63o00j967j884j185p46L21K009K408R33k95m20q47j784
$$ -2408 -1059 694 2360 3323 2723 756 -1128 -2313 -3059 -2738 -729 1679 2612 2317 1897 1050 -734
507g34j541k43P08P59R17J425J498K03j472j813j218j228n84J390K601J687N73
$$ -734 -2275 -2518 -1810 -1051 -134 1291 2789 2992 1520 -293 -1511 -2739 -3323 -1933 668 2355 2928
524B928j48j415k116j393m23J72J185J711R92L65K94l67j278j429j219o20O34
$$ 2928 2780 1365 -751 -2144 -2567 -2395 -1210 501 1493 1858 2152 1785 507 -922 -2141 -2761 -2127
541b127J423J471J807J161j310k608j483p76p74R36K572J765K25q6o25j286j088
$$ -2127 -704 767 2574 3735 2425 -183 -1666 -2442 -3216 -2280 292 2057 2282 2196 1571 285 -803
558h03r31o14N47J158P14J145J666K9j750j596j473j463L90K091J746J432J251
$$ -803 -1734 -2348 -1801 -643 71 1216 2882 2911 1161 -435 -1908 -3371 -2981 -890 856 2288 3539
575C539r43k541j241l78r15K27J804J152M22P34K09q08p93j385j796p8J375R20
$$ 3539 2596 55 -1186 -1564 -2479 -2252 -448 704 1126 1860 2069 1261 468 -917 -2713 -2791 -1416 -496
593d96J462K397J78k212j665j154j565N1K029J473Q65J151k55j618p00l80j473
$$ -496 966 3363 3541 1329 -336 -1490 -3055 -3004 -975 498 1363 2514 2259 641 -59 -439 -1912
610a912n76J109P53Q31J838Q48q33r26j583k482m56J776J026J087K321N29k006
$$ -1912 -2488 -1379 -626 205 2043 2891 2058 1132 -451 -2933 -3389 -1613 -587 500 2821 3350 1344
627A344j407o08j373n09J210Q77O71J555N21q15k36p09k294j163R04O84R43K418
$$ 1344 -63 -671 -2044 -2553 -1343 -466 205 1760 2281 1466 1230 521 -1773 -2936 -2032 -1348 -405 2013
645B013J230j040j072j165k233q08J399R40P31J826Q54j102p45m86j562j062L96
$$ 2013 3243 2203 1131 -34 -2267 -3075 -1676 -736 -5 1821 2675 1573 828 342 -1220 -2282 -1886
662a886L90P27K044J190l89k41q22k451j485O64P97P80K073J423o48q90q04j728
$$ -1886 -1496 -769 1275 2465 2076 1835 1013 -1438 -2923 -2259 -1462 -682 1391 2814 2166 1276 472 -1256
680a256j045M48M38M89J799J281k43k69m16j799j575m0K25O98K003J569j06l47
$$ -1256 -2301 -1853 -1415 -926 873 2154 1911 1642 1226 -573 -2148 -2188 -1963 -1265 738 2307 2201 1854
698A854o20j989j577J21N51N93J591J451Q6l25n34j519j365k53oM23J656J562
$$ 1854 1234 -755 -2332 -2211 -1660 -1067 524 1975 2061 1736 1202 -317 -1682 -1935 -1941 -1518 138 1700
716A700L08J1l84j672j710m12J24N16J538J615M64r5m62j426j575m91J8L25J294
$$ 1700 2008 2019 1635 -37 -1747 -2159 -2035 -1519 19 1634 2098 2003 1541 115 -1460 -1951 -1933 -1608 -314
735c14J546O83J49l67j321j477p21k98K64J408J588P29J78j77j282j613q27j72
$$ -314 1232 1915 2064 1697 376 -1101 -1822 -2120 -1856 -448 1140 1869 2047 1870 588 -1025 -1852 -2024
753b024K01J133J524R33K62k32j036j416r62m13Q6J083J454R62M84n0j019j441
$$ -2024 -1823 -690 834 1767 2029 1797 761 -655 -1617 -2030 -1944 -861 593 1555 2039 1989 970 -471
771d71j086m89N1R05J459J075N22j4q11j364j131o08l6P88J340J119P29J02q12
$$ -471 -1557 -2046 -1995 -1090 369 1444 1966 1952 1141 -223 -1354 -1962 -1998 -1210 130 1249 1978 2080 1268
790A268j324j127o82k00O81J278J243P34J53n81j159j264q50k14N89J162J183
$$ 1268 -56 -1183 -1865 -2065 -1384 -106 1137 1871 2024 1443 284 -980 -1830 -2044 -1455 -293 890
807H90Q78K74n28j155j181q56l93M30J144J194R56L53l54j018j263r51m28L35
$$ 890 1768 2042 1514 359 -822 -1678 -2071 -1641 -497 697 1653 2006 1652 634 -629 -1580 -2008 -1673
825a673R62J202J056M86l32r24j120j081n85K27R52J152J003O27j11q89j160j070
$$ -1673 -711 491 1547 2033 1701 777 -343 -1424 -2009 -1782 -830 322 1325 1952 1841 952 -208 -1278
843a278o12Q7P45J152J097P34j01p57j063j106p63pP35J037J110Q20N1o70j030
$$ -1278 -1890 -1803 -1058 94 1191 1925 1824 1067 4 -1102 -1865 -1872 -1137 -100 1010 1830 1881 1211 181
862A81j094q99r0O80R75J050Q99K26o18r57j070r50k14N32Q57J111J041L02n66
$$ 181 -913 -1812 -1902 -1222 -247 803 1702 1928 1310 353 -717 -1667 -1881 -1349 -492 619 1660 1962 1396
881A396q88r94j077l91N27Q29J029J038M38m40p58j010j162m36M50P38Q79J191
$$ 1396 508 -486 -1563 -1954 -1427 -598 431 1469 1907 1467 709 -301 -1463 -1899 -1449 -711 168 1359
899A359N95m46o98r43j116o14L17O11R28J248O35m30n03p65j302p57L17N96P60
$$ 1359 1954 1508 810 -133 -1249 -1863 -1546 -935 -7 1241 1876 1446 943 178 -1124 -1881 -1564 -968 -208
918b08J230P96k62m78p54j366q04L19M32O55J340Q93k12m43o33j324q75J72K91
$$ -208 1022 1818 1556 1078 324 -1042 -1846 -1527 -1095 -440 900 1793 1581 1138 505 -819 -1694 -1522 -1231
937a231N67J403R68k37k77l69j413j157J26M00M59J276J120o8k22m97j401j014
$$ -1231 -664 739 1707 1470 1193 824 -589 -1746 -1620 -1220 -761 515 1635 1567 1345 848 -553 -1567
955a567J90J55J45J435J257k30j80j29j248j236j4P5J23J398J272k8o3l3j366
$$ -1567 -1377 -1222 -1077 358 1615 1385 1205 1076 -172 -1408 -1422 -1347 -1224 174 1446 1418 1355 1322 -44
974d4j449K8J47J31J263J244llmj331j250J95j65l32J248J526O7J5L03j125j533
$$ -44 -1493 -1465 -1318 -1187 76 1320 1317 1314 1310 -21 -1271 -1076 -1241 -1573 -325 1201 1268 1283 1586 461 -1072
995a072k75j07q3J216J468Q6J20K25j258j494K8j2l02J001J353O3J93N24r90j451
$$ -1072 -1347 -1454 -1537 -321 1147 1233 1353 1578 320 -1174 -1146 -1158 -1460 -459 894 957 1150 1674 684 -767
1015g67j02k89p39R55J730L49J41M90q82j640l84k17l40J079J393M0K13O80r24
$$ -767 -869 -1158 -1897 -942 788 1137 1278 1768 886 -754 -1138 -1355 -1695 -616 777 817 1030 1710 786
1034G86j457j7j06r20N81J446L21L89Q89o73j487m72m67q47Q40J676M16K42O42
$$ 786 -671 -688 -794 -1714 -1133 313 634 1023 1912 1239 -248 -720 -1187 -2034 -1194 482 898 1140 1782
1053A782p65j455k39k38p02O55J234N8L01J089l50j400l22l27j126J89J426O72
$$ 1782 1017 -438 -677 -915 -1617 -962 272 330 631 1720 1370 -30 -352 -679 -1805 -1616 -190 482
1071D82N25R09m79j429n38m71q54N97J441K97J60Q67k77j169k17k59j069K3J111
$$ 482 1007 1916 1437 8 -530 -1001 -1855 -1258 183 480 640 1507 1230 61 -156 -415 -1484 -1461 -350
1090c50L02M50J311K9j265n97n09j119L6J259O89N57Q59k77j136l45l40j030J51
$$ -350 -48 402 1713 1742 477 -120 -629 -1748 -1712 -453 236 793 1652 1375 239 -106 -446 -1476 -1325
1109a325J044J93J82J146L06q79l77m48j190l56Q23N16P18J233J75j014o42n19
$$ -1325 -281 -88 94 1240 1546 667 290 -158 -1348 -1704 -881 -365 353 1586 1761 747 105 -414
1127d14r93j19Q96N05M18Q91J42p23k54k66j155l77O47K50L53J227O52n89n22
$$ -414 -1407 -1526 -630 -125 293 1184 1326 603 349 83 -1072 -1449 -802 -552 -199 1028 1680 1091 569
1146E69n94j149m72O32N23N85J088K91o99l63l81r60l90M97K84L26R33N52k50
$$ 569 -25 -1174 -1646 -1014 -491 94 1182 1473 774 411 30 -930 -1320 -823 -539 -213 720 1272 1022
1165A022k67l93j077p09L06L13N09J081O41k30m64n58r84n06L05L11M28R40N23
$$ 1022 755 362 -715 -1424 -1118 -805 -296 785 1426 1196 732 174 -810 -1316 -1011 -700 -272 668 1191
1184A191k38j96k61r18p26L9K49L52Q76P39Q1j80m92r52p15l6K47M34R21O60J4
$$ 1191 953 757 496 -422 -1148 -1109 -860 -508 368 1107 1188 1008 516 -436 -1151 -1187 -940 -506 415 1075 1089
1205A089j94l69q19o57q5Q1L27P48P44J80o0k57p84q10k67Q6L40P81P64L02l6
$$ 1089 895 526 -293 -950 -1035 -954 -627 121 865 1045 985 728 -56 -866 -1133 -1047 -707 74 838 1140 1104
1226A104m19p51p09k70N0K70O82P37L20Lk40o39p67l49p3K15O12P95M18Q3k17
$$ 1104 685 -66 -775 -1045 -995 -725 -43 694 1014 1017 777 138 -629 -978 -1051 -836 -224 571 989 1072 855
1247H55n76q03m69j11K07O26P00N05J26j81n83o85m69j99J19N65P13M97K00j09
$$ 855 279 -524 -993 -1104 -897 -271 429 934 1060 879 296 -389 -858 -1057 -938 -373 340 837 1037 928
1267I28m63p25n56k24R3M16P33O07K41j05m24p00n17l26K1M29O19O04L19Ll71
$$ 928 465 -260 -816 -1040 -947 -531 202 809 1050 945 521 -179 -696 -1022 -1001 -572 47 651 970 973 602
1288F02o43n83l40n9L61O34O05L74P8l36o07n90m28p6L17N71N99M35Q9k69n49
$$ 602 -41 -624 -964 -1023 -662 -28 577 951 1029 693 86 -504 -932 -1008 -691 -120 479 914 1003 734 185
1309A85n93m57j68K63N54N76M76J69j96n13o14m76k11J91M56O09M97K43j59m53
$$ 185 -408 -865 -1033 -770 -216 360 836 1005 809 296 -318 -794 -1005 -814 -358 251 748 991 832 379
1329C79n94n17k35J17M64N52N38K57q9m18n63n35l13N6L87N70N83L00m1l73n41
$$ 379 -215 -732 -967 -850 -386 166 704 961 872 454 -109 -644 -957 -901 -514 56 639 939 898 525 -16
1350a6n44l28m6L68N53N18L72J7k58n57n62l80o8K93N01N59M09P2k46m76n57m12
$$ -16 -560 -888 -934 -566 -13 505 877 894 636 79 -483 -863 -931 -638 -137 422 831 903 657 181 -376 -788
1372g88q6J91M77N56M07J20j97m20n70m23j81J63M66N33M49J69q9m16n66m64j67
$$ -788 -874 -683 -206 350 757 877 680 260 -310 -733 -914 -751 -285 248 697 866 777 361 -205 -669 -836
1393h36Q9L66N47M71K27q9l67n38m28k88M2L59N37M45K63L1l16n40m97k62m0L11
$$ -836 -747 -381 166 637 864 775 408 -130 -558 -846 -804 -445 92 537 800 831 515 -25 -522 -784 -824 -513
1415e13N06M72L08O9k78n32m82k59p6J76N02N31L25O3k32m46m21l97j71K44M58
$$ -513 -7 465 773 842 564 32 -450 -709 -785 -609 -107 424 749 812 580 134 -287 -684 -855 -611 -153
1436a53M15M01J81j94m63m48l67k10J84M43M27L73K25q9m34m93l51k24Q5L85M50
$$ -153 262 663 844 650 187 -261 -628 -838 -654 -211 216 589 814 725 291 -202 -553 -777 -692 -307 143
1457A43L89K16n6l56l95m25l17Q7L91M14L34L55K2m18m18l84l34j8L88L51M09
$$ 143 532 748 692 336 -59 -484 -801 -714 -323 91 425 780 802 384 -34 -418 -752 -770 -382 -31 378
1478C78L99l1l83l37l17l96n4L04L54L61L86J02k93l39l57m90j13L13L61L28M82
$$ 378 777 746 363 26 -291 -687 -741 -437 -83 278 664 766 473 134 -223 -713 -826 -513 -152 176 658
1499F58J60k89l63l49m36j45K63L18K95M74J78k88k49k66m67l00K54K70K69N32
$$ 658 818 529 166 -183 -619 -764 -501 -183 112 586 764 476 227 -39 -506 -806 -552 -282 -13 519
1519E19K99k12k66l29n49k73K72K44K64M85L37k55k84k08m51k79J67J58J73N52
$$ 519 818 606 340 11 -538 -811 -539 -295 -31 454 791 536 252 44 -407 -686 -519 -361 -188 364
1539C64L65j98j53r2n73m65J12K24K24N61M10j52k29k08n41l80J98J69J43N00
$$ 364 729 531 378 286 -287 -752 -640 -416 -192 369 779 627 398 190 -351 -731 -533 -364 -221 279
1559B79L79j55j17p2m38m81N3Q3O6N21N32p2r2o0n79n82R4K07J28M72M54p0j08
$$ 279 658 503 386 314 -124 -605 -552 -469 -403 118 650 578 486 426 -153 -735 -641 -434 -306 166 620 550 442
1582D42q7m75m38J24M3j06M90M75L5m8Q8m77n48q1nJ8N37N70J3m4k1m66n82N0
$$ 442 355 -120 -558 -434 -391 -497 -7 468 503 455 543 66 -482 -563 -568 -550 -13 557 570 526 505 39 -543 -493
1606d93L1pL96N00m2M0R6l51n19n6m3j55L66N71J28M6J26l80o22j67j6m2M46N01
$$ -493 -462 -469 -73 427 385 425 521 170 -349 -405 -448 -603 -237 334 462 508 634 254 -368 -535 -551 -593 -147 354
1630C54O5jJ29l25n14o8mj84K30M71J73R2J90k18n47k08j05j70K38N92K11Q2J59
$$ 354 419 418 547 222 -292 -360 -364 -548 -318 153 326 418 608 390 -157 -365 -470 -640 -402 190 401 483 642
1653F42l31n01j50p8j53K43M60J44N8K33j33n02j67r9k70R3M61L16J25K63j58
$$ 642 311 -190 -340 -418 -571 -328 132 276 334 567 434 -68 -235 -334 -604 -511 -50 266 391 654 496
1674D96m81k75j37k12J40N16K11Q2K04j00m59j70r3k61P0L88K00J31L34k7l80
$$ 496 15 -260 -397 -609 -469 47 258 340 544 444 -15 -185 -278 -539 -469 -81 119 250 584 557 177
1695A77k88j75k97M7L79K70J81K47m2l57k72j46k53K6L56J84J81K96Ok89k20j68
$$ 177 -111 -286 -583 -536 -157 113 294 541 499 142 -130 -276 -529 -503 -147 37 218 514 520 231 11 -157
1717a57l32l8K50K46K12L37O3k85k38k64k89j6K58K25J87K89P9k40k24k06k65
$$ -157 -489 -527 -277 -31 181 518 581 296 58 -206 -495 -511 -253 -28 159 448 527 287 63 -143 -408
1738d08j32K44J80K01K84J61j91j71k69k97j34J65K21K10L04J26j13k08k48k92
$$ -408 -540 -296 -116 85 369 530 339 168 -101 -398 -532 -367 -146 64 368 494 381 173 -75 -367
1758c67r0O4K02K03L00J70p9j64k31k86j60K3J88J96L06J71k8j64k45k89j60K1
$$ -367 -457 -393 -191 12 312 482 403 239 8 -278 -438 -415 -227 -31 275 446 418 254 9 -280 -440 -419
1780d19J56J99K85K06j7j27k23k76j74J7N8K22K44K28N2j15j99k75k05n4J09K01
$$ -419 -263 -64 221 427 410 283 60 -216 -390 -373 -315 -93 151 379 431 316 117 -158 -363 -417 -308 -107
1802a07K21K49P2p3j95k60k34r2O9J75K57K13J14o1j72k19k45j11M2J64K50K22
$$ -107 114 363 435 362 167 -93 -327 -419 -350 -175 82 295 409 348 176 -43 -288 -399 -357 -193 57 279
1824B79J23k9j45k37k39j43J8J25K43K52R7M3j83j74k33j41J2M1K48K40J84Jr5
$$ 279 402 373 228 -9 -248 -391 -373 -248 -5 247 344 387 204 30 -203 -344 -332 -291 -43 197 381 382 287
1847B87k18k20j74n1R5K05J99J78N5l5k07k58j53o8P1J74K65J47O7n5j65k68j57
$$ 287 69 -151 -325 -376 -281 -76 123 301 356 321 114 -144 -297 -365 -294 -120 145 292 359 304 139 -129 -286
1870b86n9J8J64K28J74J14j9j53k46j69j07K1J14K64J74J10L4j61k43j68r2o7
$$ -286 -345 -327 -163 65 239 353 334 181 -65 -234 -341 -320 -206 58 232 342 376 215 -28 -196 -288 -355
1892c55J05K60J60J24P3j33k33j90q3q7J23K32J73J03N1l1k48j88j28q3P3K15
$$ -355 -250 10 170 294 367 234 1 -189 -272 -359 -236 -4 169 272 323 292 44 -144 -272 -355 -282 -67
1914f7J88J21J14q0k04k13r4r4L6J90J91J22J13m1j89j85j26j08K6J81J92J07
$$ -67 121 242 356 276 72 -141 -235 -329 -293 -103 88 210 323 282 93 -92 -218 -326 -300 -119 73 180
1936A80J45Pk09j63j04j79j1J87J48J63J39K7j71j82j26j41m8J69J62J18J86K3
$$ 180 325 332 123 -40 -144 -323 -334 -147 1 164 303 330 159 -23 -149 -290 -338 -169 -7 111 297 320
1958C20j41j61j31j75l3J34J67Q5J85J16j75j60j01j94o6J27J10J51J75J35j62
$$ 320 179 18 -113 -288 -321 -187 -20 65 250 366 191 31 -70 -264 -330 -203 -93 58 233 368 206
1979B06j28r1k18j15J10J35J05J91J09p1j45j16j86r9N6J39R5K38J03q5j29j08
$$ 206 78 -13 -231 -346 -236 -101 4 195 304 233 88 -28 -214 -313 -257 -118 -23 215 318 233 104 -4
2001dj93j23P4J08Q7J84K07j42o4p6j93j50N8Q8O5J97J64n2q5o4j99j85N3R2N6
$$ -4 -197 -320 -246 -138 -51 133 340 198 134 58 -135 -285 -227 -139 -74 123 287 235 150 86 -113 -298 -245 -153 -97
2026i7K11J73k8j07n1j67j97KR1M5J91J67K3n9m8j74k20l0O4M8J82K05J7l1m2
$$ -97 114 287 259 152 101 -66 -263 -261 -170 -125 66 233 256 197 149 -25 -245 -275 -211 -163 19 224 241 210 168
2051A68j96j89nN3J4J61J94J5k5m6j03j92m3oJ1J54K26L1k1J1j45k49m0KK7J52
$$ 168 -28 -217 -222 -169 -155 6 200 215 190 144 41 -151 -194 -200 -189 -35 191 222 201 212 67 -182 -222 -220 -193 -41
2077d1J95Q8n5rj43j68o7Lj9J43J70Q7L5l0p4j60j21m5k0J04K10J07L7Pj14j95
$$ -41 154 242 187 178 35 -133 -200 -197 -216 -73 97 184 219 189 115 -45 -166 -211 -231 -127 83 190 227 234 120 -75
2103g5j38PmQ8J66J40K4k7m7j58j01o2j2N5J50J42L3M6o6j58j57o8oO6J98J10
$$ -75 -213 -206 -210 -122 44 184 208 181 134 -24 -125 -187 -199 -144 6 148 181 227 161 3 -154 -222 -228 -162 36 146
2129A46P0K1j06j28j27l8m6M2J47R2P8N2m1r7j21j06o4J7J39J06J52P3l0j55j46
$$ 146 216 237 131 3 -124 -162 -208 -166 -19 73 151 203 162 65 -56 -162 -226 -209 -70 36 188 261 231 76 -70
2154g0j12n6O7P5J22J47LL4j16j10j25n5j2R5J15R8Q6J2n7j65j07j00j6J49J34
$$ -70 -182 -238 -171 -96 26 173 176 210 94 -16 -141 -196 -208 -113 2 100 186 198 141 -24 -131 -231 -247 -98 36
2179C6L3J10L3q6j15j21o0k2L4J34J12P9N0o1r4j20j04q4N6J24J44Q8K5m9p6j22
$$ 36 69 179 212 126 11 -110 -170 -192 -158 -24 88 167 217 156 62 -58 -162 -246 -190 -66 78 166 191 142 66 -56
2205e6j30k7O4O7J09R1Q0l7q8q9j11o8J5M8J43J01O4ol9j44j21m4j1R6J24J01
$$ -56 -186 -213 -149 -82 27 118 198 161 73 -16 -127 -195 -180 -132 11 112 176 170 131 -13 -134 -178 -189 -93 31 132
2231A32O4j0j01o8j46m1QL8R1J33N1J1l0p7j38n3m8J7J23J10R3L1m4r7j04j20
$$ 132 196 186 85 17 -129 -170 -162 -124 -33 100 151 162 132 55 -83 -136 -184 -167 -44 66 159 190 146 49 -55 -175
2257a75j7O1O4J15P6O6lj50q5p5o2M1O5J06J04M7l1n1j09j20k9PM5J21J02L4L5
$$ -175 -192 -131 -67 48 124 190 187 37 -48 -123 -185 -144 -79 27 131 178 147 96 -13 -133 -162 -155 -110 11 113 147 182
2284A82j00r1j04p3L5M4N9J30P4J5p4p7r0p3l6N4J10P4R4L7n7j07q6q2n1O6J17
$$ 182 82 -9 -113 -186 -151 -107 -48 82 156 171 97 20 -70 -143 -179 -125 -15 59 153 190 133 26 -60 -142 -193 -127 -10
2311a0P7Q7kk2o3j04j00k8L3P5P9R1L6nn5q8j28k3j4J11P7Q8P0l2p3p4r3q8M0
$$ -10 67 154 152 130 67 -37 -137 -165 -132 -57 22 113 149 144 89 1 -127 -150 -164 -53 24 112 182 150 77 3 -90 -178 -138
2340a38M8O6J12P5Ro2r6p4j04RP8O4Q0P0K9o5p6r5n3n3L5R5J12R5j4l0q1o5j06
$$ -138 -90 -24 88 163 172 110 14 -60 -164 -155 -77 -13 67 137 166 101 25 -70 -123 -176 -141 -46 66 161 147 117 36 -29 -135
2369a35j7K9P2J23O4Lk0o5p8r7l5jQ5P1J05N0l6o8o5q8o6L4N1Q6P8O2Lm2p2j07
$$ -135 -152 -123 -51 72 136 139 119 54 -24 -121 -156 -157 -72 -1 104 154 118 50 -15 -103 -169 -135 -84 2 80 142 145 103 31 -76
2399g6o9m5Q6J05Q8L7Mn7o8r7m9PJ7P7R9Q4mn8m0j05o4k1M2O2R2R3j8lq6o6r4
$$ -76 -145 -190 -104 1 89 126 130 73 5 -92 -141 -134 -117 -40 59 143 139 81 41 -64 -128 -149 -107 -45 47 140 122 119 33 -33 -127
2430a27J1j4N4J20O3L0mp7q3o0m1%P1Q6O1M7lk0j28q3m6k1P9J11L9M2J1K1j57
$$ -127 -116 -130 -76 44 107 137 133 56 -27 -87 -128 -128 -57 29 90 137 134 114 -14 -97 -143 -164 -85 26 65 107 118 139 -18
2459a8o7l3l9L3J27O6L2Qjr2j07l6m1O5Q9P4L4M0mj20p4k5n2L1P6R1O4J4K5j26
$$ -18 -85 -118 -157 -124 3 69 101 109 108 16 -91 -127 -168 -103 -14 60 94 134 130 10 -64 -89 -141 -110 -34 57 121 135 160 34
2489C4p0m3n8M5M7O8Q3J5ln1j26lo8mQ8O0L1Q1Mm8j25m1n0nQ3N8K6R0J6n2q0n3
$$ 34 -36 -79 -137 -92 -45 23 106 121 118 67 -59 -62 -130 -134 -46 14 45 126 130 82 -43 -84 -134 -139 -56 2 28 118 134 82 2 -51
2521e1o1l5M9J07OR8N7p9p7l6r4l6Q2O1O8O7J9m6o8n3o8o9Q6N6K7Q5O0p1o3j7
$$ -51 -112 -147 -98 9 15 113 170 91 14 -22 -116 -152 -70 -9 59 126 145 99 31 -22 -90 -159 -73 -17 10 95 155 84 21 4
2551Dq4n3K9Q0J5R4P5n2n9o0n3p6K7P9K8Q9M5k4l1o2o4q1N5M9KJ10O8k9m2m5o9
$$ 4 -80 -133 -104 -24 -9 85 160 108 49 -11 -64 -140 -113 -34 -6 83 128 104 73 11 -53 -134 -79 -30 -28 82 150 121 79 34 -35
2582c5j13J3O7PP8J01pn8j7m2r0k4L9M3Q1R4k1n2k6l0j39NN6K9N7R8L2o1j7m0
$$ -35 -148 -135 -68 -61 17 118 111 53 36 -6 -96 -120 -81 -38 43 137 116 64 38 8 -131 -126 -70 -41 16 114 146 85 68 28
2612B8j26j4L3K6M1R0N0n9K9q8j03l2J8K7P7R7J7j7qn9j12k9K7K5L7J04M2km3
$$ 28 -98 -112 -79 -53 -12 78 128 69 98 10 -93 -125 -107 -80 -3 94 111 94 86 27 -85 -114 -87 -62 -25 79 121 119 76
2641G6j9j09n0QPM4J09L6Mk5j4j23n7N3l9O5Q0O1Qj2n2r0j8m0J8L3Q1M0L0J1n6
$$ 76 57 -52 -102 -94 -87 -43 66 102 106 81 67 -56 -113 -60 -99 -34 46 107 115 103 51 -39 -57 -97 -79 -46 35 75 105 116 60
2672F0q7p8j1J1J5J24L7J5J0j1j00o9jl0N2Q7J7N6L2l8q7n8lk6rQ5P7J8K1j6q1
$$ 60 -27 -105 -116 -105 -90 34 71 86 96 85 -15 -84 -85 -115 -63 24 41 97 129 91 4 -54 -57 -83 -92 -7 70 88 109 93 12
2703A2n8l8n5L4R0M6N0L4l4m2q7j8j9PN9J3N5P7m0o2m2n6n0J4Q3M6N5L9Lo2q3
$$ 12 -46 -84 -139 -105 -15 31 81 115 81 39 -48 -66 -85 -78 -19 -6 49 126 86 24 -18 -74 -124 -110 -27 19 74 113 116 54 -29
2734b9k8n1K2L5O7O4L3J8o7o2l6o9pL8O7N8M0J2k5r4j3n3k7N1L7J00pJ2l1l4k1
$$ -29 -57 -108 -86 -51 16 80 113 131 64 2 -34 -103 -110 -72 -5 53 93 105 80 -14 -27 -80 -107 -56 -19 81 74 86 55 21 0
2765@r2nL5N1K2R2j8Qo3n2m6o5N0L3O1L8O9m3k5k4j01oPK7O8O2K7No1n9p0k0L
$$ 0 -92 -97 -62 -11 11 103 85 93 30 -22 -68 -133 -83 -50 11 49 118 75 50 26 -75 -81 -74 -47 21 83 110 115 54 -5 -75 -95 -92
2798i2N5K9O5K7Rl2k4p6n0mJ5O6M4M4K2m5k8p3k6k8J8O7L9O6J4n1k5m4o6l1M4
$$ -92 -37 -8 57 84 93 61 37 -39 -89 -93 -78 -12 32 76 98 53 25 -48 -74 -102 -84 -17 22 88 102 51 26 -18 -84 -115 -71
2829g1M2M1P7KMl6r1l0n4K8N8K8M9N1po8m8m0m7J8M2L2J01%LJ8j17m9l6K9J5K4
$$ -71 -29 12 89 91 95 59 -32 -62 -116 -88 -30 -2 47 98 91 23 -25 -65 -112 -94 -52 -20 81 81 84 102 -15 -64 -100 -71 -56 -32
2861c2Q8M0k1lo8o1j6nK1M4N2O4j6Nn5p2k3l6K5M0M0M6jKm0l9l0m1J1L4O5L6N8
$$ -32 56 96 75 72 4 -57 -73 -78 -57 -13 39 103 87 92 37 -35 -58 -94 -69 -29 11 57 56 58 18 -21 -51 -92 -81 -47 18 54 112
2894A12l7n0l1m1l9%K5P9P0rJ3m4m2o6j0j8M0M6M6JK5J0q2l7l9qM2L6O6J1K1j6
$$ 112 75 25 -6 -47 -86 -86 -61 18 88 79 92 48 6 -60 -70 -88 -48 -2 44 45 70 80 -2 -39 -78 -86 -44 -8 58 69 90 74
2926G4o5o0j3j5QP2K8N0J1m1j7p3n3pK3M9O7M9j6nl8n6j2m0j1P4M5K9M9m8Jp3
$$ 74 9 -51 -64 -79 -71 1 29 79 90 49 32 -41 -94 -101 -78 -29 38 87 71 66 28 -28 -40 -80 -91 -17 28 57 106 58 59 -14
2958a4n1j6j0P4J7M8L4qj9p0n9pRK5N3J9O4Nl6m4m5n4nJ3N5N9K6L3m9m9k1m3n3
$$ -14 -65 -81 -91 -17 0 48 82 74 55 -15 -74 -81 -72 -47 6 25 89 94 58 14 -31 -85 -90 -77 -22 37 63 96 47 -2 -23 -66 -119
2991a19N2M4N3N2J2m1k6n1k9k7OM5L7O7J8on5m2o4j1J0M4N1M7K2rk0q7m4k5nO1
$$ -119 -67 -23 30 82 94 53 27 -24 -53 -80 -74 -29 8 75 93 87 32 -10 -74 -85 -75 -31 20 67 89 80 60 -27 -71 -96 -101 -40
3023d0M8L1L0J0l2m5o3j7pJ3N0Q1N2k3o0k1n0j8rLN1M8M8rk1k9p0k1k8K6L8L4
$$ -40 8 39 69 79 47 2 -61 -78 -85 -72 -22 59 111 88 28 7 -43 -61 -70 -67 -16 32 80 71 50 21 -49 -70 -98 -72 -34 0
3055@R6lk1k9j03m6LK5M4M3O8K2k3m8k0n7j7j2M4M9P8J2k8k4m0o8k1k0O8O5j1
$$ 0 96 93 72 43 -60 -106 -103 -78 -34 9 77 99 76 28 8 -49 -66 -78 -34 15 93 105 77 53 13 -55 -76 -96 -28 37 26
3086B6P3J4n2m4o8Pk9L4L2M6L8K4n0l2n3k6pkM6N4N3qjm9n7m4k2J2P0M4K0lK7
$$ 26 99 113 61 17 -51 -44 -73 -39 -7 39 77 101 51 19 -34 -60 -67 -69 -23 31 84 76 75 26 -31 -75 -97 -85 -15 29 49 46 73
3119G3l3n7k7j3%L0M3O3%Mk4q1m3qQJ2P4L9M4l4m0l6l2p6M7J2N0O9J3ll7l6k9
$$ 73 40 -17 -44 -57 -57 -27 16 79 79 83 59 -22 -65 -73 -65 -53 21 60 104 70 30 -6 -38 -114 -67 -55 -5 64 77 74 37 1 -28
3152b8n8lK8N7L5N2Nj7n3k8o7%K5L3N6M7Lk4k7n1l3m3L2jP6O1J7k9l4m6l7mJ2
$$ -28 -86 -89 -61 -4 31 83 88 71 18 -10 -77 -77 -52 -19 37 84 87 63 36 -15 -48 -91 -59 -60 16 77 94 65 31 -15 -52 -56 -44
3185d4J9M7M3K2j1o3j4q9PqM3M8N7L4l6J8m0o9k9k8O5K3P5J0J3k9q2l2j1j0MO2
$$ -44 -25 22 65 87 76 13 -1 -90 -83 -91 -48 0 57 91 55 73 33 -36 -65 -93 -28 -5 70 80 93 64 -18 -50 -61 -71 -67 -5
3217eM8K2J8k2n1m0n5MJ8L1O2L0K5k4o9m4l2J2j8N4R7J3K1j2o2l6n3mOK6N8L0
$$ -5 43 65 83 61 10 -30 -85 -81 -63 -32 30 60 85 61 -8 -52 -84 -72 -90 -36 61 74 95 83 21 -15 -68 -72 -66 -40 18 48
3249D8K1mk8o6m2j6ML9N3P0J0l1j5q2nk3PJ6N8O3K8j4j3n8q7kl4K6P0N5oN3j7
$$ 48 69 65 37 -29 -71 -87 -83 -44 9 79 89 58 43 -39 -44 -67 -60 -44 14 77 105 91 78 20 -67 -69 -103 -77 -7 48 42 95 78
3282G8o8o7k0jJ3N8N5L1Oj2n6o8j0j3LN4O5K0nJ5n8k7p4%J5K5O8L4J7k4j1p5n3
$$ 78 10 -57 -77 -78 -65 -7 48 79 85 73 17 -51 -61 -74 -71 -17 48 68 63 78 20 -7 -81 -81 -66 -41 27 61 78 54 43 -32 -85
3315h5rpO6O4L2M1m8j9m1o5k5K6K4O7K7K4J8m5n1o0j2MK4L4P2L8ol8n5k2m2j3
$$ -85 -94 -101 -35 29 61 102 54 35 -6 -71 -96 -70 -46 21 48 72 90 45 -6 -66 -78 -74 -50 -16 56 94 88 50 -5 -27 -69 -82
3347h2M0K0O0N3j6j9p2k4m3j6L1N4K4O5J2k6%r3qk5j6P4K3N4RK3n1n9n7k6qP7
$$ -82 -42 -22 38 91 75 56 -16 -40 -83 -99 -68 -14 10 75 87 61 61 -32 -40 -65 -81 -7 16 70 79 102 51 -8 -65 -91 -99 -22
3379b2K4M3M4rn9j0m9o2j4N3M9M7M6qm1l5n5m4L7J3O2L8OM0m1l2l3r2LN4N3J9
$$ -22 2 45 89 80 21 11 -38 -100 -114 -61 -12 35 81 73 32 -3 -58 -102 -65 -52 10 48 54 94 53 21 -12 -104 -101 -47 6 25
3411B5O4Ll1l1o1o8J0K8M4O6M7J8o3j8p1k2l0K4L3P0K2Qk0rn6q0kmL9P3O7K3k6
$$ 25 89 92 61 30 -31 -99 -89 -61 -17 49 96 114 51 33 -38 -60 -90 -66 -33 37 59 67 47 38 -18 -98 -100 -104 -65 8 75 98 72
3444G2l1k8q2l2M2L9L6K4L9J5o2l3l2p1L1J8M9P0Rjm4Mp0l1J6QK5O3K7K4n0k0
$$ 72 41 13 -69 -101 -59 -20 16 40 79 94 32 -1 -33 -104 -73 -55 -6 64 73 72 28 32 -38 -69 -53 -45 -20 43 70 94 44 24
3476B4n9k2j1k2O1N7P3j5k7l8m3n4JJK5P6L7L2m8Oq4o8J0NM6P5K0M6k8k2q8j0
$$ 24 -35 -57 -68 -90 -29 28 101 86 59 21 -22 -76 -75 -74 -49 27 64 96 48 54 -30 -98 -88 -83 -37 38 58 104 76 54 -34 -44
3508d4l6M8k5P1O6K2l6jo2o8j3j1K8L1Q2M1k0qp0q6J3k7RR5Q0j0L7n3n5l4m1j3
$$ -44 -80 -32 -57 14 80 102 66 65 3 -65 -78 -89 -61 -30 52 93 73 65 -5 -91 -78 -105 -96 -1 79 69 106 53 -2 -36 -77 -90
3540i0rN0J11J9j3Ln3n3l5k8K4P9J8M2K9J7r3n2k2j8oM8N6J2M1K5o1r0k8mJ8K8
$$ -90 -99 -49 62 81 68 71 18 -35 -70 -98 -74 5 23 65 94 111 18 -34 -56 -74 -80 -32 24 36 77 102 41 -49 -77 -81 -63 -35
3572c5O1RL8L3k3j12pm9J1L5P6J9K1K8l9p8k4o1l6N3J00J6N6J7n2n9j4o1k6M5
$$ -35 26 35 73 106 83 -29 -36 -85 -74 -39 37 56 77 105 66 -12 -36 -97 -133 -80 20 36 92 109 57 -2 -16 -77 -103 -58
3602e8N0M1J6L4k7n6j6o3k3L4L5M4N0N7o4n4k7k0l6RM1P3J0N0j2n4p2J4p5J0R2
$$ -58 -8 33 49 83 56 0 -16 -79 -102 -68 -33 11 61 118 54 0 -27 -47 -83 -74 -33 40 50 100 88 34 -38 -24 -99 -89 3
3633CK3L8J2J1l0n0m5n1J0O7L0M4L4rm4m1n0m4k1M7L5P5M5Pm4l8k9q2KK9M4M6
$$ 3 26 64 76 87 57 7 -38 -89 -79 -12 18 62 96 87 43 2 -48 -92 -113 -66 -31 44 89 96 52 14 -15 -97 -95 -66 -22 24
3665B4M8J4n1no3l9k2L5K9M8O0J0j0k1r6l4j2K3N4PP3Pl9j4m6m1m6L5M8%P0J5
$$ 24 72 86 35 30 -33 -72 -94 -59 -30 18 78 88 78 57 -39 -73 -85 -62 -8 -1 72 79 40 26 -20 -61 -107 -72 -24 -24 46 61
3697F1K5n1k3p6rJ3K7QQ1L2ml1l9p9%j7L3N4N5K1oj1n3m8o3RK1L0R8K7Nj4n2n8
$$ 61 86 35 12 -64 -73 -60 -33 -25 56 88 84 53 14 -65 -65 -82 -49 5 60 81 75 64 11 -37 -100 -91 -70 -40 58 85 90 76 24 -34
3731c4l6j2L3M1L7L5J1J4o8p5m0J4L9J1Q9j2M1j1l2m7o9j9J7M8M2M6Knj9m2p5
$$ -34 -70 -82 -49 -8 29 64 75 89 21 -54 -94 -80 -41 -30 59 47 88 77 45 -2 -71 -90 -73 -25 17 63 65 60 41 -1 -76
3762g6%KL8J2R5%l0J8p4j5m8OL0K4O4L4J2n1m0m7m5J9L0M8M1L0J0pq8m2l9jJ1
$$ -76 -76 -74 -36 -24 71 71 41 59 -15 -30 -78 -72 -42 -18 46 80 92 41 1 -46 -91 -72 -42 6 47 77 87 80 -8 -50 -89 -90 -79
3795g9P8K7M6J3m1jq7j4j8OM0P3M8k1J3n0o8k7m1J7N5O2L1J5j6k5l4l5o4J0O0
$$ -79 -1 26 72 85 44 43 -44 -58 -76 -70 -30 43 91 70 83 33 -35 -62 -103 -86 -31 31 62 77 61 36 2 -33 -97 -87 -27
3826b7O2J9L1m6Mo6k2l6L9j3N3M3L1Kj4o9l1j8k1K3N6N9K8j6j3l7o0l2m2N9M7
$$ -27 35 54 85 39 43 -23 -45 -81 -42 -55 -2 41 72 74 60 -9 -40 -58 -79 -56 0 59 87 71 58 21 -39 -71 -113 -54 -7
3857gL7M3K5n6m5l3l4j2K0L5P3L1j2j8l9n4j9k9J9N1N4N8OJq6l2p1NlM8N5O9j0
$$ -7 30 73 98 42 -3 -36 -70 -82 -62 -27 46 77 65 47 8 -46 -65 -94 -75 -24 30 88 94 95 9 -23 -94 -89 -92 -44 11 80 70
3890G0L8n0o7qn8K7mP1L9K9j6l1l4l3m1K0mM3M2L1K8p0rp0NMk6O5L0O2%j6m9o8
$$ 70 108 58 -9 -17 -75 -48 -52 19 58 87 71 40 6 -27 -68 -48 -52 -9 33 64 92 22 13 -57 -52 -48 -74 -9 21 83 83 67 18 -50
3924e0l3j6M8L7L4L6J4Ko4k5l8k0J8K7P2KL3jo0j2k9n0kL2L9O8K5j7j6o3m2k0
$$ -50 -83 -99 -51 -14 20 56 70 72 8 -17 -55 -75 -57 -30 42 44 77 76 16 4 -25 -75 -77 -45 -6 62 87 70 54 -9 -51 -71
3956g1lN9KO1N2j6m1o3k9l3K4K6M3L7K6J7n7j5m7m1j8M9L7M2L7Jo0%o6Lj2rL3
$$ -71 -74 -15 -13 48 100 84 43 -20 -49 -82 -58 -32 11 48 74 91 34 19 -28 -69 -87 -38 -1 41 78 79 19 19 -47 -44 -56 -65 -32
3989c2J9P1L7l4j8o7k7m1M7N1J5J8N0l8m3k5k6j3%J2P8L8j1M4m9r0j9m7NO8L4
$$ -32 -13 58 95 61 43 -24 -51 -92 -45 6 21 39 89 51 8 -17 -43 -56 -56 -44 34 72 61 105 56 -34 -53 -100 -95 -27 7
4020GL1N4No3n3m3j3L5PN6K7L8k8j8m8o3j3L4k5O4K7N2K0j3p7k5l7k5J9O7O3J7
$$ 7 38 92 97 34 -19 -62 -75 -40 -33 23 50 88 60 42 -6 -69 -82 -48 -73 -9 18 70 90 77 0 -25 -62 -87 -68 -1 62 79
4052G9lk4m1m5m1k9L8K3O0J5N8m2k5l1l6m0K9L3M6L8M8o2k4k7l6n2M0J0N9L3J6
$$ 79 76 52 11 -34 -75 -104 -66 -43 17 32 90 48 23 -8 -44 -84 -55 -22 24 62 110 48 24 -3 -39 -91 -51 -41 18 51 67
4083F7j7J1q9k8mk6J9L6O5M7j1k2m6k2n3j5M8M4L5RM6o2Np8k5m8N4K8O1L8j0k6
$$ 67 50 61 -28 -56 -60 -86 -67 -31 34 81 70 48 2 -20 -73 -88 -40 4 39 48 94 32 37 -41 -66 -114 -60 -32 29 67 57 31
4115C1qq1k5J2rN1P6LJ9j8k4o9j5l7L8J5M6P2jj0l5n5m1j6%K6L5Q2J1qj2p0k1
$$ 31 23 -58 -83 -71 -80 -29 47 50 69 51 27 -42 -57 -94 -56 -41 5 77 76 66 31 -24 -65 -81 -81 -55 -20 62 73 65 53 -17 -38
4148c8m4J5K9M7L5K4Mk3p9Jm3%L0O3LM5J3l5k8n6k4prP0O4mlRl2m7n0kK1N0O0
$$ -38 -82 -67 -38 9 44 68 72 49 -30 -29 -72 -72 -42 21 24 69 82 47 19 -37 -61 -68 -77 -7 57 53 50 59 27 -20 -70 -72 -51 -1 59
4183E9rK9k2k4o6ml7K6nO8L5JL6n6o3k8onO1J8K1M3ql6m8jm5J2J0O3rO7K6o0o0
$$ 59 50 79 57 33 -33 -37 -74 -48 -53 15 50 51 87 31 -32 -60 -66 -71 -10 8 29 72 64 28 -20 -21 -66 -54 -44 19 10 77 103 43 -17
4218a7k2n9J1J7Q3L1%K4j6n4l1k2l0L5M2N5qK2j7l7n6qm3N3P8j3K9L1k0l7m5m1
$$ -17 -39 -98 -87 -70 13 44 44 68 52 -2 -33 -55 -85 -50 -8 47 39 61 44 7 -49 -57 -100 -47 31 18 47 78 58 21 -24 -65
4250f5j4J1O9L6K2Oj3k6k7m7k7L5L1K5L3Q%n1Pp4k0oN7O5K7M1l5l6l5k7n6K4K0
$$ -65 -79 -68 1 37 59 65 52 26 -1 -48 -75 -40 -9 16 49 57 57 6 13 -61 -81 -87 -30 35 62 103 68 32 -3 -30 -86 -62 -42
4283d2L9M9K1Jl9j5n2l9J1J6N3L9K7Ll5k7m7m5J7PK3O2L4L3l4m2l2l0k6J3M8J4
$$ -42 -3 46 67 68 29 14 -38 -77 -66 -50 3 42 69 72 37 10 -37 -82 -65 -58 -35 27 61 94 60 18 -14 -44 -70 -57 -9 5
4315EN0K5n9mk3n4j4j1O4M1J8K6k1J7q3l2j9K9%N0L9J0K1m7j2n4l2JK9L3M7L9
$$ 5 55 80 21 17 -6 -60 -74 -85 -21 20 38 64 43 60 -23 -55 -74 -45 -45 5 44 54 75 28 16 -38 -70 -69 -40 -7 40 79
4347G9jmr9k5jkLK7R0j4K7j8j3o7m4m1N2M4N2j6pPqn2j7k8NN1K5M0K3jn9No3R
$$ 79 78 74 -25 -50 -51 -53 -50 -23 67 53 80 62 49 -18 -62 -103 -51 -7 45 29 22 29 21 -31 -48 -76 -71 -20 5 45 68 67 8 13 -50 -41
4383d1j5K1M8K6nMol8m7qk7N9K7M3K7j0pm2k9k7k8K7O4J7J4K0l7mp5Mm0K1M1M1
$$ -41 -56 -35 13 39 34 38 32 -6 -53 -61 -88 -29 -2 41 68 58 51 9 -20 -47 -75 -48 16 33 47 67 30 26 -49 -45 -85 -64 -23 18
4417A8K3J8k3l6k6l5ppP2J6L6j1K2n7k8nn1J4K9O4K9K4j1k7n2m1k3LL6P4OJ4M
$$ 18 41 59 36 0 -26 -61 -68 -75 -3 13 49 38 60 3 -25 -30 -81 -67 -38 26 55 79 68 41 -11 -52 -75 -72 -36 38 44 58 62
4450F2l0o0Jj9l4M4P3QJ8K0m2n1l8kk1M7%L1L7L1m6m3k3j7l1L6L5P0K7K0o2l8
$$ 62 32 -28 -27 -46 -80 -36 37 45 63 83 41 -10 -48 -50 -71 -24 -24 7 44 75 29 -14 -37 -54 -85 -49 -14 56 83 103 41 3
4482Cl1l3pM0J5K2M7Pl6j0m0j8m0J1N4K4L3J3K8o7k9j9n1K7QM8O3Rk2k9j2m8k1
$$ 3 -28 -61 -68 -28 -13 9 56 63 27 17 -23 -41 -81 -70 -16 8 41 54 82 15 -14 -33 -84 -57 -49 -1 62 71 49 20 8 -40 -61
4515f1QJ5N6PM8no0j9l7m1N1J3LK8L2L2j9l2p9l2LN0ON9M4ok7j8p5j7K4l5P6L4
$$ -61 -53 -38 18 25 73 68 8 -11 -48 -89 -38 -25 -22 6 38 70 51 19 -60 -92 -89 -39 -33 26 70 64 37 19 -56 -73 -49 -84 -8 26
4549B6M2rk9Rn2m2j0L1K0L2K2K4k1kn8j9j6lL5M6J8K8l9k5l1j9l0K1L8mN7j7K5
$$ 26 68 59 30 39 -13 -55 -65 -34 -14 18 40 64 43 41 -17 -36 -52 -55 -20 26 44 72 33 8 -23 -42 -72 -51 -13 -17 40 23 48
4582D8lm8m6j4J3K6LL5M6l4kk1n7ojK4K9K4N2k2rj3o2l0NL4PM4K9j5K1n4l1l9
$$ 48 45 -3 -49 -63 -50 -24 -21 14 60 26 24 3 -54 -60 -61 -37 -8 16 68 46 37 24 -38 -68 -63 -29 -22 22 51 36 57 3 -28 -67
4616f7J0K9J7L5J0J9k6nm8Jo9K4M3L9PN4l4j0o9k5J0nK3L3L4J7J1j9m4n5rK6J0
$$ -67 -57 -28 -11 24 34 53 27 22 -26 -25 -94 -70 -27 12 19 73 39 29 -40 -65 -55 -60 -37 -4 30 47 58 39 -5 -60 -69 -43 -33
4649c3L2M1K6j4k5j7l3l9j1N3MM3J9K6l2n1k4l2OK0K1N1K3lk3pn2j5%NQQ5JJ0
$$ -33 -1 40 66 52 27 10 -23 -62 -73 -20 -16 27 46 72 40 -11 -35 -67 -61 -41 -20 31 54 51 28 21 -31 -46 -46 -41 -33 52 53 63
4683F3k0m2l6j3oj0K6K9L5K9lj6n5rj4mJ0M3L0j0N9m9m8j1k1j4K5M4J0J8J2j3
$$ 63 43 1 -35 -48 -54 -64 -38 -9 26 55 52 36 -19 -28 -42 -46 -36 7 37 27 86 37 -11 -22 -43 -57 -32 12 22 40 52 39
4715C9n0J4n2j5J5N4QL2Pj8n7nl5RJ9N7j6J1L9k6j1k4po3N6K2J6K0M4l7j5j7o7
$$ 39 -11 3 -49 -64 -49 5 13 45 52 34 -23 -28 -63 -54 -35 22 6 17 56 30 19 -5 -12 -75 -19 3 19 39 83 46 31 14 -53
4748e3kK9kL6L3K0j7Ko6l5NK4j1N4JL4K0l4l2k2l9J3K2L9nL9mj1l2k9k4NK0lN0
$$ -53 -55 -26 -28 8 41 61 44 46 -20 -55 -50 -26 -37 17 18 52 72 38 6 -16 -55 -42 -20 19 14 53 49 38 6 -23 -47 -42 -22 -25 25
4783B5J9K3k7j2l9m9L2k8PR1JqK1l9l0pnj3J6L4K5K3Pn0k0m0j6QJ0M1Q2m4K8j0
$$ 25 44 67 40 28 -11 -60 -28 -56 -49 42 43 35 56 17 -13 -20 -25 -38 -22 12 37 60 67 17 -3 -43 -59 -51 -41 0 82 38 66 56
4817E6o0k6l2L7ML8jL8l0K8o1k3jj0J3K1M3J9rj8l5j4l1j9M6KN3K6j4K5l8n3m
$$ 56 -4 -30 -62 -25 -21 17 16 54 24 52 -9 -32 -33 -43 -30 -9 34 53 44 26 -9 -23 -54 -73 -27 -25 28 54 40 65 27 -26 -30
4850c0l6M9K8MN3m2Pj0m4j9mJ1J9N4nNPl9l3j8J1%J9K5K5j0N4m8o2k3nJ6J2M1
$$ -30 -66 -17 11 15 68 26 33 23 -21 -40 -44 -33 -14 40 35 40 47 8 -25 -43 -32 -32 -13 12 37 27 81 33 -29 -52 -57 -41 -29 12
4884A2J5K4J5l6m8j7mk3M1K1L1J1%Jm0pn1kL9LK4O0nk6k7n0J0j1mK7M4OL8m2o
$$ 12 27 51 66 30 -18 -35 -39 -62 -21 0 31 42 42 43 3 -4 -55 -57 -18 -15 9 69 64 38 11 -39 -29 -40 -44 -17 27 33 71 29 23
4919B3k9k1l5qL7M7L5PJ0l6o2J1k9kj8O3L6L0Om1k6m1J4j0nO3J0NL4n0ol7jj1
$$ 23 -6 -27 -62 -70 -33 14 49 56 66 30 -32 -21 -50 -52 -70 -7 29 59 65 24 -2 -43 -29 -39 -44 19 29 34 68 18 12 -25 -26 -37
4953c7MJ5K6K2Qplm4mn2L9pO3RNM9o8l5l6J6rJ8M6J0K7kj8m2mk9jM4nK2L9ol5
$$ -37 -33 -18 8 30 38 31 28 -16 -20 -72 -33 -40 23 32 37 86 18 -17 -53 -37 -46 -28 18 28 55 53 35 -7 -11 -40 -41 3 -2 20 59 53 18
4990A8l5l0JoL8J4RL5j4Ro4pj3K5kRK9J8k0K6m3k7k2J6MLO0KLQj6n2Ok4QM2K1
$$ 18 -17 -47 -46 -52 -14 0 9 44 30 39 -25 -32 -45 -20 -22 -13 16 34 14 40 -3 -30 -52 -36 -32 -29 31 33 36 44 28 -24 -18 -42 -34 8 29
5027B9L9j6l1j6J1o2KK7nL6NM3rl8m1j4lJ0J3L7K7K4n7K5l9j2k5j6J3L8O1j2j1
$$ 29 68 52 21 5 16 -46 -44 -17 -22 14 19 62 53 15 -26 -40 -43 -33 -20 17 44 68 11 36 -3 -15 -40 -56 -43 -5 56 44 33
5060C3K1l0m8j6J8jK6L2KL2k8l6k4j7MQL1J8K9Ql0j1k6k2k0k5M3M5L0J0j5m0l0
$$ 33 54 24 -24 -40 -22 -23 3 35 37 69 41 5 -19 -36 -32 -24 7 25 54 62 32 21 -5 -27 -47 -72 -29 16 46 56 41 1 -29
5093b9J9n1K8L3nJ7K2J2l3k0j1k3%L5%M2J6k8jm9K4l2OK5mK0J4j1kj2o0K0j7K6
$$ -29 -10 -61 -33 0 -5 12 34 46 13 -7 -18 -41 -41 -6 -6 36 52 24 23 -26 -2 -34 -28 -3 -7 13 27 16 14 2 -58 -38 -55 -29
5127b9J9L4K8j5j3k5k2J7k7oL1K6L1j6Rm9%n7RJ8J8L5J7J7k4Nl1l7oj1P4k2K3
$$ -29 -10 24 52 37 24 -1 -23 -6 -33 -39 -8 18 49 33 42 -7 -7 -64 -55 -37 -19 16 33 50 26 31 0 -37 -43 -54 20 -2 21
5160B1M1k2m5j7j9j8J5K2QM2K1j6J9n6om0J0J2K8L1K4k2j2k8Nk2l0J8L5PK1K0
$$ 21 62 40 -5 -22 -41 -59 -44 -22 -14 28 49 33 52 -4 -10 -50 -40 -28 0 31 55 33 21 -7 -2 -24 -54 -36 -1 6 27 47
5192D7l1pm7RMj5K9L0RL7l2j3m8j6LK0QK4L3j0Ll2k0k7pLML8L1l3O1k4n6pk1M
$$ 47 16 9 -38 -29 -25 -40 -11 19 28 65 33 20 -28 -44 -41 -21 -13 11 44 34 37 5 -15 -42 -49 -46 -42 -4 27 -6 55 31 -25 -32 -53 -49
5228d9K5J5M7KJ0k2k2k6%k2K6qM7L5l4Jk6j8j4NPK4K5j5J5K0n3k8j1mkL0K4L9
$$ -49 -24 -9 38 40 50 28 6 -20 -20 -42 -16 -24 23 58 24 25 -1 -19 -33 -28 -21 3 28 13 28 48 -5 -33 -44 -48 -50 -20 4 43
5262D3k9M0n4k1Kk8L0j3L6K4JJ9n2k0jnk7M8N0j4J6j8k5k8kJ9l9PO3oL4Nk7k7
$$ 43 14 54 0 -21 -19 -47 -17 -30 6 30 31 50 -2 -22 -23 -28 -55 -7 43 29 45 27 2 -26 -28 -9 -48 -41 22 16 50 55 28 1
5296Ak5J1p9O5JL1J3J8kl0k0m9J4PL4K8j0L4K1o3k1k0LlK6J8O1njl7l2j9j0K0
$$ 1 -24 -13 -92 -27 -26 5 18 36 34 4 -16 -65 -51 -44 -10 18 8 42 63 0 -21 -41 -38 -41 -15 3 64 59 58 21 -11 -30 -40 -20
5330b0lM8RoJ3m0j0k9j0L1J6j8K9J2K8l7k6k1LrK1NM2K9k9Oo5N6n7k8K4J9L3M0
$$ -20 -23 25 34 28 41 1 -9 -38 -48 -17 -1 -19 10 22 50 13 -13 -34 -31 -40 -19 -14 28 57 28 34 -31 25 -32 -60 -36 -17 16 56
5364E6l4L6p1j2j4%J2J5L7J6j6rj1jn7QJ8NK3L5Nk4J1m8l4PK4oK8M6J8m6k1j7
$$ 56 22 58 -13 -25 -39 -39 -27 -12 25 41 25 16 5 4 -53 -45 -27 -22 1 36 41 17 28 -20 -54 -47 -23 -29 -1 45 63 17 -4 -21
5398b1Nl1J1LK4P7k8j%o2K1k9RRlJ6L0K6j6j9n3k6K4K3K9k1N8n%n2j5qk4N4k0
$$ -21 -16 -47 -36 -33 -9 68 40 39 39 -23 -2 -31 -22 -13 -16 0 30 56 40 21 -32 -58 -34 -11 18 -3 55 50 50 -2 -17 -25 -49 5 -15
5433a5K0N2k3km8J3k7k7K9J3JK3L4J7n7Oo1OJ7J7PL1RJ6k9Lk3l9J0pL7N3Jm6K5
$$ -15 5 57 34 32 -16 -3 -30 -57 -28 -15 -14 9 43 60 3 9 -52 -46 -29 -12 -5 26 35 51 22 25 2 -37 -27 -34 3 56 57 11 36
5468C6m6Jk7J1lK7qL2K9l7j5l7j0K7l5J7N0K3k5L4k2k3l4pJ6qO2J4kpKl0n6J0
$$ 36 -10 -9 -36 -25 -28 -1 -9 23 52 15 0 -37 -47 -20 -55 -38 12 35 10 44 22 -1 -35 -42 -26 -34 28 42 40 33 35 5 -51 -41
5502d1J9K5OQJ4KJo0kJ3m7K4O2J3L7l3j5o5kQJ8mL3L6j9K3k3k6k2qJk0P7k1J8
$$ -41 -22 3 9 17 31 33 34 -26 -28 -15 -62 -38 24 37 74 41 26 -39 -41 -33 -15 -19 14 50 31 54 31 5 -17 -25 -24 -44 33 12 30
5537C0J2j8qj5k6l1QL3K5J2J5Rmq0J4k0J3J6J8J9pK4l5jj3j3k4K5M0J0qJJ0k7
$$ 30 42 24 16 1 -25 -56 -48 -15 10 22 37 46 42 -38 -24 -44 -31 -15 3 22 15 39 4 3 -10 -23 -47 -22 18 28 20 21 31 4
5571Dl5L6o2K9K7M5j4LOk1k0l6j9JL2J0O0Jk8j0j5m4K9lM3j1M6m1Qqjn2j8J4L4
$$ 4 -31 5 -57 -28 -1 44 30 33 39 18 -2 -38 -57 -56 -24 -14 46 47 19 9 -6 -50 -21 -24 19 8 54 13 21 13 12 -40 -58 -44 -10
5606a0J9lK6Oj3n0rNj3L7J5K9K3l8k4Mj1j7Jk3O6k0M2Kk0j2m7j7RM7j6K1L8Ok7
$$ -10 9 6 32 38 25 -25 -34 -29 -42 -5 10 39 62 24 0 4 -7 -24 -23 -46 20 0 42 44 24 12 -35 -52 -43 4 -12 9 47 53 26
5641B6m2J8l2roK4O9j7K1j4m3l0J4l4jM6M4Rj5j2qk1k6kj1L3M3K1Lrj3k9l3kk
$$ 26 -16 2 -30 -39 -45 -21 48 31 52 38 -5 -35 -21 -55 -56 -10 34 43 28 16 8 -13 -39 -41 -52 -19 24 45 48 39 26 -3 -36 -38 -40
5676d0K6lN3Jqj6l9k8J9k3N2J6L0LKmk3l4l0J6MJ3N0rK6n7J8m4j4J5j0K9M4rK4
$$ -40 -14 -17 36 37 29 13 -26 -54 -35 -58 -6 10 40 43 45 41 18 -16 -46 -30 -26 -13 37 28 54 -3 15 -29 -43 -28 -38 -9 35 26 50
5711E0j7l6Mk8lQJ0OK8J0J0j9m7j7K7j7K4J2K3K7l7qk5qMk4L5J9K5L7k2Nn6j4
$$ 50 33 -3 1 -27 -30 -22 -12 -6 22 32 42 23 -24 -41 -14 -31 -7 5 28 55 18 10 -15 -23 -19 -43 -8 11 36 73 51 56 0 -14
5745a4k2PK2pP2pK0n1k6J2l2J1qL0K6nJ9k6j4l4QJ2k2K1M7Jk7L3m4j3lj3j1K9
$$ -14 -36 -29 -7 -14 58 51 71 20 -6 6 -26 -15 -23 7 33 28 47 21 7 -27 -19 -7 -29 -8 39 40 13 46 2 -11 -14 -27 -38 -9
5779ij4O1Pk7k1j0jl6K4K3j4O9ml1J5l7oj5JJ0K1K1J3jl7Qk1m6L0J2M1PrjJ1j8
$$ -9 -23 38 45 18 -3 -13 -14 -50 -26 -3 -17 52 48 17 32 -5 -11 -26 -25 -15 6 27 40 39 2 10 -11 -57 -27 -15 26 33 24 23 34 16
5815A6n9J9j6kL9K7K3mNl8j6k4r%K5N8MJ1k1Mn9Jqk7O0MJ9J9k1k0kl6loL8QK0
$$ 16 -43 -24 -40 -42 -3 24 47 43 48 10 -6 -30 -39 -39 -14 44 48 59 38 42 -17 -16 -24 -51 9 13 32 51 30 10 8 -28 -31 -37 1 9 29
5852B9j7L2k5kl3m8QM8K0K9Kl8L5m4k3k2K3QJ3L2j3M0k9j6k2j9qrP6k6M4lj9k0
$$ 29 12 44 19 17 -16 -64 -56 -8 12 41 43 5 40 -4 -27 -49 -26 -18 -5 27 14 54 25 9 -13 -32 -40 -49 27 1 45 42 23 3
5886Ck9Lj0JK8J0jM8k6km0Pl6kQO4jJ4j6j7j3l1k4J5L9JM2j2M1k5n3mqk3K0K0
$$ 3 -26 -23 -33 -32 -4 6 5 53 27 25 -15 -8 -44 -46 -38 26 25 39 23 6 -7 -38 -62 -47 -8 -7 35 23 64 39 -14 -18 -26 -49 -29 -9
5922iL3K0j1oj2l7jl7M8K2K3j3K0k4j4k0l1MJ2J9K6KJ5J0l3j6k4J2j8L7J0L9k7
$$ -9 24 44 33 27 15 -22 -23 -60 -12 10 33 20 40 16 2 -18 -49 -45 -33 -14 12 14 29 39 6 -10 -34 -22 -40 -3 7 46 19
5955A9L5o3lk1K6kJLK8JLJl3nrk3K3J7J3J9oJ2l6Lm8J8J6j8N1LJ1j2Jm4Pl2K4
$$ 19 54 -9 -12 -33 -7 -9 -8 -5 23 24 27 28 -5 -10 -19 -42 -19 -2 11 30 24 36 0 3 -45 -27 -11 -29 22 25 36 24 25 -19 -12 -44 -20
$$ [...]
8191a
##END NTUPLES=NMR FID
##END=
