##TITLE=1H_DE-124_12_35sum_2
 200.13MHz,D2O.
 8 sc
 
 29.1.2026
##JCAMPDX= 6.0         $$ Bruker NMR JCAMP-DX V2.0
##DATA TYPE= NMR FID
##DATA CLASS= NTUPLES
##ORIGIN= UXNMR, Bruker Analytische Messtechnik GmbH
##OWNER= pz
$$ XWIN-NMR		Version 3.5
$$ Thu Jan 29 16:19:50 2026 Russian Standard Time (UT+4h)  she@DPX200
##.OBSERVE FREQUENCY= 200.1313
##.OBSERVE NUCLEUS= ^1H
##.DELAY= (6, 6)
##.ACQUISITION MODE= SIMULTANEOUS
##.ACQUISITION SCHEME= undefined
##.AVERAGES= 8
##.DIGITISER RES= 18
##SPECTROMETER/DATA SYSTEM= spect
##.PULSE SEQUENCE= zg30
##.SOLVENT NAME= DMSO
##.SHIFT REFERENCE= (INTERNAL, DMSO, 0, 14.3821)
##AUDIT TRAIL= $$ (NUMBER, WHEN, WHO, WHERE, WHAT)
$$ ##TITLE= Audit trail, XWIN-NMR		Version 3.5
$$ ##JCAMPDX= 5.01
$$ ##ORIGIN= Bruker BioSpin GmbH
$$ ##OWNER= she
$$ F:/spectra/data/she/nmr/H-C/1/audita.txt
$$ ##AUDIT TRAIL=  $$ (NUMBER, WHEN, WHO, WHERE, WHAT)
(   1,<2026-01-29 16:18:06.03 +0400>,<she>,<DPX200>,
      <created by zg, POWCHK disabled, PULCHK disabled
       configuration hash MD5:
       00 E9 B6 7A A2 85 ED C7 34 08 36 98 17 FE 4E 26
       data hash MD5: 16K
       12 B9 0A 4B FB 17 55 CF 3F 72 AD F8 36 F8 CF 1A>)
$$ ##END=
$$ 
$$ hash MD5
$$ B2 A5 FA 5C 13 2C 80 87 36 BB 1E D5 52 04 7A 01
##$RELAX= 
##$RELAX= 
##$RELAX= 
##$RELAX= 
##$RELAX= 
##$RELAX= 
$$ Bruker specific parameters
$$ --------------------------
##$DU= <F:/spectra>
##$EXPNO= 1
##$NAME= <H-C>
##$PROCNO= 1
##$TYPE= <nmr>
##$USER= <she>
##$AMP= (0..31)
100 100 100 100 100 100 100 100 100 100 100 100 100 100 100 100 100 100 
100 100 100 100 100 100 100 100 100 100 100 100 100 100 
##$AQSEQ= 0
##$AQ_mod= 1
##$AUNM= <au_zg>
##$AUTOPOS= <>
##$BF1= 200.13
##$BF2= 200.13
##$BF3= 200.13
##$BF4= 200.13
##$BF5= 200.13
##$BF6= 200.13
##$BF7= 200.13
##$BF8= 200.13
##$BYTORDA= 1
##$CFDGTYP= 0
##$CFRGTYP= 5
##$CHEMSTR= <none>
##$CNST= (0..31)
1 1 145 1 1 1 1 1 1 1 1 1 1 1 1 1 1 1 1 1 1 1 1 1 1 1 1 1 1 1 1 1 
##$CPDPRG= <>
##$CPDPRG1= <>
##$CPDPRG2= <>
##$CPDPRG3= <>
##$CPDPRG4= <mlev>
##$CPDPRG5= <mlev>
##$CPDPRG6= <mlev>
##$CPDPRG7= <mlev>
##$CPDPRG8= <mlev>
##$CPDPRGB= <>
##$CPDPRGT= <>
##$D= (0..31)
0 0.7 0 0 0 0 0 0 0 0 0 0.03 0 0 0 0 0 0 0 0 0 0 0 0 0 0 0 0 0 0 0 0 
##$DATE= 1769689085
##$DBL= (0..7)
120 120 120 120 120 120 120 120 
##$DBP= (0..7)
150 150 150 150 150 150 150 150 
##$DBP07= 0
##$DBPNAM0= <>
##$DBPNAM1= <>
##$DBPNAM2= <>
##$DBPNAM3= <>
##$DBPNAM4= <>
##$DBPNAM5= <>
##$DBPNAM6= <>
##$DBPNAM7= <>
##$DBPOAL= (0..7)
0.5 0.5 0.5 0.5 0.5 0.5 0.5 0.5 
##$DBPOFFS= (0..7)
0 0 0 0 0 0 0 0 
##$DE= 6
##$DECBNUC= <off>
##$DECIM= 32
##$DECNUC= <off>
##$DECSTAT= 4
##$DIGMOD= 1
##$DIGTYP= 9
##$DL= (0..7)
0 120 120 120 120 120 120 120 
##$DP= (0..7)
150 150 150 150 150 150 150 150 
##$DP07= 0
##$DPNAME0= <>
##$DPNAME1= <>
##$DPNAME2= <>
##$DPNAME3= <>
##$DPNAME4= <>
##$DPNAME5= <>
##$DPNAME6= <>
##$DPNAME7= <>
##$DPOAL= (0..7)
0.5 0.5 0.5 0.5 0.5 0.5 0.5 0.5 
##$DPOFFS= (0..7)
0 0 0 0 0 0 0 0 
##$DQDMODE= 0
##$DR= 18
##$DS= 0
##$DSLIST= <SSSSSSSSSSSSSSS>
$$ [...]
##$SUBNAM0= <"">
##$SUBNAM1= <"">
##$SUBNAM2= <"">
##$SUBNAM3= <"">
##$SUBNAM4= <"">
##$SUBNAM5= <"">
##$SUBNAM6= <"">
##$SUBNAM7= <"">
##$SUBNAM8= <"">
##$SUBNAM9= <"">
##$SW= 18.0517328524113
##$SWIBOX= (0..15)
0 0 2 0 0 0 0 0 0 0 0 0 0 0 0 0 
##$SW_h= 3612.71676300578
##$TD= 16384
##$TD0= 1
##$TE= 0
##$TE2= 300
##$TE3= 300
##$TEG= 300
##$TL= (0..7)
0 120 120 120 120 120 120 120 
##$TP= (0..7)
150 150 150 150 150 150 150 150 
##$TP07= 0
##$TPNAME0= <>
##$TPNAME1= <>
##$TPNAME2= <>
##$TPNAME3= <>
##$TPNAME4= <>
##$TPNAME5= <>
##$TPNAME6= <>
##$TPNAME7= <>
##$TPOAL= (0..7)
0.5 0.5 0.5 0.5 0.5 0.5 0.5 0.5 
##$TPOFFS= (0..7)
0 0 0 0 0 0 0 0 
##$TUNHIN= 0
##$TUNHOUT= 0
##$TUNXOUT= 0
##$USERA1= <user>
##$USERA2= <user>
##$USERA3= <user>
##$USERA4= <user>
##$USERA5= <user>
##$V9= 5
##$VALIST= <valist>
##$VCLIST= <CCCCCCCCCCCCCCC>
##$VD= 0
##$VDLIST= <DDDDDDDDDDDDDDD>
##$VPLIST= <PPPPPPPPPPPPPPP>
##$VTLIST= <TTTTTTTTTTTTTTT>
##$WBST= 1024
##$WBSW= 4
##$XGAIN= (0..3)
0 0 0 0 
##$XL= 0
##$YL= 0
##$YMAX_a= 16770
##$YMIN_a= -25059
##$ZGOPTNS= <>
##$ZL1= 120
##$ZL2= 120
##$ZL3= 120
##$ZL4= 120
##$ABSF1= 10
##$ABSF2= 0
##$ABSG= 5
##$ABSL= 3
##$ALPHA= 0
##$AQORDER= 0
##$ASSFAC= 0
##$ASSFACI= 0
##$ASSFACX= 0
##$ASSWID= 0
##$AUNMP= <proc_1d>
##$AZFE= 0.1
##$AZFW= 0.1
##$BCFW= 1
##$BC_mod= 2
##$BYTORDP= 1
##$COROFFS= 0
##$CY= -3
##$DATMOD= 1
##$DC= 2
##$DFILT= <>
##$DTYPP= 0
##$F1P= 0
##$F2P= 0
##$FCOR= 0.5
##$FTSIZE= 0
##$FT_mod= 4
##$GAMMA= 1
##$GB= 0.15
##$INTBC= 1
##$INTSCL= 1
##$ISEN= 128
##$LB= 0.25
##$LEV0= 0
##$LPBIN= 0
##$MAXI= 10000
##$MC2= 0
##$MEAN= 0
##$ME_mod= 0
##$MI= 1.114404
##$NCOEF= 0
##$NC_proc= 0
##$NLEV= 6
##$NOISF1= 3.799351
##$NOISF2= 2.8
##$NSP= 1
##$NTH_PI= 0
##$NZP= 0
##$OFFSET= 14.38212
##$PC= 1
##$PHC0= -3614.62
##$PHC1= 7.79231
##$PH_mod= 1
##$PKNL= yes
##$PPARMOD= 0
##$PSCAL= 0
##$PSIGN= 0
##$REVERSE= no
##$SF= 200.129724274929
##$SI= 16384
##$SIGF1= 3
##$SIGF2= 2
##$SINO= 400
##$SIOLD= 16384
##$SREGLST= <1H.CDCl3>
##$SSB= 0
##$STSI= 0
##$STSR= 0
##$SW_p= 3205.1282051282
##$SYMM= 0
##$S_DEV= 0
##$TDeff= 0
##$TDoff= 0
##$TI= <>
##$TILT= no
##$TM1= 0
##$TM2= 0
##$TOPLEV= 0
##$USERP1= <user>
##$USERP2= <user>
##$USERP3= <user>
##$USERP4= <user>
##$USERP5= <user>
##$WDW= 1
##$XDIM= 8192
##$YMAX_p= 0
##$YMIN_p= 0
$$ End of Bruker specific parameters
$$ ---------------------------------
##NTUPLES= NMR FID
##VAR_NAME=  TIME,          FID/REAL,        FID/IMAG
##SYMBOL=    X,             R,               I
##VAR_TYPE=  INDEPENDENT,   DEPENDENT,       DEPENDENT
##VAR_FORM=  AFFN,          ASDF,            ASDF
##VAR_DIM=   8192,          8192,            8192
##UNITS=     SECONDS,       ARBITRARY UNITS, ARBITRARY UNITS
##FACTOR=    0.0002768,     1,               1
##FIRST=     0,             0,               0
##LAST=      2.2672688,     0,               0
##MIN=       0,             -25059,          0
##MAX=       2.2672688,     16770,           0
$$ Real data points
##PAGE= N=1
##DATA TABLE= (X++(R..R)), XYDATA
0 0 0 0 0 0 0 0 0 0 0 0 0 0 0 0 0 0 0 0 0 0 0 1 -8 8 -8 8 -8 8 -9 16 -16 16 -19 24 -24 32 -32 39 -40 48 -48 56 -64
43 -64 72 -74 81 -95 104 -112 122 -137 152 -168 185 -201 225 -249 277 -311 348 -394 451 -522 617
64 617 -746 931 -1227 1771 -3112 14003 10405 -14873 -680 -2128 -14185 -9969 4466 4266 6852
79 6852 6478 -2508 -3086 6158 -1626 -10856 -4173 -1328 -5785 5926 14881 5021 3860 11346 -6321
94 -6321 -25047 -9896 6927 -487 -390 12383 10139 -1257 -4934 -7747 -6134 2807 633 -7226 2830
109 2830 12877 3410 -141 8374 1061 -12314 -8188 -4832 -9624 1613 16698 8915 -1571 2491
123 2491 -655 -11535 -8748 -307 2118 6558 7855 108 864 7581 -1098 -11221 -3489 141 -8806
138 -8806 -5005 8010 7663 4463 7475 736 -10210 -7277 -2239 -4366 1353 10846 7716 1901 2017
153 2017 -2861 -7935 -3239 -1790 -6727 -1508 6825 2936 739 7498 5122 -4779 -5293 -3576 -6600
168 -6600 -1998 6978 6452 4179 6081 359 -8381 -6689 -3273 -5111 -1135 5732 3842 1832 5430
183 5430 3074 -3203 -2266 -1614 -5880 -3608 3221 3420 3247 6901 3497 -4661 -5501 -4419 -6716 -3383
199 -3383 3984 4786 3777 5786 3140 -2675 -2667 -1719 -4467 -3312 1366 2035 2349 5135 3238 -1627 -2203
216 -2203 -3332 -7196 -5052 1718 3502 3391 6083 5268 -9 -2500 -3154 -4857 -3427 385 1230 1908
232 1908 4483 3548 -298 -1645 -2563 -5139 -4320 -715 887 2670 6211 5683 1314 -856 -1828 -4611
248 -4611 -5137 -2050 527 2191 3928 3479 1271 -162 -2052 -4653 -4314 -1569 211 1911 4672 5231
264 5231 3042 920 -1341 -4194 -4915 -3129 -1303 751 3299 4195 2773 791 -1313 -3525 -4115 -2865
280 -2865 -1103 1324 3948 4834 3678 1908 -428 -3256 -4717 -4124 -2480 -161 2386 3901 3659 2223
296 2223 -62 -2554 -3843 -3499 -2101 235 2898 4438 4302 2799 380 -2315 -4254 -4664 -3506 -1162
312 -1162 1575 3483 4037 3251 1217 -1383 -3340 -3846 -2928 -896 1690 3749 4452 3527 1338 -1409 -3672
329 -3672 -4740 -4242 -2246 593 3041 4158 3931 2384 -225 -2659 -3824 -3552 -1947 626 2983 4155
345 4155 3956 2385 -380 -3037 -4546 -4529 -3064 -441 2201 3933 4615 3506 566 -2051 -3183 -3810
361 -3810 -3329 -734 2423 3847 3904 2914 602 -2028 -3854 -4841 -3982 -1047 1671 3164 4400 4380 1859
378 1859 -1029 -2752 -4127 -4103 -1381 1378 2599 3934 4302 1563 -1862 -3349 -4200 -4245 -1945 794 2517
395 2517 4425 4822 2114 -406 -1333 -3465 -4899 -2645 380 1636 3568 4840 2393 -662 -1962 -4165
411 -4165 -5461 -2580 814 1890 3812 5284 2789 -161 -816 -2895 -4825 -2747 -285 137 2447 4867
427 4867 2972 503 -189 -3141 -5944 -3490 -224 535 3351 6286 3724 258 -344 -2851 -5505 -2852
443 -2852 182 -434 1244 4546 3104 420 508 -1453 -4367 -3191 -1933 -2008 2350 6859 4036 789
459 789 1743 -1350 -6653 -4832 -607 -329 1814 5053 2633 -197 1252 -445 -4544 -3023 -333 -1458
475 -1458 33 3671 3131 2953 4274 -761 -6753 -3813 -858 -3832 -1166 6603 5973 694 181 -944
491 -944 -4173 -2683 -624 -1958 468 4624 2225 -116 2912 2016 -2815 -2804 -2829 -5590 -1405 5517 3252
508 3252 805 5273 3191 -6230 -6817 -975 -255 91 3291 2834 1759 2978 -534 -4650 -770 1250
524 1250 -4286 -4055 2324 2366 1301 5317 3490 -3314 -2698 -1156 -5915 -4257 5161 6398 1555 1506 1119
541 1119 -2678 -2840 -2233 -3636 124 4220 -419 -2469 4627 5387 -1804 -2039 315 -4118 -5009 858
557 858 2143 1956 6261 4617 -3581 -4745 -1741 -3399 -2686 2347 2608 1569 3682 919 -3470 611
573 611 3042 -3973 -5473 1273 1424 -1470 3222 5724 1012 -1044 -1833 -6142 -5039 1762 2535 1207
589 1207 4685 4028 -1963 -2299 -475 -3124 -2094 2316 -158 -2605 2884 4685 -395 -291 1980 -2792
605 -2792 -5761 -2032 -273 673 5360 5468 72 -759 -358 -4706 -4778 1108 1749 -201 2690 2976 -1126
622 -1126 -99 2022 -2144 -3960 -371 -870 -2438 2409 5265 2213 1384 1131 -3867 -5508 -1378 -348
638 -348 -481 3871 4741 74 -680 647 -2488 -3413 183 -139 -1929 1487 3452 1086 1640 2737 -1600
655 -1600 -4332 -2157 -2099 -2318 2352 4974 2137 1113 1144 -2598 -4291 -1343 -602 -1066 2112 3387 699
672 699 847 2229 -799 -3036 -1417 -1848 -2852 573 3257 2050 2412 2838 -1161 -4007 -2317 -1736 -1928
689 -1928 1334 3602 2019 1587 1704 -1218 -2808 -1184 -1519 -2523 130 2423 1514 1970 2851 285 -2238
706 -2238 -2001 -2491 -2913 129 2777 2253 2305 2495 -201 -2565 -2155 -2134 -2299 69 1949 1525 1998 2651 543
725 543 -1569 -1503 -2022 -2787 -867 1411 1802 2487 2867 805 -1494 -1892 -2495 -2876 -802 1351 1706 2261
743 2261 2637 956 -979 -1462 -2088 -2564 -1164 650 1288 2226 2798 1359 -511 -1332 -2258 -2909 -1590 359
761 359 1403 2302 2748 1572 -165 -1163 -2139 -2678 -1625 40 1080 1978 2539 1756 305 -922 -2124
778 -2124 -2690 -1792 -377 721 1891 2751 2109 541 -798 -1835 -2442 -2023 -829 504 1835 2516 1994
795 1994 807 -414 -1661 -2468 -2142 -1051 350 1664 2392 2172 1219 -103 -1457 -2357 -2254 -1247 27
812 27 1316 2192 2254 1449 82 -1325 -2183 -2210 -1475 -302 1123 2176 2330 1573 352 -920 -1983 -2311
830 -2311 -1760 -550 885 1922 2178 1746 693 -696 -1887 -2253 -1758 -743 566 1758 2303 1938 947
847 947 -461 -1700 -2195 -1919 -1094 191 1579 2193 1955 1140 -143 -1443 -2028 -1932 -1287 -6 1434 2062
865 2062 1924 1385 262 -1235 -2065 -1980 -1520 -322 1179 1909 1947 1635 468 -1140 -1940 -1885 -1610 -581 1000
884 1000 1799 1841 1706 764 -843 -1701 -1791 -1857 -989 701 1582 1796 2059 1184 -738 -1659 -1711 -1940 -1232 636
904 636 1588 1726 1942 1133 -668 -1317 -1353 -1965 -1531 355 1249 1344 2001 1616 -87 -952 -1400 -2443 -1948 393
924 393 1304 1230 2107 1995 -111 -1315 -1492 -2052 -1466 351 727 737 2136 2108 -40 -889 -607 -1767 -2211
943 -2211 -652 284 930 2592 2417 59 -722 -595 -2287 -2739 -304 1131 1112 1910 1723 -13 -200 -100
961 -100 -2067 -2418 -13 452 -409 1284 2621 1280 282 -298 -2379 -2709 -520 -87 -213 2388 3427
978 3427 585 -938 -514 -1606 -2018 -324 -125 -304 1834 2307 -70 -8 1372 -761 -2823 -1564 -651
995 -651 -513 1775 2734 1052 880 932 -2309 -3729 -727 665 -198 1258 2324 713 144 571 -1425
1012 -1425 -1913 127 -417 -1960 209 2806 1451 915 1555 -949 -2658 -1365 -1443 -1639 1917 3812 895
1029 895 -157 899 -947 -2634 -791 -134 -816 880 1686 -213 675 2540 93 -2137 -917 -1004 -2379
1046 -2379 5 2411 1510 1648 2224 -1133 -3251 -1131 -420 -1496 690 2676 866 130 1153 -378
1062 -378 -1460 198 -494 -2533 -525 1694 443 892 2926 882 -1934 -1348 -1600 -2553 204 2634
1078 2634 1278 1042 2147 -209 -2437 -687 -126 -1520 -33 1432 -44 194 2477 921 -1190 -79
1094 -79 -758 -3119 -1280 1382 989 1460 2881 722 -1875 -1129 -1144 -2284 -215 1973 640 337 1789
1111 1789 406 -1208 159 -15 -2132 -1206 520 -236 557 2827 1651 -604 -354 -1158 -3030 -1386
1127 -1386 1236 794 941 2380 773 -1341 -483 -465 -1788 -613 834 -307 -81 1894 1399 -119 355
1144 355 -168 -2509 -1728 9 -257 822 2860 1798 -407 -295 -769 -2342 -1284 653 246 417 1802
1161 1802 973 -407 361 132 -1739 -1392 -153 -613 -81 1963 1812 496 564 -299 -2282 -1815 -193 -162
1179 -162 398 2015 1500 19 84 -210 -1572 -1172 -74 -506 -191 1444 1392 465 846 350 -1488 -1651 -799
1198 -799 -849 -106 1672 1659 628 602 -49 -1590 -1504 -499 -502 -85 1275 1186 591 687 458 -1059 -1271 -793 -980
1219 -980 -459 1025 1226 757 960 383 -1047 -1406 -780 -875 -239 1030 1301 820 849 456 -794 -1167 -662
1238 -662 -893 -576 569 1087 945 1024 633 -566 -1017 -981 -1107 -660 587 1098 1008 1028 603 -467 -1005 -1005 -1063
1259 -1063 -664 366 895 926 1011 747 -161 -784 -898 -1073 -741 126 744 975 1173 877 -71 -737 -968 -1109
1279 -1109 -846 -41 660 953 1110 845 105 -523 -862 -1083 -857 -176 446 859 1077 918 229 -400 -879 -1125
1299 -1125 -965 -318 338 823 1078 1013 431 -198 -725 -1039 -931 -521 110 677 952 953 469 -123 -649 -1010 -1043
1320 -1043 -584 83 613 1009 1027 642 91 -483 -928 -984 -675 -116 427 902 978 636 133 -447 -895 -1068 -734
1341 -734 -215 359 874 1089 829 293 -276 -751 -1012 -820 -355 238 678 940 790 351 -204 -579 -955 -847
1361 -847 -330 246 724 975 1065 407 149 -673 -987 -1048 -503 -70 579 997 809 530 126 -485 -965 -867 -560
1382 -560 -59 432 928 872 828 318 -424 -1046 -839 -619 -404 271 978 897 632 286 -285 -809 -654 -509 -415
1403 -415 191 889 886 618 567 -50 -706 -718 -878 -757 231 895 671 575 812 87 -944 -953 -537 -471 17 610
1425 610 704 759 796 -3 -751 -641 -637 -911 -333 569 642 845 997 43 -700 -498 -687 -1195 -354 909 980 514
1447 514 520 287 -387 -544 -825 -1006 -152 457 203 379 1369 664 -472 -364 -704 -1293 -301 446 399 638 1216
1468 1216 516 -693 -682 -451 -673 -493 187 327 632 1059 278 -376 217 -151 -1383 -921 345 265 365
1487 365 1302 895 -208 -196 -563 -1285 -795 593 530 379 959 631 -275 -78 -302 -1114 -255 340 -278 -299
1507 -299 1308 1091 -242 -54 177 -1301 -1199 -58 216 458 1376 848 -300 -85 -234 -1194 -733 432
1525 432 5 -41 968 515 -221 407 382 -1073 -1157 -41 -449 -335 1102 1397 412 116 -190 -1297 -1089
1544 -1089 64 6 95 1195 738 -403 36 241 -817 -646 190 -368 -553 726 1189 86 581 671 -1006
1563 -1006 -1311 -544 -511 -176 1220 1161 7 191 30 -1057 -870 231 -112 -366 728 696 -128 456 764
1582 764 -509 -840 -213 -754 -773 647 1073 381 664 479 -972 -1160 -157 -406 -233 888 994 -83
1600 -83 269 412 -614 -527 184 -446 -917 281 622 131 772 864 -497 -930 -431 -836 -636 761 1056 271
1620 271 466 478 -655 -815 -74 -344 -546 329 509 -127 361 741 -172 -340 64 -660 -985 36 620 280
1640 280 783 865 -344 -738 -257 -580 -739 386 742 151 166 546 -59 -325 151 -344 -664 -73 284 -17
1660 -17 402 747 110 -499 -274 -714 -975 33 432 240 611 766 -68 -426 -90 -293 -645 13 284 -92
1680 -92 226 745 141 -102 -5 -449 -1032 -301 126 -54 643 971 129 -191 8 -464 -669 -234 244 33 327
1701 327 599 121 -103 28 -311 -666 -293 -57 -102 366 795 404 70 67 -390 -803 -417 -28 -43 359 658
1722 658 269 27 127 -240 -491 -311 -130 -119 280 668 427 83 265 -140 -639 -502 -160 -224 211 652 382
1743 382 226 107 -229 -585 -342 -264 -126 190 564 409 267 233 -100 -506 -441 -314 -286 65 421 453 319 257
1765 257 -81 -461 -445 -323 -204 108 456 458 372 246 -26 -358 -611 -290 -338 1 321 427 374 289 40 -283
1787 -283 -399 -362 -301 31 224 390 382 243 85 -291 -445 -342 -440 -135 284 404 371 482 182 -122 -385 -444
1809 -444 -296 -125 221 369 453 387 139 -154 -348 -434 -413 -148 96 348 426 472 161 -178 -409 -480 -291 -136
1831 -136 107 288 401 334 287 -155 -271 -370 -276 -222 -31 251 427 443 291 7 -227 -344 -390 -221 39 183
1853 183 378 432 289 -6 -205 -329 -411 -331 -88 209 404 421 300 124 -63 -294 -419 -334 -48 132 274 373
1875 373 359 136 -126 -315 -464 -342 -107 113 228 418 426 184 -117 -293 -353 -281 -139 -74 220 455 366 70
1897 70 -21 -125 -402 -404 -198 30 204 413 449 170 41 -83 -371 -443 -223 32 179 295 278 174 170 -96 -444
1920 -444 -361 -82 -82 -23 324 519 257 75 -30 -306 -392 -254 -149 2 373 388 143 77 -22 -282 -289 -146 -154 -31
1944 -31 390 378 70 179 244 -240 -498 -246 -154 -97 210 363 239 217 84 -357 -370 -132 -117 -107 285 361 79
1967 79 183 180 -225 -373 -88 -217 -303 111 399 245 228 239 -131 -347 -245 -276 -175 351 430 86 184 253 -247
1990 -247 -340 -53 -138 -281 77 266 18 212 403 -28 -263 -125 -275 -346 70 305 188 341 327 -211 -371
2011 -371 -90 -222 -322 173 316 4 98 331 -24 -199 48 -171 -423 -50 186 47 294 501 2 -264
2031 -264 -142 -332 -419 106 310 83 159 360 -105 -268 7 -99 -352 130 248 -60 197 455 59 -35 160
2052 160 -313 -669 -148 188 73 290 511 21 -263 -30 -172 -396 65 208 -43 31 408 63 -144 190
2072 190 -118 -433 13 37 -150 54 444 345 -212 58 -180 -522 -166 192 -11 176 363 21 -231 88 -89
2093 -89 -362 -57 90 -174 22 371 189 44 208 -88 -501 -224 -2 -142 188 509 181 -113 54 -141
2113 -141 -402 -90 134 -86 42 343 86 -62 235 30 -311 -163 -75 -286 -29 387 240 77 169 -70 -446
2134 -446 -232 0 -87 76 400 124 -72 127 -30 -281 -125 31 -234 -70 241 134 59 277 47 -298 -225
2155 -225 -111 -215 -9 372 222 93 144 -23 -313 -151 -43 -148 3 201 108 2 217 106 -187 -160 -81
2176 -81 -279 -147 237 212 112 245 45 -281 -252 -113 -227 -10 239 196 -138 126 -94 -95 -207 49 -188 -269
2198 -269 154 99 146 215 114 -138 -161 -145 -276 -103 162 165 120 154 88 -111 -166 -58 -217 -99 41 306 39 207
2222 207 104 -35 -144 -126 -209 -144 -4 187 143 386 201 -96 -8 -114 -290 -39 81 122 322 239 60 -78
2244 -78 -83 -84 -182 -151 25 80 113 175 184 16 -44 -142 -207 -172 -8 38 80 218 162 -8 -74 -108 -182 -151 -19 43 81 167 163
2273 163 51 -11 -91 -189 -173 -51 19 129 168 165 54 -17 -90 -185 -153 -49 3 114 168 167 52 -14 -73 -153 -170 -111 -2
2300 -2 47 146 144 77 17 -68 -126 -183 -87 -6 51 166 159 108 28 -31 -141 -153 -107 -61 25 136 192 139 48 -55 -109 -141 -119 -40
2330 -40 47 109 138 129 62 -25 -105 -166 -134 -45 19 77 150 145 85 -32 -111 -143 -107 -57 24 103 149 141 83 3 -95 -102 -114 -97 -36 79
2362 79 186 140 101 48 -53 -151 -157 -78 -11 58 165 138 100 48 -40 -137 -142 -124 -45 62 119 128 122 84 -61 -121 -119 -112 -76 23 112
2393 112 132 135 54 -28 -128 -136 -130 -92 37 101 101 115 112 -2 -86 -75 -112 -92 16 105 99 99 115 -1 -89 -124 -142 -94 5 51 88
2424 88 176 131 8 -107 -94 -93 -108 -22 65 49 98 117 0 -69 -48 -122 -143 -41 75 63 139 172 56 -51 -64 -140 -148 -34
2452 -34 73 81 85 177 44 -32 -27 -72 -155 -20 61 28 98 167 62 -30 -7 -108 -196 -56 36 -2 100 194 53 -60 -37
2479 -37 -99 -145 -35 60 31 76 201 47 1 1 -54 -153 -87 -5 0 97 198 95 -2 -5 -113 -222 -79 31 -23 84 195
2506 195 63 -48 22 -60 -170 -69 -18 -37 38 164 86 14 55 -72 -226 -131 -27 -48 58 212 115 11 57 -62
2530 -62 -194 -56 16 -42 26 157 68 20 107 15 -163 -90 -40 -112 -11 178 127 28 96 -7 -206 -124 0 -56 27 179
2556 179 76 10 41 -16 -143 -76 -9 -144 -28 160 97 44 158 43 -151 -115 -93 -105 -10 177 98 54 97 -4 -150
2581 -150 -100 18 -86 -1 93 2 105 145 62 -114 -25 -154 -246 -220 253 128 106 41 43 -32 -185 -41 -137 -48 128
2606 128 93 13 127 46 -133 -37 -1 -140 -77 62 68 59 171 104 -63 -96 -99 -182 -74 85 126 53 141 55 -99 -71 -48
2633 -48 -138 -57 82 39 6 126 89 -38 -43 -28 -159 -124 -7 64 88 162 110 -58 -67 -66 -136 -76 73 67 63 119 85 -45 -6
2662 -6 -3 -116 -113 12 9 23 104 153 -23 -24 -31 -187 -145 -8 49 36 148 95 -23 -46 -31 -128 -130 20 -8 -1 110 133 -9
2691 -9 38 -27 -141 -144 -33 -11 29 143 147 50 7 -9 -105 -135 -45 2 38 97 119 29 15 12 -124 -101 -32 -35 5 121 128 67 8
2722 8 1 -104 -125 -72 -15 33 76 110 28 26 -19 -116 -103 -74 -22 9 76 130 67 69 22 -84 -112 -82 -45 10 96 129 71 42 -24
2753 -24 -75 -125 -56 -17 17 96 109 52 28 -8 -81 -134 -98 -105 -35 36 70 91 81 32 -59 -112 -104 -78 -36 46 77 103 51 44 -30 -62
2785 -62 -103 -71 -33 52 70 97 74 62 -39 -83 -78 -97 -21 32 64 102 90 57 -5 -91 -68 -66 -35 17 54 73 97 49 5 -68 -94
2816 -94 -76 -66 -24 69 86 142 62 27 81 -89 -59 -35 -8 54 81 83 75 18 -49 -58 -89 -48 -30 31 90 102 73 52 -25 -70 -114
2847 -114 -76 -43 18 72 76 71 31 3 -62 -92 -82 -65 12 81 92 107 49 1 -46 -98 -100 -51 17 73 102 82 47 -14 -62 -77 -129
2878 -129 -56 -41 61 77 114 57 -6 -32 -140 -90 -64 -18 -3 59 105 44 24 -37 -55 -110 -83 -33 16 52 96 83 26 -41 -49
2907 -49 -102 -89 -1 21 59 129 73 26 -9 -42 -133 -73 -67 27 45 37 -7 188 30 -61 10 -132 6 -72 6 59 82 6 8 -37
2937 -37 -105 -98 -47 -37 56 72 83 54 41 -37 -76 -63 -68 -49 37 100 106 78 68 13 -74 -100 -75 -45 16 60 88 79 39 -52 -64 -77
2969 -77 -79 -64 42 69 68 36 63 -87 133 -86 3 -101 -49 92 78 89 123 8 -121 -29 -99 -30 8 119 265 71
2995 71 128 61 0 29 -102 -69 -48 65 61 54 75 42 -65 -72 -68 -117 -54 96 59 56 109 32 -51 -60 -88 -94 -36 44 47 53 94 31 -22
3028 -22 -44 -62 -108 -41 -13 58 104 157 142 -90 -139 -97 -101 -172 85 -159 52 64 149 -100 -78 -28 0 139 -6 105 20
3055 20 141 117 97 63 -6 -197 -89 -7 -34 55 140 84 0 -27 -56 -116 -77 4 26 8 118 90 -16 -1 -15 -107 -103 -21
3083 -21 1 34 108 120 21 28 -34 -113 -108 -18 -10 38 119 75 -26 72 -14 -199 -85 80 -56 166 183 45 54 117 -13 -109
3111 -109 -42 -66 -1 21 235 138 15 -39 24 -85 -88 -27 -39 24 52 107 74 116 -30 -16 -66 -90 -133 -77 106 133 92 23
3139 23 31 -105 -107 -57 -47 -47 47 25 -6 100 106 21 -86 64 -140 -88 -65 -99 215 137 72 -122 -13 -28 -37 -82 94 84
3167 84 75 61 41 -89 -76 -44 -56 -12 46 60 36 63 38 -51 -74 -49 -75 -90 27 62 76 65 76 -49 -86 -56 -66 -39 38
3196 38 63 36 103 76 -9 -37 -47 -95 -71 18 28 65 90 74 23 -59 -69 -86 -83 20 32 47 97 69 36 -25 -47 -73 -96 -59
3226 -59 48 40 73 90 31 -28 -28 -63 -84 -55 -3 68 81 94 59 -21 -45 -78 -108 -27 17 49 115 103 45 -3 -52 -57 -62 -17 16 45
3258 45 91 99 60 6 -5 -55 -87 -70 -17 26 75 100 71 8 -22 -70 -91 -54 22 -1 101 119 61 39 -32 -74 -75 -31 -8 5 57
3289 57 100 76 100 -88 -118 97 -102 -31 -29 113 94 85 78 36 -32 -30 -91 -74 47 -20 202 41 -30 12 31 -27 -105 -18 -10
3318 -10 56 73 91 88 11 -35 -79 -72 -51 -16 17 74 87 94 58 -19 -48 -63 -55 -11 26 61 98 71 39 8 -56 -91 -91 -36 0 53 86
3351 86 80 15 26 -41 -59 -91 -65 1 16 94 73 62 50 -58 -47 -71 -63 -36 33 98 9 170 -80 -175 -141 -176 -111 -117 112 57
3381 57 -15 177 68 -11 -130 -43 -136 -136 -8 28 88 100 65 -15 -32 -73 -55 -26 7 37 81 100 50 3 -65 -80 -110 -48 39
3410 39 50 59 72 62 13 -21 -61 -70 -41 -6 20 105 84 54 4 -33 -62 -104 -38 -35 17 94 114 205 -17 46 -28 -279 -152 58
3440 58 -169 38 96 115 72 97 -28 -69 15 -80 13 94 27 72 -22 53 9 -145 -13 58 0 24 123 71 47 8 -6 -65
3468 -65 -79 -35 -8 29 76 85 49 24 -38 -63 -77 -26 -15 31 73 82 51 -26 75 -41 -70 -105 -64 -18 -37 32 -18 -41 -65 4
3498 4 52 -67 -55 94 33 150 -38 110 28 -28 61 -71 -12 83 163 30 24 52 87 88 -143 16 -54 -52 101 87 0
3525 0 62 -161 21 -101 -36 -58 -113 -47 13 98 42 -7 -110 -20 -65 -62 -43 28 46 47 88 60 -8 -65 -46 -79 -10 14 121
3554 121 -6 49 -10 -125 -16 45 70 -55 -93 76 98 86 169 -68 -20 -1 -51 -14 -31 -8 4 97 59 11 -74 -86 3
3581 3 -80 147 84 29 118 98 -13 -13 -83 13 -137 -8 13 22 21 49 -2 -22 54 -98 -22 -12 15 142 111 138 116 16 -16
3610 -16 53 -19 57 -35 -15 -92 1 73 96 76 -47 -39 -111 44 30 141 68 -10 26 37 -157 -70 16 29 12 57 85 20 -19
3639 -19 26 20 -85 -142 -51 -95 0 100 117 -28 -7 -55 -101 -39 -47 7 44 79 43 25 18 -54 -76 -41 -19 -30 37 95 44 37 28
3670 28 -37 -87 -62 -24 -3 52 69 34 5 104 31 -11 48 -41 -27 48 138 40 69 71 -89 -71 -11 -11 -67 20 -14 74 61 130 -33
3701 -33 -57 -92 -20 41 -37 92 17 142 60 -54 -48 -101 -48 -92 0 43 88 50 96 35 -129 36 -3 -100 21 66 58 66 77
3730 77 12 -72 -70 -58 -59 -22 3 48 15 -22 72 -112 -182 -60 -76 -36 113 193 -104 -3 -138 -147 -72 -186 -37 97 84
3757 84 -5 126 96 107 13 -65 -79 -87 79 -2 75 49 52 132 -3 101 -6 36 -96 -82 -26 67 38 138 47 38 -58 -16
3785 -16 5 158 180 119 11 49 59 -172 21 -66 -39 8 17 61 74 31 -8 -11 -62 -56 -59 -23 -20 45 17 -32 -89 -40 -15 -122
3815 -122 -76 -110 53 -28 5 73 75 18 69 -33 -2 20 61 71 52 117 78 -7 22 122 -48 132 -42 -9 53 110 46
3842 46 27 -35 -34 -10 -55 -139 -2 132 159 41 37 52 -100 -192 -138 66 26 78 40 -2 23 -36 -68 -86 -13 15 -97 27
3870 27 72 -17 188 39 -42 -97 -51 -121 184 64 112 16 35 -110 10 -54 -33 -137 12 29 43 184 121 -7 83
3895 83 -64 -39 13 -42 -23 -32 81 53 181 -332 -83 -57 -210 -63 -70 99 216 100 83 -42 -142 -43 -92 23 -65
3920 -65 83 80 45 60 -75 -6 -36 26 -144 139 80 21 73 60 -21 -41 -58 -68 -56 2 7 32 43 40 -10 0 -47 -69 -59 -8
3950 -8 27 50 42 35 42 43 -109 29 -101 -21 40 -51 71 3 5 -67 20 -8 -59 15 -31 35 180 146 56 20 -138 -147 131 88
3980 88 99 59 -51 105 8 -110 31 -1 -160 40 -75 79 -29 -81 187 106 -27 4 23 -95 76 -155 -9
4003 -9 159 11 15 -35 87 59 -53 -1 2 63 67 59 -19 23 -44 -73 -38 -25 4 49 52 8 -38 12 -44 -20 -42 -43 -55 34 114 67
4035 67 4 -54 -124 75 -6 -112 7 -19 45 69 36 7 -23 -60 -11 -29 -22 38 63 28 98 42 -23 -38 -47 -54 -13 -5 34 43 41 33
4067 33 -19 -67 -28 -27 -21 30 58 25 21 18 -27 -31 -32 -39 -44 2 42 45 21 64 -2 -62 -39 -16 -46 -7 64 48 7 43 -22 -34 -37 -24 -45
4102 -45 1 22 41 30 22 2 -60 -28 -53 -69 15 15 33 40 28 30 -29 -32 -63 -54 -18 41 38 35 56 -13 -28 -3 -43 -55 -10 30 17 44
4136 44 42 28 -18 -33 -38 -72 -45 9 26 47 45 23 -36 -56 -42 -52 -40 21 12 29 73 10 14 -13 -28 -69 -54 23 9 24 48 31 8
4169 8 -6 -33 -52 -21 10 22 41 60 38 9 -7 -22 -42 -43 -31 15 17 75 47 -1 18 -44 -68 -52 6 -19 26 55 55 -15 -20 -32 -69
4202 -69 -57 -11 -41 -11 46 45 13 9 0 -33 -58 -24 -41 15 60 18 45 6 -28 -53 -58 -14 -24 30 51 35 -11 9 -35 -21 -33 -25 -17
4235 -17 31 57 54 30 3 5 -53 -64 -30 -8 -9 62 25 30 12 -6 5 -35 -27 -27 -2 49 36 27 34 9 -13 -37 -40 -33 -31 21 80 29 19 10
4271 10 -30 -29 -48 -18 4 -4 24 16 8 8 -8 -47 -60 -53 -25 -13 39 47 46 14 -12 -11 -54 -41 -43 -10 34 39 27 34 15 7 -5 -36 -30 4 21
4308 21 25 45 37 -22 -55 -39 -45 -22 -15 -2 35 34 21 22 -16 -29 -48 -49 -7 26 11 10 53 22 -13 -3 -43 -29 -15 20 40 39 51 49 3
4343 3 -31 -22 -42 1 13 43 59 8 30 -20 4 -35 -43 14 -13 18 36 40 22 -29 -11 -46 -40 -31 -16 19 39 21 28 -19 -26 -51 -63 -46
4377 -46 -14 24 42 38 64 -3 -28 -21 -34 -38 -4 12 42 56 27 22 -25 -45 -45 -24 -40 32 60 47 6 9 1 -20 -19 -23 -9 16 20 14 51 30
4413 30 -2 -19 -23 -35 -5 -11 36 56 10 18 36 -7 -36 -26 -26 40 -1 53 52 44 0 -40 -26 -21 -32 -11 24 46 50 30 18 8 -39 -58
4447 -58 -2 -44 1 33 20 29 16 1 -46 -18 -33 -30 -4 8 26 42 -12 14 -39 -31 -12 -7 3 51 72 7 4 12 -37 -29 2 -31 -17 12
4481 12 20 16 21 -2 -33 -21 -2 -19 -9 7 2 19 39 -4 -9 -25 -13 -44 -41 14 64 53 39 8 -19 -44 -15 -29 -21 16 10 43 26 43
4515 43 -21 -30 -7 -34 -18 9 23 29 28 18 -9 -12 -38 -35 -16 -8 -19 30 30 0 -36 -11 -11 -24 10 -9 11 31 0 23 -13 4 -14 -28
4549 -28 -29 -16 16 14 43 39 10 5 -10 -38 -38 0 3 14 49 18 14 -6 -12 -34 -32 -8 -8 -11 9 18 18 27 -21 -32 -50 -33 -26 28 43 23 19 -11
4587 -11 -9 -30 -29 -9 2 29 38 53 7 11 -17 -35 -37 -12 -2 -9 37 16 5 9 -18 -29 -14 -10 1 12 34 23 25 33 -3 -41 -20 -9 -21
4622 -21 8 8 57 -27 29 13 -18 -46 -5 -19 -14 17 31 21 50 -16 5 -77 14 15 58 -6 20 -27 44 120 -27 13 -13 -15 34 63
4654 63 8 50 43 3 -105 21 -159 -14 -93 91 -49 1 61 90 -38 -64 16 33 -3 -129 52 -45 25 -21 43 83
4680 83 -6 -54 -83 20 -67 6 30 78 -13 -110 -50 49 -6 7 40 41 36 -19 -10 -25 -44 -35 -31 -4 14 29 5 23 24 -19 -22 -30 -40 -19
4714 -19 12 10 35 12 8 -15 -11 -10 -18 6 11 0 19 31 20 2 1 -19 -36 -2 22 -5 27 -3 -9 34 -61 -30 -9 -24 0 14 12 19 22 30
4750 30 -9 -20 -19 13 -36 11 32 -2 33 47 36 -29 -6 41 31 -55 -40 21 -26 -34 -29 22 -53 29 -24 8 26 -1 27 32 37 -16 -21
4783 -21 -41 -38 12 7 -9 27 -29 -10 4 -15 -35 -38 -8 -3 26 -4 15 -14 -20 -18 -29 -1 10 -17 -11 -8 60 11 12 -54 -57 -52 55 12 15 18
4819 18 -10 -23 70 -93 -48 -50 -98 -113 16 24 27 73 -37 3 -50 -33 -24 -10 20 23 12 4 12 -15 -35 -14 -1 -7 22 37 12 44 23
4852 23 -12 -46 9 -18 -19 25 26 1 34 1 -18 -24 -29 -13 6 -9 50 4 -14 -32 -16 -20 -22 -20 9 -23 14 6 29 4 0 12 -40 -32 -8
4887 -8 79 1 96 -29 -55 -48 11 -67 -44 -4 9 3 1 -25 -20 49 -47 74 -30 -60 112 19 -1 187 -43 87 87 -28 39
4916 39 25 108 -8 143 21 -41 22 20 43 -32 75 -73 -141 12 -23 77 -39 145 13 63 -9 -49 9 -89 -71 25
4942 25 -39 12 -44 -73 -30 -20 4 25 40 35 -8 2 -13 -19 -25 -23 8 21 6 37 -9 34 23 -33 -6 -28 20 -21 88 60 21 116
4974 116 39 -26 21 19 -7 -149 26 -29 57 44 -29 -12 -11 -7 10 -53 38 -4 6 -8 -16 -17 -50 -11 -17 -1 8 34 9 8 21 -12 -44
5007 -44 -53 -17 4 19 50 -3 27 6 -14 16 6 -16 4 11 10 28 -7 14 -32 -17 -6 11 -3 5 43 38 -2 -6 22 -26 -14 -1 -37
5040 -37 9 24 9 25 -4 -3 -21 -31 -14 -12 19 34 14 29 21 -21 -17 28 -20 -37 8 20 33 26 20 -10 -15 23 -38 -41 36 7 35 -18
5074 -18 16 -3 -52 -5 -17 -43 -16 15 21 25 30 2 -7 -20 -17 -13 7 1 14 13 23 1 -2 -7 -1 -14 -42 2 -10 30 31 1 16 -6 3 -21 -24
5111 -24 20 7 5 30 -18 -14 4 -48 -25 -1 9 14 13 51 3 -37 -12 -36 -32 -26 18 22 8 -3 33 91 -88 -47 -40 -27 8 -9 60 9
5145 9 128 23 -36 -80 -56 -3 34 15 -22 237 92 -124 104 90 -66 19 119 47 -9 -12 -15 22 -27 -20 -67 -39 -2 -19
5173 -19 -15 44 -14 49 -13 54 -46 61 -3 48 90 64 -78 -133 24 -126 97 -65 -109 93 -13 -34 -48 -153 16
5198 16 -33 18 -19 -6 45 -50 86 -12 -2 16 -18 -19 -10 22 -19 -8 8 36 18 4 18 -2 -5 -11 -29 15 33 20 8 20 14 -15
5230 -15 13 1 10 25 29 38 30 -9 4 -34 -29 -46 -2 0 7 13 19 11 -26 -12 -29 -41 -30 -6 7 6 23 18 -21 6 -1 3 26 -10 14 34 -4
5267 -4 -3 4 24 -33 3 -36 -10 24 22 -46 3 1 -23 21 60 14 187 -54 -48 117 133 164 11 44 21 -69 -172 36 119 29
5297 29 -24 -15 -28 29 -27 -17 -71 -16 6 -1 -26 35 -40 24 46 52 52 4 -1 26 32 79 65 88 -30 -16 -52 -35 81 33 13 -39
5329 -39 -60 5 -123 -64 -22 32 -52 -18 20 28 73 40 -33 -38 31 9 55 1 66 16 65 33 -77 -69 -39 38 0 42 -23 14 -21
5360 -21 -125 31 57 87 28 -317 47 99 -60 -62 28 -6 -17 10 23 -52 10 172 18 82 18 0 -25 18 -45 -32 -78
5387 -78 -147 -25 33 38 35 -89 78 61 -45 102 -6 40 -3 37 48 31 -48 -14 -38 -20 77 19 59 -95 5 4 -19 16
5415 16 -34 4 -4 -6 12 16 -29 -21 8 0 -21 1 0 -5 21 27 -5 -1 -30 -3 -45 3 40 -16 18 -17 46 -18 5 -1 -45 -9 31 1 9 15
5451 15 9 0 7 -7 -49 -7 -5 52 19 17 0 5 -5 -11 -23 -28 12 -11 7 -5 -11 -16 -3 -26 -8 -3 33 46 -24 -28 24 -13 0 -10 -30 16
5487 16 -4 1 13 22 25 -11 1 -24 -14 -33 -22 -14 -10 6 8 18 -1 -13 -29 -22 -14 18 10 6 15 -6 -22 4 -7 -5 -21 17 -9 17 21 17 6
5524 6 -28 3 -30 -10 -1 1 23 10 -12 -9 -27 -24 -14 -12 15 -7 14 -13 15 0 -11 -9 -37 7 13 21 -7 1 -3 8 -3 -8 -5 -29 -10 1 33
5561 33 26 19 1 -5 -23 -36 -2 4 -15 6 1 -18 15 -10 -5 -4 -18 -10 -2 3 -11 6 6 6 -29 -19 -40 -43 -15 13 24 2 20 6 -7 -19 -4
5598 -4 -26 -23 14 20 6 -2 9 13 -18 -15 -25 -22 -2 26 24 15 -23 -3 -13 -57 16 -5 -6 10 11 8 24 -28 -16 12 -26 -23 -17 -14 10 10 23 -8
5636 -8 -25 -24 -4 2 21 -3 6 39 5 14 -10 -21 -5 -8 -15 20 14 21 12 17 -7 -11 -59 -21 3 -21 4 21 20 19 -27 -15 -23 -16 0 -7 28 0 -2
5675 -2 -7 -17 -3 -22 -25 -12 3 5 4 37 4 -18 1 -7 -7 -5 1 -13 19 3 5 -7 -10 14 -25 -13 -14 -7 -8 15 18 7 -10 0 -34 -12 8 -30
5713 -30 5 0 -1 11 -15 -40 -6 -3 -23 -5 -9 -2 5 -7 -6 -13 -23 2 8 3 24 26 9 -2 3 -8 -11 7 -47 5 6 -13 -2 6 2 9 -15 -24 2
5752 2 -1 -3 -18 13 31 9 -26 -15 -49 -51 -3 -26 7 25 0 3 0 1 -5 22 31 -11 24 13 8 -15 -8 -10 -7 -37 -14 8 57 31 3 9 -18
5789 -18 -29 -14 -13 -27 1 -25 10 -11 -26 23 -15 -27 -5 -16 -24 -32 17 29 14 35 -2 -18 -32 11 -15 11 13 12 19 5 -10 -22 -25 -13
5823 -13 -39 -2 15 8 29 5 -15 -36 -36 -51 -4 -36 -21 -8 2 -5 -15 -10 -42 -25 -20 -10 -4 23 -5 8 -4 -1 -19 1 -1 -17 6 9 16
5858 16 14 18 9 -7 13 -7 -24 8 3 -17 -2 1 7 -5 -1 -36 0 5 -20 -9 1 -25 14 -18 -35 -17 -4 14 -5 -23 4 16 -4 -15
5892 -15 7 -19 -16 21 18 -9 38 4 -17 -7 -31 -1 -45 -6 -4 6 34 33 1 -22 -10 -28 14 -9 -36 15 -10 14 13 -19 -36 -37 7
5925 7 -2 16 1 -4 -14 8 -13 -18 -7 -27 0 -17 19 21 24 7 3 -15 -33 -15 8 22 18 33 38 12 14 -24 -10 -12 -8 -36 0 -6 10 2 2 -15
5963 -15 -15 -18 -8 20 3 11 -15 22 -9 5 -20 -25 -18 -7 15 9 10 12 32 -12 -20 -15 -15 23 -6 28 9 31 14 -9 -3 -12 -23 -41 0 7 16 18
6001 18 -15 -15 -7 -20 -12 -21 1 -17 5 17 16 9 -25 -3 -8 -1 5 4 6 43 60 5 7 -16 -12 -12 -8 11 41 20 6 -11 -12 -11 -5 -10 -1 15 21 -3 15
6042 15 10 -18 -27 -44 -38 -41 0 -25 22 0 19 -19 -20 3 5 20 -27 -21 26 -11 20 -10 -6 -23 -11 -16 -20 6 -8 5 14 -9 -6 8 -9 4
6078 4 -15 -1 19 28 -5 26 -6 7 -17 -24 -27 1 16 -19 11 -13 7 -9 -39 -12 -1 8 10 7 20 19 10 0 11 6 -10 14 16 52 23 -2
6114 -2 9 14 -25 -21 -1 -23 -10 -2 23 18 3 12 -15 -16 6 -19 -5 16 7 8 -1 8 5 -3 -12 27 1 3 10 3 -3 4 -3 -24 -3 -15 -2 20 16 39 27
6155 27 2 6 0 -4 -2 33 28 -13 0 7 4 13 -18 -7 -17 -23 24 -4 8 -15 -20 -15 -37 -12 13 -23 6 3 25 5 19 6 -27 -13 -19 1 7
6192 7 6 17 9 -4 3 -10 20 20 -17 30 -8 -10 17 11 6 -4 -22 -25 -2 -12 -20 -12 -37 16 15 -16 -11 -15 11 -25 -1 25 5 13 -5 -12 -2 -24
6230 -24 -3 -10 -7 12 36 15 -8 1 -21 22 -22 10 39 14 1 12 -15 5 -23 -9 -14 -7 3 -16 -13 10 34 -21 -31 -12 -14 -10 -24 16
6264 16 0 -10 4 -26 -3 0 -39 -1 13 38 -5 8 16 -17 -1 -1 -23 -29 -17 24 16 33 8 -15 15 -10 -21 -27 -1 -6 -1 4 -6 -1 -33
6299 -33 0 0 -17 -41 -26 -14 14 8 -3 10 -6 -13 0 5 12 -3 4 6 0 -5 -15 21 13 7 -48 40 26 1 7 22 5 3 0 -10 -12 -15 19 1
6337 1 -11 -12 -5 -17 -9 -19 -33 6 21 0 5 2 -25 -10 -10 0 -30 -1 18 -2 4 6 18 -22 -40 -9 0 -8 -14 2 20 -9 -19 3 -19 -11 16
6374 16 -36 13 42 -4 5 5 -8 -33 -28 -16 15 -7 2 -5 -13 10 1 -10 -20 -9 17 5 -6 14 2 -22 -10 -1 -10 -12 9 -3 9 32 11
6409 11 -23 -1 -14 -7 0 -29 24 -13 -13 -19 -25 -14 -24 -17 -43 -16 4 -38 -2 -9 -1 -11 -14 -30 1 -18 11 8 -15 -15 16 19 -19 -10 7 0 14
6446 14 -8 0 36 7 -12 -42 7 -19 14 7 -12 -7 9 -6 -6 5 -5 -11 -9 -6 -15 7 -6 14 -11 -18 10 -15 6 -18 -20 16 21 22 -8 2
6482 2 -12 -18 -10 -14 -1 12 25 32 26 14 1 -14 -32 5 5 24 17 5 -2 -7 -32 -33 -13 -11 1 -25 5 -8 12 5 -19 -14 -23 -28 -27 -5 -28 11 3
6521 3 6 8 -7 6 -25 8 3 25 9 10 -7 -3 4 -23 17 2 -26 10 -1 9 5 -18 0 1 -25 -10 -31 -10 21 0 -3 -7 -22 -33 -35 9
6557 9 -15 -2 -27 7 29 8 -35 6 -42 -16 -19 21 11 12 8 -20 -1 1 -5 -16 15 6 5 18 22 17 -22 7 41 -31 7 -6 13 18 32 -5
6593 -5 -5 -4 -1 -17 -1 14 19 15 1 14 -2 -12 -12 -22 -2 14 17 14 24 34 -22 -19 -9 -1 -5 8 44 13 5 15 -3 -17 -13 -14 1 -10 15 8
6631 8 -5 9 -2 -4 -10 -19 -28 -11 -16 -1 10 15 11 -21 -12 -1 -19 -3 -5 -5 45 25 2 -21 -6 -16 -19 16 0 -5 2 -13 4 4 5 -1 -18 -16 1
6670 1 0 -17 18 9 36 -17 9 -18 -17 -19 11 -7 -31 2 -23 -17 -18 -6 24 -12 9 12 15 16 -8 -15 -3 -19 -21 -9 10 32 11 28 -30 -7
6706 -7 -8 -14 4 -8 -10 42 -5 21 -16 -2 -10 -8 -11 -14 -7 1 17 -7 1 -8 -13 -11 -27 -39 -1 -21 -8 9 7 -17 5 10 -19 19 -14 -17 9 0 17
6745 17 27 -4 -17 -20 -12 -24 -8 -1 -23 15 2 -36 -5 -43 1 -10 -1 -20 -9 27 1 9 -2 -30 -22 -10 4 -1 4 6 -15 -34 5 2 5 14
6781 14 -13 10 20 10 44 8 -26 9 5 0 26 0 26 5 25 38 -24 -6 -7 16 -36 -7 1 9 7 12 6 3 -4 -21 -9 -5 -13 7 -5 -1 -5
6818 -5 -12 24 -13 4 38 -12 38 34 17 -3 -17 9 20 -23 -5 16 -5 0 -8 -4 25 -21 7 0 -1 -17 -15 26 -33 14 -16 -9 -14 -6 28 7
6854 7 14 6 -1 -11 17 -8 -3 -2 1 -13 5 -2 29 -8 -1 31 22 17 -7 -5 -3 49 13 -1 12 -4 -13 -36 -28 -17 -6 6 -17 -1 -14 -3 1 -29
6892 -29 -10 -9 -26 1 -12 6 18 -23 -28 -16 -21 -5 2 -26 14 6 0 -13 -20 0 -1 -19 21 26 -6 37 28 25 -3 1 -14 13 -4 14 -11 7
6928 7 6 -18 -13 -20 -16 -30 -10 -6 0 23 22 -9 -14 10 -10 -18 21 2 4 15 24 42 -21 20 13 -22 -2 -26 -13 7 13 15 -10 -15 -12 13 5 17 -12
6967 -12 28 -21 -20 0 -25 13 5 1 7 -11 -8 -7 -2 13 4 -2 3 3 0 -10 14 -12 18 -2 -5 18 10 -2 -6 15 10 10 16 -3 -31 6 0 -5 19 -5
7007 -5 -3 7 18 -12 0 -19 -8 -3 -10 -8 1 13 21 9 9 -24 -17 -6 -19 2 -10 18 9 18 14 -12 18 -29 -4 1 17 24 11 6 23 -5 2 25
7045 25 -5 -1 6 25 7 15 2 -8 14 -16 -32 -17 2 -5 -4 -1 28 5 9 -19 -2 -5 -17 -13 29 7 32 9 -7 18 25 -1 13 -10 -9 11
7081 11 13 -10 -4 0 3 -11 -22 24 17 -3 29 4 2 -23 14 13 -22 20 12 4 -3 7 27 -7 5 -15 -8 -20 25 15 -19 12 5 -8 34 -13
7117 -13 -1 -9 -12 18 3 -23 30 8 -20 5 -5 1 20 19 -1 -6 12 -8 25 6 -12 -21 9 26 -8 29 -30 13 -17 -31 -10 5 12 6
7151 6 21 14 -2 -5 5 -15 -15 -11 -8 -19 31 13 17 19 -3 10 -15 18 20 15 -2 4 13 -22 -3 6 -12 -11 6 -42 6 1 -8 -19 4 -45 -13 4
7189 4 -16 32 15 19 4 7 2 -4 0 -18 25 28 1 28 7 14 -4 -6 10 22 16 -21 19 18 2 8 1 0 -7 -7 4 -18 12 -4 -2 7 -14 -17 -5 -2
7229 -2 -14 -3 6 13 4 23 5 4 7 1 -13 -1 11 0 -3 35 24 -14 -7 4 -8 9 9 22 51 11 13 -30 -26 28 29 -7 6 -5 -9 -12 -10 -12 1
7268 1 -35 0 13 3 10 -25 -29 15 7 -20 7 -2 10 3 12 -10 22 22 32 -5 -21 -22 -7 16 10 34 -15 32 15 28 22 -2 4 19 2 7 -8
7305 -8 -8 26 -9 -26 7 -13 1 30 12 12 28 23 0 -1 -18 -32 -25 17 8 -5 18 14 15 2 15 28 10 -9 21 9 9 28 19 1 10 -7
7341 -7 -32 19 -10 -9 16 5 -12 -11 -23 -33 2 -17 4 -30 -35 -20 -6 11 -20 6 -3 -27 -24 -1 18 3 -4 3 -16 11 6 8 27 7 -24
7376 -24 14 4 21 21 -7 -2 -9 24 10 11 -13 -8 -7 -15 2 -1 -12 33 0 -4 20 2 -17 15 -28 -4 8 -23 -6 -1 11 25 -6 16 -10
7411 -10 19 16 -35 32 8 20 10 -21 10 31 13 18 1 7 -1 0 15 17 -20 -9 -15 -11 -6 0 -16 4 -5 0 1 -27 31 -13 6 12 -4 11 8 -7
7449 -7 17 1 19 -19 9 -5 7 5 12 34 19 -6 12 -14 -24 -7 -2 -14 11 1 10 -8 -20 -13 5 -11 -5 8 -7 1 -9 20 -3 23
7483 23 -6 -9 4 7 8 16 5 -15 4 -1 -10 -18 -2 -15 17 22 22 49 38 27 2 27 -12 11 -5 26 20 42 21 -12 -15 17 -12 -2 9 4
7519 4 -25 7 25 1 12 6 6 4 17 2 14 4 0 -5 -13 5 -12 27 13 3 28 5 -7 39 8 -8 2 15 -2 -1 -8 49 29 4 -26
7554 -26 3 20 -5 19 4 -6 -14 8 14 2 -3 -22 -7 3 -19 10 16 -14 10 0 -3 6 -11 26 6 20 28 10 -2 -16 -16 -4 35 32 8
7589 8 37 -9 -20 0 4 13 -4 4 5 -5 10 5 6 -8 7 -30 22 -7 -23 17 12 17 13 1 -20 -4 14 11 17 27 2 -30 22 17 12 1 -16
7626 -16 8 16 9 -6 3 -15 -1 4 -1 20 -5 12 -9 37 -4 -9 5 1 14 -10 -6 -3 -5 -2 16 8 25 21 3 -12 -4 11 -27 9 21 12 30 1
7664 1 36 20 -12 -6 12 -9 -13 19 17 12 0 3 -8 -17 -8 16 12 8 15 -14 35 -8 12 4 -7 -7 20 -1 -10 3 10 21 -7 -15 -2 10 3 3 3 17
7704 17 -8 10 19 -15 -4 6 2 14 -2 -1 -17 -17 -8 23 -24 -16 -9 -8 -2 -7 -10 -23 -24 8 4 -20 -5 -16 -14 4 -4 1 28 -15 -5 5 -12 -13 -17
7743 -17 -1 18 8 3 24 -16 -1 14 22 38 23 2 -12 19 -22 5 -6 -5 -15 -8 23 -6 6 12 8 2 -10 23 6 8 6 1 1 8 0 -3 10
7780 10 -28 5 5 -13 -14 3 9 1 -1 11 6 -8 5 4 12 24 4 7 16 -4 -5 7 6 28 -8 12 7 14 -14 -6 -33 9 15 -1 2 5 9 11 -31 11
7820 11 -16 -5 -26 -29 17 4 6 15 18 8 -4 8 -3 20 -8 -4 9 19 0 25 14 -13 -1 33 17 12 8 9 24 16 -169 -104 -88 39
7854 39 -3 -127 -140 208 -155 -9 93 85 130 20 20 -24 43 59 32 -19 19 -46 28 26 14 -9 20 -9 3 18 2 -22 29
7883 29 21 6 -16 0 -6 2 7 7 24 -9 0 7 10 -15 -12 -10 15 -10 -16 -5 17 8 -20 -14 0 16 7 12 18 -5 16 12 -2 18 8 15 28 2 19
7922 19 4 -3 5 12 17 -5 -7 -7 5 -18 -13 -2 14 2 -7 -9 -1 -11 13 6 -15 -8 14 -12 -33 -10 -7 24 14 15 23 -3 -21 21 8 -15 -12 16
7960 16 9 5 10 13 -12 3 21 -9 -6 28 -4 -20 9 -12 16 9 -8 12 -10 1 -4 -1 -3 28 -2 -1 1 -24 23 25 -12 9 2 9 -32 -14 -10 7
7998 7 11 -17 3 -6 -12 -12 5 3 11 -4 6 3 13 3 23 2 -23 9 -1 -15 8 25 19 3 -11 -24 -17 -18 3 16 23 -5 -1 7 -11 20 -6
8035 -6 0 20 28 9 18 7 13 16 4 -1 -1 -1 3 28 15 8 0 33 6 -43 -4 -6 8 -8 -3 -5 -27 10 1 -31 -7 -1 5 -13 -25 8 25 -12 -24
8074 -24 -16 15 -7 5 8 8 3 -16 -20 -12 -17 3 24 -6 14 3 13 7 -1 -24 -5 38 16 10 -22 13 41 -11 -24 -9 18 -10 -3 12 22 1
8110 1 -25 -2 7 -4 -3 2 -3 -19 7 -46 5 2 30 5 -12 -8 14 2 9 4 -3 20 -28 7 24 1 -2 0 -6 4 -3 -4 3 -3 -15 -3 -4 9 11 -22
8150 -22 30 -14 10 -23 3 -6 5 -31 -25 29 9 -13 2 -6 8 24 42 -26 2 12 21 4 -9 -27 -21 -19 -4 18 21 -1 1 18 -34 -4
8184 -4 -17 1 -10 -3 6 5 -9
8191i
$$ Imaginary data points
##PAGE= N=2
##DATA TABLE= (X++(I..I)), XYDATA
0 0 0 0 0 0 0 0 0 0 0 0 0 0 0 0 0 0 0 0 0 0 0 0 0 0 0 0 0 0 0 0 0 0 0 0 4 -8 8 -8 8 -8 8 -8 8 -8 11 -15 16 -16 16 -18
50 -18 21 -24 24 -27 31 -35 39 -43 49 -57 66 -74 90 -110 138 -185 271 -444 970 -5425 -25059 -7552
72 -7552 3776 -7387 -3296 11237 8027 1506 902 -5383 -5566 4698 1125 -8639 -1199 5435 -42
87 -42 5091 12296 522 -6202 1353 -8009 -21232 -3087 16770 6230 -1875 7969 5520 -7660
101 -7660 -8194 -3613 -802 5791 4120 -4721 1567 11168 1204 -6337 2089 -969 -13213 -7215 2557
116 2557 -489 5125 16183 5825 -8529 -3641 -873 -8680 -4772 6123 6301 4555 4087 -2617 -3588
131 -3588 3415 -2060 -11507 -3355 4114 -3393 -1752 10994 9313 449 888 -2717 -11249 -6272 2895
146 2895 1539 3178 9805 4828 -4119 -3476 -3953 -7272 -2281 1797 -2310 828 8933 4889 -658 3956
162 3956 2287 -7959 -7856 -1687 -1895 1304 9017 6754 240 113 -3323 -10071 -6367 699 261 2138
178 2138 7944 5369 459 2374 749 -5891 -5073 -1622 -3646 -1349 6046 5891 2263 3048 -372 -8224
194 -8224 -7640 -2485 -1887 1262 7992 7479 2830 2348 -335 -6018 -5569 -2159 -2871 -1327 4121 4832 2784
211 2784 3207 592 -5047 -5429 -3587 -4282 -820 6638 7640 4166 3674 1375 -4747 -6832 -4690 -3565
227 -3565 -905 3701 4576 3217 3463 1305 -3684 -4966 -3784 -3715 -1221 3839 5505 4953 5246 2400 -3676
244 -3676 -6006 -4864 -4647 -2894 2005 5030 4816 3917 1545 -2190 -3984 -4199 -4255 -1798 2747 4834 4772
261 4772 4791 2798 -1658 -4605 -5367 -5437 -3404 794 3699 4597 4773 3076 -616 -3512 -4506 -4334 -2408
278 -2408 1008 3672 4896 5038 3040 -589 -3575 -5020 -5419 -3953 -592 2651 4496 4949 3646 815
294 815 -2121 -4062 -4515 -3195 -310 2511 4313 4866 3595 686 -2473 -4636 -5326 -4241 -1683 1453
310 1453 3990 4989 4152 1865 -919 -3272 -4402 -3723 -1541 1278 3480 4447 3809 1726 -1250 -3767
326 -3767 -4949 -4464 -2455 354 3089 4705 4552 2769 211 -2295 -3900 -4043 -2483 25 2423 3942
342 3942 3952 2414 -92 -2550 -4285 -4575 -3073 -558 2108 4071 4507 3378 1417 -1099 -3616 -4321
358 -4321 -2863 -925 806 3013 4278 3066 629 -1599 -3380 -4185 -3354 -1583 850 3525 4592 3474
374 3474 1943 239 -2453 -4137 -3456 -2044 -359 2410 4034 2965 1550 341 -2442 -4580 -3655 -1680
390 -1680 -56 2336 4076 3618 2668 1217 -1915 -3878 -2954 -2384 -2094 857 3656 3133 2251 1735 -1290
407 -1290 -3973 -3356 -2506 -1870 1555 4519 3645 2572 2157 -908 -3754 -2964 -2402 -2641 47 2928 2321
424 2321 2167 2923 247 -2907 -2588 -2806 -3556 -30 3813 3381 3139 3815 215 -3884 -3281 -2830 -3585 -317
442 -317 3277 1974 1401 3330 1261 -2365 -1955 -1788 -3351 -1312 1593 1522 3426 5786 1522 -3386 -2259
459 -2259 -2583 -5675 -2526 3264 3143 2362 3854 1009 -2790 -1233 -860 -3788 -1855 2181 1282 1095 3786
476 3786 2584 -55 62 -3181 -7294 -2941 2547 503 1118 6916 4795 -2763 -3432 -1888 -3405 -1682
492 -1682 1758 823 1342 4393 1803 -2038 223 313 -4280 -3892 -958 -1605 1554 7340 4122 -1390 1082
509 1082 281 -7458 -6522 2128 3653 1577 3225 2510 -465 -215 -1920 -5082 -1313 2228 -2132 -2375
525 -2375 4508 4838 843 2250 832 -5756 -4914 -234 -2112 -921 7257 7100 -918 -2513 -1157 -3713
541 -3713 -3447 -535 -510 1697 5072 1044 -2366 3285 4083 -4052 -5126 -363 -2116 -2843 3609 5331
557 5331 2097 2932 1036 -6527 -6677 -429 194 98 4363 4296 739 1015 -485 -4518 -1324 2261 -3168
574 -3168 -4630 3140 4580 -65 2142 4061 -1925 -5082 -3116 -3852 -1806 5184 5744 1406 2129 1467
590 1467 -4457 -4715 -466 -1171 -974 3373 1985 -1522 2440 4192 -1986 -3490 -94 -2582 -4674 766
606 766 4123 3077 4424 3151 -3297 -4706 -1889 -3352 -2711 3583 4536 548 1385 1968 -2345 -2459 608
623 608 -1999 -3686 1015 2323 160 3046 4970 -8 -2902 -2045 -4279 -4425 1342 3666 1918 3555
639 3555 3407 -2185 -3758 -915 -1974 -2656 1517 2377 -62 1870 3563 12 -1372 -120 -2975 -4800
655 -4800 -816 1548 1014 3697 4910 246 -2584 -1701 -3194 -3702 510 2551 1204 2523 3111 -510
671 -510 -1693 -23 -1935 -3670 -865 697 -97 2355 4237 1462 -434 -289 -2983 -4674 -1231 1347
687 1347 1028 2783 3891 846 -1231 -934 -2552 -3374 -584 674 -203 1748 3586 1438 -42 328
703 328 -1712 -3691 -1999 -398 -63 2342 4036 1945 -5 -327 -2284 -3763 -1813 -53 302 2006
719 2006 3251 1595 410 410 -1412 -3082 -1868 -698 -565 1246 3125 2267 1058 517 -1581 -3292 -2355
736 -2355 -1080 -442 1558 3184 2271 1035 504 -1242 -2801 -2190 -1204 -691 899 2445 2160 1485 942
753 942 -833 -2554 -2352 -1631 -1053 725 2525 2534 1833 1011 -680 -2250 -2349 -1838 -1201 466 2131 2315 1805
772 1805 1129 -294 -1839 -2275 -2043 -1384 272 1808 2205 2080 1558 86 -1703 -2383 -2178 -1452 -132 1370
790 1370 2175 2246 1606 145 -1340 -2043 -2125 -1649 -387 1180 2134 2309 1804 525 -971 -1950 -2310 -1896 -686
809 -686 851 1908 2250 1865 833 -614 -1802 -2319 -1943 -841 590 1634 2212 2062 1038 -459 -1686
826 -1686 -2186 -2062 -1191 191 1481 2215 2091 1207 -87 -1294 -2070 -2205 -1345 39 1256 1993 2165 1489
844 1489 203 -1140 -2016 -2226 -1523 -245 957 1865 2256 1708 412 -894 -1769 -2213 -1722 -516 659
861 659 1694 2256 1774 528 -590 -1530 -2227 -1984 -770 458 1509 2266 1943 781 -311 -1344 -2270
878 -2270 -2064 -800 252 1227 2165 2035 910 -56 -1024 -2108 -2070 -1005 -133 869 2098 2170 1151 341
896 341 -714 -2199 -2314 -1094 -283 638 2054 2294 1143 309 -666 -2060 -2096 -1010 -558 162 1833 2227
914 2227 1205 708 -19 -1702 -2170 -1407 -1112 -134 2056 2533 1226 801 240 -1781 -2506 -1417 -735 144
932 144 1774 1893 895 1092 721 -1564 -2254 -989 -969 -935 980 2008 1605 1748 902 -1719 -2405 -1194 -1384
951 -1384 -1202 1439 2756 1521 898 390 -1368 -1656 -723 -1457 -1397 1289 2028 497 1069 1896 -134 -1754
969 -1754 -1554 -2054 -1641 1132 2012 1011 2025 2198 -1150 -2897 -1341 -978 -1108 839 1502 623 1553 1677
987 1677 -969 -1583 165 -1027 -2678 -517 1437 1212 2023 2295 -245 -1439 -842 -2469 -2978 779 2732
1004 2732 1017 998 1755 -305 -1503 -617 -1383 -1736 689 1055 -719 952 3128 990 -1042 -379 -1672
1021 -1672 -2787 -715 785 497 2590 3412 -126 -2244 -573 -1404 -2560 -18 1510 457 1016 1795
1037 1795 -301 -575 1169 -693 -3247 -1108 612 -487 1213 3117 1388 -366 -100 -2190 -3545
1052 -3545 -456 1625 198 1237 2818 419 -1356 -156 -693 -1839 -96 361 -1268 360 2773
1067 2773 1051 -31 1255 -473 -3216 -1907 -204 -483 1488 3668 1147 -737 22 -1221 -2854
1082 -2854 -665 1176 -283 417 1991 284 -386 1473 51 -2107 -986 -369 -1628 -37 2788 1849
1098 1849 670 1090 -837 -3282 -1624 82 -604 880 2829 948 -567 616 -241 -1979 -563 270
1114 270 -1414 -576 1716 1024 502 1910 525 -2244 -1727 -882 -1728 31 2767 1887 389 939 -335
1131 -335 -2461 -1153 15 -894 -14 1663 594 0 1386 813 -1336 -1005 -504 -1949 -897 1607 1496
1148 1496 1034 2024 557 -2006 -1664 -625 -1309 -293 1876 1230 358 1085 321 -1417 -684 -166 -1471
1165 -1471 -991 918 760 591 1831 1207 -855 -1038 -990 -2010 -1001 1258 1318 864 1603 797 -1181 -1091
1183 -1091 -571 -1254 -706 851 640 355 1454 1101 -480 -547 -529 -1734 -1441 256 678 834 1812 1306 -470
1202 -470 -852 -879 -1653 -1115 525 761 606 1415 1048 -331 -490 -442 -1367 -1274 32 228 413 1583 1556 120
1222 120 -176 -604 -1605 -1450 27 390 827 1390 1260 53 -341 -407 -1356 -1241 -265 239 397 1176 1289
1241 1289 436 42 -419 -1266 -1350 -580 -89 372 1314 1383 574 -15 -456 -1258 -1358 -603 -129 369 1145 1315
1261 1315 680 214 -253 -974 -1226 -797 -293 235 1043 1250 821 419 -183 -1080 -1333 -892 -414 158 921 1255
1281 1255 963 470 -118 -861 -1194 -927 -563 27 755 1144 970 570 -17 -741 -1130 -1041 -671 -53 724 1143
1301 1143 1087 722 172 -587 -1075 -1088 -728 -212 541 862 1091 837 152 -467 -1007 -1013 -838 -312 404 974 1083
1322 1083 857 316 -339 -866 -1098 -971 -442 251 791 1042 906 412 -210 -767 -1010 -937 -483 188 769 1027
1342 1027 944 599 -29 -731 -1000 -996 -613 -55 572 872 1044 680 -5 -632 -920 -873 -787 -102 541 926 1002 762
1364 762 207 -433 -895 -982 -835 -276 162 730 973 785 170 -349 -667 -936 -916 -319 437 826 918 993 210
1385 210 -267 -439 -1028 -994 -351 306 534 819 1034 527 -254 -567 -846 -864 -426 182 455 960 1118 469 -238
1406 -238 -364 -755 -1007 -772 -167 332 911 1222 478 -167 -142 -632 -1248 -724 184 429 604 890 581 86
1426 86 -114 -674 -1146 -600 -45 -35 424 1289 852 234 49 -612 -1240 -698 137 -89 318 1383 785 -246
1446 -246 -263 -391 -803 -707 -366 -199 492 1007 462 161 453 12 -1195 -908 -222 -327 140 1429 791 61
1466 61 564 -257 -1476 -900 22 126 154 766 695 513 515 -277 -930 -272 -96 -947 -406 1089 890 228 658
1487 658 232 -1059 -1051 -483 -633 -59 1167 907 96 392 41 -846 -650 -232 -590 128 757 112 -30 1044
1507 1044 534 -959 -686 -221 -1062 -997 795 975 595 826 171 -1177 -514 -51 -667 -43 700 580 -52
1526 -52 692 311 -696 -93 105 -855 -936 617 660 103 1124 933 -541 -795 -464 -964 -482 855 719
1545 719 213 780 417 -806 -477 169 -620 -567 516 217 -255 947 1042 -321 -288 -12 -1192 -1171 261
1564 261 506 334 1209 917 -573 -595 -224 -818 -666 678 482 -93 664 666 -307 -135 303 -798 -1141 -118
1584 -118 -17 -189 1035 1260 54 -212 -130 -1208 -1069 326 498 91 913 894 -465 -421 168 -627 -693 223
1604 223 49 -459 723 1040 156 208 367 -865 -1220 -355 -75 -141 1111 1339 -98 -264 -102 -866 -1006
1623 -1006 115 163 -118 561 803 -82 103 541 -318 -913 -155 -316 -582 585 1150 454 204 241 -825
1642 -825 -1217 -228 -27 -147 643 960 146 57 318 -482 -899 -78 -247 -459 172 759 247 495 312 -407
1662 -407 -1001 -532 -363 -469 552 1070 452 238 313 -492 -873 -273 -124 -367 320 679 156 230 554 -140
1682 -140 -693 -332 -469 -598 294 823 603 464 702 -136 -819 -344 -460 -376 267 556 318 271 406 -171 -546
1703 -546 -313 -298 -488 42 494 320 486 598 11 -554 -428 -492 -630 -11 549 420 420 453 -28 -519 -335 -423
1725 -423 -316 53 345 450 395 545 25 -248 -302 -481 -662 -347 259 415 457 337 123 -390 -342 -403 -534 -150
1747 -150 300 285 371 494 129 -225 -302 -433 -542 -261 121 220 379 556 257 -105 -196 -422 -512 -251 135 281
1769 281 444 519 282 -89 -209 -438 -537 -302 -177 287 401 464 314 16 -142 -335 -503 -326 -76 168 292
1790 292 528 220 98 -160 -356 -437 -489 -163 145 239 351 377 121 -18 -221 -444 -363 -181 42 288 412 312
1812 312 161 -92 -305 -416 -395 -204 35 259 414 417 157 27 -215 -305 -234 -193 10 -88 329 354 269 15 -161
1835 -161 -314 -294 -345 -205 176 383 423 277 143 -108 -305 -403 -293 -116 53 277 363 265 148 -74 -299 -394
1857 -394 -258 -146 54 259 428 390 212 -24 -225 -322 -326 -245 -43 223 317 297 233 15 -122 -328 -323 -270 -42 253
1881 253 347 299 267 134 -163 -383 -374 -239 -68 123 217 293 348 135 -173 -281 -215 -249 -205 131 325 324 329 197 -99
1906 -99 -279 -283 -330 -240 71 255 285 255 145 -84 -137 -254 -429 -229 174 209 126 348 392 -49 -288 -261 -344 -308 -32
1931 -32 169 234 395 295 -45 -189 -197 -324 -236 59 124 135 401 348 -76 -91 -28 -340 -532 -110 196 175 298 370
1955 370 118 -65 -193 -446 -356 73 130 75 322 347 -47 -124 -22 -346 -416 -17 48 -119 294 509 150 -49
1977 -49 -33 -294 -431 -141 15 71 432 421 -22 -102 11 -331 -438 -16 95 -86 233 403 84 63 154 -213
1999 -213 -510 -211 -66 -102 284 491 170 18 -26 -435 -499 -55 41 -76 283 468 4 -65 153 -138 -366 -82
2021 -82 -86 -260 127 411 158 169 241 -235 -535 -217 -119 -164 405 559 139 16 130 -215 -479 -12 35 -214 39
2044 39 215 -135 71 348 -81 -333 -209 -22 -450 146 479 233 198 295 -217 -510 -167 -16 -197 180 428
2065 428 52 -46 239 -79 -229 18 -34 -450 16 306 79 102 345 155 -429 -381 -201 -459 102 460 171
2086 171 98 190 -113 -424 -57 -18 -221 30 283 -2 46 364 111 -209 -75 -171 -438 -100 286 167 227 406
2108 406 8 -355 -144 -127 -293 61 352 84 10 271 15 -229 -11 -42 -347 -179 150 -8 126 424 195
2129 195 -196 -121 -177 -424 -103 276 145 115 280 20 -279 -106 -82 -287 -56 151 -30 38 303 151 -58 56
2151 56 -60 -410 -222 121 58 108 382 204 -160 -125 -151 -354 -109 150 42 46 270 97 -116 17 -41 -305 -190
2174 -190 28 -50 16 314 202 -20 -7 -81 -363 -221 44 73 69 361 96 38 67 -113 -365 -121 133 0 22
2197 22 224 218 -74 65 -62 -252 -260 -51 -69 56 279 218 41 46 -48 -241 -177 34 -217 179 317 263 2 103
2221 103 -3 -209 -180 -130 -83 -29 265 82 203 113 -31 -71 -219 -105 -139 170 206 238 199 108 -37 -217 -95 -84
2245 -84 -81 -34 152 185 119 109 8 -156 -175 -157 -112 -49 128 148 108 73 13 -145 -175 -90 -81 -27 118 148 126 124 31 -87
2273 -87 -144 -138 -133 -57 85 175 155 129 31 -71 -135 -149 -117 -48 76 149 151 129 70 -80 -144 -155 -160 -113 16 126 104 124 88
2302 88 -45 -101 -138 -153 -77 -3 112 163 154 81 -25 -82 -132 -139 -114 30 119 123 155 91 -10 -82 -122 -129 -107 -10 57 113 129 64
2332 64 29 -96 -141 -170 -151 -65 81 89 117 94 31 -68 -117 -149 -140 -14 69 119 121 127 64 -36 -105 -132 -113 -37 52 78 139 171
2362 171 35 -48 -73 -117 -116 -52 43 75 150 156 73 -29 -74 -121 -172 -73 7 68 126 140 34 -2 -69 -173 -185 -101 -7 49 105
2391 105 152 92 5 -74 -122 -146 -78 -36 33 156 180 77 16 -22 -102 -149 -105 -31 17 110 162 84 18 -19 -70 -158 -127 -52 -7
2420 -7 102 118 83 51 -17 -151 -185 -97 -52 -19 67 159 102 35 27 -66 -149 -96 -45 -56 57 182 123 64 61 -76 -129 -96 -91 -79
2450 -79 122 141 46 46 -4 -116 -175 -105 -46 -72 18 124 96 52 93 -41 -168 -88 -90 -93 38 149 110 85 98 -56 -174
2477 -174 -84 -45 -64 53 150 92 56 121 14 -128 -33 -47 -114 10 120 84 104 163 24 -126 -96 -102 -143 31 165 113
2503 113 73 96 -18 -162 -74 -63 -112 -38 87 56 72 137 28 -103 -46 -71 -174 -61 110 73 99 163 31 -117 -70
2528 -70 -91 -139 -8 163 46 82 131 55 -86 -4 -62 -180 -67 32 18 46 184 59 -98 -82 -96 -209 -97 95
2552 95 56 77 166 24 -135 -24 -51 -181 -62 43 -29 9 172 108 -43 19 -58 -202 -101 66 22 88 227 115
2576 115 -50 -22 -67 -163 -71 83 36 33 137 65 -120 -56 84 -210 -89 -12 -53 87 169 124 249 -62 -28 -99 -109
2601 -109 47 15 16 164 90 -59 4 -28 -141 -25 39 -7 -13 150 120 11 82 0 -141 -143 -17 -79 21 182 127 33
2627 33 31 -68 -176 -107 15 -69 -9 126 91 -43 67 22 -131 -147 -58 -128 -8 129 130 50 100 6 -117 -128 -43 -36 -16
2654 -16 152 152 30 49 15 -121 -69 -15 -38 -53 88 104 40 96 54 -114 -123 -52 -65 -29 120 123 59 65 43 -128 -114 -66 -78
2683 -78 -40 77 99 27 89 64 -87 -92 -30 -87 -80 81 94 85 110 61 -60 -106 -48 -108 -33 87 108 62 79 51 -56 -90 -41
2712 -41 -92 -85 12 60 34 88 81 -45 -102 -68 -125 -81 8 67 60 68 88 -55 -89 -51 -123 -45 7 66 62 129 72 -6 -61 -50 -96 -104
2744 -104 -16 51 72 110 92 -1 -56 -52 -111 -91 -25 43 61 94 95 -15 -47 -80 -118 -76 -45 28 41 93 101 0 -14 -61 -92 -120
2774 -120 -50 5 49 77 99 67 -13 -35 -94 -111 -56 22 46 81 82 53 -6 -50 -93 -100 -42 -6 21 102 109 36 -5 -19 -86 -126 -84
2805 -84 -13 12 48 93 63 13 -40 -111 -108 -51 -26 19 77 102 70 70 -6 -79 -98 -75 61 144 73 94 118 40 8 -84 -68 -94 -61
2836 -61 -17 27 81 96 53 7 -45 -110 -122 -108 -18 45 108 101 53 -27 -70 -131 -89 -53 -23 56 89 102 90 23 -14 -93 -79 -71 -36
2867 -36 64 102 104 71 59 -21 -89 -95 -87 -67 24 83 97 74 21 -57 -97 -105 -105 -74 1 41 69 81 33 -25 -59 -92 -108 -86 18 48
2899 48 104 97 89 -10 -25 -83 -96 -59 9 63 87 108 94 26 -21 -88 -78 -88 -5 36 109 -12 119 -102 -101 -57 -157 29 20 -120
2929 -120 -23 145 53 25 -59 -93 -145 -107 -54 54 42 115 86 41 -40 -69 -74 -91 -36 42 27 102 107 67 -15 -32 -83 -83 -50 27
2959 27 29 91 115 47 -18 -39 -101 -135 -60 7 16 86 82 47 0 -15 -100 -19 -85 -15 82 60 133 89 54 -6 -25 -99 -71 70 -51
2990 -51 22 139 126 106 -52 -70 -256 5 5 -39 39 114 67 2 3 -26 -127 -107 -57 -26 31 124 96 30 15 -62 -113 -97 -46
3019 -46 -6 19 109 46 48 16 -37 -129 -83 -43 -37 -19 124 116 43 95 13 -150 -108 -1 -206 -47 224 116 148 -80 -71 -55
3047 -55 97 -145 -92 -114 174 219 30 170 69 -139 -68 -81 -178 -24 97 100 21 111 -12 -80 -81 -61 -91 -3 110 82
3073 82 50 91 34 -77 -54 -21 -82 -67 40 67 58 90 55 -64 -76 -76 -93 -41 89 58 45 53 48 -78 -95 -4 -107 -60 38
3102 38 -130 -84 159 212 25 -144 -73 -139 -56 96 88 102 132 73 -72 -48 -22 -99 -74 48 68 25 105 81 -35 -46 8
3129 8 -25 -164 14 71 53 232 44 52 -44 -97 -79 -156 19 -15 64 41 89 6 94 -11 -80 -140 171 -20 298 194
3155 194 85 158 -48 -3 -137 -118 -20 -10 8 125 95 68 -20 -8 -112 -82 -17 -12 2 99 80 -4 32 -8 -107 -116 -82 -38
3183 -38 31 82 100 34 7 6 -108 -120 -39 -25 2 74 100 56 24 -3 -72 -88 -25 -26 -25 60 107 36 35 40 -69 -108 -81 -52 -40 58
3215 58 113 64 17 -24 -68 -121 -67 -56 -39 36 83 53 50 9 -36 -100 -70 -62 -30 44 78 70 48 39 -40 -108 -70 -86 -24 70 94 101 79
3248 79 72 -15 -80 -59 -38 -47 13 83 69 51 53 -20 -60 -105 -86 -60 21 61 69 68 54 0 -93 -71 -82 -57 -14 55 50 78 6 24 -36
3281 -36 -80 -67 -50 -3 40 68 125 59 55 -92 -23 -126 -23 -3 -82 49 94 154 77 53 -68 -69 -57 -14 62 20 10 157
3309 157 -12 67 -63 -180 -38 8 18 91 107 91 56 2 -79 -45 -57 -35 3 60 69 105 50 0 -52 -48 -61 -61 4 63 59 95
3339 95 50 9 -48 -77 -84 -68 2 43 47 57 64 21 -48 -73 -76 -75 -36 7 67 98 66 23 -15 -41 -82 -82 -54 20 62 81 68 24 106
3372 106 -152 -228 -228 -109 -136 -9 64 31 -26 91 -125 -85 -74 45 39 120 126 85 100 21 -60 -67 -104 -81 -6 38 103 80 61
3401 61 24 -19 -96 -94 -78 -29 34 73 62 86 40 2 -62 -85 -65 -30 31 69 92 98 51 13 -58 -56 -79 -43 -6 33 42 70 42 -39
3433 -39 -114 -84 -77 -48 -48 -46 99 -98 57 42 -101 -63 -48 34 17 7 229 -76 184 -106 99 -42 -80 -146 -132 -21
3459 -21 99 27 88 82 -45 -14 -83 -85 -69 31 25 64 72 50 -22 -55 -77 -131 -41 3 46 38 51 33 -57 -109 -268 -338 27 -3
3489 -3 86 108 56 55 -13 31 4 -71 -28 11 51 68 100 69 24 92 -11 -201 -140 -34 68 -27 91 47 19 -37 -26 -174
3517 -174 -62 -75 49 69 148 115 105 50 26 -129 -11 78 207 115 106 186 -80 -37 -65 -36 -50 19 -25 9 96 94 20 26
3545 26 1 -63 -83 -20 -25 9 76 94 31 53 -131 -101 -112 -180 -138 51 21 45 1 -60 -37 -103 -120 12 -46 22 188 54
3573 54 -132 11 -59 -6 -86 -24 6 -22 132 100 101 149 36 -134 -152 -14 -30 3 -11 -20 133 -17 -16 12 -137 -49 9
3600 9 -225 133 55 61 0 -37 -110 -110 -174 -49 -76 -9 34 88 32 121 -1 -18 102 -115 -89 52 108 -50 124 82 43
3627 43 19 17 -42 2 20 76 92 79 47 -49 -43 -4 26 20 -80 118 77 -13 85 -50 2 -57 -62 -92 24 56 57 82 64 -29 -40
3658 -40 -78 -15 -89 12 85 53 46 86 19 -26 20 -57 -47 -13 30 25 64 87 2 -12 -39 -72 -89 106 -23 97 100 -40 22
3687 22 -66 -80 -101 -52 -31 47 53 -12 95 27 -62 -16 -28 -80 -65 -72 11 38 75 -10 29 -51 1 -76 -80 -8 87 18 160 -27
3717 -27 -27 5 -41 -40 -36 118 -40 25 78 54 18 1 -72 -92 -77 -37 -13 32 40 65 24 16 -32 -62 -56 -151 10 39 104 162 -3
3748 -3 128 44 4 -16 -124 -49 35 149 98 -39 108 24 15 -149 -41 -3 -34 91 51 -5 42 19 -57 -35 3 -15 8
3775 8 -64 36 83 -82 -99 -107 -133 -111 -13 58 100 220 15 55 29 -33 -93 -57 -30 21 45 63 91 53 9 -47 -45 -59 -49 -24
3805 -24 15 54 54 34 43 49 -114 -39 -76 -22 -11 79 11 137 -74 -20 -123 -205 -32 -69 41 170 130 6 90 217 -79
3832 -79 -152 7 147 -26 109 123 33 -6 -155 141 172 -107 -269 -88 -123 37 -22 55 -76 45 -88 -67 -168
3855 -168 52 5 49 -9 -31 44 -34 -48 -88 -37 -56 42 13 182 36 -66 -115 -54 -1 -206 -125 37 -30 91 -20 17
3881 17 -59 -124 -105 33 -71 -14 0 0 126 30 13 -52 -25 -179 -40 34 67 15 101 -65 1 65 -199 -54 -95 30
3907 30 90 -51 166 58 -177 -42 -191 -20 74 -10 114 126 -27 127 -62 -44 -67 -13 -13 21 -87 86 45 26
3931 26 45 -34 -60 -45 -77 -39 6 32 29 19 0 -37 -35 -52 -56 -42 -18 40 67 66 21 3 -11 -70 -61 -175 10 137 34 40 146
3962 146 -184 105 -31 -78 -3 -244 -50 47 78 -59 78 42 -117 52 44 -18 -77 23 196 115 -33 -110 -38 -71
3986 -71 -31 -32 -80 159 112 -25 90 -49 139 -15 -64 -72 -26 39 28 -50 -1 -58 -94 -33 -133 37 -2 50 45 58 23 22
4014 22 -63 -35 -49 -52 23 31 23 47 48 0 -52 -41 -64 -57 13 -3 56 35 50 16 7 -125 13 -55 7 10 27 142 61 47 -59 1
4046 1 -77 -35 1 19 -6 67 67 14 -32 -29 -104 -140 59 -16 10 50 67 12 -22 -31 -31 -80 -11 -4 19 31 50 5 -20 3 -43 -39 -20
4079 -20 47 26 53 90 38 1 7 -66 -58 -27 17 8 29 57 20 -19 -12 -23 -28 -29 -11 -7 18 54 21 20 9 -34 -58 -64 -28 -27 6 45 28
4114 28 -2 24 -48 -66 -74 -13 -13 9 82 32 15 -4 9 -40 -56 -18 -40 34 71 23 29 20 -7 -45 -26 -26 -22 12 53 63 12 0 -18
4147 -18 -55 -44 -43 -29 -20 40 -2 17 0 -6 -51 -55 -48 -14 -12 56 54 16 34 14 -9 -32 -18 -13 17 31 38 46 9 18 -70 -11 -40 -19 12 40
4183 40 42 9 53 -8 -41 -56 -8 -49 -51 -4 41 8 19 9 -46 -59 -8 -49 -37 30 14 35 41 18 -7 -39 -5 -47 -30 32 26 44
4215 44 68 37 -28 -22 -47 -28 -20 37 46 37 28 30 -18 -32 -36 -46 -34 -10 -7 -16 24 4 -25 -75 -19 -71 -44 7 -1 43 35 -11 -20 -8 -22 -36
4251 -36 -49 -13 19 19 61 34 12 7 2 -10 -38 -16 26 15 28 58 -21 -24 -27 -25 -65 -27 -11 -3 43 1 10 -13 -32 -35 -38 -21 -13 3 27 29
4287 29 27 -16 -9 -34 -25 -8 5 -8 36 28 33 12 -2 -20 -45 -6 -19 47 38 37 41 11 0 -43 -53 -49 -36 13 16 28 3 -4 -6 -85 -47 -19
4323 -19 -36 1 35 40 30 1 -4 -56 -52 -44 -26 2 22 58 35 20 7 -17 -47 -23 2 -8 36 50 45 20 11 -58 -16 -23 -45 -5 23 -3
4357 -3 44 12 29 -38 -56 -42 -80 -17 -11 27 28 28 30 -24 -24 -28 -63 -12 -12 36 39 77 35 -13 -15 -42 -23 -16 15 34 43 47 28 -8 -7 -29 -27 10
4395 10 -30 22 26 -6 22 -12 -50 -43 -3 -31 -23 17 20 16 -4 22 -1 -30 -38 -20 -10 30 5 27 38 10 0 16 10 -9 9 18 24 23 27 33
4431 33 6 -23 -39 -56 -16 3 27 20 35 -26 -12 -39 -51 -64 -41 1 27 36 60 4 0 -23 -59 -24 -24 -6 8 30 44 41 18 -1 -33
4464 -33 -15 -18 1 9 8 20 15 -4 6 -9 -26 -19 -7 17 11 43 63 -5 -4 -47 -41 -20 -11 -12 30 54 4 -5 -15 -16 -44 -34 -15 6 38 35 41
4501 41 -4 7 5 -39 -11 -29 7 29 49 15 19 18 -12 -21 -3 -6 3 12 18 6 12 28 9 -36 -35 -26 -32 -16 3 6 10 -5 -21 -42 -33 -28 3 -13
4539 -13 36 24 30 26 31 -18 -16 15 15 14 31 54 18 44 5 -14 -33 -15 -29 13 -5 40 8 16 5 -28 -40 0 -44 -20 5 -23 18 39
4573 39 7 -46 5 -38 -49 -2 9 8 32 15 20 -32 -18 -14 -12 -36 40 -4 16 50 20 -15 -12 -14 -22 -5 26 30 -17 43 21 -12 -14 -19 -28 -47
4609 -47 -15 18 -18 26 10 -14 -41 -32 -45 -30 37 -4 22 27 13 17 -44 -10 -25 -33 18 -16 43 46 25 11 -11 -1 -3 1 34 -15 -41 30
4643 30 -101 2 -59 -84 -27 -64 9 59 133 89 -32 17 -6 -57 -6 -8 -146 45 27 -29 -12 37 -40 -59 -79 -7 7 -57
4671 -57 68 23 9 62 1 -75 -36 -28 114 18 -13 -68 99 25 -7 -98 -4 57 -89 22 -52 98 -13 13 19 -31 -34 -19
4699 -19 -18 -51 -12 3 21 7 2 -1 -22 -26 -33 4 -33 12 45 22 -9 -17 -33 -10 -27 9 7 28 58 27 48 -13 -6 -18 -11 -11 -21 26 23 29
4735 29 23 12 -13 -106 -37 -38 -27 -1 -2 13 -17 4 -25 -18 -47 -25 -1 3 25 19 14 28 22 -31 -93 -21 -12 -1 4 -26 57 -82 14 -99
4769 -99 42 65 -6 -65 46 1 -14 -36 8 -26 -29 -30 -1 -4 -35 10 -7 -30 17 -18 -34 -10 -31 -14 45 9 -6 19 55 -11 4
4800 4 -22 -7 19 6 20 8 19 9 -18 -19 -11 -30 62 45 26 13 14 48 58 45 -115 -73 -45 -49 -34 104 -63 28 58 7 24
4831 24 4 -23 -52 -18 19 47 12 -20 -1 -25 -22 1 -3 29 21 2 8 17 3 -18 -3 20 4 10 31 25 -4 -7 -23 -15 -29 -22 -40 -14 14
4866 14 6 -9 23 -17 -53 -26 -23 2 -25 14 14 32 28 -4 -18 -10 -36 -5 20 35 17 -28 52 72 64 -98 56 -14 -66 124 57 17
4898 17 29 -10 -59 -4 2 -11 -33 11 2 34 -136 -141 -94 -39 1 -46 54 64 -48 65 -59 6 144 94 -12 -69 -120 137
4926 137 -103 -1 -36 -16 -34 52 90 10 112 -22 -44 -54 32 -69 32 -99 -10 -45 -25 -31 -8 9 -12 -18 -29 -60 -12
4953 -12 -29 -28 -13 -2 8 -3 21 -16 -19 -29 -31 -5 0 2 2 -4 64 -27 -6 1 10 38 83 88 -55 8 -8 -13 -11 -5 -7 -29 -15 -19 -24 3 -14 10
4991 10 -51 -31 -12 11 -28 4 -4 -13 4 -15 -6 -17 -12 -37 -8 9 29 41 42 17 2 -17 -32 -29 11 16 16 18 37 42 44 15 2 -18 -28 -1
5027 -1 4 7 26 13 -5 -25 -26 -35 -41 -3 -31 -1 -10 22 -14 8 6 -34 -32 -1 5 -16 -2 16 -4 23 25 -15 -32 14 12 44 -20 49 -7 21
5063 21 -24 -8 -3 -13 4 33 9 13 -3 14 -12 -21 -28 4 -12 -4 0 -4 15 -21 -4 -12 -46 -41 6 -23 33 16 19 -13 26 -5 -40 -12 -11 22
5099 22 7 16 11 -1 19 -39 -3 -36 -33 1 -6 20 -13 29 11 -12 -41 -28 -12 -27 14 29 -2 -15 -33 -35 0 -13 -35 -1 -16 23 14
5132 14 30 13 -22 -28 -33 -31 17 -41 58 -58 44 -4 89 20 -8 73 -22 39 -130 -89 -173 -55 -96 -75 18 -107 -66 -97 -85
5161 -85 -63 -77 73 -44 2 -34 -35 -34 9 -30 44 14 8 -19 -9 -8 -40 -101 -14 -119 90 92 -57 -51 -78 85 -119 -151 146
5190 146 -97 -135 -104 71 -97 26 -46 -82 -120 -21 19 3 11 20 -60 -101 -32 -49 -33 -18 6 20 28 -3 6 -11 -24 -22 -15 10 -1
5221 -1 6 57 25 40 24 20 -6 9 -12 -13 6 24 26 30 25 7 -47 -33 10 -15 -10 -29 14 -25 -13 5 -41 -63 -3 -22 30 1 37 13
5255 13 23 21 -22 21 -35 -17 24 0 13 21 15 20 -11 1 -10 23 4 43 12 22 33 3 63 -48 -78 -100 52 41 4 -10 -118
5286 -118 -113 -61 -62 7 -52 146 -106 74 37 -81 -144 92 -15 -34 31 -54 25 24 9 2 30 -22 -28 -52 40 -15 -22 41 30 33
5316 33 -39 88 38 24 -33 28 -8 20 55 17 -5 -22 8 3 30 -4 -31 -70 -101 8 118 -69 10 58 -58 25 21 100 14
5345 14 -7 -140 59 12 -33 -4 138 -37 -7 -53 -101 111 -106 -101 127 77 106 -7 47 156 41 -92 -39 -58 -21
5370 -21 18 -39 -144 -22 -148 54 107 91 -27 -54 -12 -15 49 -3 -30 -30 -51 4 54 -60 40 -5 71 160 -45 11 -25
5397 -25 -81 60 34 -62 132 16 46 45 45 40 -50 -59 20 -50 -25 23 -8 2 7 13 -22 5 -11 -28 -11 -14 -14 -15 -9 0 19 23 3 -10 1
5432 1 -2 11 16 13 37 31 27 15 -3 -7 11 -9 4 24 14 18 6 -6 -12 -18 -30 -18 -15 -38 5 4 9 10 8 -20 -29 -31 19 -9 -4 18 6 -3 -16 -24
5472 -24 5 13 3 15 -1 28 25 9 -26 5 14 21 -6 -6 -6 -14 24 6 25 -5 -31 -7 -10 7 -18 16 -12 17 7 -23 -31 -13 -6 -1 11 -21
5508 -21 22 12 11 11 -16 -15 -5 -3 38 6 32 36 10 -14 -11 -4 -10 -12 4 26 12 8 10 -40 -22 -2 -22 -12 -36 4 4 -18 14 -43 -15 1
5544 1 -43 -45 3 28 17 4 -4 5 -6 -37 -7 -16 13 54 34 28 25 9 -8 18 -11 -8 9 32 22 34 20 14 -12 -10 8 -22 -10 30 -2
5579 -2 17 19 -14 -1 -24 -5 -16 -13 -15 25 22 -2 -44 1 -21 -13 -11 27 -14 4 14 12 26 10 -3 -16 -9 0 -10 39 37 -1 26 -2 11 -7
5615 -7 -3 -5 -24 13 2 -3 -3 -20 5 -20 -33 -7 -11 8 16 11 22 -13 -10 -26 -16 -6 -9 12 44 -17 21 8 -18 -3 20 0 -13 21 13 1
5651 1 16 34 21 10 -7 -6 -4 -5 6 45 5 3 35 -7 -51 -10 -6 -20 -11 -3 -2 -13 10 -10 12 -17 -13 1 20 -2 22 44 5 27 4
5686 4 -17 23 0 38 1 34 4 -9 8 -11 -24 -11 -17 25 -28 0 23 -16 18 -14 -42 -46 -25 -12 10 18 5 12 9 2 -31 -44 -17 -6
5720 -6 1 10 -6 2 -3 -4 7 -7 -6 9 20 11 5 43 18 1 -14 14 -8 -19 -14 23 -12 18 7 -36 -25 -45 0 -18 -38 -12 3 26 -29
5755 -29 -11 -15 -4 -11 -18 0 5 9 -6 2 32 7 0 -24 -16 31 6 20 7 20 26 11 3 10 -18 -14 12 17 48 28 -1 -17 -12 -6 29 7 9 3 -15
5794 -15 30 -33 4 -30 -8 -3 -3 -23 13 7 5 11 13 14 -29 15 18 33 16 14 37 15 8 17 -19 2 -23 21 45 11 32 24 9 5 -22 -22 21
5831 21 -33 -22 27 -24 -8 19 -22 -14 -30 -36 -5 -12 14 21 9 18 4 26 4 10 -10 9 17 11 15 41 27 -4 -21 -1 -17 -19 10 12 9 -2
5867 -2 -32 8 -27 -16 -30 -8 -10 5 22 -20 -11 -31 -17 -43 -21 -23 16 -1 2 -20 4 -2 -16 -33 -20 4 22 -19 20 1 9 7 -24 -4
5901 -4 -12 14 3 24 23 21 7 -9 -1 6 -20 -2 9 15 -4 0 -9 -12 -11 -7 -24 -23 -10 16 -6 4 2 1 3 -33 -22 12 13 -10 11 38 38 -19 8
5940 8 -1 0 -10 -12 16 17 30 15 -20 -16 -16 -12 -14 11 -2 14 -15 -4 7 5 -29 -35 -34 -2 -4 -8 -9 -10 -13 4 -28 -15 -13 0 18 15 20 7 4 -18 21
5981 21 -10 -11 -3 0 1 1 27 7 33 -15 -3 -23 5 14 18 11 7 20 -16 -7 12 -45 -25 0 -27 6 8 11 -16 -24 -10 -13 -17 -1 2 25 -13 6
6019 6 15 -8 -31 -17 1 7 19 10 29 13 31 -12 -15 -20 0 23 -1 3 3 10 -10 13 -11 2 -5 1 -10 -27 -7 -29 14 0 6 -18 3 -20
6055 -20 -22 33 18 -12 22 12 -6 -18 -8 -6 -1 32 10 16 7 15 -7 -26 6 -8 -14 5 26 16 8 13 16 -21 -16 -3 -30 -42 -15 -6 -9 4 -10
6092 -10 -17 -12 -1 -35 29 46 -4 4 -7 -5 -13 20 -13 -5 -6 6 7 17 13 20 4 -3 -1 1 6 0 -1 12 27 -5 -1 -4 -13 -11 -4 -6 11 11 19 4 -5 -23 -43
6135 -43 -25 -13 0 -6 15 18 22 -14 -2 -5 10 -13 26 37 31 15 -15 22 8 -27 -4 -10 18 25 16 17 29 8 4 -6 -3 -29 2 7 3 11 12 10
6173 10 -41 -37 -20 -41 -1 7 1 16 3 0 1 -10 -25 -16 28 -4 -20 28 34 -11 21 11 -26 13 -1 12 26 23 20 5 5 10 -14 3 -38 -6
6209 -6 -7 -4 -17 9 -5 5 -41 -9 -15 4 0 -3 30 26 21 -28 1 7 4 -9 8 21 34 15 36 17 -4 -20 40 -6 36 57 -7 15 -8
6244 -8 6 -15 19 -1 -33 20 9 -8 11 -38 27 7 -10 24 -23 14 11 -9 28 6 -25 0 -36 -13 -4 -6 1 30 21 30 26 26 17 -23 23
6279 23 16 -6 44 10 13 17 9 2 -16 32 -25 -18 -3 -25 -4 -29 11 6 -14 -21 -34 -5 0 33 -22 -4 0 -24 -23 -25 -11 41 17 2 -6 13 -2
6316 -2 -13 -12 -32 -9 -3 37 8 11 8 30 -9 17 -30 -28 10 -7 36 3 5 -2 -27 -7 -1 -5 -22 -30 -10 15 5 16 19 -24 -15 0 15 -39 16
6353 16 -3 21 23 21 -1 8 14 20 4 29 13 26 -1 6 3 1 4 -3 27 -5 0 17 -8 -9 0 3 -27 -11 -41 -9 -10 -18 -7 3 -3 -21 -9 -34 -11
6392 -11 2 29 10 8 6 -8 -28 -14 -11 7 5 21 16 34 46 -19 20 -7 -1 2 -4 29 22 -2 1 -31 -10 -30 -1 -56 -3 9 6 -35 3 1
6428 1 -33 -24 -28 -12 -2 21 4 9 15 -10 14 8 -32 7 17 13 18 25 18 3 -12 0 -21 16 16 -16 2 11 2 24 -15 -2 -20 -29 -22 -27 6 -16
6466 -16 4 -37 -23 0 -28 -14 -9 -15 0 1 -5 22 9 2 -3 13 -12 -4 22 16 49 25 27 18 -37 -12 -20 36 26 44 36 14 -6 -3 10 -18 -21
6503 -21 13 -4 14 0 -14 -12 -13 30 -26 -28 -25 6 -3 6 11 -20 -3 -8 -6 -13 16 1 25 25 12 42 47 36 -21 -24 -1 -13 8 20 28 31 22 7
6541 7 -20 -16 -25 -16 -2 1 8 -13 -26 -50 -20 -7 -28 4 -13 20 10 1 -17 -21 -38 -22 16 10 12 21 15 23 29 -17 -11 14 -13 9 21 31 21 -11
6579 -11 17 29 10 15 0 -8 14 15 0 7 4 -10 -2 -50 -15 -20 -21 -28 -6 -7 7 16 -4 -8 -6 3 3 1 5 -7 15 23 22 -44 13 0 15 19 7 40
6619 40 -12 9 17 -4 -26 4 0 8 6 19 -21 -18 11 -30 -28 -28 -38 -27 -3 -19 10 4 3 -11 -6 7 -17 -28 -16 1 14 23 8 -7 -18 3
6655 3 -12 -1 -12 -3 22 30 44 -7 3 -31 17 -2 -2 22 7 10 -7 -4 -23 -8 5 23 -30 -8 -22 -14 -3 -10 -14 -18 -22 5 1 -12 -2 17
6691 17 12 11 -5 11 25 -16 2 29 2 13 10 25 10 -27 -1 20 -15 10 -6 -7 8 19 9 -14 -4 19 -7 9 -13 -5 -3 -1 8 -12
6725 -12 4 -2 7 -12 -17 3 9 13 -19 -19 9 2 10 5 -4 -4 26 37 -16 3 -9 18 8 16 18 9 30 -3 18 -30 7 -3 1 -26 8 -19 16 16
6763 16 -38 19 -13 -15 -25 -10 -23 5 -8 -2 13 -7 -27 -13 11 11 11 10 12 29 13 2 29 23 17 -18 19 35 -5 -5 8 -10 29 -13 -11
6798 -11 -14 -6 -20 1 32 17 -2 -14 -34 0 -16 -29 10 6 -3 -15 31 -2 -17 -12 26 -7 18 5 12 -15 20 48 -2 10 7 -10 -14 15
6832 15 9 5 1 -4 3 4 -26 -6 -22 0 5 -22 13 -14 -35 -20 -12 -12 -22 -21 7 4 -12 1 -9 54 -7 -11 26 6 21 8 14 13 -6 -19 -7
6869 -7 -1 -1 5 26 13 13 0 12 3 -12 -13 8 4 0 -3 13 8 -16 -32 -13 -50 0 -6 0 28 -4 12 -8 5 1 -3 2 0 9 -21 2 1 17 7 7
6909 7 16 -2 15 26 21 12 25 11 20 -7 -17 10 11 -14 4 8 10 -44 -37 8 -21 -19 -28 -31 8 -8 -10 7 -10 -5 -16 -31 -13 10 -5 17 20 22
6947 22 15 16 6 21 -5 10 2 26 24 9 25 4 9 -19 3 -14 -9 12 12 23 7 -25 -21 -3 -23 -1 -19 5 -13 4 -14 31 -3 -1 -27
6982 -27 -20 2 -9 24 8 -6 -13 7 -5 1 -11 14 16 40 0 34 9 9 15 3 -7 8 2 25 -9 -11 33 0 -25 -1 -5 -17 3 2 -15
7017 -15 3 2 3 -18 -18 -1 -26 -17 -14 -11 6 10 -5 2 8 3 -34 19 29 5 29 -8 1 -10 -10 -10 16 14 13 24 27 23 6 14 4 6 14 0 -4 -8 1 6
7059 6 7 -5 -24 -24 -11 -15 -25 16 21 10 26 7 -3 6 -2 13 -20 30 29 35 6 15 3 7 -4 -26 16 6 13 14 15 -1 -1 -20 -9 -18 3 -16
7097 -16 1 -19 1 -13 -39 -27 -17 -21 -17 3 0 3 9 -14 0 2 -14 2 -11 7 27 19 6 31 -4 19 -4 25 26 6 10 0 -15 9 2
7132 2 -16 4 -6 11 -2 1 2 -12 1 -5 -5 -22 -16 -3 -3 -4 12 -44 6 -26 2 -1 -22 -6 -8 -19 2 58 -16 34 5 -16 11 -13 -15 8
7168 8 15 6 2 0 15 -13 -18 -27 -44 -16 -13 28 -11 -22 -23 -15 -23 -37 -12 19 -12 -27 4 28 3 9 7 -12 10 -2 0 26 -8 47 27 -2 8
7205 8 23 17 18 5 25 -10 15 40 9 17 5 -29 -9 13 -1 5 -8 17 -7 7 -11 -17 9 -8 -15 -20 -18 0 -23 -6 -24 -13 -2 2 0 -1
7241 -1 29 22 6 3 3 -3 10 -2 4 -5 -4 12 40 22 -11 -5 2 -12 13 13 29 18 -15 -11 -18 -46 -30 -21 -21 6 -11 12 -25 -20 -10 -7 7 -3 3
7280 3 -7 2 46 11 8 16 22 14 -13 4 -11 11 17 23 -6 -4 6 -22 1 -27 0 14 1 1 -5 6 1 -33 -36 -9 -5 -9 -4 -6 3 -13 -13 -8 -38 -5
7320 -5 9 1 20 -5 10 21 -12 5 0 -21 4 33 -3 5 11 21 10 16 8 5 -17 12 9 -2 2 11 -5 -3 -16 -1 14 -5 -12 0 -1 0 -8 -17 -11
7359 -11 -31 -2 -7 -6 9 3 -16 9 9 -2 -8 10 -14 12 17 20 28 6 19 14 -5 -6 23 13 38 18 -4 27 15 -13 -6 -7 -24 -32 -16 10 -40
7396 -40 -13 -1 -11 -5 -27 -15 8 -15 -4 3 12 -39 2 4 -24 1 22 -1 15 18 19 12 11 -31 0 6 9 24 -1 3 -3 18 5 -10 -11 -6 -16
7433 -16 11 -19 -7 -7 -7 -22 -9 -24 0 -20 -33 0 -23 26 -27 12 18 14 5 3 -17 22 -1 1 5 0 6 33 47 4 15 17 4 13 -8 14
7469 14 8 -30 -13 -12 7 -13 1 -25 4 -7 -6 -11 -28 -3 -15 -1 -19 13 9 8 19 2 10 14 1 12 2 9 14 37 3 0 -16 2 12 6
7505 6 -5 -5 25 12 7 -22 1 -6 -3 -15 9 -13 -5 -31 -25 3 -16 5 -13 -24 23 -15 -14 25 -2 -15 -19 22 3 23 7 2 -13 23 18 4
7541 4 9 38 16 17 25 11 17 24 -5 16 16 -36 -5 -4 -8 -4 7 -6 -15 -15 -12 -21 -49 -28 -11 -6 7 11 16 -18 -1 4 -16 16 6 18 -6 -1 20 0
7581 0 19 -4 -5 -7 27 8 18 18 -10 4 10 13 -5 1 0 -5 17 -13 -23 -20 -44 -38 -45 -21 -30 -4 -24 1 -35 -2 -8 -2 13 4 -8 22 1 23
7619 23 -8 7 11 17 -6 -1 -5 22 21 3 24 13 1 13 1 -19 18 6 -3 15 20 -19 -34 -24 -22 -21 0 -26 -19 -5 -27 8 -15 -13 -1 4
7655 4 15 9 -1 -18 1 3 -4 -4 -27 -12 19 21 -2 -1 8 11 -9 -14 -21 -13 22 -22 -12 -16 47 8 16 -35 -20 -13 -28 2 9 -41 -35 -4 6 -24 -4
7694 -4 12 -31 -22 -3 35 -9 28 15 4 10 6 -8 8 -1 33 20 33 1 12 11 17 9 -10 -4 24 15 -8 3 3 -9 23 -24 -5 10 -20 15
7730 15 4 -19 11 5 4 -19 4 -22 -18 6 -14 9 10 15 -4 -7 -3 7 15 0 1 3 4 15 10 -11 8 21 19 23 -21 3 -9 -16 -5 -5 54 -14
7768 -14 13 -13 5 -16 -20 -29 -22 -57 -7 3 -45 -22 -11 -1 1 -16 17 -23 -44 11 -16 20 -7 7 22 12 20 8 30 -20 28 2 -25
7801 -25 16 -4 27 0 -5 -21 2 -16 -12 -6 -14 -22 -6 -6 -20 -14 -12 -11 -15 -9 -21 -7 -5 -13 7 3 -23 -21 -11 -8 23 27 0 22 4 -11 6 -9 3
7840 3 -10 22 32 0 47 4 0 -23 -17 -128 -31 14 -4 -97 -42 -23 -78 99 54 -43 99 -8 -56 23 -61 13 -2 -9 -70 23
7870 23 -25 17 -28 27 -16 4 24 28 21 16 -22 3 36 15 27 -3 4 -6 37 -10 -3 -12 30 -22 17 -2 9 8 -16 -14 -35 -10 -34 -39 17
7905 17 -19 -10 -22 -16 23 -5 -29 -17 28 7 6 4 28 15 1 4 16 -14 23 3 24 11 18 12 -14 12 8 0 1 -3 -33 0 -19 -17 -4 -18
7941 -18 -11 -4 7 -26 -47 -26 5 -5 -34 -19 10 8 1 3 7 19 -14 -7 10 15 -2 11 21 -3 11 20 -13 -2 25 -22 13 -1 10 4 -3 13
7977 13 9 9 -7 10 -29 -36 -21 -9 -41 2 -13 -2 2 -60 -36 11 9 31 4 -25 19 -23 12 14 12 -21 32 -12 14 11 43 -7 12 20 20
8012 20 -2 2 10 6 7 13 -21 -2 -26 -21 -17 6 -4 -22 -3 8 10 -11 -11 -27 27 -7 -3 -7 -10 4 -21 13 -1 3 3 -3 5 -8 -6 -5 3 -12 4 -28
8052 -28 0 23 19 -8 27 14 -6 -33 -41 -9 -7 20 0 -19 -10 -13 1 -11 -26 -7 -8 -36 -23 18 -4 -14 -5 -21 20 -7 -8 -17 4 -7 18
8087 18 -5 -2 -20 2 4 -13 0 20 24 1 5 13 -1 -15 -2 8 -27 -22 -21 -10 8 -28 7 3 7 -14 -16 -42 -7 -5 -7 18 -31 20 -27 -20 -3
8124 -3 -12 -13 21 2 18 4 18 33 -29 11 8 -10 -5 41 9 -3 18 6 4 -23 -18 5 5 11 16 -17 -1 -1 -6 -21 -4 18 -12 -27 3 -3 21
8161 21 -9 -18 -46 -5 -6 -13 -15 13 7 -9 -1 19 25 24 -9 0 22 0 29 15 38 -6 2 -26 23 -8 8 -8 15 -7
8191g
##END NTUPLES=NMR FID
##END=
